<svg
  xmlns="http://www.w3.org/2000/svg" viewBox="0 0 38.95 26.75" style="fill: currentColor;">
  <title>laptop</title>
  <g id="Layer_2" data-name="Layer 2">
    <g id="Layer_1-2" data-name="Layer 1">
      <path d="M33.17,19h-.86V4.64a.5.5,0,0,0-.49-.5h-23a.5.5,0,0,0-.49.5V19H7.49V3.79a.5.5,0,0,1,.5-.5H32.67a.5.5,0,0,1,.5.5Z"/>
      <path d="M36.17,21.19V2a2,2,0,0,0-1.89-2H6.38A2,2,0,0,0,4.49,2V21.19H0v.64a5.09,5.09,0,0,0,5.24,4.92H33.71A5.09,5.09,0,0,0,39,21.83v-.64ZM6.21,2c0-.17.1-.29.17-.29h27.9c.07,0,.17.12.17.29V21.19H23v.64a1.14,1.14,0,0,1-1.2,1.07H17.18A1.14,1.14,0,0,1,16,21.83v-.64H6.21Z"/>
      <path d="M23.75,12.36l-5.4-4.62a.14.14,0,0,0-.23.1L18.05,15l2-.91a.15.15,0,0,1,.19.07l1.42,3.13,1.45-.66-1.42-3.13a.12.12,0,0,1,.06-.18Z"/>
    </g>
  </g>
</svg>
