<svg id="Layer_1" data-name="Layer 1" xmlns="http://www.w3.org/2000/svg" viewBox="0 0 35 35">
  <defs>
    <style>
      .scenic-video-icon{fill:#231f20}
    </style>
  </defs>
  <polygon class="scenic-video-icon" points="15.86 5.64 18.83 5.64 18.83 0 18.81 0 15.88 0 15.86 0 15.86 5.64"/>
  <polygon class="scenic-video-icon" points="21.8 5.64 24.76 5.64 24.76 0 24.66 0 21.8 0 21.8 5.64"/>
  <path class="scenic-video-icon" d="M27.73,5.64h5.7V1.46A1.46,1.46,0,0,0,32,0H27.73Z"/>
  <polygon class="scenic-video-icon" points="9.93 5.64 12.9 5.64 12.9 0 10.03 0 9.93 0 9.93 5.64"/>
  <path class="scenic-video-icon" d="M7,5.64V0H2.72A1.46,1.46,0,0,0,1.26,1.46V5.64Z"/>
  <polygon class="scenic-video-icon" points="12.9 29.36 9.93 29.36 9.93 35 10.03 35 12.9 35 12.9 29.36"/>
  <path class="scenic-video-icon" d="M7,29.36H1.26v4.18A1.46,1.46,0,0,0,2.72,35H7Z"/>
  <path class="scenic-video-icon" d="M27.73,29.36V35H32a1.46,1.46,0,0,0,1.46-1.46V29.36Z"/>
  <polygon class="scenic-video-icon" points="24.76 29.36 21.8 29.36 21.8 35 24.66 35 24.76 35 24.76 29.36"/>
  <polygon class="scenic-video-icon" points="18.83 29.36 15.86 29.36 15.86 35 15.88 35 18.81 35 18.83 35 18.83 29.36"/>
  <path class="scenic-video-icon" d="M1.26,8.6V26.4H33.43V8.6ZM14.05,21V14a.77.77,0,0,1,1.17-.66l5.85,3.51a.77.77,0,0,1,0,1.32l-5.85,3.51A.77.77,0,0,1,14.05,21Z"/>
</svg>
