<svg xmlns="http://www.w3.org/2000/svg" viewBox="0 0 35 35">
  <g class="layer-shape" data-name="Shape">
    <path
      fill='currentColor'
      d="M17.5,34.5h0a2.43,2.43,0,0,1-2.43-2.43V19.93H2.93A2.43,2.43,0,0,1,.5,17.5h0a2.43,2.43,0,0,1,2.43-2.43H15.07V2.93A2.43,2.43,0,0,1,17.5.5h0a2.43,2.43,0,0,1,2.43,2.43V15.07H32.07A2.43,2.43,0,0,1,34.5,17.5h0a2.43,2.43,0,0,1-2.43,2.43H19.93V32.07A2.43,2.43,0,0,1,17.5,34.5Z"
    />
  </g>
</svg>
