<svg xmlns="http://www.w3.org/2000/svg" viewBox="0 0 35 35">
  <path
      class="scenic-call-phone"
      fill="currentColor"
      d="M10.22,20.73H25.59a7.49,7.49,0,0,1,5.67,2.61l2,2.28A7.42,7.42,0,0,1,35,30.44a2.74,2.74,0,0,1-2.74,2.74H28.53A3.49,3.49,0,0,1,25,29.69a3.48,3.48,0,0,0-3.48-3.48h-8a3.48,3.48,0,0,0-3.48,3.48,3.48,3.48,0,0,1-3.48,3.49H2.89A2.74,2.74,0,0,1,.15,30.44a6.61,6.61,0,0,1,1.94-4.67l2.85-2.85A7.47,7.47,0,0,1,10.22,20.73Z"
      />
  <polygon
      class="scenic-call-arrow"
      fill="currentColor"
      points="13.66 9.41 13.66 0.82 21.13 0.82 21.13 9.41 26.29 9.41 17.58 17.87 8.87 9.41 13.66 9.41"
      />
</svg>
