<svg id="Layer_1" data-name="Layer 1" xmlns="http://www.w3.org/2000/svg" viewBox="0 0 35 35">
  <g class="layer-symbol" data-name="Symbol">
    <path d="M24.64,5.78H7.54A1.93,1.93,0,0,0,5.61,7.71V27.62a1.94,1.94,0,0,0,1.93,1.93H27.46a1.94,1.94,0,0,0,1.93-1.93V10.52ZM14.29,7.7h5.78v4.18H14.29ZM27.46,27.62H7.54V7.7h4.82v6.11H22V7.7h1.84l3.62,3.62Z"/>
    <rect x="11.72" y="18.31" width="11.57" height="6.43"/>
  </g>
</svg>
