<svg width="14" height="20" viewBox="0 0 14 20" fill="none" xmlns="http://www.w3.org/2000/svg">
<path d="M4 19C4 19.5 4.4 20 5 20H9C9.6 20 10 19.5 10 19V18H4V19ZM7 0C3.1 0 0 3.1 0 7C0 9.4 1.2 11.5 3 12.7V15C3 15.5 3.4 16 4 16H10C10.6 16 11 15.5 11 15V12.7C12.8 11.4 14 9.3 14 7C14 3.1 10.9 0 7 0Z" fill="#FEFEFE"/>
</svg>
