{
    "domains": ["dev.sip.scenic.sat.qc.ca"],
    "contacts": {
        "reflector": {
            "name": "Reflector Service",
            "exclude_from": []
        },
        "scenic-ci1": {
            "name": "Scenic CI - 1",
            "exclude_from": []
        },
        "scenic-ci2": {
            "name": "Scenic CI - 2",
            "exclude_from": []
        },
        "scenic-ci3": {
            "name": "Scenic CI - 3",
            "exclude_from": []
        }
    }
}
