{
    "pose_backends": [
        {
            "name": "trt",
            "params": {
                "optimize": false,
                "keypoint_dataset": "BODY_25",
                "model_path": "livepose/models/trt",
                "model_optimized": "resnet18_baseline_att_224x224_A_epoch_249_trt.pth",
                "model_weights": "resnet18_baseline_att_224x224_A_epoch_249.pth",
                "model_desc": "human_pose.json",
                "model_height": 224,
                "model_width": 224,
                "min_pose_confidence": 0.15
            }
        }
    ],
    "cameras": {
        "input_paths":["/dev/video0"],
        "intrinsics": {}
    },
    "filters": {
        "skeletons": {
            "two_dimensional": true,
            "three_dimensional": false
        }
    },
    "outputs": {
        "websocket": {
            "server": {
                "host": "10.10.33.39",
                "port": 4435,
                "ssl": false
	    },
            "nb_messages_per_second": 30,
            "flow_sent": {
                "stream_types": ["FILTER"],
                "channel_types": ["OUTPUT"]
            }
        }
    }
}
