<svg width="20" height="20" viewBox="0 0 20 20" fill="none" xmlns="http://www.w3.org/2000/svg">
<path d="M8.586 9.99939L5.04987 13.5355C4.65938 13.926 4.65938 14.5591 5.04987 14.9496V14.9496C5.44035 15.3401 6.07345 15.3401 6.46393 14.9496L10.0001 11.4135L13.5362 14.9496C13.9267 15.3401 14.5598 15.3401 14.9503 14.9496V14.9496C15.3407 14.5591 15.3407 13.926 14.9503 13.5355L11.4141 9.99939L14.9493 6.46423C15.3398 6.07375 15.3398 5.44065 14.9493 5.05017V5.05017C14.5588 4.65969 13.9257 4.65969 13.5352 5.05017L10.0001 8.58533L6.4649 5.05017C6.07442 4.65969 5.44133 4.65969 5.05084 5.05017V5.05017C4.66036 5.44065 4.66036 6.07375 5.05084 6.46423L8.586 9.99939Z" fill="#FFB864"/>
</svg>
