<svg width="20" height="20" viewBox="0 0 20 20" fill="none" xmlns="http://www.w3.org/2000/svg">
<path d="M10 1.55127C10 1.33648 10.253 1.22168 10.4146 1.36312L13.785 4.31218C13.8988 4.41178 13.8988 4.58887 13.785 4.68847L10.4146 7.63753C10.253 7.77897 10 7.66417 10 7.44938V5.50033C7.23858 5.50033 5 7.7389 5 10.5003C5 13.2618 7.23858 15.5003 10 15.5003C12.4212 15.5003 14.4405 13.7794 14.9013 11.4939C15.0104 10.9526 15.4477 10.5003 16 10.5003C16.5523 10.5003 17.0075 10.9506 16.9295 11.4974C16.4456 14.8911 13.5275 17.5003 10 17.5003C6.13401 17.5003 3 14.3663 3 10.5003C3 6.63433 6.13401 3.50033 10 3.50033V1.55127Z" fill="#FEFEFE"/>
</svg>
