[{
  "id": "contact1",
  "fullName": "Éric Aubut",
  "role": "technician",
  "organization": "Salleqc Museum",
  "phone": "514-221-2131",
  "email": "info@salleqc.ca"
}, {
  "id": "contact2",
  "fullName": "Éric Aubut",
  "role": "technician",
  "organization": "Salleqc Museum",
  "phone": "514-221-2131",
  "email": "info@salleqc.ca"
}, {
  "id": "contact3",
  "fullName": "Éric Aubut",
  "role": "technician",
  "organization": "Salleqc Museum",
  "phone": "514-221-2131",
  "email": "info@salleqc.ca"
}, {
  "id": "contact4",
  "fullName": "Éric Aubut",
  "role": "technician",
  "organization": "Salleqc Museum",
  "phone": "514-221-2131",
  "email": "info@salleqc.ca"
}, {
  "id": "contact5",
  "fullName": "Éric Aubut",
  "role": "technician",
  "organization": "Salleqc Museum",
  "phone": "514-221-2131",
  "email": "info@salleqc.ca"
}, {
  "id": "contact6",
  "fullName": "Éric Aubut",
  "role": "technician",
  "organization": "Salleqc Museum",
  "phone": "514-221-2131",
  "email": "info@salleqc.ca"
}
]

