<svg xmlns="http://www.w3.org/2000/svg" version="1.1" viewBox="0 0 35 35">
  <g data-name="Symbol" class="layer-symbol">
    <path d="M 2.93,19.93 C 1.5879481,19.93 0.5,18.842052 0.5,17.5 v 0 c 0,-1.342052 1.0879481,-2.43 2.43,-2.43 32.179369,0.0032 -1.93213163,-2.22e-4 29.14,0 1.342052,0 2.43,1.087948 2.43,2.43 v 0 c 0,1.342052 -1.087948,2.43 -2.43,2.43 -31.53708637,0.0024 -0.426984,0 -29.14,0 z" />
  </g>
</svg>
