<svg id="Layer_1" data-name="Layer 1" xmlns="http://www.w3.org/2000/svg" viewBox="0 0 35 35">
  <path d="M6.59,2.43A1.39,1.39,0,0,0,5.38,3.77V5.2A1.41,1.41,0,0,0,6.73,6.57,1.41,1.41,0,0,0,8.08,5.2V5.12H32.31V22.17h0a1.35,1.35,0,1,0,0,2.69h1.36A1.4,1.4,0,0,0,35,23.52V3.77a1.4,1.4,0,0,0-1.35-1.34ZM1.21,7.81A1.4,1.4,0,0,0,0,9.16V29.35A1.4,1.4,0,0,0,1.35,30.7H27.82a1.4,1.4,0,0,0,1.35-1.35V9.16a1.4,1.4,0,0,0-1.35-1.35ZM2.69,10.5H26.47V28H2.69Zm8.85,4a1.09,1.09,0,0,0-.95,1.06V23a1.06,1.06,0,0,0,.53.92,1.1,1.1,0,0,0,1.07,0L18.53,20a1.07,1.07,0,0,0,0-1.83l-6.33-3.52a1.12,1.12,0,0,0-.62-.13Z" style="fill:#010101"/>
</svg>
