<svg id="Layer_1" data-name="Layer 1" xmlns="http://www.w3.org/2000/svg" viewBox="0 0 35 35">
  <defs>
    <style>
      .scenic-data-icon{fill:#231f20}
    </style>
  </defs>
  <path class="scenic-data-icon" d="M6.43,11.19H2V24.31H6.43a2.38,2.38,0,0,0,2.38-2.39V13.58A2.38,2.38,0,0,0,6.43,11.19Zm.85,10.73a1,1,0,0,1-1,1H3.53V12.69H6.26a1,1,0,0,1,1,1Z"/>
  <polygon class="scenic-data-icon" points="18.35 11.19 18.35 12.72 20.91 12.72 20.91 24.31 22.61 24.31 22.61 12.72 25.16 12.72 25.16 11.19 18.35 11.19"/>
  <path class="scenic-data-icon" d="M10.52,13.3v11h1.53V19.88H15.8v4.43h1.53v-11a2.12,2.12,0,0,0-2.11-2.11H12.63A2.11,2.11,0,0,0,10.52,13.3Zm5.28,5.22H12.05V13.44a.71.71,0,0,1,.71-.71h2.32a.71.71,0,0,1,.72.71Z"/>
  <path class="scenic-data-icon" d="M26.19,13.3v11h1.53V19.88h3.75v4.43H33v-11a2.11,2.11,0,0,0-2.11-2.11H28.3A2.11,2.11,0,0,0,26.19,13.3Zm5.28,5.22H27.72V13.44a.71.71,0,0,1,.71-.71h2.32a.71.71,0,0,1,.72.71Z"/>
</svg>
