<?xml version="1.0" encoding="UTF-8" standalone="no"?>
<svg xmlns="http://www.w3.org/2000/svg" viewBox="0 0 35 35" version="1.1">
  <g transform="matrix(0.72914485,0,0,0.72914485,0.72743364,8.4563226)">
    <g transform="translate(-5.255302,-4.6225382)">
      <path
         class="ScenicEyeBlind"
         fill="currentColor"
         d="m 41.083883,3.9152736 -1.41,-1.42 -25.93,25.9000004 1.41,1.42" />
    </g>
  </g>
  <g transform="matrix(0.72914485,0,0,0.72914485,0.72743364,8.4563226)">
    <g transform="matrix(0.28603921,0,0,0.28603921,-0.6108491,-12.600582)">
      <path
         class="ScenicEyeBlind"
         fill="currentColor"
         d="M 23.011719,0 C 10.571384,0 0.69721468,10.351813 0.28320312,10.791016 c -0.37759389,0.403332 -0.37759389,1.032178 0,1.433593 0.3069069,0.324295 5.73137048,6.035044 13.57617188,9.011719 l 2.423828,-2.419922 C 12.342846,17.541155 8.2104281,15.160995 3.7324219,11.494141 12.786711,3.8991911 21.993841,1.4325604 30.710938,4.4042969 L 32.994141,2.125 C 29.989219,0.88097884 26.614509,0 23.011719,0 Z M 34.945312,3.0039062 32.75,5.1972656 c 3.135317,1.3891616 6.200693,3.4973802 9.162109,6.3437504 -7.694138,6.570765 -15.137522,9.6924 -23.398437,7.875 l -2.519531,2.515625 c 2.210206,0.636508 4.665139,1.089843 7.017578,1.089843 12.441704,0 22.318372,-10.357672 22.730469,-10.796875 0.380334,-0.401415 0.380334,-1.033547 0,-1.433593 C 45.474106,10.507372 41.247599,6.0979137 34.945312,3.0039062 Z"
         transform="matrix(3.4960242,0,0,3.4960242,2.1355432,44.05194)" />
    </g>
    <path
       d="m 23.013672,2.8984375 a 8.6481698,8.6848661 0 0 0 -8.644531,8.6835935 8.6481698,8.6848661 0 0 0 2.773437,6.375 l 1.611328,-1.607422 a 6.387777,6.387777 0 0 1 -2.11914,-4.753906 6.387777,6.387777 0 0 1 6.326172,-6.3867186 6.387777,6.387777 0 0 1 0.06055,0 6.387777,6.387777 0 0 1 4.75586,2.125 l 1.61914,-1.6171875 a 8.6481698,8.6848661 0 0 0 -6.378906,-2.8183594 8.6481698,8.6848661 0 0 1 -0.0039,0 z" />
    <g transform="matrix(1.797823,0,0,1.797823,-1.0211103,-5.5881002)">
      <path
         class="ScenicEyeBlind"
         fill="currentColor"
         d="m 22.980469,6.7578125 c -2.670242,0.015899 -4.826434,2.1851789 -4.826172,4.8554685 5.39e-4,1.405803 0.610395,2.742357 1.671875,3.664063 l 6.851562,-6.8437502 c -0.921875,-1.0639614 -2.26018,-1.6753913 -3.667968,-1.6757813 -0.0098,-2.95e-5 -0.01953,-2.95e-5 -0.0293,0 z"
         transform="matrix(0.55622828,0,0,0.55622828,0.56797043,3.1082594)" />
    </g>
  </g>
</svg>
