<svg width="20" height="20" viewBox="0 0 20 20" fill="none" xmlns="http://www.w3.org/2000/svg">
<path fill-rule="evenodd" clip-rule="evenodd" d="M12.8824 2.82353C12.8824 2.36871 13.2511 2 13.7059 2H16.1765C16.6313 2 17 2.36871 17 2.82353V5.29412C17 5.74894 16.6313 6.11765 16.1765 6.11765C15.7216 6.11765 15.3529 5.74894 15.3529 5.29412V4.81171L11.4059 8.75879C11.0842 9.0804 10.5628 9.0804 10.2412 8.75879C9.9196 8.43719 9.9196 7.91576 10.2412 7.59415L14.1883 3.64706H13.7059C13.2511 3.64706 12.8824 3.27835 12.8824 2.82353Z" fill="#FEFEFE"/>
<path fill-rule="evenodd" clip-rule="evenodd" d="M16 6.0987V6C16 4.89543 15.1046 4 14 4H13.8354L11.8354 6H14V6.16465L15.3529 4.81171V5.29412C15.3529 5.5491 15.4688 5.77701 15.6508 5.92807C15.7502 6.01058 15.8693 6.07016 16 6.0987ZM10.4211 6H6L6 14H14V7.57886L14.9423 6.63655C15.2264 6.8979 15.5937 7.07021 16 7.10922V14C16 15.1046 15.1046 16 14 16H6C4.89543 16 4 15.1046 4 14V6C4 4.89543 4.89543 4 6 4H12.3126C12.3291 4.01959 12.3461 4.03883 12.3634 4.05769L10.4211 6Z" fill="#FEFEFE"/>
</svg>
