{
    "data-root": "/data/docker",
    "storage-driver": "overlay2",
    "runtimes": {
        "nvidia": {
            "path": "nvidia-container-runtime",
            "runtimeArgs": []
        }
    }
}