<?xml version="1.0" encoding="utf-8"?>
<!-- Generator: Adobe Illustrator 19.2.0, SVG Export Plug-In . SVG Version: 6.00 Build 0)  -->
<svg version="1.1" id="Calque_1" xmlns="http://www.w3.org/2000/svg" xmlns:xlink="http://www.w3.org/1999/xlink" x="0px" y="0px"
	 viewBox="0 0 1135 1135" style="enable-background:new 0 0 1135 1135;" xml:space="preserve">
<style type="text/css">
	.st0{fill:#F9B233;}
	.st1{fill:#37A3DC;}
	.st2{fill:#E6292C;}
	.st3{fill:#FFFFFF;}
	.st4{fill:none;stroke:#000000;stroke-width:65;stroke-linecap:round;stroke-linejoin:round;stroke-miterlimit:10;}
</style>
<circle class="st2" cx="567.5" cy="567.5" r="566.8"/>
<g>
	<g>
		<path class="st3" d="M567.2,462.5C567.2,462.5,567.2,462.5,567.2,462.5c-18,0-32.5-14.6-32.5-32.6l0.6-290
			c0-17.9,14.6-32.4,32.5-32.4c0,0,0,0,0.1,0c17.9,0,32.5,14.6,32.4,32.6l-0.6,290C599.7,448,585.1,462.5,567.2,462.5z"/>
	</g>
	<g>
		<g>
			<path class="st3" d="M567.5,927.5c-48.8,0-96.2-9.6-140.9-28.5c-43.1-18.2-81.8-44.3-115-77.6c-33.2-33.2-59.3-71.9-77.6-115
				c-18.9-44.6-28.5-92-28.5-140.9c0-78,24.4-152.3,70.6-214.8c22.2-30.1,48.9-56.5,79.1-78.4c30.7-22.2,64.4-39.4,100.4-51.1
				c17.1-5.5,35.4,3.8,40.9,20.9s-3.8,35.4-20.9,40.9c-59.2,19.2-110.1,55.9-147.3,106.3c-37.9,51.3-57.9,112.2-57.9,176.2
				c0,79.3,30.9,153.9,87,210c56.1,56.1,130.7,87,210,87c79.3,0,153.9-30.9,210-87s87-130.7,87-210c0-64-20-124.9-57.9-176.2
				C769.3,339,718.4,302.2,659.2,283c-17.1-5.5-26.4-23.9-20.9-40.9s23.9-26.4,40.9-20.9c35.9,11.7,69.7,28.8,100.4,51.1
				c30.3,21.9,56.9,48.3,79.1,78.4c46.2,62.6,70.6,136.9,70.6,214.8c0,48.8-9.6,96.2-28.5,140.9c-18.2,43.1-44.3,81.8-77.6,115
				c-33.2,33.2-71.9,59.3-115,77.6C663.8,917.9,616.3,927.5,567.5,927.5z"/>
		</g>
	</g>
</g>
</svg>
