[{
  "id": "V1",
  "type": "HDMI",
  "media": ["video"],
  "direction": ["input"]
}, {
  "id": "V2",
  "type": "HDMI",
  "media": ["video"],
  "direction": ["input"]
}, {
  "id": "P1",
  "type": "HDMI",
  "media": ["video"],
  "direction": ["output"]
}, {
  "id": "P2",
  "type": "HDMI",
  "media": ["video"],
  "direction": ["output"]
}, {
  "id": "M1",
  "type": "XLR-Jack",
  "media": ["audio"],
  "direction": ["input"]
}, {
  "id": "M2",
  "type": "XLR-Jack",
  "media": ["audio"],
  "direction": ["input"]
}, {
  "id": "S1",
  "type": "XLR-Jack",
  "media": ["audio"],
  "direction": ["output"]
}, {
  "id": "S2",
  "type": "XLR-Jack",
  "media": ["audio"],
  "direction": ["output"]
}, {
  "id": "S3",
  "type": "XLR-Jack",
  "media": ["audio"],
  "direction": ["output"]
}, {
  "id": "G1",
  "type": "USB",
  "media": ["video", "audio"],
  "direction": ["input", "output"]
}, {
  "id": "G2",
  "type": "USB",
  "media": ["video", "audio"],
  "direction": ["input", "output"]
}, {
  "id": "G3",
  "type": "USB",
  "media": ["video", "audio"],
  "direction": ["input", "output"]
}, {
  "id": "NDI",
  "type": "NDI",
  "media": ["video"],
  "direction": ["input", "output"]
}, {
  "id": "B1",
  "type": "Bluetooth",
  "media": ["video", "audio"],
  "direction": ["input", "output"]
}]
