{
  "$id": "http://sat.qc.ca/preset-onboarding/step.schema.json",
  "title": "Preset step",
  "description": "An item for all preset steps",
  "type": "object",
  "properties": {
    "id": {
      "description": "Unique ID for each item",
      "type": "string"
    },
    "title": {
      "description": "The title of the item",
      "type": "string"
    },
    "description": {
      "description": "The title of the item",
      "type": "string"
    },
    "totalPageCount": {
      "description": "The media of the item",
      "type": "string"
    }
  },
  "required": ["id", "title", "description", "totalPageCount"]
}
