{
  "$id": "http://sat.qc.ca/preset-onboarding/advice.preset.json",
  "title": "Preset Scene Advice",
  "description": "A preset list of scene advice and device testing",
  "type": "object",
  "properties": {
    "details": {
      "description": "",
      "type": "array",
      "items": {
        "$ref": "http://sat.qc.ca/preset-onboarding/detail.schema.json"
      }
        }
      },
  "required": ["details"]
}
