{
  "kinds": [
    {
      "author": "Nicolas Bouillot",
      "description": "Receives OSC messages and updates associated property",
      "kind": "OSCsink",
      "license": "LGPL",
      "name": "OSCsink"
    },
    {
      "author": "Nicolas Bouillot",
      "description": "Receive OSC messages and write to shmdata",
      "kind": "OSCsrc",
      "license": "LGPL",
      "name": "OSCsrc"
    },
    {
      "author": "Nicolas Bouillot",
      "description": "Encode raw audio stream",
      "kind": "audioenc",
      "license": "LGPL",
      "name": "audioenc"
    },
    {
      "author": "Nicolas Bouillot",
      "description": "Creates audio test signals",
      "kind": "audiotestsrc",
      "license": "LGPL",
      "name": "audiotestsrc"
    },
    {
      "author": "Jérémie Soria",
      "description": "Replays and controls a recorded shmdata audio/video file",
      "kind": "avplayer",
      "license": "LGPL",
      "name": "avplayer"
    },
    {
      "author": "Jérémie Soria",
      "description": "Records connected audio/video shmdata",
      "kind": "avrec",
      "license": "LGPL",
      "name": "avrec"
    },
    {
      "author": "Nicolas Bouillot",
      "description": "Dummy plugin for testing/example purpose",
      "kind": "connection-quid",
      "license": "LGPL",
      "name": "connection-quid"
    },
    {
      "author": "Francis Lecavalier",
      "description": "Plugin for cropping video sources",
      "kind": "cropper",
      "license": "LGPL",
      "name": "cropper"
    },
    {
      "author": "Nicolas Bouillot",
      "description": "Custom Save plugin for testing/example purpose",
      "kind": "custom-save",
      "license": "LGPL",
      "name": "custom-save"
    },
    {
      "author": "Nicolas Bouillot",
      "description": "Generic shmdata decoder",
      "kind": "decoder",
      "license": "LGPL",
      "name": "decoder"
    },
    {
      "author": "Nicolas Bouillot",
      "description": "Dummy plugin for testing/example purpose",
      "kind": "dummy",
      "license": "LGPL",
      "name": "dummy"
    },
    {
      "author": "Nicolas Bouillot",
      "description": "Quiddity for testing the reading of shmdata",
      "kind": "dummysink",
      "license": "LGPL",
      "name": "dummysink"
    },
    {
      "author": "Nicolas Bouillot",
      "description": "Dummy plugin for testing/example purpose",
      "kind": "dyn-reader-quid",
      "license": "LGPL",
      "name": "dyn-reader-quid"
    },
    {
      "author": "Nicolas Bouillot",
      "description": "Dummy plugin for testing/example purpose",
      "kind": "dyn-writer-quid",
      "license": "LGPL",
      "name": "dyn-writer-quid"
    },
    {
      "author": "Nicolas Bouillot",
      "description": "Quiddity for user data saving",
      "kind": "emptyquid",
      "license": "LGPL",
      "name": "emptyquid"
    },
    {
      "author": "Francis Lecavalier",
      "description": "Plugin for launching command lines",
      "kind": "executor",
      "license": "LGPL",
      "name": "executor"
    },
    {
      "author": "Nicolas Bouillot",
      "description": "Import an external shmdata writer",
      "kind": "extshmsrc",
      "license": "LGPL",
      "name": "extshmsrc"
    },
    {
      "author": "Nicolas Bouillot",
      "description": "File decoding to one or more shmdata",
      "kind": "filesrc",
      "license": "LGPL",
      "name": "filesrc"
    },
    {
      "author": "Jérémie Soria",
      "description": "Video window with fullscreen",
      "kind": "glfwin",
      "license": "LGPL",
      "name": "glfwin"
    },
    {
      "author": "Hantz-Carly F. Vius",
      "description": "Plugin implementing a simple Gst pipeline",
      "kind": "gst",
      "license": "LGPL",
      "name": "gst"
    },
    {
      "author": "Nicolas Bouillot",
      "description": "Decode an SDP-described stream delivered through http and make shmdata",
      "kind": "httpsdpdec",
      "license": "LGPL",
      "name": "httpsdpdec"
    },
    {
      "author": "Nicolas Bouillot",
      "description": "Run a Jack audio server",
      "kind": "jackserver",
      "license": "LGPL",
      "name": "jackserver"
    },
    {
      "author": "Nicolas Bouillot",
      "description": "Audio display",
      "kind": "jacksink",
      "license": "LGPL",
      "name": "jacksink"
    },
    {
      "author": "Nicolas Bouillot",
      "description": "Get audio from jack",
      "kind": "jacksrc",
      "license": "LGPL",
      "name": "jacksrc"
    },
    {
      "author": "Jérémie Soria",
      "description": "Choice of LADSPA plugins",
      "kind": "ladspa",
      "license": "LGPL",
      "name": "ladspa"
    },
    {
      "author": "Jérémie Soria",
      "description": "Computes the absolute time between two timecode shmdata",
      "kind": "ltcdiff",
      "license": "LGPL",
      "name": "ltcdiff"
    },
    {
      "author": "Jérémie Soria",
      "description": "Generate an LTC timecode audio track (can be cadenced by external sound shmdata)",
      "kind": "ltcsource",
      "license": "LGPL",
      "name": "ltcsource"
    },
    {
      "author": "Jérémie Soria",
      "description": "Control Jack Transport from an incoming LTC stream",
      "kind": "ltctojack",
      "license": "LGPL",
      "name": "ltctojack"
    },
    {
      "author": "Nicolas Bouillot",
      "description": "Dummy plugin for testing/example purpose",
      "kind": "methodquid",
      "license": "LGPL",
      "name": "methodquid"
    },
    {
      "author": "Nicolas Bouillot",
      "description": "Shmdata to midi",
      "kind": "midisink",
      "license": "LGPL",
      "name": "midisink"
    },
    {
      "author": "Nicolas Bouillot",
      "description": "Midi to shmdata and properties",
      "kind": "midisrc",
      "license": "LGPL",
      "name": "midisrc"
    },
    {
      "author": "Nicolas Bouillot/Jérémie Soria",
      "description": "Maps properties to a protocol",
      "kind": "protocol-mapper",
      "license": "LGPL",
      "name": "protocol-mapper"
    },
    {
      "author": "Nicolas Bouillot",
      "description": "Inspecting Devices And Playing Audio To Outputs",
      "kind": "pulsesink",
      "license": "LGPL",
      "name": "pulsesink"
    },
    {
      "author": "Nicolas Bouillot",
      "description": "Audio From Pulse audio driver",
      "kind": "pulsesrc",
      "license": "LGPL",
      "name": "pulsesrc"
    },
    {
      "author": "Nicolas Bouillot",
      "description": "Audio resampling with libsamplerate",
      "kind": "resample",
      "license": "GPL",
      "name": "resample"
    },
    {
      "author": "Jérémie Soria/Francis Lecavalier",
      "description": "Plugin for streaming audio/video to an RTMP server (Youtube, Twitch, etc.)",
      "kind": "rtmp",
      "license": "LGPL",
      "name": "rtmp"
    },
    {
      "author": "Jérémie Soria",
      "description": "Takes an input shmdata and delays it by a fixed amount",
      "kind": "shmdelay",
      "license": "LGPL",
      "name": "shmdelay"
    },
    {
      "author": "Jérémie Soria",
      "description": "Dummy quiddity for testing of signals",
      "kind": "signal",
      "license": "LGPL",
      "name": "signal"
    },
    {
      "author": "Nicolas Bouillot",
      "description": "Manages user sessions",
      "kind": "sip",
      "license": "LGPL",
      "name": "sip"
    },
    {
      "author": "Emmanuel Durand",
      "description": "Gives system load information",
      "kind": "systemusage",
      "license": "LGPL",
      "name": "systemusage"
    },
    {
      "author": "Nicolas Bouillot",
      "description": "Make an image timelapse from raw video stream",
      "kind": "timelapse",
      "license": "LGPL",
      "name": "timelapse"
    },
    {
      "author": "Nicolas Bouillot",
      "description": "URI decoding to one or more shmdata",
      "kind": "urisrc",
      "license": "LGPL",
      "name": "urisrc"
    },
    {
      "author": "Nicolas Bouillot",
      "description": "Discover and use v4l2 supported capture cards and cameras",
      "kind": "v4l2src",
      "license": "GPL",
      "name": "v4l2src"
    },
    {
      "author": "Nicolas Bouillot",
      "description": "Encode raw video stream",
      "kind": "videnc",
      "license": "LGPL",
      "name": "videnc"
    },
    {
      "author": "Nicolas Bouillot",
      "description": "Convert pixel format of raw video stream",
      "kind": "videoconvert",
      "license": "LGPL",
      "name": "videoconvert"
    },
    {
      "author": "Nicolas Bouillot",
      "description": "Take snapshot from a video shmdata",
      "kind": "videosnapshot",
      "license": "LGPL",
      "name": "videosnapshot"
    },
    {
      "author": "Nicolas Bouillot",
      "description": "Creates a test video stream",
      "kind": "videotestsrc",
      "license": "LGPL",
      "name": "videotestsrc"
    },
    {
      "author": "Emmanuel Durand",
      "description": "Connects to a VNC server and outputs the video to a shmdata",
      "kind": "vncclientsrc",
      "license": "LGPL",
      "name": "vncclientsrc"
    },
    {
      "author": "François Ubald Brien",
      "description": "Plugin to create a local VRPN server from shmdata sources.",
      "kind": "vrpnsink",
      "license": "LGPL",
      "name": "vrpnsink"
    },
    {
      "author": "Francis Lecavalier",
      "description": "Watch a directory for shmdatas",
      "kind": "watcher",
      "license": "LGPL",
      "name": "watcher"
    },
    {
      "author": "Hantz-Carly F. Vius",
      "description": "Plugin implementing a simple WebRTC client",
      "kind": "webrtc",
      "license": "LGPL",
      "name": "webrtc"
    }
  ]
}
