{
  "$id": "http://sat.qc.ca/preset-onboarding/entry.preset.json",
  "title": "Preset Configuration",
  "description": "A preset configuration",
  "type": "object",
  "properties": {
    "checkList": {
      "description": "An array of all the steps needed before starting the preset",
      "type": "array"
    },
    "deviceList": {
      "description": "An array of all the devices needed for the preset",
      "type": "array"
    },
    "input": {
      "description": "The preset configuration of all inputs",
      "type": "object",
      "entries": {
            "$ref": "http://sat.qc.ca/preset-onboarding/entry.schema.json"
          }
        }
      },
    "output": {
      "description": "The preset configuration of all outputs",
      "type": "object",
      "entries": {
            "$ref": "http://sat.qc.ca/preset-onboarding/entry.schema.json"
          }
        },
  "required": ["checkList", "deviceList", "input", "output"]
}
