{
  "$id": "http://sat.qc.ca/preset-onboarding/detail.schema.json",
  "title": "Preset Detail",
  "description": "An item for all preset test and advice sections",
  "type": "object",
  "properties": {
    "id": {
      "description": "Unique ID for each detail",
      "type": "string"
    },
    "title": {
      "description": "The title of the detail",
      "type": "string"
    },
    "iconType": {
      "description": "The type of the detail icon",
      "type": "string"
    },
    "testerCaption": {
      "description": "The caption for the device to be tested",
      "type": "string"
    },
    "adviceList": {
      "description": "A list of all advice statements",
      "type": "array"
    }
  },
  "required": ["id", "title", "iconType", "testerCaption", "adviceList"]
}
