{
   "description" : "splashConfiguration",
   "scenes" : {
      "GPU" : {
         "display" : 0,
         "links" : [
            [ "Object", "gui" ],
            [ "VirtualCube", "gui" ],
            [ "Object", "Cam1" ],
            [ "Object", "Cam2" ],
            [ "Object", "Cam3" ],
            [ "Object", "Cam4" ],
            [ "Mesh", "Object" ],
            [ "Probe", "Object" ],
            [ "VirtualCube", "Probe" ],
            [ "CubeMap_mesh", "VirtualCube" ],
            [ "EIS_output", "VirtualCube" ],
            [ "VirtualCube_EIS_output_filter", "VirtualCube" ],
            [ "gui", "Window" ],
            [ "Cam1", "Window" ],
            [ "Cam2", "Window" ],
            [ "Cam3", "Window" ],
            [ "Cam4", "Window" ],
            [ "Window_Cam1_warp", "Window" ],
            [ "Window_Cam2_warp", "Window" ],
            [ "Window_Cam3_warp", "Window" ],
            [ "Window_Cam4_warp", "Window" ],
            [ "Cam1", "Window_Cam1_warp" ],
            [ "Cam2", "Window_Cam2_warp" ],
            [ "Cam3", "Window_Cam3_warp" ],
            [ "Cam4", "Window_Cam4_warp" ],
            [ "EIS_output", "VirtualCube_EIS_output_filter" ],
            [ "Probe", "filter_1" ]
         ],
         "objects" : {
            "Cam1" : {
               "16bits" : [ 1 ],
               "activateColorLUT" : [ 0 ],
               "alias" : [ "Cam1" ],
               "blendPrecision" : [ 0.10000000149011612 ],
               "blendWidth" : [ 0.05000000074505806 ],
               "brightness" : [ 1 ],
               "buffer" : [ 0 ],
               "calibrationPoints" : [
                  [
                     2.4481840133666992,
                     2.2306349277496338,
                     0.62325000762939453,
                     0.97665369510650635,
                     0.96885812282562256,
                     1
                  ],
                  [
                     2.1754651069641113,
                     2.0865879058837891,
                     -1.75,
                     0.9785991907119751,
                     -0.97231835126876831,
                     1
                  ],
                  [
                     -2.1880350112915039,
                     1.9425410032272339,
                     -1.75,
                     -0.9856153130531311,
                     -0.94873130321502686,
                     1
                  ],
                  [
                     -2.5516600608825684,
                     2.2306349277496338,
                     0.62325000762939453,
                     -0.98054474592208862,
                     0.97577857971191406,
                     1
                  ],
                  [
                     0.17552700638771057,
                     2.2306349277496338,
                     -0.50943702459335327,
                     0.076396353542804718,
                     0.12295906990766525,
                     1
                  ],
                  [
                     -0.0062850001268088818,
                     1.9905569553375244,
                     -1.75,
                     -0.017509698867797852,
                     -0.97923874855041504,
                     1
                  ]
               ],
               "colorMixMatrix" : [
                  [ 1, 0, 0, 0, 1, 0, 0, 0, 1 ]
               ],
               "colorTemperature" : [ 6500 ],
               "contrast" : [ 1 ],
               "eye" : [ 0.34620091319084167, -3.9817614555358887, 0.44685593247413635 ],
               "far" : [ 100 ],
               "fov" : [ 26.526628494262695 ],
               "getReprojectionError" : [ 0 ],
               "grabMipmapLevel" : [ -1 ],
               "hide" : [ 0 ],
               "multisampling" : [ 0 ],
               "near" : [ 0.10000000149011612 ],
               "principalPoint" : [ 0.51065605878829956, 1.446479320526123 ],
               "priorityShift" : [ 0 ],
               "saturation" : [ 1 ],
               "savable" : [ 1 ],
               "size" : [ 1920, 1080 ],
               "target" : [ 0.2999330461025238, -3.0120329856872559, 0.68661880493164062 ],
               "timestamp" : [ 0 ],
               "type" : "camera",
               "up" : [ 0.0095449406653642654, -0.23957976698875427, 0.97082978487014771 ],
               "weightedCalibrationPoints" : [ 1 ]
            },
            "Cam2" : {
               "16bits" : [ 1 ],
               "activateColorLUT" : [ 0 ],
               "alias" : [ "Cam2" ],
               "blendPrecision" : [ 0.10000000149011612 ],
               "blendWidth" : [ 0.05000000074505806 ],
               "brightness" : [ 1 ],
               "buffer" : [ 0 ],
               "calibrationPoints" : [
                  [
                     2.9027149677276611,
                     2.2306349277496338,
                     -1.75,
                     -0.71038252115249634,
                     -0.93187350034713745,
                     1
                  ],
                  [
                     2.9027149677276611,
                     2.2306349277496338,
                     0.51537501811981201,
                     -0.68852460384368896,
                     0.9821506142616272,
                     1
                  ],
                  [
                     2.9027149677276611,
                     -0.84236502647399902,
                     0.62325000762939453,
                     0.95641225576400757,
                     0.95460933446884155,
                     1
                  ],
                  [
                     2.9027149677276611,
                     -0.84236502647399902,
                     -0.94093799591064453,
                     0.97750169038772583,
                     -0.9654839038848877,
                     1
                  ],
                  [
                     2.5390899181365967,
                     2.2306349277496338,
                     -1.2645629644393921,
                     -0.96068990230560303,
                     -0.95620435476303101,
                     1
                  ],
                  [
                     2.4481840133666992,
                     2.2306349277496338,
                     0.56931298971176147,
                     -0.99480873346328735,
                     0.970802903175354,
                     1
                  ],
                  [
                     2.9027149677276611,
                     0.93421298265457153,
                     -0.23974999785423279,
                     -0.12841528654098511,
                     0.2165449857711792,
                     1
                  ]
               ],
               "colorMixMatrix" : [
                  [ 1, 0, 0, 0, 1, 0, 0, 0, 1 ]
               ],
               "colorTemperature" : [ 6500 ],
               "contrast" : [ 1 ],
               "eye" : [ 1.4080955982208252, 0.10192342847585678, 0.88673561811447144 ],
               "far" : [ 100 ],
               "fov" : [ 66.568611145019531 ],
               "getReprojectionError" : [ 0 ],
               "grabMipmapLevel" : [ -1 ],
               "hide" : [ 0 ],
               "multisampling" : [ 0 ],
               "near" : [ 0.10000000149011612 ],
               "principalPoint" : [ 0.57969367504119873, 1.1600667238235474 ],
               "priorityShift" : [ 0 ],
               "saturation" : [ 1 ],
               "savable" : [ 1 ],
               "size" : [ 1920, 1080 ],
               "target" : [ 2.390338659286499, 0.28796073794364929, 0.91099607944488525 ],
               "timestamp" : [ 0 ],
               "type" : "camera",
               "up" : [ -0.025453632697463036, 0.004027338232845068, 0.99966788291931152 ],
               "weightedCalibrationPoints" : [ 1 ]
            },
            "Cam3" : {
               "16bits" : [ 1 ],
               "activateColorLUT" : [ 0 ],
               "alias" : [ "Cam3" ],
               "blendPrecision" : [ 0.10000000149011612 ],
               "blendWidth" : [ 0.05000000074505806 ],
               "brightness" : [ 0.5 ],
               "buffer" : [ 0 ],
               "calibrationPoints" : [
                  [
                     2.9027149677276611,
                     2.2306349277496338,
                     0.56931298971176147,
                     0.10782241821289062,
                     0.98648011684417725,
                     1
                  ],
                  [
                     2.9027149677276611,
                     0.74215102195739746,
                     -0.45550000667572021,
                     0.97410345077514648,
                     -0.94649225473403931,
                     1
                  ],
                  [
                     1.175495982170105,
                     2.2306349277496338,
                     -0.45550000667572021,
                     -0.98855876922607422,
                     -0.93908488750457764,
                     1
                  ],
                  [
                     1.175495982170105,
                     2.2306349277496338,
                     0.78506302833557129,
                     -0.95314210653305054,
                     0.96802514791488647,
                     1
                  ],
                  [
                     2.9027149677276611,
                     2.2306349277496338,
                     -1.75,
                     0.10382509231567383,
                     -0.81368613243103027,
                     1
                  ],
                  [
                     2.9027149677276611,
                     0.74215102195739746,
                     0.78506302833557129,
                     0.93909668922424316,
                     0.96845763921737671,
                     1
                  ],
                  [
                     2.9027149677276611,
                     2.2306349277496338,
                     -0.45550000667572021,
                     0.10109293460845947,
                     0.24922958016395569,
                     1
                  ]
               ],
               "colorMixMatrix" : [
                  [ 1, 0, 0, 0, 1, 0, 0, 0, 1 ]
               ],
               "colorTemperature" : [ 6500 ],
               "contrast" : [ 1 ],
               "eye" : [ 1.3626633882522583, 0.5482248067855835, 1.0487774610519409 ],
               "far" : [ 100 ],
               "fov" : [ 61.425922393798828 ],
               "getReprojectionError" : [ 0 ],
               "grabMipmapLevel" : [ -1 ],
               "hide" : [ 0 ],
               "multisampling" : [ 0 ],
               "near" : [ 0.10000000149011612 ],
               "principalPoint" : [ 0.53675830364227295, 1.2087808847427368 ],
               "priorityShift" : [ 0 ],
               "saturation" : [ 1 ],
               "savable" : [ 1 ],
               "size" : [ 1920, 1080 ],
               "target" : [ 2.0137078762054443, 1.3064746856689453, 1.0833935737609863 ],
               "timestamp" : [ 0 ],
               "type" : "camera",
               "up" : [ -0.022217832505702972, -0.026548737660050392, 0.99940061569213867 ],
               "weightedCalibrationPoints" : [ 1 ]
            },
            "Cam4" : {
               "16bits" : [ 1 ],
               "activateColorLUT" : [ 0 ],
               "alias" : [ "Cam4" ],
               "blendPrecision" : [ 0.10000000149011612 ],
               "blendWidth" : [ 0.05000000074505806 ],
               "brightness" : [ 1 ],
               "buffer" : [ 0 ],
               "calibrationPoints" : [
                  [
                     2.9027149677276611,
                     2.2306349277496338,
                     -1.75,
                     -0.043066952377557755,
                     0.95435255765914917,
                     1
                  ],
                  [
                     2.9027149677276611,
                     0.021916000172495842,
                     -0.13187499344348907,
                     0.94391226768493652,
                     0.92887943983078003,
                     1
                  ],
                  [
                     1.9936519861221313,
                     -0.12213099747896194,
                     -1.75,
                     0.34531253576278687,
                     -0.96107053756713867,
                     1
                  ],
                  [
                     0.53915202617645264,
                     1.1742910146713257,
                     -1.75,
                     -0.9686475396156311,
                     -0.92795354127883911,
                     1
                  ],
                  [
                     0.90277701616287231,
                     2.2306349277496338,
                     -0.67124998569488525,
                     -0.98960894346237183,
                     0.94649231433868408,
                     1
                  ],
                  [
                     2.0845589637756348,
                     1.4143689870834351,
                     -1.75,
                     -0.1377817690372467,
                     0.39659368991851807,
                     1
                  ]
               ],
               "colorMixMatrix" : [
                  [ 1, 0, 0, 0, 1, 0, 0, 0, 1 ]
               ],
               "colorTemperature" : [ 6500 ],
               "contrast" : [ 1 ],
               "eye" : [ 1.3606888055801392, 0.093350157141685486, 0.67123597860336304 ],
               "far" : [ 100 ],
               "fov" : [ 59.066123962402344 ],
               "getReprojectionError" : [ 0 ],
               "grabMipmapLevel" : [ -1 ],
               "hide" : [ 0 ],
               "multisampling" : [ 0 ],
               "near" : [ 0.10000000149011612 ],
               "principalPoint" : [ 0.54526180028915405, 1.1292301416397095 ],
               "priorityShift" : [ 0 ],
               "saturation" : [ 1 ],
               "savable" : [ 1 ],
               "size" : [ 1920, 1080 ],
               "target" : [ 1.9580107927322388, 0.69159090518951416, 0.13708755373954773 ],
               "timestamp" : [ 0 ],
               "type" : "camera",
               "up" : [ 0.30004680156707764, 0.45095726847648621, 0.84060066938400269 ],
               "weightedCalibrationPoints" : [ 1 ]
            },
            "CubeMap_mesh" : {
               "alias" : [ "CubeMap_mesh" ],
               "file" : [ "splash_Cubemap.obj" ],
               "priorityShift" : [ 0 ],
               "savable" : [ 1 ],
               "timestamp" : [ -1427761440 ],
               "type" : "mesh"
            },
            "EIS_output" : {
               "alias" : [ "EIS_output" ],
               "autosetResolution" : [ 1 ],
               "captureSize" : [ 3840, 2160 ],
               "device" : [ "/dev/video0" ],
               "doCapture" : [ 1 ],
               "file" : [ "" ],
               "flip" : [ 1 ],
               "flop" : [ 0 ],
               "index" : [ 0 ],
               "mediaInfo" : [ 3840, 2160, 16, 3, "YUYV", 1, "/dev/video0", 0 ],
               "pattern" : [ 0 ],
               "pixelFormat" : [ "YUYV" ],
               "priorityShift" : [ 0 ],
               "savable" : [ 1 ],
               "sourceFormat" : [ "" ],
               "srgb" : [ 1 ],
               "timestamp" : [ -1995404586 ],
               "type" : "image_v4l2"
            },
            "Mesh" : {
               "alias" : [ "Mesh" ],
               "file" : [
                  "/home/stationadmin/dev/ixworkshop/splash/foyer/splash_Foyer.obj\u0000\u0000\u0000\u0000\u0000\u0000\u0000\u0000\u0000\u0000\u0000\u0000\u0000\u0000\u0000\u0000\u0000\u0000\u0000\u0000\u0000\u0000\u0000\u0000\u0000\u0000\u0000\u0000\u0000\u0000\u0000\u0000\u0000\u0000\u0000\u0000\u0000\u0000\u0000\u0000\u0000\u0000\u0000\u0000\u0000\u0000\u0000\u0000\u0000\u0000\u0000\u0000\u0000\u0000\u0000\u0000\u0000\u0000\u0000\u0000\u0000\u0000\u0000\u0000\u0000\u0000\u0000\u0000\u0000\u0000\u0000\u0000\u0000\u0000\u0000\u0000\u0000\u0000\u0000\u0000\u0000\u0000\u0000\u0000\u0000\u0000\u0000\u0000\u0000\u0000\u0000\u0000\u0000\u0000\u0000\u0000\u0000\u0000\u0000\u0000\u0000\u0000\u0000\u0000\u0000\u0000\u0000\u0000\u0000\u0000\u0000\u0000\u0000\u0000\u0000\u0000\u0000\u0000\u0000\u0000\u0000\u0000\u0000\u0000\u0000\u0000\u0000\u0000\u0000\u0000\u0000\u0000\u0000\u0000\u0000\u0000\u0000\u0000\u0000\u0000\u0000\u0000\u0000\u0000\u0000\u0000\u0000\u0000\u0000\u0000\u0000\u0000\u0000\u0000\u0000\u0000\u0000\u0000\u0000\u0000\u0000\u0000\u0000\u0000\u0000\u0000\u0000\u0000\u0000\u0000\u0000\u0000\u0000\u0000\u0000\u0000\u0000\u0000\u0000\u0000\u0000\u0000\u0000\u0000\u0000\u0000\u0000\u0000\u0000\u0000\u0000\u0000\u0000\u0000\u0000\u0000\u0000\u0000\u0000\u0000\u0000\u0000\u0000\u0000\u0000\u0000\u0000\u0000\u0000\u0000\u0000\u0000\u0000\u0000\u0000\u0000\u0000\u0000\u0000\u0000\u0000\u0000\u0000\u0000\u0000\u0000\u0000\u0000\u0000\u0000\u0000\u0000\u0000\u0000\u0000\u0000\u0000\u0000\u0000\u0000\u0000\u0000\u0000\u0000\u0000\u0000\u0000\u0000\u0000\u0000\u0000\u0000\u0000\u0000\u0000\u0000\u0000\u0000\u0000\u0000\u0000\u0000\u0000\u0000\u0000\u0000\u0000\u0000\u0000\u0000\u0000\u0000\u0000\u0000\u0000\u0000\u0000\u0000\u0000\u0000\u0000\u0000\u0000\u0000\u0000\u0000\u0000\u0000\u0000\u0000\u0000\u0000\u0000\u0000\u0000\u0000\u0000\u0000\u0000\u0000\u0000\u0000\u0000\u0000\u0000\u0000\u0000\u0000\u0000\u0000\u0000\u0000\u0000\u0000\u0000\u0000\u0000\u0000\u0000\u0000\u0000\u0000\u0000\u0000\u0000\u0000\u0000\u0000\u0000\u0000\u0000\u0000\u0000\u0000\u0000\u0000\u0000\u0000\u0000\u0000\u0000\u0000\u0000\u0000\u0000\u0000\u0000\u0000\u0000\u0000\u0000\u0000\u0000\u0000\u0000\u0000\u0000\u0000\u0000\u0000\u0000\u0000\u0000\u0000\u0000\u0000\u0000\u0000\u0000\u0000\u0000\u0000\u0000\u0000\u0000\u0000\u0000\u0000\u0000\u0000\u0000\u0000\u0000\u0000\u0000\u0000\u0000\u0000\u0000\u0000\u0000\u0000\u0000\u0000\u0000\u0000\u0000\u0000\u0000\u0000\u0000\u0000\u0000\u0000\u0000\u0000\u0000\u0000\u0000\u0000\u0000\u0000\u0000\u0000\u0000\u0000\u0000\u0000\u0000\u0000\u0000\u0000\u0000\u0000\u0000\u0000\u0000\u0000\u0000\u0000\u0000\u0000\u0000\u0000\u0000\u0000\u0000\u0000\u0000\u0000\u0000\u0000\u0000\u0000\u0000\u0000\u0000\u0000\u0000"
               ],
               "priorityShift" : [ 0 ],
               "savable" : [ 1 ],
               "timestamp" : [ 1606028234 ],
               "type" : "mesh"
            },
            "Object" : {
               "alias" : [ "Object" ],
               "color" : [ 1, 1, 1, 1 ],
               "fill" : [ "texture" ],
               "normalExponent" : [ 0 ],
               "position" : [ 0, 0, 0 ],
               "priorityShift" : [ 0 ],
               "rotation" : [ 0, 0, 0 ],
               "savable" : [ 1 ],
               "scale" : [ 1, 1, 1 ],
               "sideness" : [ 1 ],
               "timestamp" : [ 0 ],
               "type" : "object"
            },
            "Probe" : {
               "alias" : [ "Probe" ],
               "position" : [ 0, 0, 0 ],
               "priorityShift" : [ 0 ],
               "projection" : [ "equirectangular" ],
               "rotation" : [ 0, -90, 90 ],
               "savable" : [ 1 ],
               "size" : [ 4096, 2048 ],
               "sphericalFov" : [ 180 ],
               "timestamp" : [ -1 ],
               "type" : "virtual_probe"
            },
            "VirtualCube" : {
               "alias" : [ "VirtualCube" ],
               "color" : [ 1, 1, 1, 1 ],
               "fill" : [ "texture" ],
               "normalExponent" : [ 0 ],
               "position" : [ 0, 0, 0 ],
               "priorityShift" : [ 0 ],
               "rotation" : [ 0, 0, 0 ],
               "savable" : [ 1 ],
               "scale" : [ 1, 1, 1 ],
               "sideness" : [ 2 ],
               "timestamp" : [ -1995438284 ],
               "type" : "object"
            },
            "VirtualCube_EIS_output_filter" : {
               "alias" : [ "VirtualCube_EIS_output_filter" ],
               "blackLevel" : [ 0 ],
               "blackLevelAuto" : [ 0, 1 ],
               "brightness" : [ 1 ],
               "buffer" : [ 0 ],
               "colorCurveAnchors" : [ 0 ],
               "colorTemperature" : [ 6500 ],
               "contrast" : [ 1 ],
               "fileFilterSource" : [ "" ],
               "filterSource" : [ "" ],
               "grabMipmapLevel" : [ -1 ],
               "invertChannels" : [ 0 ],
               "keepRatio" : [ 0 ],
               "priorityShift" : [ 0 ],
               "saturation" : [ 1 ],
               "savable" : [ 1 ],
               "scale" : [ 1, 1 ],
               "size" : [ 3840, 2160 ],
               "sizeOverride" : [ -1, -1 ],
               "timestamp" : [ -1995438284 ],
               "type" : "filter",
               "watchShaderFile" : [ 0 ]
            },
            "Window" : {
               "alias" : [ "Window" ],
               "decorated" : [ 0 ],
               "gamma" : [ 2.2000000476837158 ],
               "layout" : [ 0, 1, 2, 3 ],
               "position" : [ 0, 0 ],
               "presentationDelay" : [ -1995387978 ],
               "priorityShift" : [ 0 ],
               "savable" : [ 1 ],
               "size" : [ 7680, 1080 ],
               "srgb" : [ 1 ],
               "textureList" : [
                  "Window_Cam1_warp",
                  "Window_Cam2_warp",
                  "Window_Cam3_warp",
                  "Window_Cam4_warp"
               ],
               "timestamp" : [ 0 ],
               "type" : "window"
            },
            "Window_Cam1_warp" : {
               "alias" : [ "Window_Cam1_warp" ],
               "buffer" : [ 0 ],
               "grabMipmapLevel" : [ -1 ],
               "patchControl" : [
                  6,
                  6,
                  [ -0.87532830238342285, -0.99814045429229736 ],
                  [ -0.55500060319900513, -1 ],
                  [ -0.19999998807907104, -1 ],
                  [ 0.21500007808208466, -1.0210009813308716 ],
                  [ 0.58800017833709717, -1 ],
                  [ 1, -1 ],
                  [ -0.89900130033493042, -0.60000002384185791 ],
                  [ -0.58400028944015503, -0.60000002384185791 ],
                  [ -0.19999998807907104, -0.60000002384185791 ],
                  [ 0.20000004768371582, -0.60000002384185791 ],
                  [ 0.58000028133392334, -0.58700019121170044 ],
                  [ 0.97300034761428833, -0.56000053882598877 ],
                  [ -0.92805534601211548, -0.19999998807907104 ],
                  [ -0.61299985647201538, -0.19999998807907104 ],
                  [ -0.19999998807907104, -0.19999998807907104 ],
                  [ 0.18000000715255737, -0.20199999213218689 ],
                  [ 0.50100129842758179, -0.17799994349479675 ],
                  [ 0.98500019311904907, -0.15599989891052246 ],
                  [ -0.95300060510635376, 0.20000004768371582 ],
                  [ -0.64005392789840698, 0.20000004768371582 ],
                  [ -0.19999998807907104, 0.20000004768371582 ],
                  [ 0.12499989569187164, 0.19700004160404205 ],
                  [ 0.56400048732757568, 0.20400005578994751 ],
                  [ 1.0310014486312866, 0.21200007200241089 ],
                  [ -0.96700042486190796, 0.60000002384185791 ],
                  [ -0.66899913549423218, 0.60000002384185791 ],
                  [ -0.19999998807907104, 0.60000002384185791 ],
                  [ 0.16499997675418854, 0.57300037145614624 ],
                  [ 0.56900042295455933, 0.5750003457069397 ],
                  [ 1.0280013084411621, 0.63699954748153687 ],
                  [ -0.98800015449523926, 1 ],
                  [ -0.69299882650375366, 1 ],
                  [ -0.19999998807907104, 1 ],
                  [ 0.17399999499320984, 0.99700003862380981 ],
                  [ 0.59300011396408081, 1 ],
                  [ 1.0410019159317017, 1.010000467300415 ]
               ],
               "patchResolution" : [ 64 ],
               "patchSize" : [ 6, 6 ],
               "priorityShift" : [ 0 ],
               "savable" : [ 1 ],
               "size" : [ 1920, 1080 ],
               "timestamp" : [ 0 ],
               "type" : "warp"
            },
            "Window_Cam2_warp" : {
               "alias" : [ "Window_Cam2_warp" ],
               "buffer" : [ 0 ],
               "grabMipmapLevel" : [ -1 ],
               "patchControl" : [
                  6,
                  6,
                  [ -0.92500096559524536, -0.90800118446350098 ],
                  [ -0.63499957323074341, -0.99500006437301636 ],
                  [ -0.17799994349479675, -1 ],
                  [ 0.20000004768371582, -1 ],
                  [ 0.60000002384185791, -1 ],
                  [ 1, -1 ],
                  [ -0.92700093984603882, -0.53400087356567383 ],
                  [ -0.7119985818862915, -0.69599878787994385 ],
                  [ -0.079999744892120361, -0.53000092506408691 ],
                  [ 0.22300009429454803, -0.57200038433074951 ],
                  [ 0.60799992084503174, -0.60000002384185791 ],
                  [ 1, -0.60000002384185791 ],
                  [ -0.91200113296508789, -0.047999735921621323 ],
                  [ -0.73499828577041626, -0.23500005900859833 ],
                  [ -0.072999730706214905, -0.11499981582164764 ],
                  [ 0.08999982476234436, -0.32299914956092834 ],
                  [ 0.60000002384185791, -0.19999998807907104 ],
                  [ 1, -0.19999998807907104 ],
                  [ -0.89700132608413696, 0.25300011038780212 ],
                  [ -0.70399868488311768, 0.20400005578994751 ],
                  [ -0.078999742865562439, 0.21100006997585297 ],
                  [ 0.13099990785121918, 0.20000004768371582 ],
                  [ 0.60000002384185791, 0.20000004768371582 ],
                  [ 1, 0.20000004768371582 ],
                  [ -0.94100075960159302, 0.65199935436248779 ],
                  [ -0.67099910974502563, 0.62499970197677612 ],
                  [ -0.16999992728233337, 0.56500047445297241 ],
                  [ 0.15699996054172516, 0.5750003457069397 ],
                  [ 0.60000002384185791, 0.60000002384185791 ],
                  [ 1, 0.60000002384185791 ],
                  [ -0.91700106859207153, 1.0220010280609131 ],
                  [ -0.70899862051010132, 1.008000373840332 ],
                  [ -0.17199993133544922, 0.99500006437301636 ],
                  [ 0.17399999499320984, 0.95700055360794067 ],
                  [ 0.60000002384185791, 1 ],
                  [ 1, 1 ]
               ],
               "patchResolution" : [ 64 ],
               "patchSize" : [ 6, 6 ],
               "priorityShift" : [ 0 ],
               "savable" : [ 1 ],
               "size" : [ 1920, 1080 ],
               "timestamp" : [ 0 ],
               "type" : "warp"
            },
            "Window_Cam3_warp" : {
               "alias" : [ "Window_Cam3_warp" ],
               "buffer" : [ 0 ],
               "grabMipmapLevel" : [ -1 ],
               "patchControl" : [
                  4,
                  4,
                  [ -1, -1 ],
                  [ -0.33333331346511841, -1 ],
                  [ 0.33333337306976318, -1 ],
                  [ 1, -1 ],
                  [ -1, -0.33333331346511841 ],
                  [ -0.33333331346511841, -0.33333331346511841 ],
                  [ 0.33333337306976318, -0.33333331346511841 ],
                  [ 1, -0.33333331346511841 ],
                  [ -1, 0.33333337306976318 ],
                  [ -0.33333331346511841, 0.33333337306976318 ],
                  [ 0.33333337306976318, 0.33333337306976318 ],
                  [ 1, 0.33333337306976318 ],
                  [ -1, 1 ],
                  [ -0.33333331346511841, 1 ],
                  [ 0.33333337306976318, 1 ],
                  [ 1, 1 ]
               ],
               "patchResolution" : [ 64 ],
               "patchSize" : [ 4, 4 ],
               "priorityShift" : [ 0 ],
               "savable" : [ 1 ],
               "size" : [ 1920, 1080 ],
               "timestamp" : [ 0 ],
               "type" : "warp"
            },
            "Window_Cam4_warp" : {
               "alias" : [ "Window_Cam4_warp" ],
               "buffer" : [ 0 ],
               "grabMipmapLevel" : [ -1 ],
               "patchControl" : [
                  6,
                  6,
                  [ -1, -1 ],
                  [ -0.60000002384185791, -1 ],
                  [ -0.19999998807907104, -1 ],
                  [ 0.20000004768371582, -1 ],
                  [ 0.60000002384185791, -1 ],
                  [ 1, -1 ],
                  [ -1, -0.60000002384185791 ],
                  [ -0.60000002384185791, -0.60000002384185791 ],
                  [ -0.19999998807907104, -0.60000002384185791 ],
                  [ 0.20000004768371582, -0.60000002384185791 ],
                  [ 0.60000002384185791, -0.60000002384185791 ],
                  [ 1, -0.60000002384185791 ],
                  [ -0.98800015449523926, -0.20499999821186066 ],
                  [ -0.59300011396408081, -0.21400001645088196 ],
                  [ -0.25200006365776062, -0.19299997389316559 ],
                  [ 0.12199988961219788, -0.17899994552135468 ],
                  [ 0.60399997234344482, -0.32699909806251526 ],
                  [ 1.0090004205703735, -0.39099827408790588 ],
                  [ -0.80600249767303467, 0.15799996256828308 ],
                  [ -0.60100001096725464, 0.12999990582466125 ],
                  [ -0.22600004076957703, 0.20000004768371582 ],
                  [ 0.15699996054172516, 0.24200013279914856 ],
                  [ 0.57900029420852661, 0.033999819308519363 ],
                  [ 1.004000186920166, 0.21800008416175842 ],
                  [ -1.0210009813308716, 0.61899977922439575 ],
                  [ -0.52800095081329346, 0.58100026845932007 ],
                  [ -0.20099999010562897, 0.50100129842758179 ],
                  [ 0.17299999296665192, 0.58800017833709717 ],
                  [ 0.64699941873550415, 0.57900029420852661 ],
                  [ 0.96100050210952759, 0.63099962472915649 ],
                  [ -0.96000051498413086, 0.97800028324127197 ],
                  [ -0.62599968910217285, 1.0160007476806641 ],
                  [ -0.19399997591972351, 0.95900052785873413 ],
                  [ 0.20500005781650543, 1.0380017757415771 ],
                  [ 0.55100065469741821, 1.0300014019012451 ],
                  [ 0.95600056648254395, 1.0360016822814941 ]
               ],
               "patchResolution" : [ 64 ],
               "patchSize" : [ 6, 6 ],
               "priorityShift" : [ 0 ],
               "savable" : [ 1 ],
               "size" : [ 1920, 1080 ],
               "timestamp" : [ 0 ],
               "type" : "warp"
            },
            "blender" : {
               "alias" : [ "blender" ],
               "mode" : [ "once" ],
               "priorityShift" : [ 0 ],
               "savable" : [ 1 ],
               "timestamp" : [ 0 ],
               "type" : "blender"
            },
            "colorCalibrator" : {
               "alias" : [ "colorCalibrator" ],
               "colorSamples" : [ 5 ],
               "detectionThresholdFactor" : [ 1 ],
               "equalizeMethod" : [ 2 ],
               "hdrStep" : [ 1 ],
               "imagePerHDR" : [ 1 ],
               "priorityShift" : [ 0 ],
               "savable" : [ 1 ],
               "timestamp" : [ 0 ],
               "type" : "colorCalibrator"
            },
            "dragndrop" : {
               "alias" : [ "dragndrop" ],
               "priorityShift" : [ 0 ],
               "savable" : [ 1 ],
               "timestamp" : [ 0 ],
               "type" : "dragndrop",
               "updateRate" : [ 10 ]
            },
            "filter_1" : {
               "alias" : [ "filter_1" ],
               "blackLevel" : [ 0 ],
               "blackLevelAuto" : [ 0, 1 ],
               "brightness" : [ 1 ],
               "buffer" : [ 0 ],
               "colorCurveAnchors" : [ 0 ],
               "colorTemperature" : [ 6500 ],
               "contrast" : [ 1 ],
               "fileFilterSource" : [ "" ],
               "filterSource" : [ "" ],
               "grabMipmapLevel" : [ -1 ],
               "invertChannels" : [ 0 ],
               "keepRatio" : [ 0 ],
               "priorityShift" : [ 0 ],
               "saturation" : [ 1 ],
               "savable" : [ 1 ],
               "scale" : [ 1, 1 ],
               "size" : [ 4096, 2048 ],
               "sizeOverride" : [ -1, -1 ],
               "timestamp" : [ 0 ],
               "type" : "filter",
               "watchShaderFile" : [ 0 ]
            },
            "geometricCalibrator" : {
               "alias" : [ "geometricCalibrator" ],
               "cameraFocal" : [ 5000 ],
               "cameraModel" : [ "PINHOLE" ],
               "captureDelay" : [ 250 ],
               "patternScale" : [ 0.0625 ],
               "priorityShift" : [ 0 ],
               "savable" : [ 1 ],
               "timestamp" : [ 0 ],
               "type" : "geometricCalibrator"
            },
            "gui" : {
               "alias" : [ "gui" ],
               "priorityShift" : [ 0 ],
               "savable" : [ 1 ],
               "timestamp" : [ 0 ],
               "type" : "gui"
            },
            "image_1" : {
               "alias" : [ "image_1" ],
               "file" : [
                  "/home/stationadmin/dev/splash/data/color_map.png\u0000\u0000\u0000\u0000\u0000\u0000\u0000\u0000\u0000\u0000\u0000\u0000\u0000\u0000\u0000\u0000\u0000\u0000\u0000\u0000\u0000\u0000\u0000\u0000\u0000\u0000\u0000\u0000\u0000\u0000\u0000\u0000\u0000\u0000\u0000\u0000\u0000\u0000\u0000\u0000\u0000\u0000\u0000\u0000\u0000\u0000\u0000\u0000\u0000\u0000\u0000\u0000\u0000\u0000\u0000\u0000\u0000\u0000\u0000\u0000\u0000\u0000\u0000\u0000\u0000\u0000\u0000\u0000\u0000\u0000\u0000\u0000\u0000\u0000\u0000\u0000\u0000\u0000\u0000\u0000\u0000\u0000\u0000\u0000\u0000\u0000\u0000\u0000\u0000\u0000\u0000\u0000\u0000\u0000\u0000\u0000\u0000\u0000\u0000\u0000\u0000\u0000\u0000\u0000\u0000\u0000\u0000\u0000\u0000\u0000\u0000\u0000\u0000\u0000\u0000\u0000\u0000\u0000\u0000\u0000\u0000\u0000\u0000\u0000\u0000\u0000\u0000\u0000\u0000\u0000\u0000\u0000\u0000\u0000\u0000\u0000\u0000\u0000\u0000\u0000\u0000\u0000\u0000\u0000\u0000\u0000\u0000\u0000\u0000\u0000\u0000\u0000\u0000\u0000\u0000\u0000\u0000\u0000\u0000\u0000\u0000\u0000\u0000\u0000\u0000\u0000\u0000\u0000\u0000\u0000\u0000\u0000\u0000\u0000\u0000\u0000\u0000\u0000\u0000\u0000\u0000\u0000\u0000\u0000\u0000\u0000\u0000\u0000\u0000\u0000\u0000\u0000\u0000\u0000\u0000\u0000\u0000\u0000\u0000\u0000\u0000\u0000\u0000\u0000\u0000\u0000\u0000\u0000\u0000\u0000\u0000\u0000\u0000\u0000\u0000\u0000\u0000\u0000\u0000\u0000\u0000\u0000\u0000\u0000\u0000\u0000\u0000\u0000\u0000\u0000\u0000\u0000\u0000\u0000\u0000\u0000\u0000\u0000\u0000\u0000\u0000\u0000\u0000\u0000\u0000\u0000\u0000\u0000\u0000\u0000\u0000\u0000\u0000\u0000\u0000\u0000\u0000\u0000\u0000\u0000\u0000\u0000\u0000\u0000\u0000\u0000\u0000\u0000\u0000\u0000\u0000\u0000\u0000\u0000\u0000\u0000\u0000\u0000\u0000\u0000\u0000\u0000\u0000\u0000\u0000\u0000\u0000\u0000\u0000\u0000\u0000\u0000\u0000\u0000\u0000\u0000\u0000\u0000\u0000\u0000\u0000\u0000\u0000\u0000\u0000\u0000\u0000\u0000\u0000\u0000\u0000\u0000\u0000\u0000\u0000\u0000\u0000\u0000\u0000\u0000\u0000\u0000\u0000\u0000\u0000\u0000\u0000\u0000\u0000\u0000\u0000\u0000\u0000\u0000\u0000\u0000\u0000\u0000\u0000\u0000\u0000\u0000\u0000\u0000\u0000\u0000\u0000\u0000\u0000\u0000\u0000\u0000\u0000\u0000\u0000\u0000\u0000\u0000\u0000\u0000\u0000\u0000\u0000\u0000\u0000\u0000\u0000\u0000\u0000\u0000\u0000\u0000\u0000\u0000\u0000\u0000\u0000\u0000\u0000\u0000\u0000\u0000\u0000\u0000\u0000\u0000\u0000\u0000\u0000\u0000\u0000\u0000\u0000\u0000\u0000\u0000\u0000\u0000\u0000\u0000\u0000\u0000\u0000\u0000\u0000\u0000\u0000\u0000\u0000\u0000\u0000\u0000\u0000\u0000\u0000\u0000\u0000\u0000\u0000\u0000\u0000\u0000\u0000\u0000\u0000\u0000\u0000\u0000\u0000\u0000\u0000\u0000\u0000\u0000\u0000\u0000\u0000\u0000\u0000\u0000\u0000\u0000\u0000\u0000\u0000\u0000\u0000\u0000\u0000\u0000\u0000\u0000\u0000\u0000\u0000\u0000\u0000\u0000\u0000\u0000\u0000\u0000\u0000\u0000"
               ],
               "flip" : [ 1 ],
               "flop" : [ 0 ],
               "mediaInfo" : [ 4096, 4096, 32, 4, "RGBA", 1 ],
               "pattern" : [ 0 ],
               "priorityShift" : [ 0 ],
               "savable" : [ 1 ],
               "srgb" : [ 1 ],
               "timestamp" : [ -1427392080 ],
               "type" : "image"
            },
            "joystick" : {
               "alias" : [ "joystick" ],
               "priorityShift" : [ 0 ],
               "savable" : [ 1 ],
               "timestamp" : [ 0 ],
               "type" : "joystick",
               "updateRate" : [ 100 ]
            },
            "keyboard" : {
               "alias" : [ "keyboard" ],
               "priorityShift" : [ 0 ],
               "savable" : [ 1 ],
               "timestamp" : [ 0 ],
               "type" : "keyboard",
               "updateRate" : [ 100 ]
            },
            "mouse" : {
               "alias" : [ "mouse" ],
               "priorityShift" : [ 0 ],
               "savable" : [ 1 ],
               "timestamp" : [ 0 ],
               "type" : "mouse",
               "updateRate" : [ 100 ]
            }
         },
         "swapInterval" : [ 1 ]
      }
   },
   "version" : "0.7.21",
   "world" : {
      "clock" : [ -1995387076 ],
      "clockDeviceName" : [ "" ],
      "configurationPath" : [ "/home/stationadmin/dev/ixworkshop/splash/foyer/" ],
      "forceRealtime" : [ 0 ],
      "framerate" : [ 60 ],
      "looseClock" : [ 0 ],
      "mediaPath" : [ "/home/stationadmin/dev/ixworkshop/splash/foyer/" ]
   }
}
