{
   "description" : "splashConfiguration",
   "scenes" : {
      "GPU" : {
         "display" : 0,
         "links" : [
            [ "Object", "gui" ],
            [ "VirtualCube", "gui" ],
            [ "Object", "Cam1" ],
            [ "Object", "Cam2" ],
            [ "Object", "Cam3" ],
            [ "Object", "Cam4" ],
            [ "Mesh", "Object" ],
            [ "Probe", "Object" ],
            [ "VirtualCube", "Probe" ],
            [ "CubeMap_mesh", "VirtualCube" ],
            [ "EIS_output", "VirtualCube" ],
            [ "VirtualCube_EIS_output_filter", "VirtualCube" ],
            [ "EIS_output", "VirtualCube_EIS_output_filter" ],
            [ "gui", "Window" ],
            [ "Cam1", "Window" ],
            [ "Cam2", "Window" ],
            [ "Cam3", "Window" ],
            [ "Cam4", "Window" ],
            [ "Window_Cam1_warp", "Window" ],
            [ "Window_Cam2_warp", "Window" ],
            [ "Window_Cam3_warp", "Window" ],
            [ "Window_Cam4_warp", "Window" ],
            [ "Cam1", "Window_Cam1_warp" ],
            [ "Cam2", "Window_Cam2_warp" ],
            [ "Cam3", "Window_Cam3_warp" ],
            [ "Cam4", "Window_Cam4_warp" ],
            [ "Probe", "filter_1" ]
         ],
         "objects" : {
            "Cam1" : {
               "16bits" : [ 1 ],
               "activateColorLUT" : [ 0 ],
               "alias" : [ "Cam1" ],
               "blendPrecision" : [ 0.10000000149011612 ],
               "blendWidth" : [ 0.05000000074505806 ],
               "brightness" : [ 1 ],
               "buffer" : [ 0 ],
               "colorMixMatrix" : [
                  [ 1, 0, 0, 0, 1, 0, 0, 0, 1 ]
               ],
               "colorTemperature" : [ 6500 ],
               "contrast" : [ 1 ],
               "eye" : [ 0.13892500102519989, -0.08789370208978653, -0.0058720400556921959 ],
               "far" : [ 100 ],
               "fov" : [ 28.841547012329102 ],
               "getReprojectionError" : [ 0 ],
               "grabMipmapLevel" : [ -1 ],
               "hide" : [ 0 ],
               "multisampling" : [ 0 ],
               "near" : [ 0.10000000149011612 ],
               "principalPoint" : [ 0.574878990650177, 1.2755999565124512 ],
               "priorityShift" : [ 0 ],
               "saturation" : [ 1 ],
               "savable" : [ 1 ],
               "size" : [ 1920, 1080 ],
               "target" : [ -0.33645901083946228, -0.30319499969482422, 0.84715497493743896 ],
               "timestamp" : [ 0 ],
               "type" : "camera",
               "up" : [ 0.09248650074005127, -0.97645097970962524, -0.19491100311279297 ],
               "weightedCalibrationPoints" : [ 1 ]
            },
            "Cam2" : {
               "16bits" : [ 1 ],
               "activateColorLUT" : [ 0 ],
               "alias" : [ "Cam2" ],
               "blendPrecision" : [ 0.10000000149011612 ],
               "blendWidth" : [ 0.05000000074505806 ],
               "brightness" : [ 1 ],
               "buffer" : [ 0 ],
               "colorMixMatrix" : [
                  [ 1, 0, 0, 0, 1, 0, 0, 0, 1 ]
               ],
               "colorTemperature" : [ 6500 ],
               "contrast" : [ 1 ],
               "eye" : [ -0.050616998225450516, -0.13849399983882904, 0.30552700161933899 ],
               "far" : [ 100 ],
               "fov" : [ 35.906101226806641 ],
               "getReprojectionError" : [ 0 ],
               "grabMipmapLevel" : [ -1 ],
               "hide" : [ 0 ],
               "multisampling" : [ 0 ],
               "near" : [ 0.10000000149011612 ],
               "principalPoint" : [ 0.56670498847961426, 1.1360800266265869 ],
               "priorityShift" : [ 0 ],
               "saturation" : [ 1 ],
               "savable" : [ 1 ],
               "size" : [ 1920, 1080 ],
               "target" : [ 0.71668899059295654, -0.15165500342845917, 0.94667297601699829 ],
               "timestamp" : [ 0 ],
               "type" : "camera",
               "up" : [ -0.005288389977067709, -0.99988502264022827, -0.014196399599313736 ],
               "weightedCalibrationPoints" : [ 1 ]
            },
            "Cam3" : {
               "16bits" : [ 1 ],
               "activateColorLUT" : [ 0 ],
               "alias" : [ "Cam3" ],
               "blendPrecision" : [ 0.10000000149011612 ],
               "blendWidth" : [ 0.05000000074505806 ],
               "brightness" : [ 1 ],
               "buffer" : [ 0 ],
               "colorMixMatrix" : [
                  [ 1, 0, 0, 0, 1, 0, 0, 0, 1 ]
               ],
               "colorTemperature" : [ 6500 ],
               "contrast" : [ 1 ],
               "eye" : [ 0.072895899415016174, -0.1596979945898056, 0.41405001282691956 ],
               "far" : [ 100 ],
               "fov" : [ 57.317600250244141 ],
               "getReprojectionError" : [ 0 ],
               "grabMipmapLevel" : [ -1 ],
               "hide" : [ 0 ],
               "multisampling" : [ 0 ],
               "near" : [ 0.10000000149011612 ],
               "principalPoint" : [ 0.46987798810005188, 1.1648600101470947 ],
               "priorityShift" : [ 0 ],
               "saturation" : [ 1 ],
               "savable" : [ 1 ],
               "size" : [ 1920, 1080 ],
               "target" : [ 0.38386198878288269, -0.14492900669574738, 1.364359974861145 ],
               "timestamp" : [ 0 ],
               "type" : "camera",
               "up" : [ 0.022298000752925873, -0.99971699714660645, 0.0082411095499992371 ],
               "weightedCalibrationPoints" : [ 1 ]
            },
            "Cam4" : {
               "16bits" : [ 1 ],
               "activateColorLUT" : [ 0 ],
               "alias" : [ "Cam4" ],
               "blendPrecision" : [ 0.10000000149011612 ],
               "blendWidth" : [ 0.05000000074505806 ],
               "brightness" : [ 1 ],
               "buffer" : [ 0 ],
               "colorMixMatrix" : [
                  [ 1, 0, 0, 0, 1, 0, 0, 0, 1 ]
               ],
               "colorTemperature" : [ 6500 ],
               "contrast" : [ 1 ],
               "eye" : [ 0.063087202608585358, -0.15174099802970886, 0.2790989875793457 ],
               "far" : [ 100 ],
               "fov" : [ 51.499801635742188 ],
               "getReprojectionError" : [ 0 ],
               "grabMipmapLevel" : [ -1 ],
               "hide" : [ 0 ],
               "multisampling" : [ 0 ],
               "near" : [ 0.10000000149011612 ],
               "principalPoint" : [ 0.45020198822021484, 1.5 ],
               "priorityShift" : [ 0 ],
               "saturation" : [ 1 ],
               "savable" : [ 1 ],
               "size" : [ 1920, 1080 ],
               "target" : [ 0.39383101463317871, 0.01672540046274662, 1.2076599597930908 ],
               "timestamp" : [ 0 ],
               "type" : "camera",
               "up" : [ 0.012835700064897537, -0.98465001583099365, 0.17407000064849854 ],
               "weightedCalibrationPoints" : [ 1 ]
            },
            "CubeMap_mesh" : {
               "alias" : [ "CubeMap_mesh" ],
               "file" : [
                  "/home/stationadmin/cubemap.obj\u0000\u0000\u0000\u0000\u0000\u0000\u0000\u0000\u0000\u0000\u0000\u0000\u0000\u0000\u0000\u0000\u0000\u0000\u0000\u0000\u0000\u0000\u0000\u0000\u0000\u0000\u0000\u0000\u0000\u0000\u0000\u0000\u0000\u0000\u0000\u0000\u0000\u0000\u0000\u0000\u0000\u0000\u0000\u0000\u0000\u0000\u0000\u0000\u0000\u0000\u0000\u0000\u0000\u0000\u0000\u0000\u0000\u0000\u0000\u0000\u0000\u0000\u0000\u0000\u0000\u0000\u0000\u0000\u0000\u0000\u0000\u0000\u0000\u0000\u0000\u0000\u0000\u0000\u0000\u0000\u0000\u0000\u0000\u0000\u0000\u0000\u0000\u0000\u0000\u0000\u0000\u0000\u0000\u0000\u0000\u0000\u0000\u0000\u0000\u0000\u0000\u0000\u0000\u0000\u0000\u0000\u0000\u0000\u0000\u0000\u0000\u0000\u0000\u0000\u0000\u0000\u0000\u0000\u0000\u0000\u0000\u0000\u0000\u0000\u0000\u0000\u0000\u0000\u0000\u0000\u0000\u0000\u0000\u0000\u0000\u0000\u0000\u0000\u0000\u0000\u0000\u0000\u0000\u0000\u0000\u0000\u0000\u0000\u0000\u0000\u0000\u0000\u0000\u0000\u0000\u0000\u0000\u0000\u0000\u0000\u0000\u0000\u0000\u0000\u0000\u0000\u0000\u0000\u0000\u0000\u0000\u0000\u0000\u0000\u0000\u0000\u0000\u0000\u0000\u0000\u0000\u0000\u0000\u0000\u0000\u0000\u0000\u0000\u0000\u0000\u0000\u0000\u0000\u0000\u0000\u0000\u0000\u0000\u0000\u0000\u0000\u0000\u0000\u0000\u0000\u0000\u0000\u0000\u0000\u0000\u0000\u0000\u0000\u0000\u0000\u0000\u0000\u0000\u0000\u0000\u0000\u0000\u0000\u0000\u0000\u0000\u0000\u0000\u0000\u0000\u0000\u0000\u0000\u0000\u0000\u0000\u0000\u0000\u0000\u0000\u0000\u0000\u0000\u0000\u0000\u0000\u0000\u0000\u0000\u0000\u0000\u0000\u0000\u0000\u0000\u0000\u0000\u0000\u0000\u0000\u0000\u0000\u0000\u0000\u0000\u0000\u0000\u0000\u0000\u0000\u0000\u0000\u0000\u0000\u0000\u0000\u0000\u0000\u0000\u0000\u0000\u0000\u0000\u0000\u0000\u0000\u0000\u0000\u0000\u0000\u0000\u0000\u0000\u0000\u0000\u0000\u0000\u0000\u0000\u0000\u0000\u0000\u0000\u0000\u0000\u0000\u0000\u0000\u0000\u0000\u0000\u0000\u0000\u0000\u0000\u0000\u0000\u0000\u0000\u0000\u0000\u0000\u0000\u0000\u0000\u0000\u0000\u0000\u0000\u0000\u0000\u0000\u0000\u0000\u0000\u0000\u0000\u0000\u0000\u0000\u0000\u0000\u0000\u0000\u0000\u0000\u0000\u0000\u0000\u0000\u0000\u0000\u0000\u0000\u0000\u0000\u0000\u0000\u0000\u0000\u0000\u0000\u0000\u0000\u0000\u0000\u0000\u0000\u0000\u0000\u0000\u0000\u0000\u0000\u0000\u0000\u0000\u0000\u0000\u0000\u0000\u0000\u0000\u0000\u0000\u0000\u0000\u0000\u0000\u0000\u0000\u0000\u0000\u0000\u0000\u0000\u0000\u0000\u0000\u0000\u0000\u0000\u0000\u0000\u0000\u0000\u0000\u0000\u0000\u0000\u0000\u0000\u0000\u0000\u0000\u0000\u0000\u0000\u0000\u0000\u0000\u0000\u0000\u0000\u0000\u0000\u0000\u0000\u0000\u0000\u0000\u0000\u0000\u0000\u0000\u0000\u0000\u0000\u0000\u0000\u0000\u0000\u0000\u0000\u0000\u0000\u0000\u0000\u0000\u0000\u0000\u0000\u0000\u0000\u0000\u0000\u0000\u0000\u0000\u0000\u0000\u0000\u0000\u0000\u0000\u0000\u0000\u0000\u0000\u0000\u0000\u0000\u0000\u0000\u0000\u0000\u0000\u0000\u0000\u0000\u0000\u0000"
               ],
               "priorityShift" : [ 0 ],
               "savable" : [ 1 ],
               "timestamp" : [ 859478350 ],
               "type" : "mesh"
            },
            "EIS_output" : {
               "alias" : [ "EIS_output" ],
               "autosetResolution" : [ 1 ],
               "captureSize" : [ 3840, 2160 ],
               "device" : [ "/dev/video0" ],
               "doCapture" : [ 1 ],
               "file" : [ "" ],
               "flip" : [ 1 ],
               "flop" : [ 0 ],
               "index" : [ 0 ],
               "mediaInfo" : [ 3840, 2160, 16, 3, "YUYV", 1, "/dev/video0", 0 ],
               "pattern" : [ 0 ],
               "pixelFormat" : [ "YUYV" ],
               "priorityShift" : [ 0 ],
               "savable" : [ 1 ],
               "sourceFormat" : [ "" ],
               "srgb" : [ 1 ],
               "timestamp" : [ -2037411629 ],
               "type" : "image_v4l2"
            },
            "Mesh" : {
               "alias" : [ "Mesh" ],
               "file" : [
                  "/home/stationadmin/foyer_equirectangular.obj"
               ],
               "priorityShift" : [ 0 ],
               "savable" : [ 1 ],
               "timestamp" : [ 1683922981 ],
               "type" : "mesh"
            },
            "Object" : {
               "alias" : [ "Object" ],
               "color" : [ 1, 1, 1, 1 ],
               "fill" : [ "texture" ],
               "normalExponent" : [ 0 ],
               "position" : [ 0, 0, 0 ],
               "priorityShift" : [ 0 ],
               "rotation" : [ 0, 0, 0 ],
               "savable" : [ 1 ],
               "scale" : [ 1, 1, 1 ],
               "sideness" : [ 2 ],
               "timestamp" : [ 0 ],
               "type" : "object"
            },
            "Probe" : {
               "alias" : [ "Probe" ],
               "position" : [ 0, 0, 0 ],
               "priorityShift" : [ 0 ],
               "projection" : [ "equirectangular" ],
               "rotation" : [ 0, -90, 0 ],
               "savable" : [ 1 ],
               "size" : [ 4096, 2048 ],
               "sphericalFov" : [ 210 ],
               "timestamp" : [ -1 ],
               "type" : "virtual_probe"
            },
            "VirtualCube" : {
               "alias" : [ "VirtualCube" ],
               "color" : [ 1, 1, 1, 1 ],
               "fill" : [ "texture" ],
               "normalExponent" : [ 0 ],
               "position" : [ 0, 0, 0 ],
               "priorityShift" : [ 0 ],
               "rotation" : [ 0, 0, 0 ],
               "savable" : [ 1 ],
               "scale" : [ 1, 1, 1 ],
               "sideness" : [ 2 ],
               "timestamp" : [ -2037411629 ],
               "type" : "object"
            },
            "VirtualCube_EIS_output_filter" : {
               "alias" : [ "VirtualCube_EIS_output_filter" ],
               "blackLevel" : [ 0 ],
               "blackLevelAuto" : [ 0, 1 ],
               "brightness" : [ 1 ],
               "buffer" : [ 0 ],
               "colorCurveAnchors" : [ 0 ],
               "colorTemperature" : [ 6500 ],
               "contrast" : [ 1 ],
               "fileFilterSource" : [ "" ],
               "filterSource" : [ "" ],
               "grabMipmapLevel" : [ -1 ],
               "invertChannels" : [ 0 ],
               "keepRatio" : [ 0 ],
               "priorityShift" : [ 0 ],
               "saturation" : [ 1 ],
               "savable" : [ 1 ],
               "scale" : [ 1, 1 ],
               "size" : [ 3840, 2160 ],
               "sizeOverride" : [ -1, -1 ],
               "timestamp" : [ -2037411629 ],
               "type" : "filter",
               "watchShaderFile" : [ 0 ]
            },
            "Window" : {
               "alias" : [ "Window" ],
               "decorated" : [ 0 ],
               "gamma" : [ 2.2000000476837158 ],
               "layout" : [ 0, 1, 2, 3 ],
               "position" : [ 0, 0 ],
               "presentationDelay" : [ -1964911023 ],
               "priorityShift" : [ 0 ],
               "savable" : [ 1 ],
               "size" : [ 7680, 1080 ],
               "srgb" : [ 1 ],
               "textureList" : [
                  "Window_Cam1_warp",
                  "Window_Cam2_warp",
                  "Window_Cam3_warp",
                  "Window_Cam4_warp"
               ],
               "timestamp" : [ 0 ],
               "type" : "window"
            },
            "Window_Cam1_warp" : {
               "alias" : [ "Window_Cam1_warp" ],
               "buffer" : [ 0 ],
               "grabMipmapLevel" : [ -1 ],
               "patchControl" : [
                  4,
                  4,
                  [ -1, -1 ],
                  [ -0.33333331346511841, -1 ],
                  [ 0.33333337306976318, -1 ],
                  [ 1, -1 ],
                  [ -1, -0.33333331346511841 ],
                  [ -0.33333331346511841, -0.33333331346511841 ],
                  [ 0.33333337306976318, -0.33333331346511841 ],
                  [ 1, -0.33333331346511841 ],
                  [ -1, 0.33333337306976318 ],
                  [ -0.33333331346511841, 0.33333337306976318 ],
                  [ 0.33333337306976318, 0.33333337306976318 ],
                  [ 1, 0.33333337306976318 ],
                  [ -1, 1 ],
                  [ -0.33333331346511841, 1 ],
                  [ 0.33333337306976318, 1 ],
                  [ 1, 1 ]
               ],
               "patchResolution" : [ 64 ],
               "patchSize" : [ 4, 4 ],
               "priorityShift" : [ 0 ],
               "savable" : [ 1 ],
               "size" : [ 1920, 1080 ],
               "timestamp" : [ 0 ],
               "type" : "warp"
            },
            "Window_Cam2_warp" : {
               "alias" : [ "Window_Cam2_warp" ],
               "buffer" : [ 0 ],
               "grabMipmapLevel" : [ -1 ],
               "patchControl" : [
                  4,
                  4,
                  [ -1, -1 ],
                  [ -0.33333331346511841, -1 ],
                  [ 0.33333337306976318, -1 ],
                  [ 1, -1 ],
                  [ -1, -0.33333331346511841 ],
                  [ -0.33333331346511841, -0.33333331346511841 ],
                  [ 0.33333337306976318, -0.33333331346511841 ],
                  [ 1, -0.33333331346511841 ],
                  [ -1, 0.33333337306976318 ],
                  [ -0.33333331346511841, 0.33333337306976318 ],
                  [ 0.33333337306976318, 0.33333337306976318 ],
                  [ 1, 0.33333337306976318 ],
                  [ -1, 1 ],
                  [ -0.33333331346511841, 1 ],
                  [ 0.33333337306976318, 1 ],
                  [ 1, 1 ]
               ],
               "patchResolution" : [ 64 ],
               "patchSize" : [ 4, 4 ],
               "priorityShift" : [ 0 ],
               "savable" : [ 1 ],
               "size" : [ 1920, 1080 ],
               "timestamp" : [ 0 ],
               "type" : "warp"
            },
            "Window_Cam3_warp" : {
               "alias" : [ "Window_Cam3_warp" ],
               "buffer" : [ 0 ],
               "grabMipmapLevel" : [ -1 ],
               "patchControl" : [
                  4,
                  4,
                  [ -1, -1 ],
                  [ -0.33333331346511841, -1 ],
                  [ 0.33333337306976318, -1 ],
                  [ 1, -1 ],
                  [ -1, -0.33333331346511841 ],
                  [ -0.33333331346511841, -0.33333331346511841 ],
                  [ 0.33333337306976318, -0.33333331346511841 ],
                  [ 1, -0.33333331346511841 ],
                  [ -1, 0.33333337306976318 ],
                  [ -0.33333331346511841, 0.33333337306976318 ],
                  [ 0.33333337306976318, 0.33333337306976318 ],
                  [ 1, 0.33333337306976318 ],
                  [ -1, 1 ],
                  [ -0.33333331346511841, 1 ],
                  [ 0.33333337306976318, 1 ],
                  [ 1, 1 ]
               ],
               "patchResolution" : [ 64 ],
               "patchSize" : [ 4, 4 ],
               "priorityShift" : [ 0 ],
               "savable" : [ 1 ],
               "size" : [ 1920, 1080 ],
               "timestamp" : [ 0 ],
               "type" : "warp"
            },
            "Window_Cam4_warp" : {
               "alias" : [ "Window_Cam4_warp" ],
               "buffer" : [ 0 ],
               "grabMipmapLevel" : [ -1 ],
               "patchControl" : [
                  4,
                  4,
                  [ -1, -1 ],
                  [ -0.33333331346511841, -1 ],
                  [ 0.33333337306976318, -1 ],
                  [ 1, -1 ],
                  [ -1, -0.33333331346511841 ],
                  [ -0.33333331346511841, -0.33333331346511841 ],
                  [ 0.33333337306976318, -0.33333331346511841 ],
                  [ 1, -0.33333331346511841 ],
                  [ -1, 0.33333337306976318 ],
                  [ -0.33333331346511841, 0.33333337306976318 ],
                  [ 0.33333337306976318, 0.33333337306976318 ],
                  [ 1, 0.33333337306976318 ],
                  [ -1, 1 ],
                  [ -0.33333331346511841, 1 ],
                  [ 0.33333337306976318, 1 ],
                  [ 1, 1 ]
               ],
               "patchResolution" : [ 64 ],
               "patchSize" : [ 4, 4 ],
               "priorityShift" : [ 0 ],
               "savable" : [ 1 ],
               "size" : [ 1920, 1080 ],
               "timestamp" : [ 0 ],
               "type" : "warp"
            },
            "blender" : {
               "alias" : [ "blender" ],
               "mode" : [ "none" ],
               "priorityShift" : [ 0 ],
               "savable" : [ 1 ],
               "timestamp" : [ 0 ],
               "type" : "blender"
            },
            "colorCalibrator" : {
               "alias" : [ "colorCalibrator" ],
               "colorSamples" : [ 5 ],
               "detectionThresholdFactor" : [ 1 ],
               "equalizeMethod" : [ 2 ],
               "hdrStep" : [ 1 ],
               "imagePerHDR" : [ 1 ],
               "priorityShift" : [ 0 ],
               "savable" : [ 1 ],
               "timestamp" : [ 0 ],
               "type" : "colorCalibrator"
            },
            "dragndrop" : {
               "alias" : [ "dragndrop" ],
               "priorityShift" : [ 0 ],
               "savable" : [ 1 ],
               "timestamp" : [ 0 ],
               "type" : "dragndrop",
               "updateRate" : [ 10 ]
            },
            "filter_1" : {
               "alias" : [ "filter_1" ],
               "blackLevel" : [ 0 ],
               "blackLevelAuto" : [ 0, 1 ],
               "brightness" : [ 1 ],
               "buffer" : [ 0 ],
               "colorCurveAnchors" : [ 0 ],
               "colorTemperature" : [ 6500 ],
               "contrast" : [ 1 ],
               "fileFilterSource" : [ "" ],
               "filterSource" : [ "" ],
               "grabMipmapLevel" : [ -1 ],
               "invertChannels" : [ 0 ],
               "keepRatio" : [ 0 ],
               "priorityShift" : [ 0 ],
               "saturation" : [ 1 ],
               "savable" : [ 1 ],
               "scale" : [ 1, 1 ],
               "size" : [ 4096, 2048 ],
               "sizeOverride" : [ -1, -1 ],
               "timestamp" : [ 0 ],
               "type" : "filter",
               "watchShaderFile" : [ 0 ]
            },
            "geometricCalibrator" : {
               "alias" : [ "geometricCalibrator" ],
               "cameraFocal" : [ 5000 ],
               "cameraModel" : [ "PINHOLE" ],
               "captureDelay" : [ 250 ],
               "patternScale" : [ 0.0625 ],
               "priorityShift" : [ 0 ],
               "savable" : [ 1 ],
               "timestamp" : [ 0 ],
               "type" : "geometricCalibrator"
            },
            "gui" : {
               "alias" : [ "gui" ],
               "priorityShift" : [ 0 ],
               "savable" : [ 1 ],
               "timestamp" : [ 0 ],
               "type" : "gui"
            },
            "joystick" : {
               "alias" : [ "joystick" ],
               "priorityShift" : [ 0 ],
               "savable" : [ 1 ],
               "timestamp" : [ 0 ],
               "type" : "joystick",
               "updateRate" : [ 100 ]
            },
            "keyboard" : {
               "alias" : [ "keyboard" ],
               "priorityShift" : [ 0 ],
               "savable" : [ 1 ],
               "timestamp" : [ 0 ],
               "type" : "keyboard",
               "updateRate" : [ 100 ]
            },
            "mouse" : {
               "alias" : [ "mouse" ],
               "priorityShift" : [ 0 ],
               "savable" : [ 1 ],
               "timestamp" : [ 0 ],
               "type" : "mouse",
               "updateRate" : [ 100 ]
            }
         },
         "swapInterval" : [ 1 ]
      }
   },
   "version" : "0.7.21",
   "world" : {
      "clock" : [ -1964912425 ],
      "clockDeviceName" : [ "" ],
      "configurationPath" : [ "/home/stationadmin/" ],
      "forceRealtime" : [ 0 ],
      "framerate" : [ 60 ],
      "looseClock" : [ 0 ],
      "mediaPath" : [ "/home/stationadmin/" ]
   }
}
