{
    "config": {
        "polling_interval": 2,
        "disable_motion": true,
        "verbose": false,
        "print_events": false,
        "print_motion_data": false,
        "osc_namespace": "puaracontroller",
        "osc_server_port": 9000,
        "osc_client_address": "localhost",
        "osc_client_port": 9001,
        "forward_address": "10.10.30.34",
        "forward_port": 54321
    },
    "forwarders": [
        {
            "internal_address": "touch",
            "controller_id": 1,
            "forward_namespace": "/avatar/position",
            "forward_arguments": ["X", "pressure", "Y"],
            "range": {"min": 15, "max": -15}
        },
        {
            "internal_address": "analogleft",
            "controller_id": 1,
            "forward_namespace": "/avatar/position",
            "forward_arguments": ["X", "hardcoded", "Y"],
            "range": {"min": 15, "max": -15}
        },
        {
            "internal_address": "triggerright",
            "controller_id": 1,
            "forward_namespace": "/camera/zoom",
            "forward_arguments": ["value"],
            "range": {"min": 0, "max": 1}
        },
        {
            "internal_address": "A",
            "controller_id": 1,
            "forward_namespace": "/camera/position/000",
            "forward_arguments": ["value"]
        }
    ],
    "midi": [
        {
            "type": null,
            "channel": 0,
            "note_value": "value",
            "velocity_controller": null
        }
    ]
}