# Blender v3.1.2 OBJ File: 'immersive_space.blend'
# www.blender.org
o Cube.003_Cube.004
v 0.000000 0.000000 2.200000
v 0.000000 0.000000 0.000000
v 3.050000 -0.000000 2.200000
v 3.050000 -0.000000 0.000000
v 0.000000 0.000000 1.100000
v 1.525000 -0.000000 2.200000
v 3.050000 -0.000000 1.100000
v 1.525000 -0.000000 0.000000
v 1.525000 -0.000000 1.100000
vt 0.416553 0.300464
vt 0.416553 0.600929
vt -0.000000 0.600929
vt -0.000000 0.300464
vt 0.416553 -0.000000
vt -0.000000 -0.000000
vt 0.833106 -0.000000
vt 0.833106 0.300464
vt 0.833106 0.600929
vn -0.0000 -1.0000 0.0000
s off
f 9/1/1 6/2/1 1/3/1 5/4/1
f 8/5/1 9/1/1 5/4/1 2/6/1
f 4/7/1 7/8/1 9/1/1 8/5/1
f 7/8/1 3/9/1 6/2/1 9/1/1
