[
  {
    "type": "string",
    "title": "Splash IP",
    "desc": "Splash server IP address",
    "section": "connection",
    "key": "ipaddr"
  },
  {
    "type": "numeric",
    "title": "Splash port",
    "desc": "Splash server port",
    "section": "connection",
    "key": "port"
  },
  {
    "type": "dynamic_option",
    "title": "Target image object",
    "desc": "Image object to preview/control",
    "section": "splash",
    "key": "target_image",
    "app_function": "image_objects"
  },
  {
    "type": "color_picker",
    "title": "Background color",
    "desc": "Color of various backgrounds of the layout",
    "section": "ui",
    "key": "bg_color"
  }
]