File Name, X-coord, Y-coord, Z-coord
use_cases/centech/IR_(3.69_4.73)_N.wav, 3.69, 4.73, 1
use_cases/centech/IR_(1.0_0.0)_B.wav, 1.0, 0, 1
use_cases/centech/IR_(1.85_5.71)_L.wav, 1.85, 5.71, 1
use_cases/centech/IR_(1.24_3.8)_K.wav, 1.24, 3.8, 1
use_cases/centech/IR_(6.0_0.0)_F.wav, 6.0, 0.0, 1
use_cases/centech/IR_(0.93_2.85)_J.wav, 0.93, 2.85, 1
use_cases/centech/IR_(5.71_1.85)_R.wav, 5.71, 1.85, 1
use_cases/centech/IR_(4.93_6.3)_O.wav, 4.93, 6.3, 1
use_cases/centech/IR_(2.47_7.61)_M.wav, 2.47, 7.61, 1
use_cases/centech/IR_(0.0_0.0)_A.wav, 0.0, 0.0, 1
use_cases/centech/IR_(3.0_0.0)_D.wav, 3.0, 0.0, 1
use_cases/centech/IR_(6.55_4.59)_Q.wav, 6.55, 4.59, 1
use_cases/centech/IR_(0.31_0.95)_H.wav, 0.31, 0.95, 1
use_cases/centech/IR_(0.62_1.9)_I.wav, 0.62, 1.9, 1
use_cases/centech/IR_(3.28_2.29)_P.wav, 3.28, 2.29, 1
use_cases/centech/IR_(4.0_0.0)_E.wav, 4.0, 0.0, 1
use_cases/centech/IR_(8.0_0.0)_G.wav, 8.0, 0.0, 1
use_cases/centech/IR_(7.61_2.47)_S.wav, 7.61, 2.47, 1
use_cases/centech/IR_(2.0_0.0)_C.wav, 2.0, 0.0, 1 