{
    "scripts": [
        "node_modules/reveal.js-plugins/audio-slideshow/plugin.js",
        "node_modules/reveal.js-plugins/audio-slideshow/recorder.js",
        "node_modules/reveal.js-plugins/audio-slideshow/RecordRTC.js",
        "plugin.js"
        ]
}