{
  "dependencies": {
    "color-thief": {
      "version": "2.2.1",
      "resolved": "https://registry.npmjs.org/color-thief/-/color-thief-2.2.1.tgz",
      "from": "color-thief@2.2.1",
      "dependencies": {
        "canvas": {
          "version": "1.2.11",
          "resolved": "https://registry.npmjs.org/canvas/-/canvas-1.2.11.tgz",
          "from": "canvas@1.2.11",
          "dependencies": {
            "nan": {
              "version": "2.2.0",
              "resolved": "https://registry.npmjs.org/nan/-/nan-2.2.0.tgz",
              "from": "nan@2.2.0"
            }
          }
        }
      }
    }
  }
}
