<?xml version="1.0" encoding="utf-8"?>
<!-- Generator: Adobe Illustrator 26.2.0, SVG Export Plug-In . SVG Version: 6.00 Build 0)  -->
<svg version="1.1" xmlns="http://www.w3.org/2000/svg" xmlns:xlink="http://www.w3.org/1999/xlink" x="0px" y="0px"
	 viewBox="0 0 2122.75 1440" style="enable-background:new 0 0 2122.75 1440;" xml:space="preserve">
<style type="text/css">
	.st0{fill:#FFFFFF;}
</style>
<g id="Layer_1">
	<g>
		<g>
			<path class="st0" d="M848.02,453.26l130.6-108.44c-7.47-6.33-16.11-11.2-25.47-14.31l-89.7-29.81
				c-6.2-2.06-12.65-3.29-19.16-3.66c-1.61-0.09-3.23-0.13-4.82-0.11c-3.2,0.03-6.43,0.27-9.59,0.71
				c-7.98,1.12-15.67,3.52-22.86,7.12c-2.89,1.45-5.71,3.1-8.38,4.91c-2.71,1.84-5.32,3.87-7.76,6.06l-74.42,66.52
				c-6.67,5.96-12.24,13.06-16.46,20.91l68.37,23.14L848.02,453.26z"/>
			<path class="st0" d="M906.42,716.51l29.38,169.27l131.43-106.63l-5.68-33.03c-0.01-0.05-0.02-0.1-0.02-0.14l-56.66-354.64
				c-1.59-9.95-5.12-19.45-10.34-27.98l-130.7,108.53L906.42,716.51z"/>
			<path class="st0" d="M1415.31,774.55c-1.64-9.45-5.06-18.48-10.04-26.61l-234.51,195.13l-47.01,39.12l7.02,40.51l20.08,115.89
				c8.02-2.92,15.51-7.2,22.08-12.67l232.77-193.68c3.7-3.08,7.11-6.54,10.12-10.28c0.99-1.22,1.95-2.5,2.86-3.8
				c1.81-2.57,3.46-5.28,4.92-8.07c1.45-2.77,2.74-5.67,3.82-8.6c1.63-4.43,2.83-9.03,3.57-13.67c1.26-7.91,1.21-15.93-0.16-23.83
				L1415.31,774.55z"/>
			<path class="st0" d="M1108.16,963.39l281.15-233.94c-7.12-5.96-15.31-10.58-24.16-13.6l-88.03-29.97
				c-24.77-8.43-51.7-3.63-72.02,12.86c0,0-0.01,0-0.01,0.01l-116.91,94.85c0,0,0,0,0,0l-0.44,0.35L951.55,904.45L1108.16,963.39z"
				/>
			<path class="st0" d="M1099.67,986.29l-143.79-54.12l-32.65-12.29c0,0,0,0,0,0l-0.2-0.07c-0.18-0.07-0.35-0.16-0.53-0.24
				c-0.29-0.13-0.58-0.24-0.87-0.39c-0.2-0.11-0.39-0.24-0.59-0.35c-0.27-0.16-0.53-0.31-0.79-0.49c-0.26-0.18-0.49-0.39-0.73-0.59
				c-0.17-0.15-0.36-0.27-0.53-0.43c-0.4-0.37-0.77-0.77-1.11-1.19c-0.01-0.02-0.03-0.03-0.04-0.04c-0.28-0.35-0.54-0.71-0.78-1.08
				c-0.06-0.09-0.11-0.17-0.16-0.26c-0.22-0.35-0.41-0.72-0.59-1.08c-0.03-0.07-0.07-0.13-0.1-0.2c-0.2-0.44-0.38-0.9-0.52-1.36
				c-0.02-0.06-0.03-0.12-0.05-0.18c-0.13-0.43-0.23-0.86-0.32-1.3c-0.01-0.05-0.03-0.09-0.03-0.14l-75.51-434.22l-42.84-14.5
				l-104.88-35.5c-1.58,8.99-1.57,18.02,0.03,26.87l70.14,388.82l24.93,143.44c1.13,6.49,3.11,12.8,5.89,18.75
				c1.37,2.92,2.94,5.78,4.67,8.5c1.73,2.71,3.65,5.33,5.72,7.8c2.06,2.46,4.31,4.82,6.68,6.99c7.28,6.69,15.69,11.79,24.99,15.16
				l265.03,96.06c8.56,3.1,17.61,4.58,26.69,4.41l-18.05-104.18L1099.67,986.29z"/>
			<path class="st0" d="M1087.73,793.97l0.44-0.35c0,0,0,0,0,0l116.91-94.85c0,0,0.01,0,0.01-0.01
				c20.32-16.48,47.25-21.29,72.02-12.86l88.03,29.97c8.84,3.01,17.03,7.63,24.16,13.6l-281.15,233.94l-156.61-58.94L1087.73,793.97
				z M1004.86,391.35l56.66,354.64c0.01,0.05,0.02,0.1,0.02,0.14l5.68,33.03L935.8,885.78l-29.38-169.27l-42.6-244.62l130.7-108.53
				C999.74,371.9,1003.27,381.4,1004.86,391.35z M716.48,382.26l74.42-66.52c2.44-2.18,5.05-4.22,7.76-6.06
				c2.67-1.81,5.49-3.46,8.38-4.91c7.19-3.6,14.88-6,22.86-7.12c3.16-0.44,6.39-0.68,9.59-0.71c1.59-0.01,3.22,0.02,4.82,0.11
				c6.51,0.36,12.96,1.59,19.16,3.66l89.7,29.81c9.36,3.11,18,7.98,25.47,14.31l-130.6,108.44l-79.64-26.95l-68.37-23.14
				C704.24,395.32,709.81,388.22,716.48,382.26z M1100.13,1138.65l-265.03-96.06c-9.3-3.37-17.71-8.47-24.99-15.16
				c-2.37-2.18-4.61-4.53-6.68-6.99c-2.07-2.47-3.99-5.09-5.72-7.8c-1.73-2.72-3.31-5.58-4.67-8.5c-2.78-5.95-4.76-12.26-5.89-18.75
				l-24.93-143.44l-70.14-388.82c-1.6-8.84-1.6-17.88-0.03-26.87l104.88,35.5l42.84,14.5l75.51,434.22
				c0.01,0.05,0.02,0.09,0.03,0.14c0.08,0.44,0.19,0.87,0.32,1.3c0.02,0.06,0.03,0.12,0.05,0.18c0.15,0.46,0.32,0.91,0.52,1.36
				c0.03,0.07,0.07,0.13,0.1,0.2c0.18,0.37,0.37,0.73,0.59,1.08c0.05,0.09,0.1,0.17,0.16,0.26c0.24,0.37,0.49,0.73,0.78,1.08
				c0.01,0.02,0.03,0.03,0.04,0.04c0.34,0.42,0.71,0.82,1.11,1.19c0.17,0.16,0.35,0.28,0.53,0.43c0.24,0.2,0.47,0.41,0.73,0.59
				c0.25,0.18,0.52,0.33,0.79,0.49c0.2,0.12,0.38,0.25,0.59,0.35c0.28,0.15,0.58,0.27,0.87,0.39c0.18,0.08,0.35,0.17,0.53,0.24
				l0.2,0.07c0,0,0,0,0,0l32.65,12.29l143.79,54.12l9.11,52.59l18.05,104.18C1117.74,1143.23,1108.69,1141.75,1100.13,1138.65z
				 M1430.96,887.81c-0.74,4.64-1.94,9.24-3.57,13.67c-1.08,2.94-2.36,5.83-3.82,8.6c-1.46,2.79-3.11,5.5-4.92,8.07
				c-0.91,1.3-1.87,2.58-2.86,3.8c-3.01,3.74-6.41,7.2-10.12,10.28l-232.77,193.68c-6.57,5.47-14.06,9.75-22.08,12.67l-20.08-115.89
				l-7.02-40.51l47.01-39.12l234.51-195.13c4.98,8.13,8.4,17.16,10.04,26.61l15.49,89.43
				C1432.17,871.89,1432.22,879.9,1430.96,887.81z"/>
		</g>
	</g>
</g>
<g id="Layer_2">
</g>
<g id="Layer_3">
</g>
<g id="Layer_4">
</g>
</svg>
