<?xml version="1.0" encoding="utf-8"?>
<!-- Generator: Adobe Illustrator 26.2.0, SVG Export Plug-In . SVG Version: 6.00 Build 0)  -->
<svg version="1.1" id="Layer_1" xmlns="http://www.w3.org/2000/svg" xmlns:xlink="http://www.w3.org/1999/xlink" x="0px" y="0px"
	 viewBox="0 0 1440 1440" style="enable-background:new 0 0 1440 1440;" xml:space="preserve">
<style type="text/css">
	.st0{fill:#49C7EF;}
	.st1{fill:#4898D3;}
	.st2{fill:#4067B1;}
</style>
<g id="Layer_1_00000083792654468439407780000016202122438159389609_">
	<g>
		<g>
			<g>
				<path class="st0" d="M341.95,410.32l31.49,10.66l135.65,45.91l146.22-121.41c-10.37-12.16-23.99-21.54-39.73-26.76l-89.75-29.82
					c-7.33-2.43-14.84-3.84-22.34-4.26c-1.88-0.11-3.75-0.15-5.63-0.13c-3.75,0.04-7.48,0.31-11.17,0.83
					c-9.24,1.3-18.24,4.09-26.64,8.3c-3.36,1.68-6.62,3.59-9.77,5.73s-6.17,4.49-9.04,7.06l-74.46,66.56
					C355.27,383.27,346.83,396.18,341.95,410.32z"/>
			</g>
			<g>
				<g>
					<path class="st0" d="M586,908.38l-0.06,0.05l0,0l0,0l0,0l0,0l-0.06,0.05l183.27,68.97l0,0l297.08-247.2
						c-10.06-11.73-23.21-20.81-38.37-25.97l-15.72-5.35l-72.36-24.63l0,0c-28.61-9.74-60.22-4.09-83.7,14.94c0,0-0.01,0-0.01,0.01
						l-33.8,27.42l-83.19,67.49l-153.2,124.32"/>
				</g>
				<g>
					<path class="st1" d="M585.88,908.48l0.06-0.05l0,0l0.06-0.05l152.66-123.86l0.44-0.35l-6.9-40.1l0,0l-10.99-68.77l-45.7-286.05
						c-2.64-16.48-9.77-31.54-20.21-43.77L509.09,466.89l43.84,251.72L585.88,908.48z"/>
				</g>
				<g>
					<path class="st2" d="M769.15,977.45l-183.27-68.97l-76.79-441.59l-167.14-56.56c-1.49,4.31-2.6,8.75-3.42,13.25
						c-1.86,10.3-1.95,20.98-0.04,31.59l12.97,71.92l57.2,317.09l24.93,143.44c1.33,7.65,3.66,14.98,6.86,21.84
						c1.6,3.43,3.42,6.73,5.44,9.91c2.02,3.17,4.25,6.2,6.66,9.08s5.01,5.6,7.78,8.14c8.31,7.64,18.15,13.69,29.1,17.66
						l265.16,96.11c14.7,5.33,30.27,6.46,45.14,3.72L769.15,977.45z"/>
				</g>
				<g>
					<path class="st1" d="M1101.65,861.97l-15.5-89.48c-2.76-15.91-9.77-30.42-19.91-42.24l-297.08,247.2l30.6,176.62l0,0
						c14.35-2.65,28.05-8.9,39.66-18.56l232.89-193.78c4.38-3.64,8.33-7.67,11.82-12.01c1.16-1.45,2.28-2.93,3.34-4.44
						c2.13-3.03,4.04-6.18,5.75-9.43c1.71-3.26,3.2-6.62,4.46-10.06c1.9-5.16,3.3-10.51,4.17-15.97
						C1103.29,880.72,1103.27,871.32,1101.65,861.97z"/>
				</g>
			</g>
		</g>
	</g>
</g>
<g id="Layer_2_00000050639126426100816800000006690383774499143569_">
</g>
<g id="Layer_3">
</g>
<g id="Layer_4">
</g>
<g id="Layer_5">
</g>
</svg>
