<svg width="20" height="20" viewBox="0 0 20 20" fill="none" xmlns="http://www.w3.org/2000/svg">
<path d="M7.51472 4L12.4853 4L16 7.51472V12.4853L12.4853 16H7.51472L4 12.4853L4 7.51472L7.51472 4Z" fill="#F87A7A"/>
<rect x="6" y="9" width="8" height="2" fill="white"/>
</svg>
