<svg width="20" height="20" viewBox="0 0 20 20" fill="none" xmlns="http://www.w3.org/2000/svg">
<path d="M11.2924 4.31941C11.3091 3.59568 10.727 3 10.003 3V3C9.27947 3 8.69748 3.59512 8.71361 4.31851L8.87789 11.6819C8.8915 12.2921 9.39009 12.7797 10.0005 12.7797V12.7797C10.6105 12.7797 11.109 12.2926 11.123 11.6827L11.2924 4.31941ZM10.0001 17C10.8046 17 11.4932 16.3372 11.5001 15.5121C11.4932 14.7005 10.8046 14.0377 10.0001 14.0377C9.16828 14.0377 8.49329 14.7005 8.50011 15.5121C8.49329 16.3372 9.16828 17 10.0001 17Z" fill="#00FFFF"/>
</svg>
