{
	"description" : "splashConfiguration",
	// Default encoding for text
	"encoding" : "UTF-8",
	"scenes" : 
	{
		"local" : 
		{
			"address" : "localhost",
			"links" : 
			[
				[
					"object",
					"gui"
				],
				[
					"object_2",
					"gui"
				],
				[
					"object",
					"cam1"
				],
				[
					"object",
					"camera_1"
				],
				[
					"mesh",
					"object"
				],
				[
					"virtual_probe_3",
					"object"
				],
				[
					"mesh_1",
					"object_2"
				],
				[
					"object_2_image_filter",
					"object_2"
				],
				[
					"image",
					"object_2"
				],
				[
					"object_2",
					"virtual_probe_3"
				],
				[
					"gui",
					"win1"
				],
				[
					"cam1",
					"window_1"
				],
				[
					"window_1_cam1_warp",
					"window_1"
				],
				[
					"camera_1",
					"window_1"
				],
				[
					"window_1_camera_1_warp",
					"window_1"
				],
				[
					"cam1",
					"window_1_cam1_warp"
				],
				[
					"camera_1",
					"window_1_camera_1_warp"
				],
				[
					"image",
					"object_2_image_filter"
				],
				[
					"virtual_probe_3",
					"filter_1"
				]
			],
			"objects" : 
			{
				"blender" : 
				{
					"alias" : 
					[
						"blender"
					],
					"depthAwareBlending" : 
					[
						false
					],
					"mode" : 
					[
						"none"
					],
					"priorityShift" : 
					[
						0
					],
					"savable" : 
					[
						true
					],
					"timestamp" : 
					[
						0
					],
					"type" : "blender"
				},
				"cam1" : 
				{
					"16bits" : 
					[
						true
					],
					"activateColorLUT" : 
					[
						0
					],
					"alias" : 
					[
						"cam1"
					],
					"blendPrecision" : 
					[
						0.10000000149011612
					],
					"blendWidth" : 
					[
						0.05000000074505806
					],
					"brightness" : 
					[
						1.0
					],
					"buffer" : null,
					"calibrationPoints" : 
					[
						[
							-1.0,
							-1.0,
							-0.20000000298023224,
							0.54609894752502441,
							-0.36956864595413208,
							true
						],
						[
							-1.0,
							-1.0,
							0.40000000596046448,
							0.54958158731460571,
							0.22789071500301361,
							true
						],
						[
							-1.0,
							-1.0,
							-0.80000001192092896,
							0.54749828577041626,
							-0.93775969743728638,
							true
						],
						[
							-1.0,
							0.0,
							-0.80000001192092896,
							-0.0027723982930183411,
							-0.93821138143539429,
							true
						],
						[
							-1.0,
							1.0,
							-0.80000001192092896,
							-0.52949875593185425,
							-0.9335365891456604,
							true
						],
						[
							-1.0,
							1.0,
							0.0,
							-0.52790486812591553,
							-0.17398375272750854,
							true
						]
					],
					"colorLUTSize" : 
					[
						0
					],
					"colorMixMatrix" : 
					[
						[
							1.0,
							0.0,
							0.0,
							0.0,
							1.0,
							0.0,
							0.0,
							0.0,
							1.0
						]
					],
					"colorSamples" : 
					[
						0
					],
					"colorTemperature" : 
					[
						6500.0
					],
					"contrast" : 
					[
						1.0
					],
					"eye" : 
					[
						-2.3353109359741211,
						-0.11437785625457764,
						-0.66167682409286499
					],
					"far" : 
					[
						100.0
					],
					"fov" : 
					[
						75.998527526855469
					],
					"getReprojectionError" : 
					[
						0.0
					],
					"grabMipmapLevel" : 
					[
						-1
					],
					"hide" : 
					[
						false
					],
					"multisampling" : 
					[
						0
					],
					"near" : 
					[
						0.10000000149011612
					],
					"principalPoint" : 
					[
						0.52325206995010376,
						0.095119215548038483
					],
					"priorityShift" : 
					[
						0
					],
					"saturation" : 
					[
						1.0
					],
					"savable" : 
					[
						true
					],
					"size" : 
					[
						1920,
						1080
					],
					"target" : 
					[
						-1.3355292081832886,
						-0.093723751604557037,
						-0.66484653949737549
					],
					"timestamp" : 
					[
						0
					],
					"type" : "camera",
					"up" : 
					[
						0.003074888838455081,
						0.0046226647682487965,
						0.99998456239700317
					],
					"weightedCalibrationPoints" : 
					[
						true
					]
				},
				"camera_1" : 
				{
					"16bits" : 
					[
						true
					],
					"activateColorLUT" : 
					[
						0
					],
					"alias" : 
					[
						"camera_1"
					],
					"blendPrecision" : 
					[
						0.10000000149011612
					],
					"blendWidth" : 
					[
						0.05000000074505806
					],
					"brightness" : 
					[
						1.0
					],
					"buffer" : null,
					"calibrationPoints" : 
					[
						[
							-1.0,
							-1.0,
							-0.80000001192092896,
							-0.71578705310821533,
							-0.88224929571151733,
							true
						],
						[
							-1.0,
							-1.0,
							-0.20000000298023224,
							-0.71381902694702148,
							-0.34744805097579956,
							true
						],
						[
							-1.0,
							-1.0,
							0.40000000596046448,
							-0.71480065584182739,
							0.20842368900775909,
							true
						],
						[
							0.0,
							-1.0,
							-0.80000001192092896,
							-0.19556045532226562,
							-0.88275063037872314,
							true
						],
						[
							1.0,
							-1.0,
							-0.80000001192092896,
							0.31777670979499817,
							-0.87663280963897705,
							true
						],
						[
							1.0,
							-1.0,
							0.20000000298023224,
							0.32479417324066162,
							0.014634132385253906,
							true
						]
					],
					"colorLUTSize" : 
					[
						0
					],
					"colorMixMatrix" : 
					[
						[
							0.3203125,
							0.0,
							261.22830200195312,
							0.0,
							-1.875,
							0.3203125,
							0.0,
							261.22830200195312,
							330.0
						]
					],
					"colorSamples" : 
					[
						0
					],
					"colorTemperature" : 
					[
						6500.0
					],
					"contrast" : 
					[
						1.0
					],
					"eye" : 
					[
						0.2081274688243866,
						-5.0609397888183594,
						0.39021956920623779
					],
					"far" : 
					[
						100.0
					],
					"fov" : 
					[
						30.0
					],
					"getReprojectionError" : 
					[
						0.0
					],
					"grabMipmapLevel" : 
					[
						-1
					],
					"hide" : 
					[
						false
					],
					"multisampling" : 
					[
						0
					],
					"near" : 
					[
						0.10000000149011612
					],
					"principalPoint" : 
					[
						0.5,
						0.5
					],
					"priorityShift" : 
					[
						0
					],
					"saturation" : 
					[
						1.0
					],
					"savable" : 
					[
						true
					],
					"size" : 
					[
						1920,
						1080
					],
					"target" : 
					[
						0.24799291789531708,
						-4.0631022453308105,
						0.33796805143356323
					],
					"timestamp" : 
					[
						0
					],
					"type" : "camera",
					"up" : 
					[
						-0.0056763906031847,
						0.052518419921398163,
						0.99860382080078125
					],
					"weightedCalibrationPoints" : 
					[
						true
					]
				},
				"colorCalibrator" : 
				{
					"alias" : 
					[
						"colorCalibrator"
					],
					"colorLUTSize" : 
					[
						16
					],
					"colorSamples" : 
					[
						5
					],
					"detectionThresholdFactor" : 
					[
						1.0
					],
					"equalizeMethod" : 
					[
						2
					],
					"hdrStep" : 
					[
						1.0
					],
					"imagePerHDR" : 
					[
						1
					],
					"priorityShift" : 
					[
						0
					],
					"savable" : 
					[
						true
					],
					"timestamp" : 
					[
						0
					],
					"type" : "colorCalibrator"
				},
				"dragndrop" : 
				{
					"alias" : 
					[
						"dragndrop"
					],
					"priorityShift" : 
					[
						0
					],
					"savable" : 
					[
						true
					],
					"timestamp" : 
					[
						0
					],
					"type" : "dragndrop",
					"updateRate" : 
					[
						10
					]
				},
				"filter_1" : 
				{
					"alias" : 
					[
						"filter_1"
					],
					"brightness" : 
					[
						1.0
					],
					"buffer" : null,
					"colorTemperature" : 
					[
						6600.0
					],
					"contrast" : 
					[
						1.0
					],
					"grabMipmapLevel" : 
					[
						-1
					],
					"invertChannels" : 
					[
						false
					],
					"keepRatio" : 
					[
						false
					],
					"priorityShift" : 
					[
						0
					],
					"saturation" : 
					[
						1.0
					],
					"savable" : 
					[
						true
					],
					"scale" : 
					[
						1.0,
						1.0
					],
					"size" : 
					[
						2048,
						2048
					],
					"sizeOverride" : 
					[
						-1,
						-1
					],
					"timestamp" : 
					[
						0
					],
					"type" : "filter"
				},
				"gui" : 
				{
					"alias" : 
					[
						"gui"
					],
					"fullscreen" : 
					[
						true
					],
					"priorityShift" : 
					[
						0
					],
					"savable" : 
					[
						true
					],
					"timestamp" : 
					[
						0
					],
					"type" : "gui"
				},
				"image" : 
				{
					"alias" : 
					[
						"image"
					],
					"file" : 
					[
						"SATMETA-0096 (OBS)"
					],
					"flip" : 
					[
						true
					],
					"flop" : 
					[
						false
					],
					"mediaInfo" : 
					[
						3840,
						2160,
						16,
						3,
						"UYVY",
						true
					],
					"pattern" : 
					[
						false
					],
					"priorityShift" : 
					[
						0
					],
					"reload" : 
					[
						false
					],
					"savable" : 
					[
						true
					],
					"srgb" : 
					[
						true
					],
					"timestamp" : 
					[
						-481104578
					],
					"type" : "image_ndi"
				},
				"keyboard" : 
				{
					"alias" : 
					[
						"keyboard"
					],
					"priorityShift" : 
					[
						0
					],
					"savable" : 
					[
						true
					],
					"timestamp" : 
					[
						0
					],
					"type" : "keyboard",
					"updateRate" : 
					[
						100
					]
				},
				"mesh" : 
				{
					"alias" : 
					[
						"mesh"
					],
					"file" : 
					[
						"./wall_corner_double_equi_larger.obj"
					],
					"priorityShift" : 
					[
						0
					],
					"reload" : 
					[
						false
					],
					"savable" : 
					[
						true
					],
					"timestamp" : 
					[
						1045860550
					],
					"type" : "mesh"
				},
				"mesh_1" : 
				{
					"alias" : 
					[
						"mesh_1"
					],
					"file" : 
					[
						"/home/manu/src/00_collaborations/2023-EnsAD-ISEA/splash/cubemap.obj"
					],
					"priorityShift" : 
					[
						0
					],
					"reload" : 
					[
						false
					],
					"savable" : 
					[
						true
					],
					"timestamp" : 
					[
						1713306750
					],
					"type" : "mesh"
				},
				"mouse" : 
				{
					"alias" : 
					[
						"mouse"
					],
					"priorityShift" : 
					[
						0
					],
					"savable" : 
					[
						true
					],
					"timestamp" : 
					[
						0
					],
					"type" : "mouse",
					"updateRate" : 
					[
						100
					]
				},
				"object" : 
				{
					"alias" : 
					[
						"object"
					],
					"color" : 
					[
						0.0,
						0.0,
						0.0,
						1.0
					],
					"fill" : 
					[
						"texture"
					],
					"normalExponent" : 
					[
						0.0
					],
					"position" : 
					[
						0.0,
						0.0,
						0.0
					],
					"priorityShift" : 
					[
						0
					],
					"rotation" : 
					[
						0.0,
						0.0,
						0.0
					],
					"savable" : 
					[
						true
					],
					"scale" : 
					[
						1.0,
						1.0,
						1.0
					],
					"sideness" : 
					[
						0
					],
					"timestamp" : 
					[
						0
					],
					"type" : "object"
				},
				"object_2" : 
				{
					"alias" : 
					[
						"object_2"
					],
					"color" : 
					[
						0.0,
						0.0,
						0.0,
						1.0
					],
					"fill" : 
					[
						"texture"
					],
					"normalExponent" : 
					[
						0.0
					],
					"position" : 
					[
						0.0,
						0.0,
						0.0
					],
					"priorityShift" : 
					[
						0
					],
					"rotation" : 
					[
						0.0,
						0.0,
						0.0
					],
					"savable" : 
					[
						true
					],
					"scale" : 
					[
						1.0,
						1.0,
						1.0
					],
					"sideness" : 
					[
						0
					],
					"timestamp" : 
					[
						-481178441
					],
					"type" : "object"
				},
				"object_2_image_filter" : 
				{
					"alias" : 
					[
						"object_2_image_filter"
					],
					"brightness" : 
					[
						1.0
					],
					"buffer" : null,
					"colorTemperature" : 
					[
						6600.0
					],
					"contrast" : 
					[
						1.0
					],
					"grabMipmapLevel" : 
					[
						-1
					],
					"invertChannels" : 
					[
						false
					],
					"keepRatio" : 
					[
						false
					],
					"priorityShift" : 
					[
						0
					],
					"saturation" : 
					[
						1.0
					],
					"savable" : 
					[
						true
					],
					"scale" : 
					[
						1.0,
						1.0
					],
					"size" : 
					[
						3840,
						2160
					],
					"sizeOverride" : 
					[
						-1,
						-1
					],
					"timestamp" : 
					[
						-481178441
					],
					"type" : "filter"
				},
				"virtual_probe_3" : 
				{
					"alias" : 
					[
						"virtual_probe_3"
					],
					"position" : 
					[
						0.0,
						0.0,
						0.0
					],
					"priorityShift" : 
					[
						0
					],
					"projection" : 
					[
						"equirectangular"
					],
					"rotation" : 
					[
						0.0,
						90.0,
						180.0
					],
					"savable" : 
					[
						true
					],
					"size" : 
					[
						2048,
						2048
					],
					"sphericalFov" : 
					[
						180.0
					],
					"timestamp" : 
					[
						-1
					],
					"type" : "virtual_probe"
				},
				"win1" : 
				{
					"alias" : 
					[
						"win1"
					],
					"decorated" : 
					[
						true
					],
					"gamma" : 
					[
						2.2000000476837158
					],
					"guiOnly" : 
					[
						true
					],
					"layout" : 
					[
						0,
						1,
						2,
						3
					],
					"position" : 
					[
						3,
						38
					],
					"presentationDelay" : 
					[
						-481078178
					],
					"priorityShift" : 
					[
						0
					],
					"savable" : 
					[
						true
					],
					"size" : 
					[
						1914,
						1039
					],
					"srgb" : 
					[
						true
					],
					"timestamp" : 
					[
						0
					],
					"type" : "window"
				},
				"window_1" : 
				{
					"alias" : 
					[
						"window_1"
					],
					"decorated" : 
					[
						false
					],
					"gamma" : 
					[
						2.2000000476837158
					],
					"guiOnly" : 
					[
						false
					],
					"layout" : 
					[
						0,
						1,
						2,
						3
					],
					"position" : 
					[
						1920,
						0
					],
					"presentationDelay" : 
					[
						-481078045
					],
					"priorityShift" : 
					[
						0
					],
					"savable" : 
					[
						true
					],
					"size" : 
					[
						3840,
						1080
					],
					"srgb" : 
					[
						true
					],
					"textureList" : 
					[
						"window_1_cam1_warp",
						"window_1_camera_1_warp"
					],
					"timestamp" : 
					[
						0
					],
					"type" : "window"
				},
				"window_1_cam1_warp" : 
				{
					"alias" : 
					[
						"window_1_cam1_warp"
					],
					"buffer" : null,
					"grabMipmapLevel" : 
					[
						-1
					],
					"patchControl" : 
					[
						4,
						4,
						[
							-1.0,
							-1.0
						],
						[
							-0.33333331346511841,
							-1.0
						],
						[
							0.33333337306976318,
							-1.0
						],
						[
							1.0,
							-1.0
						],
						[
							-1.0,
							-0.33333331346511841
						],
						[
							-0.33333331346511841,
							-0.33333331346511841
						],
						[
							0.33333337306976318,
							-0.33333331346511841
						],
						[
							1.0,
							-0.33333331346511841
						],
						[
							-1.0,
							0.33333337306976318
						],
						[
							-0.33333331346511841,
							0.33333337306976318
						],
						[
							0.33333337306976318,
							0.33333337306976318
						],
						[
							1.0,
							0.33333337306976318
						],
						[
							-1.0,
							1.0
						],
						[
							-0.33333331346511841,
							1.0
						],
						[
							0.33333337306976318,
							1.0
						],
						[
							1.0,
							1.0
						]
					],
					"patchResolution" : 
					[
						64
					],
					"patchSize" : 
					[
						4,
						4
					],
					"priorityShift" : 
					[
						0
					],
					"savable" : 
					[
						true
					],
					"size" : 
					[
						1920,
						1080
					],
					"timestamp" : 
					[
						0
					],
					"type" : "warp"
				},
				"window_1_camera_1_warp" : 
				{
					"alias" : 
					[
						"window_1_camera_1_warp"
					],
					"buffer" : null,
					"grabMipmapLevel" : 
					[
						-1
					],
					"patchControl" : 
					[
						4,
						4,
						[
							-1.0,
							-1.0
						],
						[
							-0.33333331346511841,
							-1.0
						],
						[
							0.33333337306976318,
							-1.0
						],
						[
							1.0,
							-1.0
						],
						[
							-1.0,
							-0.33333331346511841
						],
						[
							-0.33333331346511841,
							-0.33333331346511841
						],
						[
							0.33333337306976318,
							-0.33333331346511841
						],
						[
							1.0,
							-0.33333331346511841
						],
						[
							-1.0,
							0.33333337306976318
						],
						[
							-0.33333331346511841,
							0.33333337306976318
						],
						[
							0.33333337306976318,
							0.33333337306976318
						],
						[
							1.0,
							0.33333337306976318
						],
						[
							-1.0,
							1.0
						],
						[
							-0.33333331346511841,
							1.0
						],
						[
							0.33333337306976318,
							1.0
						],
						[
							1.0,
							1.0
						]
					],
					"patchResolution" : 
					[
						64
					],
					"patchSize" : 
					[
						4,
						4
					],
					"priorityShift" : 
					[
						0
					],
					"savable" : 
					[
						true
					],
					"size" : 
					[
						1920,
						1080
					],
					"timestamp" : 
					[
						0
					],
					"type" : "warp"
				}
			},
			"spawn" : 1,
			"swapInterval" : 
			[
				1
			]
		}
	},
	"version" : "0.9.27",
	"world" : 
	{
		"clock" : 
		[
			-481097292
		],
		"clockDeviceName" : 
		[
			""
		],
		"configurationPath" : 
		[
			"/home/manu/src/00_collaborations/2023-EnsAD-ISEA/splash/"
		],
		"forceRealtime" : 
		[
			false
		],
		"framerate" : 
		[
			15
		],
		"looseClock" : 
		[
			false
		],
		"masterClock" : 
		[
			0,
			0,
			0,
			23,
			63,
			44,
			148,
			false
		],
		"mediaPath" : 
		[
			"/home/manu"
		]
	}
}
