{
   "description" : "splashConfiguration",
   "scenes" : {
      "GPU_1" : {
         "display" : 0,
         "links" : [
            [ "Image", "Object_Image_filter" ],
            [ "Mesh", "Object" ],
            [ "Image", "Object" ],
            [ "Object_Image_filter", "Object" ],
            [ "Object", "gui" ],
            [ "Proj E", "Win GPU 1_Proj E_warp" ],
            [ "Object", "Proj C" ],
            [ "Object", "Proj E" ],
            [ "Proj C", "Win GPU 1_Proj C_warp" ],
            [ "Object", "Proj G" ],
            [ "Proj A", "Win GPU 1_Proj A_warp" ],
            [ "Object", "Proj A" ],
            [ "gui", "Win GPU 1" ],
            [ "Proj A", "Win GPU 1" ],
            [ "Win GPU 1_Proj A_warp", "Win GPU 1" ],
            [ "Proj E", "Win GPU 1" ],
            [ "Win GPU 1_Proj E_warp", "Win GPU 1" ],
            [ "Proj C", "Win GPU 1" ],
            [ "Win GPU 1_Proj C_warp", "Win GPU 1" ],
            [ "Proj G", "Win GPU 1" ],
            [ "Win GPU 1_Proj G_warp", "Win GPU 1" ],
            [ "Proj G", "Win GPU 1_Proj G_warp" ]
         ],
         "objects" : {
            "Image" : {
               "alias" : [ "Image" ],
               "file" : [ "/media/data/Media/index.png" ],
               "flip" : [ 0 ],
               "flop" : [ 0 ],
               "pattern" : [ 0 ],
               "priorityShift" : [ 0 ],
               "srgb" : [ 1 ],
               "type" : "image"
            },
            "Mesh" : {
               "alias" : [ "Mesh" ],
               "file" : [
                  "/home/metalab/src/splash-configs/current/satosplash/sato_centered_refined.obj"
               ],
               "priorityShift" : [ 0 ],
               "type" : "mesh"
            },
            "Object" : {
               "alias" : [ "Object" ],
               "color" : [ 1, 1, 1, 1 ],
               "fill" : [ "wireframe" ],
               "normalExponent" : [ 0 ],
               "position" : [ 0, 0, 0 ],
               "priorityShift" : [ 0 ],
               "rotation" : [ 0, 0, 10 ],
               "scale" : [ 1, 1, 1 ],
               "sideness" : [ 2 ],
               "type" : "object"
            },
            "Object_Image_filter" : {
               "alias" : [ "Object_Image_filter" ],
               "blackLevel" : [ 0 ],
               "blackLevelAuto" : [ 0, 1 ],
               "brightness" : [ 1 ],
               "colorCurveAnchors" : [ 0 ],
               "colorTemperature" : [ 6500 ],
               "contrast" : [ 1 ],
               "fileFilterSource" : [ "" ],
               "filterSource" : [ "" ],
               "invertChannels" : [ 0 ],
               "keepRatio" : [ 0 ],
               "priorityShift" : [ 0 ],
               "saturation" : [ 1 ],
               "scale" : [ 1, 1 ],
               "size" : [ 225, 225 ],
               "sizeOverride" : [ -1, -1 ],
               "type" : "filter"
            },
            "Proj A" : {
               "16bits" : [ 1 ],
               "activateColorLUT" : [ 0 ],
               "alias" : [ "Proj A" ],
               "blendPrecision" : [ 0.10000000149011612 ],
               "blendWidth" : [ 0.10000000149011612 ],
               "brightness" : [ 0.5 ],
               "calibrationPoints" : [
                  [
                     -4.8872599601745605,
                     -6.7267298698425293,
                     2.3193330764770508,
                     -0.89217817783355713,
                     -0.74991345405578613,
                     1
                  ],
                  [
                     -8.2123298645019531,
                     -1.3007099628448486,
                     2.3193340301513672,
                     0.024675110355019569,
                     -0.84155845642089844,
                     1
                  ],
                  [
                     -6.7267298698425293,
                     4.8872590065002441,
                     2.3193349838256836,
                     0.93169265985488892,
                     -0.74536800384521484,
                     1
                  ],
                  [
                     -5.4873008728027344,
                     -0.86910098791122437,
                     5.078333854675293,
                     0.021982274949550629,
                     -0.17441558837890625,
                     1
                  ],
                  [
                     0.89335900545120239,
                     -3.7211010456085205,
                     6.0024337768554688,
                     -0.90739965438842773,
                     0.82138526439666748,
                     1
                  ],
                  [
                     0.30024901032447815,
                     3.8150389194488525,
                     6.0024352073669434,
                     0.94922119379043579,
                     0.95748919248580933,
                     1
                  ],
                  [
                     -9.9999999747524271e-07,
                     -9.9999999747524271e-07,
                     6.7636351585388184,
                     0.0051679140888154507,
                     0.9683983325958252,
                     1
                  ]
               ],
               "colorMixMatrix" : [
                  [ 1, 0, 0, 0, 1, 0, 0, 0, 1 ]
               ],
               "colorTemperature" : [ 6500 ],
               "contrast" : [ 1 ],
               "eye" : [ 9.4979438781738281, 1.6594963073730469, -1.0186936855316162 ],
               "far" : [ 100 ],
               "fov" : [ 33.938453674316406 ],
               "getReprojectionError" : [ 1.3321216106414795 ],
               "hide" : [ 0 ],
               "multisampling" : [ 0 ],
               "near" : [ 0.10000000149011612 ],
               "principalPoint" : [ 0.52643173933029175, 0.018864927813410759 ],
               "priorityShift" : [ 0 ],
               "saturation" : [ 1 ],
               "size" : [ 1400, 1050 ],
               "target" : [ 8.5203456878662109, 1.5077598094940186, -0.87281984090805054 ],
               "type" : "camera",
               "up" : [ 0.14382198452949524, 0.024470752105116844, 0.98930096626281738 ],
               "weightedCalibrationPoints" : [ 1 ]
            },
            "Proj C" : {
               "16bits" : [ 1 ],
               "activateColorLUT" : [ 0 ],
               "alias" : [ "Proj C" ],
               "blendPrecision" : [ 0.10000000149011612 ],
               "blendWidth" : [ 0.10000000149011612 ],
               "brightness" : [ 0.60000002384185791 ],
               "calibrationPoints" : [
                  [
                     4.8872590065002441,
                     6.7267289161682129,
                     2.3193368911743164,
                     0.91410684585571289,
                     -0.7588312029838562,
                     1
                  ],
                  [
                     0,
                     8.3147001266479492,
                     2.3193359375,
                     0.20272576808929443,
                     -0.79662340879440308,
                     1
                  ],
                  [
                     -6.7267298698425293,
                     4.8872590065002441,
                     2.3193349838256836,
                     -0.87464958429336548,
                     -0.74696975946426392,
                     1
                  ],
                  [
                     4.4946589469909668,
                     3.2655589580535889,
                     5.0783357620239258,
                     0.93509978055953979,
                     0.18619045615196228,
                     1
                  ],
                  [
                     -9.9999999747524271e-07,
                     5.5556988716125488,
                     5.0783357620239258,
                     0.14216846227645874,
                     -0.18069262802600861,
                     1
                  ],
                  [
                     -5.2837910652160645,
                     1.7168090343475342,
                     5.078333854675293,
                     -0.9267425537109375,
                     0.1611255407333374,
                     1
                  ],
                  [
                     -3.5355310440063477,
                     -1.4644709825515747,
                     6.0024337768554688,
                     -0.92537111043930054,
                     0.95051956176757812,
                     1
                  ],
                  [
                     3.8150389194488525,
                     -0.30025100708007812,
                     6.0024352073669434,
                     0.93718546628952026,
                     0.94870132207870483,
                     1
                  ],
                  [
                     -9.9999999747524271e-07,
                     -9.9999999747524271e-07,
                     6.7636351585388184,
                     -0.0081321317702531815,
                     0.94679659605026245,
                     1
                  ]
               ],
               "colorMixMatrix" : [
                  [ 1, 0, 0, 0, 1, 0, 0, 0, 1 ]
               ],
               "colorTemperature" : [ 6000 ],
               "contrast" : [ 1 ],
               "eye" : [ 1.7046123743057251, -9.6442451477050781, -1.1459060907363892 ],
               "far" : [ 100 ],
               "fov" : [ 33.869884490966797 ],
               "getReprojectionError" : [ 247.95265197753906 ],
               "hide" : [ 0 ],
               "multisampling" : [ 0 ],
               "near" : [ 0.10000000149011612 ],
               "principalPoint" : [ 0.51414680480957031, 0.033203992992639542 ],
               "priorityShift" : [ 0 ],
               "saturation" : [ 1 ],
               "size" : [ 1400, 1050 ],
               "target" : [ 1.5444595813751221, -8.6692600250244141, -0.99177664518356323 ],
               "type" : "camera",
               "up" : [ 0.02515079453587532, -0.15206357836723328, 0.98805063962936401 ],
               "weightedCalibrationPoints" : [ 1 ]
            },
            "Proj E" : {
               "16bits" : [ 1 ],
               "activateColorLUT" : [ 0 ],
               "alias" : [ "Proj E" ],
               "blendPrecision" : [ 0.10000000149011612 ],
               "blendWidth" : [ 0.10000000149011612 ],
               "brightness" : [ 0.55000001192092896 ],
               "calibrationPoints" : [
                  [
                     4.8872590065002441,
                     6.7267289161682129,
                     2.3193368911743164,
                     -0.88722670078277588,
                     -0.74319511651992798,
                     1
                  ],
                  [
                     8.2123298645019531,
                     1.3007090091705322,
                     2.3193359375,
                     0.027498804032802582,
                     -0.82181262969970703,
                     1
                  ],
                  [
                     7.089439868927002,
                     -4.3444199562072754,
                     2.3193349838256836,
                     0.82627654075622559,
                     -0.74605220556259155,
                     1
                  ],
                  [
                     5.4872989654541016,
                     0.86909902095794678,
                     5.0783357620239258,
                     0.022181490436196327,
                     -0.16172040998935699,
                     1
                  ],
                  [
                     1.7168090343475342,
                     5.2837891578674316,
                     5.0783357620239258,
                     -0.92119348049163818,
                     0.12230409681797028,
                     1
                  ],
                  [
                     3.9284689426422119,
                     -3.9284710884094238,
                     5.0783348083496094,
                     0.81334048509597778,
                     0.044239580631256104,
                     1
                  ],
                  [
                     0.30024901032447815,
                     -3.8150410652160645,
                     6.0024337768554688,
                     0.89976567029953003,
                     0.8026728630065918,
                     1
                  ],
                  [
                     -0.89336097240447998,
                     3.7210988998413086,
                     6.0024352073669434,
                     -0.90071839094161987,
                     0.81081420183181763,
                     1
                  ],
                  [
                     -9.9999999747524271e-07,
                     -9.9999999747524271e-07,
                     6.7636351585388184,
                     0.0071823270991444588,
                     0.95192015171051025,
                     1
                  ]
               ],
               "colorMixMatrix" : [
                  [ 1, 0, 0, 0, 1, 0, 0, 0, 1 ]
               ],
               "colorTemperature" : [ 6500 ],
               "contrast" : [ 1 ],
               "eye" : [ -9.8067865371704102, -1.6536353826522827, -1.0318701267242432 ],
               "far" : [ 100 ],
               "fov" : [ 33.637714385986328 ],
               "getReprojectionError" : [ 2.6417665481567383 ],
               "hide" : [ 0 ],
               "multisampling" : [ 0 ],
               "near" : [ 0.10000000149011612 ],
               "principalPoint" : [ 0.5481722354888916, 0.021899137645959854 ],
               "priorityShift" : [ 0 ],
               "saturation" : [ 1 ],
               "size" : [ 1400, 1050 ],
               "target" : [ -8.8256406784057617, -1.5206278562545776, -0.89164447784423828 ],
               "type" : "camera",
               "up" : [ -0.13741855323314667, -0.030100550502538681, 0.9900556206703186 ],
               "weightedCalibrationPoints" : [ 1 ]
            },
            "Proj G" : {
               "16bits" : [ 1 ],
               "activateColorLUT" : [ 0 ],
               "alias" : [ "Proj G" ],
               "blendPrecision" : [ 0.10000000149011612 ],
               "blendWidth" : [ 0.10000000149011612 ],
               "brightness" : [ 0.69999998807907104 ],
               "calibrationPoints" : [
                  [
                     -9.9999999747524271e-07,
                     -9.9999999747524271e-07,
                     6.7636351585388184,
                     0.025768684223294258,
                     0.94781273603439331,
                     1
                  ],
                  [
                     -4.8872599601745605,
                     -6.7267298698425293,
                     2.3193330764770508,
                     0.93357467651367188,
                     -0.73892480134963989,
                     1
                  ],
                  [
                     1.9410300254821777,
                     -8.0849599838256836,
                     2.3193340301513672,
                     -0.14845062792301178,
                     -0.78009217977523804,
                     1
                  ],
                  [
                     7.089439868927002,
                     -4.3444199562072754,
                     2.3193349838256836,
                     -0.94270020723342896,
                     -0.71447008848190308,
                     1
                  ],
                  [
                     1.296949028968811,
                     -5.4022011756896973,
                     5.078333854675293,
                     0.030914025381207466,
                     -0.15069122612476349,
                     1
                  ],
                  [
                     -4.4946608543395996,
                     -3.2655611038208008,
                     5.078333854675293,
                     0.93130439519882202,
                     0.17051760852336884,
                     1
                  ],
                  [
                     5.4021987915039062,
                     -1.2969510555267334,
                     5.0783348083496094,
                     -0.98356413841247559,
                     0.18116888403892517,
                     1
                  ],
                  [
                     3.5355288982391357,
                     1.4644689559936523,
                     6.0024361610412598,
                     -0.92602819204330444,
                     0.94428575038909912,
                     1
                  ],
                  [
                     -3.8150410652160645,
                     0.30024901032447815,
                     6.0024337768554688,
                     0.91663539409637451,
                     0.96705621480941772,
                     1
                  ]
               ],
               "colorMixMatrix" : [
                  [ 1, 0, 0, 0, 1, 0, 0, 0, 1 ]
               ],
               "colorTemperature" : [ 5000 ],
               "contrast" : [ 1 ],
               "eye" : [ -1.7723754644393921, 9.6026020050048828, -1.0702246427536011 ],
               "far" : [ 100 ],
               "fov" : [ 34.230056762695312 ],
               "getReprojectionError" : [ 0 ],
               "hide" : [ 0 ],
               "multisampling" : [ 0 ],
               "near" : [ 0.10000000149011612 ],
               "principalPoint" : [ 0.49761328101158142, 0.042110048234462738 ],
               "priorityShift" : [ 0 ],
               "saturation" : [ 1 ],
               "size" : [ 1400, 1050 ],
               "target" : [ -1.5936660766601562, 8.6302719116210938, -0.9197622537612915 ],
               "type" : "camera",
               "up" : [ -0.019766971468925476, 0.14934521913528442, 0.98858749866485596 ],
               "weightedCalibrationPoints" : [ 1 ]
            },
            "Win GPU 1" : {
               "alias" : [ "Win GPU 1" ],
               "decorated" : [ 0 ],
               "gamma" : [ 2.2000000476837158 ],
               "layout" : [ 0, 1, 2, 3 ],
               "position" : [ 0, 0 ],
               "priorityShift" : [ 0 ],
               "size" : [ 7680, 1080 ],
               "srgb" : [ 1 ],
               "type" : "window"
            },
            "Win GPU 1_Proj A_warp" : {
               "alias" : [ "Win GPU 1_Proj A_warp" ],
               "patchControl" : [
                  6,
                  5,
                  [ -1.0030001401901245, -1.0090004205703735 ],
                  [ -0.59800004959106445, -1 ],
                  [ -0.20800000429153442, -1.002000093460083 ],
                  [ 0.21000006794929504, -1.0030001401901245 ],
                  [ 0.60499995946884155, -1.0130006074905396 ],
                  [ 1, -1.002000093460083 ],
                  [ -1.0050002336502075, -0.50399994850158691 ],
                  [ -0.60000002384185791, -0.51199984550476074 ],
                  [ -0.19999998807907104, -0.48800015449523926 ],
                  [ 0.20000004768371582, -0.5 ],
                  [ 0.60000002384185791, -0.49500006437301636 ],
                  [ 1, -0.49500006437301636 ],
                  [ -1.006000280380249, -0.0010000000474974513 ],
                  [ -0.60799992084503174, 0.0010000020265579224 ],
                  [ -0.19999998807907104, 0 ],
                  [ 0.20000004768371582, 0 ],
                  [ 0.60000002384185791, 0 ],
                  [ 0.99400007724761963, 0.0029999981634318829 ],
                  [ -1.002000093460083, 0.4930000901222229 ],
                  [ -0.61099988222122192, 0.48800015449523926 ],
                  [ -0.20399999618530273, 0.5 ],
                  [ 0.19100002944469452, 0.49800002574920654 ],
                  [ 0.60000002384185791, 0.5 ],
                  [ 1.0020959377288818, 0.48700016736984253 ],
                  [ -1.004000186920166, 0.9930000901222229 ],
                  [ -0.60100001096725464, 0.98700016736984253 ],
                  [ -0.21100001037120819, 0.99700003862380981 ],
                  [ 0.20500005781650543, 0.99100011587142944 ],
                  [ 0.59400010108947754, 0.99900001287460327 ],
                  [ 1.0010000467300415, 0.99200010299682617 ]
               ],
               "patchResolution" : [ 64 ],
               "patchSize" : [ 6, 5 ],
               "priorityShift" : [ 0 ],
               "size" : [ 1400, 1050 ],
               "type" : "warp"
            },
            "Win GPU 1_Proj C_warp" : {
               "alias" : [ "Win GPU 1_Proj C_warp" ],
               "patchControl" : [
                  6,
                  5,
                  [ -1, -1.006000280380249 ],
                  [ -0.60000002384185791, -1 ],
                  [ -0.20900000631809235, -1 ],
                  [ 0.18800002336502075, -1.010000467300415 ],
                  [ 0.60000002384185791, -1 ],
                  [ 0.995228111743927, -0.99964958429336548 ],
                  [ -1, -0.5 ],
                  [ -0.60000002384185791, -0.5 ],
                  [ -0.19999998807907104, -0.5 ],
                  [ 0.20000004768371582, -0.5 ],
                  [ 0.60000002384185791, -0.5 ],
                  [ 1, -0.5 ],
                  [ -1, 0 ],
                  [ -0.60000002384185791, 0 ],
                  [ -0.19999998807907104, 0 ],
                  [ 0.20000004768371582, 0 ],
                  [ 0.60000002384185791, 0 ],
                  [ 1, 0 ],
                  [ -1, 0.5 ],
                  [ -0.60000002384185791, 0.5 ],
                  [ -0.19999998807907104, 0.5 ],
                  [ 0.20000004768371582, 0.5 ],
                  [ 0.6029999852180481, 0.5 ],
                  [ 0.99800002574920654, 0.49800002574920654 ],
                  [ -1, 1 ],
                  [ -0.60000002384185791, 1 ],
                  [ -0.19999998807907104, 1 ],
                  [ 0.20000004768371582, 1 ],
                  [ 0.60000002384185791, 1 ],
                  [ 1, 0.99500006437301636 ]
               ],
               "patchResolution" : [ 64 ],
               "patchSize" : [ 6, 5 ],
               "priorityShift" : [ 0 ],
               "size" : [ 1400, 1050 ],
               "type" : "warp"
            },
            "Win GPU 1_Proj E_warp" : {
               "alias" : [ "Win GPU 1_Proj E_warp" ],
               "patchControl" : [
                  6,
                  5,
                  [ -0.9930000901222229, -0.99800002574920654 ],
                  [ -0.59800004959106445, -0.99900001287460327 ],
                  [ -0.1979999840259552, -1.0050002336502075 ],
                  [ 0.20500005781650543, -1.0030001401901245 ],
                  [ 0.59900003671646118, -1.004000186920166 ],
                  [ 1.0010000467300415, -1.0010000467300415 ],
                  [ -1, -0.5 ],
                  [ -0.60000002384185791, -0.5 ],
                  [ -0.19999998807907104, -0.5 ],
                  [ 0.20000004768371582, -0.5 ],
                  [ 0.58600020408630371, -0.5 ],
                  [ 0.99800002574920654, -0.5 ],
                  [ -0.98900014162063599, 0 ],
                  [ -0.58500021696090698, 0 ],
                  [ -0.19999998807907104, 0 ],
                  [ 0.20000004768371582, 0 ],
                  [ 0.60000002384185791, 0 ],
                  [ 1, 0 ],
                  [ -1.0010000467300415, 0.48900014162063599 ],
                  [ -0.58322858810424805, 0.49600005149841309 ],
                  [ -0.19099996984004974, 0.49908912181854248 ],
                  [ 0.20000004768371582, 0.5 ],
                  [ 0.60000002384185791, 0.5 ],
                  [ 1, 0.5 ],
                  [ -0.99600005149841309, 0.99400007724761963 ],
                  [ -0.60599994659423828, 0.9930000901222229 ],
                  [ -0.18299995362758636, 0.98200023174285889 ],
                  [ 0.1990000456571579, 0.99900001287460327 ],
                  [ 0.60000002384185791, 0.99600005149841309 ],
                  [ 1, 1 ]
               ],
               "patchResolution" : [ 64 ],
               "patchSize" : [ 6, 5 ],
               "priorityShift" : [ 0 ],
               "size" : [ 1400, 1050 ],
               "type" : "warp"
            },
            "Win GPU 1_Proj G_warp" : {
               "alias" : [ "Win GPU 1_Proj G_warp" ],
               "patchControl" : [
                  6,
                  5,
                  [ -1.0070003271102905, -1.0119107961654663 ],
                  [ -0.61799979209899902, -1.008000373840332 ],
                  [ -0.21500001847743988, -1.0030001401901245 ],
                  [ 0.20377171039581299, -0.99900001287460327 ],
                  [ 0.60899990797042847, -0.98900014162063599 ],
                  [ 1, -0.99400007724761963 ],
                  [ -1.0130006074905396, -0.50199997425079346 ],
                  [ -0.60000002384185791, -0.5 ],
                  [ -0.19999998807907104, -0.5 ],
                  [ 0.20000004768371582, -0.5 ],
                  [ 0.60000002384185791, -0.5 ],
                  [ 1, -0.5 ],
                  [ -1.0180008411407471, -0.0030000000260770321 ],
                  [ -0.60000002384185791, 0 ],
                  [ -0.20199999213218689, -0.0020000003278255463 ],
                  [ 0.20000004768371582, 0.0029999995604157448 ],
                  [ 0.60000002384185791, 0 ],
                  [ 1, 0 ],
                  [ -1.008000373840332, 0.5 ],
                  [ -0.60000002384185791, 0.5 ],
                  [ -0.19299997389316559, 0.5 ],
                  [ 0.19800004363059998, 0.49800002574920654 ],
                  [ 0.58800017833709717, 0.50199997425079346 ],
                  [ 1, 0.5 ],
                  [ -1.0090004205703735, 1.012000560760498 ],
                  [ -0.59700006246566772, 1.010000467300415 ],
                  [ -0.20299999415874481, 1.0010000467300415 ],
                  [ 0.19700004160404205, 0.99900001287460327 ],
                  [ 0.596000075340271, 1.0010000467300415 ],
                  [ 0.99200010299682617, 1.0010000467300415 ]
               ],
               "patchResolution" : [ 64 ],
               "patchSize" : [ 6, 5 ],
               "priorityShift" : [ 0 ],
               "size" : [ 1400, 1050 ],
               "type" : "warp"
            },
            "blender" : {
               "alias" : [ "blender" ],
               "mode" : [ "once" ],
               "priorityShift" : [ 0 ],
               "type" : "blender"
            },
            "dragndrop" : {
               "alias" : [ "dragndrop" ],
               "priorityShift" : [ 0 ],
               "type" : "dragndrop",
               "updateRate" : [ 10 ]
            },
            "gui" : {
               "alias" : [ "gui" ],
               "priorityShift" : [ 0 ],
               "type" : "gui"
            },
            "joystick" : {
               "alias" : [ "joystick" ],
               "priorityShift" : [ 0 ],
               "type" : "joystick",
               "updateRate" : [ 100 ]
            },
            "keyboard" : {
               "alias" : [ "keyboard" ],
               "priorityShift" : [ 0 ],
               "type" : "keyboard",
               "updateRate" : [ 100 ]
            },
            "mouse" : {
               "alias" : [ "keyboard" ],
               "priorityShift" : [ 0 ],
               "type" : "mouse",
               "updateRate" : [ 100 ]
            }
         },
         "priorityShift" : [ 0 ],
         "swapInterval" : [ 1 ],
         "type" : "scene"
      },
      "GPU_2" : {
         "display" : 0,
         "links" : [
            [ "Image", "Object_Image_filter" ],
            [ "Proj AA", "Win GPU 2_Proj AA_warp" ],
            [ "Object", "Proj EE" ],
            [ "Proj GG", "Win GPU 2_Proj GG_warp" ],
            [ "Proj EE", "Win GPU 2_Proj EE_warp" ],
            [ "Object", "Proj AA" ],
            [ "Proj AA", "Win GPU 2" ],
            [ "Win GPU 2_Proj AA_warp", "Win GPU 2" ],
            [ "Proj CC", "Win GPU 2" ],
            [ "Win GPU 2_Proj CC_warp", "Win GPU 2" ],
            [ "Proj EE", "Win GPU 2" ],
            [ "Win GPU 2_Proj EE_warp", "Win GPU 2" ],
            [ "Proj GG", "Win GPU 2" ],
            [ "Win GPU 2_Proj GG_warp", "Win GPU 2" ],
            [ "Object", "Proj CC" ],
            [ "Proj CC", "Win GPU 2_Proj CC_warp" ],
            [ "Mesh", "Object" ],
            [ "Image", "Object" ],
            [ "Object_Image_filter", "Object" ],
            [ "Object", "Proj GG" ]
         ],
         "objects" : {
            "Image" : {
               "alias" : [ "Image" ],
               "file" : [ "/media/data/Media/index.png" ],
               "flip" : [ 0 ],
               "flop" : [ 0 ],
               "pattern" : [ 0 ],
               "priorityShift" : [ 0 ],
               "srgb" : [ 1 ],
               "type" : "image"
            },
            "Mesh" : {
               "alias" : [ "Mesh" ],
               "file" : [
                  "/home/metalab/src/splash-configs/current/satosplash/sato_centered_refined.obj"
               ],
               "priorityShift" : [ 0 ],
               "type" : "mesh"
            },
            "Object" : {
               "alias" : [ "Object" ],
               "color" : [ 1, 1, 1, 1 ],
               "fill" : [ "wireframe" ],
               "normalExponent" : [ 0 ],
               "position" : [ 0, 0, 0 ],
               "priorityShift" : [ 0 ],
               "rotation" : [ 0, 0, 10 ],
               "scale" : [ 1, 1, 1 ],
               "sideness" : [ 2 ],
               "type" : "object"
            },
            "Object_Image_filter" : {
               "alias" : [ "Object_Image_filter" ],
               "blackLevel" : [ 0 ],
               "blackLevelAuto" : [ 0, 1 ],
               "brightness" : [ 1 ],
               "colorCurveAnchors" : [ 0 ],
               "colorTemperature" : [ 6500 ],
               "contrast" : [ 1 ],
               "fileFilterSource" : [ "" ],
               "filterSource" : [ "" ],
               "invertChannels" : [ 0 ],
               "keepRatio" : [ 0 ],
               "priorityShift" : [ 0 ],
               "saturation" : [ 1 ],
               "scale" : [ 1, 1 ],
               "size" : [ 225, 225 ],
               "sizeOverride" : [ -1, -1 ],
               "type" : "filter"
            },
            "Proj AA" : {
               "16bits" : [ 1 ],
               "activateColorLUT" : [ 0 ],
               "alias" : [ "Proj AA" ],
               "blendPrecision" : [ 0.10000000149011612 ],
               "blendWidth" : [ 0.10000000149011612 ],
               "brightness" : [ 1 ],
               "calibrationPoints" : [
                  [
                     -3.6924688816070557,
                     -8.9144086837768555,
                     -5.821897029876709,
                     -0.69051355123519897,
                     -0.65405786037445068,
                     1
                  ],
                  [
                     -3.8268299102783203,
                     -9.2387990951538086,
                     -3.2363669872283936,
                     -0.74358510971069336,
                     -0.2399076372385025,
                     1
                  ],
                  [
                     -7.604060173034668,
                     -6.4944791793823242,
                     -3.2363669872283936,
                     -0.34674590826034546,
                     -0.069941416382789612,
                     1
                  ],
                  [
                     -7.9077510833740234,
                     -2.5693800449371338,
                     2.3193330764770508,
                     -0.069761022925376892,
                     0.81326824426651001,
                     1
                  ],
                  [
                     -5.399960994720459,
                     6.3225398063659668,
                     2.3193349838256836,
                     0.93703329563140869,
                     0.80938911437988281,
                     1
                  ],
                  [
                     -5.0415291786193848,
                     8.2270307540893555,
                     -5.8218951225280762,
                     0.92248845100402832,
                     -0.79577457904815674,
                     1
                  ],
                  [
                     -1.5094189643859863,
                     -9.5300893783569336,
                     -5.821897029876709,
                     -0.86288005113601685,
                     -0.84247088432312012,
                     1
                  ],
                  [
                     -6.4944791793823242,
                     7.6040611267089844,
                     -3.2363650798797607,
                     0.86879557371139526,
                     -0.25041654706001282,
                     1
                  ],
                  [
                     -7.2265892028808594,
                     -6.3935456275939941,
                     -5.821897029876709,
                     -0.28009530901908875,
                     -0.40511247515678406,
                     1
                  ],
                  [
                     -2.430978536605835,
                     -7.951385498046875,
                     2.3193330764770508,
                     -0.90104585886001587,
                     0.83817309141159058,
                     1
                  ]
               ],
               "colorMixMatrix" : [
                  [ 1, 0, 0, 0, 1, 0, 0, 0, 1 ]
               ],
               "colorTemperature" : [ 6500 ],
               "contrast" : [ 1 ],
               "eye" : [ 8.1868629455566406, 1.5733855962753296, 2.1223347187042236 ],
               "far" : [ 100 ],
               "fov" : [ 44.290935516357422 ],
               "getReprojectionError" : [ 0 ],
               "hide" : [ 0 ],
               "multisampling" : [ 0 ],
               "near" : [ 0.10000000149011612 ],
               "principalPoint" : [ 0.54896754026412964, 0.26440870761871338 ],
               "priorityShift" : [ 0 ],
               "saturation" : [ 1 ],
               "size" : [ 1920, 1080 ],
               "target" : [ 7.3039917945861816, 1.4368780851364136, 1.6729978322982788 ],
               "type" : "camera",
               "up" : [ -0.4429745078086853, -0.075609207153320312, 0.89334028959274292 ],
               "weightedCalibrationPoints" : [ 1 ]
            },
            "Proj CC" : {
               "16bits" : [ 1 ],
               "activateColorLUT" : [ 0 ],
               "alias" : [ "Proj CC" ],
               "blendPrecision" : [ 0.10000000149011612 ],
               "blendWidth" : [ 0.10000000149011612 ],
               "brightness" : [ 0.89999997615814209 ],
               "calibrationPoints" : [
                  [
                     6.0001201629638672,
                     7.0252399444580078,
                     0.59046697616577148,
                     0.92844980955123901,
                     0.63072389364242554,
                     1
                  ],
                  [
                     0.72487002611160278,
                     9.2103204727172852,
                     0.59046697616577148,
                     0.035515159368515015,
                     0.67735683917999268,
                     1
                  ],
                  [
                     0.78459101915359497,
                     9.9691705703735352,
                     -3.2363629341125488,
                     0.055740721523761749,
                     -0.17483165860176086,
                     1
                  ],
                  [
                     0.75704097747802734,
                     9.619140625,
                     -5.8218941688537598,
                     0.042394239455461502,
                     -0.74579125642776489,
                     1
                  ],
                  [
                     -6.0001201629638672,
                     7.0252399444580078,
                     0.5904650092124939,
                     -0.95216935873031616,
                     0.66893941164016724,
                     1
                  ],
                  [
                     -6.4944791793823242,
                     7.6040611267089844,
                     -3.2363650798797607,
                     -0.895332932472229,
                     -0.29983168840408325,
                     1
                  ],
                  [
                     -6.822789192199707,
                     6.8227910995483398,
                     -5.8218951225280762,
                     -0.90564131736755371,
                     -0.94528621435165405,
                     1
                  ],
                  [
                     5.671471118927002,
                     7.8061108589172363,
                     -5.8218932151794434,
                     0.72323870658874512,
                     -0.97457915544509888,
                     1
                  ],
                  [
                     5.7357668876647949,
                     8.1915245056152344,
                     -3.2363629341125488,
                     0.77451753616333008,
                     -0.34827297925949097,
                     1
                  ]
               ],
               "colorMixMatrix" : [
                  [ 1, 0, 0, 0, 1, 0, 0, 0, 1 ]
               ],
               "colorTemperature" : [ 6000 ],
               "contrast" : [ 1 ],
               "eye" : [ 2.0733656883239746, -7.9418306350708008, 1.8375989198684692 ],
               "far" : [ 100 ],
               "fov" : [ 27.878110885620117 ],
               "getReprojectionError" : [ 0 ],
               "hide" : [ 0 ],
               "multisampling" : [ 0 ],
               "near" : [ 0.10000000149011612 ],
               "principalPoint" : [ 0.40481972694396973, 0.13848695158958435 ],
               "priorityShift" : [ 0 ],
               "saturation" : [ 1 ],
               "size" : [ 1920, 1080 ],
               "target" : [ 1.896672248840332, -7.0399398803710938, 1.4434252977371216 ],
               "type" : "camera",
               "up" : [ -0.046516086906194687, 0.392375648021698, 0.91862809658050537 ],
               "weightedCalibrationPoints" : [ 1 ]
            },
            "Proj EE" : {
               "16bits" : [ 1 ],
               "activateColorLUT" : [ 0 ],
               "alias" : [ "Proj EE" ],
               "blendPrecision" : [ 0.10000000149011612 ],
               "blendWidth" : [ 0.10000000149011612 ],
               "brightness" : [ 0.60000002384185791 ],
               "calibrationPoints" : [
                  [
                     8.5264005661010742,
                     -5.2249898910522461,
                     -3.2363650798797607,
                     0.9187932014465332,
                     -0.36924707889556885,
                     1
                  ],
                  [
                     8.2270307540893555,
                     -5.0415291786193848,
                     -5.8218951225280762,
                     0.84440624713897705,
                     -0.94342750310897827,
                     1
                  ],
                  [
                     7.5196099281311035,
                     -4.608029842376709,
                     1.4776060581207275,
                     0.9837067723274231,
                     0.86514878273010254,
                     1
                  ],
                  [
                     9.8768806457519531,
                     1.5643399953842163,
                     -3.2363629341125488,
                     0.048876803368330002,
                     -0.19461143016815186,
                     1
                  ],
                  [
                     9.1250495910644531,
                     1.4452699422836304,
                     0.59046697616577148,
                     0.047398772090673447,
                     0.66775953769683838,
                     1
                  ],
                  [
                     6.0001201629638672,
                     7.0252399444580078,
                     0.59046697616577148,
                     -0.89539104700088501,
                     0.6263812780380249,
                     1
                  ],
                  [
                     5.8778510093688965,
                     8.0901708602905273,
                     -3.2363629341125488,
                     -0.94016110897064209,
                     -0.39146929979324341,
                     1
                  ],
                  [
                     6.2664508819580078,
                     7.3370709419250488,
                     -5.8218932151794434,
                     -0.75573873519897461,
                     -0.94342750310897827,
                     1
                  ],
                  [
                     9.5300912857055664,
                     1.5094209909439087,
                     -5.8218941688537598,
                     0.049784820526838303,
                     -0.71364599466323853,
                     1
                  ]
               ],
               "colorMixMatrix" : [
                  [ 1, 0, 0, 0, 1, 0, 0, 0, 1 ]
               ],
               "colorTemperature" : [ 6500 ],
               "contrast" : [ 1 ],
               "eye" : [ -8.0190792083740234, -1.3343889713287354, 2.0897610187530518 ],
               "far" : [ 100 ],
               "fov" : [ 28.492347717285156 ],
               "getReprojectionError" : [ 0 ],
               "hide" : [ 0 ],
               "multisampling" : [ 0 ],
               "near" : [ 0.10000000149011612 ],
               "principalPoint" : [ 0.54435813426971436, 0.025662874802947044 ],
               "priorityShift" : [ 0 ],
               "saturation" : [ 1 ],
               "size" : [ 1920, 1080 ],
               "target" : [ -7.1387162208557129, -1.2098115682601929, 1.6321136951446533 ],
               "type" : "camera",
               "up" : [ 0.45176166296005249, 0.073661543428897858, 0.88909244537353516 ],
               "weightedCalibrationPoints" : [ 1 ]
            },
            "Proj GG" : {
               "16bits" : [ 1 ],
               "activateColorLUT" : [ 0 ],
               "alias" : [ "Proj GG" ],
               "blendPrecision" : [ 0.10000000149011612 ],
               "blendWidth" : [ 0.10000000149011612 ],
               "brightness" : [ 1 ],
               "calibrationPoints" : [
                  [
                     8.9100713729858398,
                     -4.5398998260498047,
                     -3.2363638877868652,
                     -0.92631906270980835,
                     -0.45782831311225891,
                     1
                  ],
                  [
                     3.6924710273742676,
                     -8.9144086837768555,
                     -5.8218960762023926,
                     0.016032051295042038,
                     -0.83526939153671265,
                     1
                  ],
                  [
                     3.8268311023712158,
                     -9.2387990951538086,
                     -3.2363660335540771,
                     0.010302884504199028,
                     -0.27988219261169434,
                     1
                  ],
                  [
                     7.8773698806762695,
                     -4.8272600173950195,
                     0.59046602249145508,
                     -0.8676484227180481,
                     0.65159934759140015,
                     1
                  ],
                  [
                     -3.8268299102783203,
                     -9.2387990951538086,
                     -3.2363669872283936,
                     0.96570283174514771,
                     -0.48063972592353821,
                     1
                  ],
                  [
                     3.5355300903320312,
                     -8.5355300903320312,
                     0.59046399593353271,
                     0.025778276845812798,
                     0.61607742309570312,
                     1
                  ],
                  [
                     7.3370709419250488,
                     -6.266448974609375,
                     -5.8218951225280762,
                     -0.54186868667602539,
                     -0.92767155170440674,
                     1
                  ],
                  [
                     -2.9816689491271973,
                     -9.1766386032104492,
                     -5.821897029876709,
                     0.79777103662490845,
                     -0.99790525436401367,
                     1
                  ],
                  [
                     -2.8549399375915527,
                     -8.7866201400756836,
                     0.59046298265457153,
                     0.94476413726806641,
                     0.47764116525650024,
                     1
                  ]
               ],
               "colorMixMatrix" : [
                  [ 1, 0, 0, 0, 1, 0, 0, 0, 1 ]
               ],
               "colorTemperature" : [ 6500 ],
               "contrast" : [ 1 ],
               "eye" : [ -1.5473699569702148, 8.1930065155029297, 2.0363898277282715 ],
               "far" : [ 100 ],
               "fov" : [ 28.129777908325195 ],
               "getReprojectionError" : [ 0 ],
               "hide" : [ 0 ],
               "multisampling" : [ 0 ],
               "near" : [ 0.10000000149011612 ],
               "principalPoint" : [ 0.63918793201446533, -0.10458023101091385 ],
               "priorityShift" : [ 0 ],
               "saturation" : [ 1 ],
               "size" : [ 1920, 1080 ],
               "target" : [ -1.4061905145645142, 7.3289332389831543, 1.5532276630401611 ],
               "type" : "camera",
               "up" : [ 0.14925727248191833, -0.46389362215995789, 0.87322676181793213 ],
               "weightedCalibrationPoints" : [ 1 ]
            },
            "Win GPU 2" : {
               "alias" : [ "Win GPU 2" ],
               "decorated" : [ 0 ],
               "gamma" : [ 2.2000000476837158 ],
               "layout" : [ 0, 1, 2, 3 ],
               "position" : [ 0, 0 ],
               "priorityShift" : [ 0 ],
               "size" : [ 7680, 1080 ],
               "srgb" : [ 1 ],
               "type" : "window"
            },
            "Win GPU 2_Proj AA_warp" : {
               "alias" : [ "Win GPU 2_Proj AA_warp" ],
               "patchControl" : [
                  6,
                  6,
                  [ -1.0010000467300415, -0.99500006437301636 ],
                  [ -0.60000002384185791, -1 ],
                  [ -0.19999998807907104, -1 ],
                  [ 0.20000004768371582, -1 ],
                  [ 0.5820002555847168, -1 ],
                  [ 0.9930000901222229, -0.99500006437301636 ],
                  [ -0.99800002574920654, -0.59300011396408081 ],
                  [ -0.60000002384185791, -0.60000002384185791 ],
                  [ -0.19999998807907104, -0.60000002384185791 ],
                  [ 0.20000004768371582, -0.60000002384185791 ],
                  [ 0.60000002384185791, -0.60000002384185791 ],
                  [ 1, -0.60000002384185791 ],
                  [ -0.99600005149841309, -0.19599997997283936 ],
                  [ -0.60000002384185791, -0.19999998807907104 ],
                  [ -0.19999998807907104, -0.19999998807907104 ],
                  [ 0.20000004768371582, -0.19999998807907104 ],
                  [ 0.58500021696090698, -0.1979999840259552 ],
                  [ 0.99900001287460327, -0.20499999821186066 ],
                  [ -1.0030001401901245, 0.20700006186962128 ],
                  [ -0.60000002384185791, 0.20000004768371582 ],
                  [ -0.19999998807907104, 0.20000004768371582 ],
                  [ 0.20000004768371582, 0.20000004768371582 ],
                  [ 0.60000002384185791, 0.20000004768371582 ],
                  [ 0.99800002574920654, 0.20000004768371582 ],
                  [ -0.99700003862380981, 0.61099988222122192 ],
                  [ -0.60000002384185791, 0.60000002384185791 ],
                  [ -0.19999998807907104, 0.60000002384185791 ],
                  [ 0.20000004768371582, 0.60000002384185791 ],
                  [ 0.60000002384185791, 0.60000002384185791 ],
                  [ 1, 0.59400010108947754 ],
                  [ -0.98700016736984253, 1 ],
                  [ -0.60000002384185791, 1 ],
                  [ -0.19999998807907104, 1 ],
                  [ 0.20000004768371582, 1 ],
                  [ 0.60000002384185791, 1 ],
                  [ 1.002000093460083, 1 ]
               ],
               "patchResolution" : [ 64 ],
               "patchSize" : [ 6, 6 ],
               "priorityShift" : [ 0 ],
               "size" : [ 1920, 1080 ],
               "type" : "warp"
            },
            "Win GPU 2_Proj CC_warp" : {
               "alias" : [ "Win GPU 2_Proj CC_warp" ],
               "patchControl" : [
                  6,
                  6,
                  [ -0.99900001287460327, -1.0170007944107056 ],
                  [ -0.60899990797042847, -1.0200009346008301 ],
                  [ -0.19999998807907104, -1 ],
                  [ 0.20000004768371582, -1 ],
                  [ 0.58700019121170044, -1.0150007009506226 ],
                  [ 1.0070003271102905, -1.008000373840332 ],
                  [ -0.99800002574920654, -0.60000002384185791 ],
                  [ -0.61199986934661865, -0.61399984359741211 ],
                  [ -0.19999998807907104, -0.60000002384185791 ],
                  [ 0.20000004768371582, -0.60000002384185791 ],
                  [ 0.59100013971328735, -0.60000002384185791 ],
                  [ 1, -0.61399984359741211 ],
                  [ -1.0090004205703735, -0.19999998807907104 ],
                  [ -0.59800004959106445, -0.19999998807907104 ],
                  [ -0.19999998807907104, -0.19999998807907104 ],
                  [ 0.20000004768371582, -0.19999998807907104 ],
                  [ 0.60000002384185791, -0.19999998807907104 ],
                  [ 1, -0.21300001442432404 ],
                  [ -0.9930000901222229, 0.20400005578994751 ],
                  [ -0.61599981784820557, 0.20000004768371582 ],
                  [ -0.19999998807907104, 0.20000004768371582 ],
                  [ 0.20000004768371582, 0.20000004768371582 ],
                  [ 0.59000015258789062, 0.20000004768371582 ],
                  [ 1, 0.1900000274181366 ],
                  [ -1.008000373840332, 0.6099998950958252 ],
                  [ -0.60000002384185791, 0.60000002384185791 ],
                  [ -0.19999998807907104, 0.60000002384185791 ],
                  [ 0.20000004768371582, 0.60000002384185791 ],
                  [ 0.58800017833709717, 0.60199999809265137 ],
                  [ 1, 0.59500008821487427 ],
                  [ -0.99622821807861328, 1.0195193290710449 ],
                  [ -0.61299985647201538, 1.0260012149810791 ],
                  [ -0.21500001847743988, 1.0070003271102905 ],
                  [ 0.19277180731296539, 1.0050002336502075 ],
                  [ 0.60000002384185791, 1.006000280380249 ],
                  [ 1.0070003271102905, 0.9930000901222229 ]
               ],
               "patchResolution" : [ 64 ],
               "patchSize" : [ 6, 6 ],
               "priorityShift" : [ 0 ],
               "size" : [ 1920, 1080 ],
               "type" : "warp"
            },
            "Win GPU 2_Proj EE_warp" : {
               "alias" : [ "Win GPU 2_Proj EE_warp" ],
               "patchControl" : [
                  6,
                  5,
                  [ -1, -1.0030001401901245 ],
                  [ -0.60199999809265137, -1.0070003271102905 ],
                  [ -0.19999998807907104, -1 ],
                  [ 0.20000004768371582, -1 ],
                  [ 0.60000002384185791, -1 ],
                  [ 0.99800002574920654, -0.99500006437301636 ],
                  [ -1, -0.5 ],
                  [ -0.60000002384185791, -0.5 ],
                  [ -0.19999998807907104, -0.5 ],
                  [ 0.20000004768371582, -0.5 ],
                  [ 0.60000002384185791, -0.5 ],
                  [ 1, -0.49200010299682617 ],
                  [ -0.99800002574920654, -0.0020000000949949026 ],
                  [ -0.60000002384185791, 0 ],
                  [ -0.19999998807907104, 0 ],
                  [ 0.20000004768371582, 0 ],
                  [ 0.60000002384185791, 0 ],
                  [ 1, 0 ],
                  [ -1, 0.5 ],
                  [ -0.60000002384185791, 0.5 ],
                  [ -0.19999998807907104, 0.5 ],
                  [ 0.20000004768371582, 0.5 ],
                  [ 0.60000002384185791, 0.5 ],
                  [ 1, 0.5 ],
                  [ -0.99800002574920654, 1.004000186920166 ],
                  [ -0.60000002384185791, 1 ],
                  [ -0.19999998807907104, 1.0070003271102905 ],
                  [ 0.20000004768371582, 1 ],
                  [ 0.60100001096725464, 1.004000186920166 ],
                  [ 0.9930000901222229, 1.010000467300415 ]
               ],
               "patchResolution" : [ 64 ],
               "patchSize" : [ 6, 5 ],
               "priorityShift" : [ 0 ],
               "size" : [ 1920, 1080 ],
               "type" : "warp"
            },
            "Win GPU 2_Proj GG_warp" : {
               "alias" : [ "Win GPU 2_Proj GG_warp" ],
               "patchControl" : [
                  6,
                  5,
                  [ -1.004000186920166, -1.0140006542205811 ],
                  [ -0.61199986934661865, -1.0090004205703735 ],
                  [ -0.19999998807907104, -1 ],
                  [ 0.20000004768371582, -1 ],
                  [ 0.60100001096725464, -1.002000093460083 ],
                  [ 1.004000186920166, -0.99946433305740356 ],
                  [ -1.002000093460083, -0.51299983263015747 ],
                  [ -0.6099998950958252, -0.5 ],
                  [ -0.19999998807907104, -0.5 ],
                  [ 0.20000004768371582, -0.5 ],
                  [ 0.60000002384185791, -0.5 ],
                  [ 1, -0.49500006437301636 ],
                  [ -1.0130006074905396, -0.0099999979138374329 ],
                  [ -0.60699993371963501, -0.0050000003539025784 ],
                  [ -0.19999998807907104, 0 ],
                  [ 0.20000004768371582, 0 ],
                  [ 0.596000075340271, 0 ],
                  [ 0.99000012874603271, 0.0060000005178153515 ],
                  [ -1.002000093460083, 0.49000012874603271 ],
                  [ -0.60199999809265137, 0.49500006437301636 ],
                  [ -0.19999998807907104, 0.5 ],
                  [ 0.20000004768371582, 0.5 ],
                  [ 0.60000002384185791, 0.5 ],
                  [ 0.99700003862380981, 0.49600005149841309 ],
                  [ -1.012000560760498, 0.99600005149841309 ],
                  [ -0.6029999852180481, 0.99500006437301636 ],
                  [ -0.21800002455711365, 1 ],
                  [ 0.19200003147125244, 1 ],
                  [ 0.59100013971328735, 0.99200010299682617 ],
                  [ 0.99000012874603271, 1.0050002336502075 ]
               ],
               "patchResolution" : [ 64 ],
               "patchSize" : [ 6, 5 ],
               "priorityShift" : [ 0 ],
               "size" : [ 1920, 1080 ],
               "type" : "warp"
            },
            "blender" : {
               "alias" : [ "blender" ],
               "mode" : [ "once" ],
               "priorityShift" : [ 0 ],
               "type" : "blender"
            }
         },
         "priorityShift" : [ 0 ],
         "swapInterval" : [ 1 ],
         "type" : "scene"
      }
   },
   "version" : "0.7.20",
   "world" : {
      "clockDeviceName" : [ "" ],
      "configurationPath" : [ "/home/metalab/src/splash-configs/current/satosplash/" ],
      "forceCoreAffinity" : [ 0 ],
      "forceRealtime" : [ 1 ],
      "framerate" : [ 15 ],
      "looseClock" : [ 1 ],
      "mediaPath" : [ "/media/data/Media" ],
      "priorityShift" : [ 0 ],
      "type" : "world"
   }
}
