# Blender v2.76 (sub 0) OBJ File: 'configuration.blend'
# www.blender.org
o Dome_Sphere.001
v -7.071068 0.000000 7.071068
v -9.238795 0.000000 3.826834
v -10.000000 0.000000 -0.000000
v -3.095975 2.249356 9.238795
v -5.720614 4.156268 7.071068
v -7.474342 5.430427 3.826834
v -8.090170 5.877852 -0.000000
v -1.182558 3.639535 9.238795
v -2.185081 6.724984 7.071068
v -2.854945 8.786614 3.826834
v -3.090171 9.510564 -0.000000
v -0.000002 -0.000001 10.000000
v 1.182555 3.639535 9.238795
v 2.185078 6.724984 7.071068
v 2.854943 8.786614 3.826834
v 3.090168 9.510564 -0.000000
v 3.095972 2.249357 9.238795
v 5.720612 4.156269 7.071068
v 7.474339 5.430427 3.826834
v 8.090168 5.877852 -0.000000
v 3.826832 0.000000 9.238795
v 7.071065 0.000000 7.071068
v 9.238792 0.000000 3.826834
v 9.999998 -0.000000 -0.000000
v 3.095972 -2.249356 9.238795
v 5.720612 -4.156269 7.071068
v 7.474340 -5.430427 3.826834
v 8.090169 -5.877852 -0.000000
v 1.182555 -3.639535 9.238795
v 2.185078 -6.724984 7.071068
v 2.854944 -8.786615 3.826834
v 3.090169 -9.510564 -0.000000
v -1.182558 -3.639535 9.238795
v -2.185081 -6.724983 7.071068
v -2.854945 -8.786615 3.826834
v -3.090170 -9.510564 -0.000000
v -3.095975 -2.249357 9.238795
v -5.720614 -4.156269 7.071068
v -7.474342 -5.430427 3.826834
v -8.090170 -5.877852 -0.000000
v -3.826835 -0.000000 9.238795
vt 0.075855 0.500118
vt 0.175361 0.500118
vt 0.237351 0.690905
vt 0.156849 0.749393
vt 0.004532 0.500118
vt 0.099148 0.791315
vt 0.368895 0.903454
vt 0.346855 0.971285
vt 0.357831 0.603371
vt 0.445663 0.667185
vt 0.399644 0.808818
vt 0.630999 0.903454
vt 0.653039 0.971285
vt 0.554230 0.667185
vt 0.600250 0.808818
vt 0.762543 0.690905
vt 0.843045 0.749393
vt 0.900746 0.791315
vt 0.642063 0.603371
vt 0.824533 0.500118
vt 0.924039 0.500118
vt 0.995362 0.500118
vt 0.675612 0.500118
vt 0.843045 0.250843
vt 0.900746 0.208920
vt 0.642063 0.396865
vt 0.762543 0.309331
vt 0.554230 0.333051
vt 0.600250 0.191418
vt 0.630999 0.096782
vt 0.653039 0.028950
vt 0.399644 0.191418
vt 0.368895 0.096782
vt 0.346855 0.028950
vt 0.445663 0.333051
vt 0.156849 0.250843
vt 0.099148 0.208920
vt 0.357831 0.396865
vt 0.237351 0.309331
vt 0.324282 0.500118
vt 0.499947 0.500118
s off
f 2/1 1/2 5/3 6/4
f 3/5 2/1 6/4 7/6
f 7/6 6/4 10/7 11/8
f 5/3 4/9 8/10 9/11
f 6/4 5/3 9/11 10/7
f 11/8 10/7 15/12 16/13
f 9/11 8/10 13/14 14/15
f 10/7 9/11 14/15 15/12
f 15/12 14/15 18/16 19/17
f 16/13 15/12 19/17 20/18
f 14/15 13/14 17/19 18/16
f 19/17 18/16 22/20 23/21
f 20/18 19/17 23/21 24/22
f 18/16 17/19 21/23 22/20
f 24/22 23/21 27/24 28/25
f 22/20 21/23 25/26 26/27
f 23/21 22/20 26/27 27/24
f 26/27 25/26 29/28 30/29
f 27/24 26/27 30/29 31/30
f 28/25 27/24 31/30 32/31
f 31/30 30/29 34/32 35/33
f 32/31 31/30 35/33 36/34
f 30/29 29/28 33/35 34/32
f 36/34 35/33 39/36 40/37
f 34/32 33/35 37/38 38/39
f 35/33 34/32 38/39 39/36
f 41/40 12/41 4/9
f 1/2 41/40 4/9 5/3
f 4/9 12/41 8/10
f 8/10 12/41 13/14
f 13/14 12/41 17/19
f 17/19 12/41 21/23
f 21/23 12/41 25/26
f 25/26 12/41 29/28
f 29/28 12/41 33/35
f 33/35 12/41 37/38
f 40/37 39/36 2/1 3/5
f 38/39 37/38 41/40 1/2
f 39/36 38/39 1/2 2/1
f 37/38 12/41 41/40
