{
   "encoding" : "UTF-8",
   "first" : {
      "Bottom_0" : {
         "activateColorLUT" : [ 0 ],
         "blackLevel" : [ 0.0 ],
         "blendPrecision" : [ 0.1000000014901161 ],
         "blendWidth" : [ 0.05000000074505806 ],
         "brightness" : [ 1.0 ],
         "calibrationPoints" : [
            [
               0.0,
               -8.483230590820312,
               0.5337179899215698,
               -0.7516431212425232,
               -0.701157271862030,
               1
            ],
            [
               0.0,
               -8.083983421325684,
               2.626643896102905,
               -0.7305389642715454,
               -0.281437098979950,
               1
            ],
            [
               9.999999974752427e-07,
               -7.176790237426758,
               4.554528236389160,
               -0.6834316253662109,
               0.1459126919507980,
               1
            ],
            [
               9.999999974752427e-07,
               -5.818653106689453,
               6.196234226226807,
               -0.6116527915000916,
               0.5994875431060791,
               1
            ],
            [
               -7.719212055206299,
               -2.099198102951050,
               0.1320690065622330,
               0.4708364903926849,
               -0.7638031244277954,
               1
            ],
            [
               1.560722947120667,
               -5.706850051879883,
               6.077175140380859,
               -0.8323353528976440,
               0.7128237485885620,
               1
            ],
            [
               1.560722947120667,
               -8.320227622985840,
               0.5234619975090027,
               -0.9491018056869507,
               -0.7142865657806396,
               1
            ],
            [
               -5.656853199005127,
               -5.998550891876221,
               0.3773959875106812,
               -0.01337028201669455,
               -0.7075780630111694,
               1
            ],
            [
               -5.656854152679443,
               -9.999999974752427e-07,
               6.010408878326416,
               0.6191943883895874,
               0.6517835855484009,
               1
            ],
            [
               -7.719211101531982,
               1.013295054435730,
               1.843178987503052,
               0.9286676049232483,
               -0.3823501467704773,
               1
            ]
         ],
         "colorMixMatrix" : [
            [ 1.0, 0.0, 0.0, 0.0, 1.0, 0.0, 0.0, 0.0, 1.0 ]
         ],
         "colorTemperature" : [ 6500.0 ],
         "eye" : [ 4.785011768341064, 4.787105083465576, 0.7671023607254028 ],
         "fov" : [ 41.90030670166016 ],
         "principalPoint" : [ 0.4348429739475250, 0.1896318197250366 ],
         "size" : [ 1920.0, 1200.0 ],
         "target" : [ 0.4118892550468445, -0.3383912742137909, 0.8460724353790283 ],
         "type" : "camera",
         "up" : [ -0.6490201950073242, -0.7606808543205261, 0.01172082219272852 ]
      },
      "Bottom_3" : {
         "activateColorLUT" : [ 0 ],
         "blackLevel" : [ 0.0 ],
         "blendPrecision" : [ 0.1000000014901161 ],
         "blendWidth" : [ 0.05000000074505806 ],
         "brightness" : [ 1.0 ],
         "calibrationPoints" : [
            [
               0.0,
               -8.483230590820312,
               0.5337179899215698,
               0.6501224040985107,
               -0.7210972309112549,
               1
            ],
            [
               9.999999974752427e-07,
               -5.818653106689453,
               6.196234226226807,
               0.5406060814857483,
               0.4484535157680511,
               1
            ],
            [
               7.963893890380859,
               9.999999974752427e-07,
               -9.999999974752427e-07,
               -0.7037001848220825,
               -0.8290762901306152,
               1
            ],
            [
               5.656855106353760,
               -5.998548984527588,
               0.3773950040340424,
               -0.03089298121631145,
               -0.7440608739852905,
               1
            ],
            [
               7.963893890380859,
               -0.3887340128421783,
               0.02445499971508980,
               -0.6598066091537476,
               -0.8200026750564575,
               1
            ],
            [
               -1.560721039772034,
               -5.706849098205566,
               6.077175140380859,
               0.7501965165138245,
               0.5379016399383545,
               1
            ],
            [
               -1.560721039772034,
               -8.320226669311523,
               0.5234630107879639,
               0.8358199596405029,
               -0.7401379346847534,
               1
            ],
            [
               1.560722947120667,
               -7.928652763366699,
               2.576173067092896,
               0.4632667303085327,
               -0.3612769842147827,
               1
            ],
            [
               -1.560721993446350,
               -7.038889884948730,
               4.467012882232666,
               0.7994011640548706,
               0.09658204019069672,
               1
            ],
            [
               1.560722947120667,
               -5.706850051879883,
               6.077175140380859,
               0.3475899994373322,
               0.3513418436050415,
               1
            ],
            [
               1.560722947120667,
               -8.320227622985840,
               0.5234619975090027,
               0.4787099957466125,
               -0.7213390469551086,
               1
            ],
            [
               4.444561004638672,
               9.999999974752427e-07,
               7.067492961883545,
               -0.4573064744472504,
               0.8330449461936951,
               1
            ]
         ],
         "colorMixMatrix" : [
            [ 1.0, 0.0, 0.0, 0.0, 1.0, 0.0, 0.0, 0.0, 1.0 ]
         ],
         "colorTemperature" : [ 6500.0 ],
         "eye" : [ -5.282357692718506, 6.956045627593994, 0.8401570916175842 ],
         "fov" : [ 40.28625488281250 ],
         "principalPoint" : [ 0.4839238822460175, 0.1176835522055626 ],
         "size" : [ 1920.0, 1200.0 ],
         "target" : [ 0.8445633649826050, -0.1755161583423615, 0.5058723688125610 ],
         "type" : "camera",
         "up" : [ -0.3864988684654236, 0.4540257155895233, 0.8027946949005127 ]
      },
      "Dome_HiRes" : {
         "file" : [ "Dome.obj" ],
         "type" : "mesh"
      },
      "Top" : {
         "activateColorLUT" : [ 0 ],
         "blackLevel" : [ 0.0 ],
         "blendPrecision" : [ 0.1000000014901161 ],
         "blendWidth" : [ 0.05000000074505806 ],
         "brightness" : [ 1.0 ],
         "calibrationPoints" : [
            [
               4.444561958312988,
               -3.404792070388794,
               6.193291187286377,
               -0.7335329055786133,
               0.7724550962448120,
               1
            ],
            [
               4.444561958312988,
               3.404791116714478,
               6.193292140960693,
               0.6648016571998596,
               0.7499151229858398,
               1
            ],
            [
               0.0,
               0.0,
               8.500000953674316,
               -0.03371379896998405,
               -0.1549700051546097,
               1
            ],
            [
               4.444561004638672,
               9.999999974752427e-07,
               7.067492961883545,
               -0.03332706540822983,
               0.8680738806724548,
               1
            ],
            [
               -1.560721993446350,
               -7.038889884948730,
               4.467012882232666,
               -0.9468937516212463,
               -0.9063549041748047,
               1
            ],
            [
               -4.444561004638672,
               -1.757614970207214,
               6.845455169677734,
               -0.2015032321214676,
               -0.9197242259979248,
               1
            ],
            [
               -4.444561004638672,
               1.757611989974976,
               6.845456123352051,
               0.1274419575929642,
               -0.9265947341918945,
               1
            ],
            [
               1.560722947120667,
               -5.706850051879883,
               6.077175140380859,
               -0.8995041251182556,
               -0.1385431587696075,
               1
            ],
            [
               1.560721993446350,
               -4.016225814819336,
               7.305484771728516,
               -0.6020552515983582,
               0.01580339483916759,
               1
            ],
            [
               1.560721993446350,
               4.016222000122070,
               7.305488109588623,
               0.5333207845687866,
               -0.01049165055155754,
               1
            ],
            [
               -1.560722947120667,
               4.016222953796387,
               7.305487155914307,
               0.4125217795372009,
               -0.5558093190193176,
               1
            ],
            [
               -1.560721993446350,
               -4.016224861145020,
               7.305483818054199,
               -0.4812499880790710,
               -0.5241067409515381,
               1
            ],
            [
               -1.560724020004272,
               7.038888931274414,
               4.467016220092773,
               0.8723084330558777,
               -0.9616307020187378,
               1
            ],
            [
               -3.061465978622437,
               -5.375733852386475,
               5.724574089050293,
               -0.6381174921989441,
               -0.8986690640449524,
               1
            ]
         ],
         "colorMixMatrix" : [
            [ 1.0, 0.0, 0.0, 0.0, 1.0, 0.0, 0.0, 0.0, 1.0 ]
         ],
         "colorTemperature" : [ 6500.0 ],
         "eye" : [ 7.639065742492676, 0.2181116491556168, -3.133064508438110 ],
         "fov" : [ 45.50563812255859 ],
         "principalPoint" : [ 0.4732724130153656, -0.1887155622243881 ],
         "size" : [ 1920.0, 1200.0 ],
         "target" : [ 0.4860556423664093, 0.07226279377937317, 0.8709351420402527 ],
         "type" : "camera",
         "up" : [ -0.8724510073661804, -0.01778947189450264, 0.4883776605129242 ]
      },
      "colorCalibrator" : {
         "colorSamples" : [ 5 ],
         "detectionThresholdFactor" : [ 1.0 ],
         "equalizeMethod" : [ 2 ],
         "hdrStep" : [ 1.0 ],
         "imagePerHDR" : [ 1 ],
         "type" : "colorCalibrator"
      },
      "first" : {
         "blendingResolution" : [ 2048 ],
         "type" : "scene"
      }, // Default window for the GUI
      "gui" : {
         "decorated" : [ 1 ],
         "fullscreen" : [ -1 ],
         "gamma" : [ 2.200000047683716 ],
         "layout" : [ 0, 0, 0, 0 ],
         "position" : [ 690, 58 ],
         "size" : [ 751, 958 ],
         "srgb" : [ 1 ],
         "type" : "window"
      },
      "image_Dome_HiRes" : {
         "file" : [ "/tmp/videocapture" ],
         "flip" : [ 1 ],
         "flop" : [ 0 ],
         "srgb" : [ 1 ],
         "type" : "image_shmdata"
      },
      "links" : [
         [ "Top", "window_1" ],
         [ "Bottom_3", "window_2" ],
         [ "Bottom_0", "window_5" ],
         [ "Dome_HiRes", "object_Dome_HiRes" ],
         [ "image_Dome_HiRes", "object_Dome_HiRes" ],
         [ "object_Dome_HiRes", "Top" ],
         [ "object_Dome_HiRes", "Bottom_3" ],
         [ "object_Dome_HiRes", "Bottom_0" ]
      ],
      "object_Dome_HiRes" : {
         "fill" : [ "texture" ],
         "normalExponent" : [ 0.0 ],
         "position" : [ 0.0, 0.0, 0.0 ],
         "scale" : [ 1.0, 1.0, 1.0 ],
         "sideness" : [ 2 ],
         "type" : "object"
      },
      "window_1" : {
         "decorated" : [ 0 ],
         "fullscreen" : [ -1 ],
         "gamma" : [ 2.200000047683716 ],
         "layout" : [ 0, 0, 0, 0 ],
         "position" : [ 1920, 0 ],
         "size" : [ 1920, 1200 ],
         "srgb" : [ 1 ],
         "type" : "window"
      },
      "window_2" : {
         "decorated" : [ 0 ],
         "fullscreen" : [ -1 ],
         "gamma" : [ 2.200000047683716 ],
         "layout" : [ 0, 0, 0, 0 ],
         "position" : [ 3840, 0 ],
         "size" : [ 1920, 1200 ],
         "srgb" : [ 1 ],
         "type" : "window"
      },
      "window_5" : {
         "decorated" : [ 0 ],
         "fullscreen" : [ -1 ],
         "gamma" : [ 2.200000047683716 ],
         "layout" : [ 0, 0, 0, 0 ],
         "position" : [ 5760, 0 ],
         "size" : [ 1920, 1200 ],
         "srgb" : [ 1 ],
         "type" : "window"
      }
   },
   "scenes" : [
      {
         "address" : "localhost",
         "display" : 0,
         "name" : "first",
         "spawn" : 1,
         "swapInterval" : 1
      },
      {
         "address" : "localhost",
         "display" : 1,
         "name" : "second",
         "spawn" : 1,
         "swapInterval" : 1
      }
   ],
   "second" : {
      "Bottom_1" : {
         "activateColorLUT" : [ 0 ],
         "blackLevel" : [ 0.0 ],
         "blendPrecision" : [ 0.1000000014901161 ],
         "blendWidth" : [ 0.05000000074505806 ],
         "brightness" : [ 1.0 ],
         "calibrationPoints" : [
            [
               -7.719212055206299,
               2.099196910858154,
               0.1320700049400330,
               -0.4199703335762024,
               -0.8190152645111084,
               1
            ],
            [
               -7.719211101531982,
               -9.999999974752427e-07,
               2.103348016738892,
               -0.6606876850128174,
               -0.4849204123020172,
               1
            ],
            [
               -9.999999974752427e-07,
               8.483229637145996,
               0.5337200164794922,
               0.6878743767738342,
               -0.7085421085357666,
               1
            ],
            [
               -1.999999994950485e-06,
               8.083982467651367,
               2.626646041870117,
               0.6665304899215698,
               -0.3244476318359375,
               1
            ],
            [
               -1.999999994950485e-06,
               7.176788806915283,
               4.554529190063477,
               0.6178747415542603,
               0.06865572929382324,
               1
            ],
            [
               -9.999999974752427e-07,
               5.818652153015137,
               6.196236133575439,
               0.5424279570579529,
               0.4734880626201630,
               1
            ],
            [
               -5.656855106353760,
               5.998549938201904,
               0.3773980140686035,
               0.03685832023620605,
               -0.7728886008262634,
               1
            ],
            [
               -7.719212055206299,
               -2.099198102951050,
               0.1320690065622330,
               -0.9563934803009033,
               -0.8876138925552368,
               1
            ],
            [
               -4.444561004638672,
               -1.757614970207214,
               6.845455169677734,
               -0.7173808813095093,
               0.8897422552108765,
               1
            ]
         ],
         "colorMixMatrix" : [
            [ 1.0, 0.0, 0.0, 0.0, 1.0, 0.0, 0.0, 0.0, 1.0 ]
         ],
         "colorTemperature" : [ 6500.0 ],
         "eye" : [ 4.911413669586182, -5.679249286651611, 0.6931545138359070 ],
         "fov" : [ 43.52149581909180 ],
         "principalPoint" : [ 0.5178577303886414, 0.1876180619001389 ],
         "size" : [ 1920.0, 1200.0 ],
         "target" : [ 0.09737728536128998, -0.3148291409015656, 0.9441399574279785 ],
         "type" : "camera",
         "up" : [ -0.6298917531967163, 0.7149801254272461, 0.3033805787563324 ]
      },
      "Bottom_2" : {
         "activateColorLUT" : [ 0 ],
         "blackLevel" : [ 0.0 ],
         "blendPrecision" : [ 0.1000000014901161 ],
         "blendWidth" : [ 0.05000000074505806 ],
         "brightness" : [ 1.0 ],
         "calibrationPoints" : [
            [
               7.963893890380859,
               9.999999974752427e-07,
               -9.999999974752427e-07,
               0.7784462571144104,
               -0.7989868521690369,
               1
            ],
            [
               5.656853199005127,
               5.998551845550537,
               0.3773970007896423,
               0.007039040327072144,
               -0.7303296923637390,
               1
            ],
            [
               5.656855106353760,
               9.999999974752427e-07,
               6.01040792465210,
               0.6368232965469360,
               0.6163609027862549,
               1
            ],
            [
               7.846282958984375,
               -1.400120973587036,
               0.8885419964790344,
               0.9836015105247498,
               -0.6115107536315918,
               1
            ],
            [
               5.656855106353760,
               -1.494727969169617,
               5.821579933166504,
               0.8860996961593628,
               0.7272301912307739,
               1
            ],
            [
               5.656855106353760,
               1.494727969169617,
               5.821581840515137,
               0.4470216333866119,
               0.4586810767650604,
               1
            ],
            [
               1.560721039772034,
               8.320226669311523,
               0.5234659910202026,
               -0.5299401283264160,
               -0.6834712624549866,
               1
            ],
            [
               -1.560724020004272,
               8.320226669311523,
               0.5234659910202026,
               -0.9401197433471680,
               -0.7055455446243286,
               1
            ],
            [
               1.560721039772034,
               5.706846237182617,
               6.077178001403809,
               -0.3855850994586945,
               0.4807914197444916,
               1
            ],
            [
               -1.560722947120667,
               5.706847190856934,
               6.077177047729492,
               -0.8331212401390076,
               0.7118405699729919,
               1
            ]
         ],
         "colorMixMatrix" : [
            [ 1.0, 0.0, 0.0, 0.0, 1.0, 0.0, 0.0, 0.0, 1.0 ]
         ],
         "colorTemperature" : [ 6500.0 ],
         "eye" : [ -4.680421829223633, -4.851277351379395, 1.019249439239502 ],
         "fov" : [ 42.15311813354492 ],
         "principalPoint" : [ 0.4923796057701111, 0.1934714317321777 ],
         "size" : [ 1920.0, 1200.0 ],
         "target" : [ -0.06413555145263672, 0.1117449626326561, 0.9916651248931885 ],
         "type" : "camera",
         "up" : [ -0.6804100275039673, -0.7318217158317566, 0.03845947608351707 ]
      },
      "Dome_HiRes" : {
         "file" : [ "Dome.obj" ],
         "type" : "mesh"
      },
      "image_Dome_HiRes" : {
         "file" : [ "/tmp/videocapture" ],
         "flip" : [ 1 ],
         "flop" : [ 0 ],
         "srgb" : [ 1 ],
         "type" : "image_shmdata"
      },
      "links" : [
         [ "Bottom_1", "window_3" ],
         [ "Bottom_2", "window_4" ],
         [ "Dome_HiRes", "object_Dome_HiRes" ],
         [ "image_Dome_HiRes", "object_Dome_HiRes" ],
         [ "object_Dome_HiRes", "Bottom_2" ],
         [ "object_Dome_HiRes", "Bottom_1" ]
      ],
      "object_Dome_HiRes" : {
         "fill" : [ "texture" ],
         "normalExponent" : [ 0.0 ],
         "position" : [ 0.0, 0.0, 0.0 ],
         "scale" : [ 1.0, 1.0, 1.0 ],
         "sideness" : [ 2 ],
         "type" : "object"
      },
      "second" : {
         "blendingResolution" : [ 2048 ],
         "type" : "scene"
      },
      "window_3" : {
         "decorated" : [ 0 ],
         "fullscreen" : [ -1 ],
         "gamma" : [ 2.200000047683716 ],
         "layout" : [ 0, 0, 0, 0 ],
         "position" : [ 1920, 0 ],
         "size" : [ 1920, 1200 ],
         "srgb" : [ 1 ],
         "type" : "window"
      },
      "window_4" : {
         "decorated" : [ 0 ],
         "fullscreen" : [ -1 ],
         "gamma" : [ 2.200000047683716 ],
         "layout" : [ 0, 0, 0, 0 ],
         "position" : [ 0, 0 ],
         "size" : [ 1920, 1200 ],
         "srgb" : [ 1 ],
         "type" : "window"
      }
   },
   "world" : {
      "framerate" : 60
   }
}
