{
   // Default encoding for text
   "encoding" : "UTF-8",
   "first" : {
      "cam1" : {
         "activateColorLUT" : [ 0 ],
         "blackLevel" : [ 0 ],
         "blendPrecision" : [ 0.10000000149011612 ],
         "blendWidth" : [ 0.15000000596046448 ],
         "brightness" : [ 0.60000002384185791 ],
         "calibrationPoints" : [
            [
               0.8710629940032959,
               -0.13796299695968628,
               0.47139701247215271,
               -0.92099791765213013,
               -0.89181691408157349,
               1
            ],
            [
               0.48872599005699158,
               -0.67267298698425293,
               0.55557000637054443,
               0.019716309383511543,
               -0.79369395971298218,
               1
            ],
            [
               -0.13796299695968628,
               -0.8710629940032959,
               0.47139701247215271,
               0.95646870136260986,
               -0.88349515199661255,
               1
            ],
            [ 0, 0, 1, -0.0058419797569513321, 1.0043550729751587, 1 ],
            [
               0.54022002220153809,
               0.12969499826431274,
               0.83147001266479492,
               -0.98385506868362427,
               0.19056868553161621,
               1
            ],
            [
               -0.29028499126434326,
               -0.47370201349258423,
               0.83147001266479492,
               0.99120134115219116,
               0.20136849582195282,
               1
            ],
            [
               0.326555997133255,
               -0.44946599006652832,
               0.83147001266479492,
               0.015028242021799088,
               -0.13906610012054443,
               1
            ],
            [
               0.24853299558162689,
               0.29099500179290771,
               0.92387998104095459,
               -0.93021976947784424,
               0.99648630619049072,
               1
            ],
            [
               -0.35355299711227417,
               -0.14644700288772583,
               0.92387998104095459,
               0.93566679954528809,
               0.99668979644775391,
               1
            ],
            [
               0.1267009973526001,
               -0.14834800362586975,
               0.98078501224517822,
               -0.022218611091375351,
               0.59285253286361694,
               1
            ]
         ],
         "colorMixMatrix" : [
            [
               0.99930876493453979,
               -0.35763245820999146,
               -0.088366694748401642,
               0.0020272375550121069,
               0.99944204092025757,
               -0.14502948522567749,
               -0.00024589552776888013,
               -0.001069284975528717,
               1.0001893043518066
            ]
         ],
         "colorTemperature" : [ 7500 ],
         "eye" : [ -0.57907092571258545, 0.77694088220596313, 0.20892031490802765 ],
         "fov" : [ 34.417346954345703 ],
         "principalPoint" : [ 0.5208246111869812, 0.0076966611668467522 ],
         "size" : [ 1400, 1050 ],
         "target" : [ 0.50898653268814087, -0.72960519790649414, 0.45673725008964539 ],
         "type" : "camera",
         "up" : [ -0.27089554071426392, 0.36787596344947815, 0.88954079151153564 ]
      },
      "cam2" : {
         "activateColorLUT" : [ 0 ],
         "blackLevel" : [ 0 ],
         "blendPrecision" : [ 0.10000000149011612 ],
         "blendWidth" : [ 0.15000000596046448 ],
         "brightness" : [ 0.69999998807907104 ],
         "calibrationPoints" : [
            [
               -0.8710629940032959,
               0.13796299695968628,
               0.47139701247215271,
               0.95117729902267456,
               -0.88376611471176147,
               1
            ],
            [
               -0.49501699209213257,
               0.25222399830818176,
               0.83147001266479492,
               0.94139266014099121,
               0.15179109573364258,
               1
            ],
            [
               -0.78579801321029663,
               -0.40038400888442993,
               0.47139701247215271,
               0.20402014255523682,
               -0.95442360639572144,
               1
            ],
            [
               -0.13796299695968628,
               -0.8710629940032959,
               0.47139701247215271,
               -0.92115938663482666,
               -0.88912808895111084,
               1
            ],
            [ 0, 0, 1, 0.0043108630925416946, 0.96680450439453125, 1 ],
            [
               0.12969499826431274,
               -0.54022002220153809,
               0.83147001266479492,
               -0.97469854354858398,
               0.18552027642726898,
               1
            ],
            [
               -0.49501699209213257,
               -0.25222399830818176,
               0.83147001266479492,
               0.14963383972644806,
               -0.13891485333442688,
               1
            ],
            [
               0.29099500179290771,
               -0.24853299558162689,
               0.92387998104095459,
               -0.91683989763259888,
               0.95623677968978882,
               1
            ],
            [
               -0.14644700288772583,
               0.35355299711227417,
               0.92387998104095459,
               0.92801302671432495,
               0.97259366512298584,
               1
            ]
         ],
         "colorMixMatrix" : [
            [
               0.99947148561477661,
               -0.19299955666065216,
               -0.086716987192630768,
               0.0025303189177066088,
               0.99958193302154541,
               -0.12434016168117523,
               0.00036009695031680167,
               -0.00063708948437124491,
               1.0000392198562622
            ]
         ],
         "colorTemperature" : [ 6500 ],
         "eye" : [ 0.80658626556396484, 0.59589779376983643, 0.2105146199464798 ],
         "fov" : [ 33.688880920410156 ],
         "principalPoint" : [ 0.5105552077293396, 0.014715641736984253 ],
         "size" : [ 1400, 1050 ],
         "target" : [ 0.78560203313827515, 0.5805392861366272, 0.21401786804199219 ],
         "type" : "camera",
         "up" : [ -0.17445293068885803, -0.12403440475463867, 0.97682219743728638 ]
      },
      "cam3" : {
         "activateColorLUT" : [ 0 ],
         "blackLevel" : [ 0 ],
         "blendPrecision" : [ 0.10000000149011612 ],
         "blendWidth" : [ 0.15000000596046448 ],
         "brightness" : [ 0.60000002384185791 ],
         "calibrationPoints" : [
            [
               -0.51837998628616333,
               0.71348899602890015,
               0.47139701247215271,
               0.0030150413513183594,
               -0.96514743566513062,
               1
            ],
            [
               -0.85755401849746704,
               0.20588000118732452,
               0.47139701247215271,
               -0.84937900304794312,
               -0.91593772172927856,
               1
            ],
            [
               0.069195002317428589,
               0.87920302152633667,
               0.47139701247215271,
               0.83861452341079712,
               -0.90348523855209351,
               1
            ],
            [ 0, 0, 1, -0.016371147707104683, 0.97259032726287842, 1 ],
            [
               -0.55385798215866089,
               -0.0435900017619133,
               0.83147001266479492,
               -0.87653982639312744,
               0.093905314803123474,
               1
            ],
            [
               -0.326555997133255,
               0.44946599006652832,
               0.83147001266479492,
               -0.0017193392850458622,
               -0.14950086176395416,
               1
            ],
            [
               0.25222399830818176,
               0.49501699209213257,
               0.83147001266479492,
               0.91356778144836426,
               0.14209115505218506,
               1
            ],
            [
               -0.24853299558162689,
               -0.29099500179290771,
               0.92387998104095459,
               -0.95867538452148438,
               0.96567732095718384,
               1
            ],
            [
               0.35355299711227417,
               0.14644700288772583,
               0.92387998104095459,
               0.89650875329971313,
               0.97702264785766602,
               1
            ]
         ],
         "colorMixMatrix" : [
            [
               0.99947977066040039,
               -0.22790157794952393,
               -0.08458033949136734,
               0.002169799292460084,
               0.99952447414398193,
               -0.1540285050868988,
               0.00021249169367365539,
               -0.0001732503151288256,
               1.0000011920928955
            ]
         ],
         "colorTemperature" : [ 6500 ],
         "eye" : [ 0.56236612796783447, -0.74515289068222046, 0.21989737451076508 ],
         "fov" : [ 34.806060791015625 ],
         "principalPoint" : [ 0.52217602729797363, 0.09358157217502594 ],
         "size" : [ 1400, 1050 ],
         "target" : [ -0.46387049555778503, 0.6933022141456604, 0.55150359869003296 ],
         "type" : "camera",
         "up" : [ 0.32591670751571655, -0.44532054662704468, 0.83394718170166016 ]
      },
      "cam4" : {
         "activateColorLUT" : [ 0 ],
         "blackLevel" : [ 0 ],
         "blendPrecision" : [ 0.10000000149011612 ],
         "blendWidth" : [ 0.15000000596046448 ],
         "brightness" : [ 0.60000002384185791 ],
         "calibrationPoints" : [
            [
               0.13796299695968628,
               0.8710629940032959,
               0.47139701247215271,
               -0.92071068286895752,
               -0.89829951524734497,
               1
            ],
            [
               0.62361299991607666,
               0.62361299991607666,
               0.47139701247215271,
               -0.15215721726417542,
               -0.96567600965499878,
               1
            ],
            [
               0.8710629940032959,
               -0.13796299695968628,
               0.47139701247215271,
               0.9831550121307373,
               -0.90080428123474121,
               1
            ],
            [
               -0.12969499826431274,
               0.54022002220153809,
               0.83147001266479492,
               -0.97026205062866211,
               0.18050554394721985,
               1
            ],
            [ 0, 0, 1, 0.008065338246524334, 0.99608069658279419, 1 ],
            [
               0.49501699209213257,
               -0.25222399830818176,
               0.83147001266479492,
               0.97479903697967529,
               0.15246780216693878,
               1
            ],
            [
               0.39284700155258179,
               0.39284700155258179,
               0.83147001266479492,
               -0.11137473583221436,
               -0.1406102180480957,
               1
            ],
            [
               -0.29099500179290771,
               0.24853299558162689,
               0.92387998104095459,
               -0.92710721492767334,
               0.9756171703338623,
               1
            ],
            [
               0.14644700288772583,
               -0.35355299711227417,
               0.92387998104095459,
               0.95056277513504028,
               0.99105864763259888,
               1
            ]
         ],
         "colorMixMatrix" : [
            [
               0.99933117628097534,
               -0.3514464795589447,
               -0.11264618486166,
               0.0019387076608836651,
               0.99952661991119385,
               -0.13954794406890869,
               -8.172204252332449e-05,
               -0.0014672101242467761,
               1.0002175569534302
            ]
         ],
         "colorTemperature" : [ 6500 ],
         "eye" : [ -0.78014945983886719, -0.59722614288330078, 0.21732558310031891 ],
         "fov" : [ 33.649547576904297 ],
         "principalPoint" : [ 0.50240790843963623, 0.018191682174801826 ],
         "size" : [ 1400, 1050 ],
         "target" : [ 0.70024293661117554, 0.5326697826385498, 0.47531327605247498 ],
         "type" : "camera",
         "up" : [ -0.38146358728408813, -0.28360086679458618, 0.87980455160140991 ]
      },
      "colorCalibrator" : {
         "colorSamples" : [ 5 ],
         "detectionThresholdFactor" : [ 1 ],
         "equalizeMethod" : [ 0 ],
         "hdrStep" : [ 1 ],
         "imagePerHDR" : [ 1 ],
         "type" : "colorCalibrator"
      },
      "first" : {
         "blendingResolution" : [ 2048 ],
         "type" : "scene"
      },
      "image" : {
         "file" : [ "/tmp/videocapture" ],
         "flip" : [ 0 ],
         "flop" : [ 0 ],
         "loop" : [ 1 ],
         "srgb" : [ 1 ],
         "type" : "image_shmdata",
         "useClock" : [ 0 ]
      },
      //"type" : "image_ffmpeg"
      "links" : [
         [ "mesh", "object" ],
         [ "object", "cam1" ],
         [ "object", "cam2" ],
         [ "object", "cam3" ],
         [ "object", "cam4" ],
         [ "image", "object" ],
         [ "cam1", "win1" ],
         [ "cam2", "win1" ],
         [ "cam3", "win1" ],
         [ "cam4", "win1" ]
      ],
      "mesh" : {
         "benchmark" : 0,
         "file" : [ "/home/metalab/splash_data/Satosphere/dome_210_alt.obj" ],
         "type" : "mesh"
      },
      "object" : {
         "fill" : [ "texture" ],
         "normalExponent" : [ 0 ],
         "position" : [ 0, 0, 0 ],
         "rotation" : [ 0, 0, 115 ],
         "scale" : [ 1, 1, 1 ],
         "sideness" : [ 2 ],
         "type" : "object"
      },
      "win1" : {
         "decorated" : [ 0 ],
         "fullscreen" : [ -1 ],
         "gamma" : [ 2.2000000476837158 ],
         "layout" : [ 0, 1, 2, 3 ],
         "position" : [ 0, 0 ],
         "size" : [ 7680, 1080 ],
         "srgb" : [ 1 ],
         "type" : "window"
      }
   },
   "scenes" : [
      {
         "address" : "localhost",
         "display" : 0,
         "name" : "first",
         "spawn" : 1,
         "swapInterval" : 1
      },
      {
         "address" : "localhost",
         "display" : 1,
         "name" : "second",
         "spawn" : 0,
         "swapInterval" : 1
      }
   ],
   "second" : {
      "cam5" : {
         "activateColorLUT" : [ 0 ],
         "blackLevel" : [ 0 ],
         "blendPrecision" : [ 0.10000000149011612 ],
         "blendWidth" : [ 0.15000000596046448 ],
         "brightness" : [ 1 ],
         "calibrationPoints" : [
            [
               0.9969170093536377,
               0.078459002077579498,
               0,
               -0.78765040636062622,
               -0.26933553814888,
               1
            ],
            [
               0.82890599966049194,
               0.065236002206802368,
               0.55557000637054443,
               -0.85102558135986328,
               0.80147063732147217,
               1
            ],
            [
               0.58778500556945801,
               -0.80901700258255005,
               0,
               0.025805402547121048,
               -0.045915022492408752,
               1
            ],
            [
               0.48872599005699158,
               -0.67267298698425293,
               0.55557000637054443,
               0.024199923500418663,
               0.77559918165206909,
               1
            ],
            [
               -0.45399001240730286,
               -0.89100700616836548,
               0,
               0.90311425924301147,
               -0.32826796174049377,
               1
            ],
            [
               -0.37747898697853088,
               -0.74084502458572388,
               0.55557000637054443,
               0.97469395399093628,
               0.78671026229858398,
               1
            ],
            [
               0.56714701652526855,
               -0.78061097860336304,
               -0.25855299830436707,
               0.023115277290344238,
               -0.38137257099151611,
               1
            ]
         ],
         "colorMixMatrix" : [
            [
               0.99650394916534424,
               -0.25770804286003113,
               -0.06704363226890564,
               0.014645704068243504,
               0.99676418304443359,
               -0.15522459149360657,
               -0.0027530156075954437,
               -0.0028668369632214308,
               1.0007370710372925
            ]
         ],
         "colorTemperature" : [ 6500 ],
         "eye" : [ -0.50406038761138916, 0.67379361391067505, 0.52845615148544312 ],
         "fov" : [ 44.337673187255859 ],
         "principalPoint" : [ 0.51621246337890625, 0.23238763213157654 ],
         "size" : [ 1920, 1080 ],
         "target" : [ 0.53364497423171997, -0.75586920976638794, -0.37932145595550537 ],
         "type" : "camera",
         "up" : [ 0.22717796266078949, -0.30391746759414673, 0.92521584033966064 ]
      },
      "cam6" : {
         "activateColorLUT" : [ 0 ],
         "blackLevel" : [ 0 ],
         "blendPrecision" : [ 0.10000000149011612 ],
         "blendWidth" : [ 0.15000000596046448 ],
         "brightness" : [ 1 ],
         "calibrationPoints" : [
            [
               -0.45399001240730286,
               -0.89100700616836548,
               0,
               -0.8272089958190918,
               -0.2997995913028717,
               1
            ],
            [
               -0.41943299770355225,
               -0.82318300008773804,
               0.38268300890922546,
               -0.87738692760467529,
               0.59823262691497803,
               1
            ],
            [
               -0.89100700616836548,
               -0.45399001240730286,
               0,
               -0.062722466886043549,
               -0.20042073726654053,
               1
            ],
            [
               -0.97237002849578857,
               0.23344500362873077,
               0,
               0.8391227126121521,
               -0.40688231587409973,
               1
            ],
            [
               -0.82318300008773804,
               -0.41943299770355225,
               0.38268300890922546,
               -0.067792057991027832,
               0.65804845094680786,
               1
            ],
            [
               -0.8983529806137085,
               0.2156749963760376,
               0.38268300890922546,
               0.89306950569152832,
               0.61672300100326538,
               1
            ],
            [
               -0.85972201824188232,
               -0.43805000185966492,
               -0.25855299830436707,
               -0.068825893104076385,
               -0.75060456991195679,
               1
            ]
         ],
         "colorMixMatrix" : [
            [
               0.99952524900436401,
               -0.16855369508266449,
               -0.10816968977451324,
               0.004137454554438591,
               0.99990087747573853,
               -0.16064785420894623,
               -0.0016611398896202445,
               -0.0034582950174808502,
               1.0007783174514771
            ]
         ],
         "colorTemperature" : [ 6500 ],
         "eye" : [ 0.71109616756439209, 0.53746509552001953, 0.5454641580581665 ],
         "fov" : [ 27.13981819152832 ],
         "principalPoint" : [ 0.38774204254150391, 0.017768921330571175 ],
         "size" : [ 1920, 1080 ],
         "target" : [ 0.6784018874168396, 0.51362919807434082, 0.5253150463104248 ],
         "type" : "camera",
         "up" : [ -0.44030234217643738, -0.28815004229545593, 0.85035485029220581 ]
      },
      "cam7" : {
         "activateColorLUT" : [ 0 ],
         "blackLevel" : [ 0 ],
         "blendPrecision" : [ 0.10000000149011612 ],
         "blendWidth" : [ 0.15000000596046448 ],
         "brightness" : [ 1 ],
         "calibrationPoints" : [
            [
               -0.97237002849578857,
               0.23344500362873077,
               0,
               -0.85735970735549927,
               -0.35679289698600769,
               1
            ],
            [
               -0.8983529806137085,
               0.2156749963760376,
               0.38268300890922546,
               -0.92153471708297729,
               0.62432920932769775,
               1
            ],
            [
               -0.58778500556945801,
               0.80901700258255005,
               0,
               0.029242616146802902,
               -0.20164315402507782,
               1
            ],
            [
               -0.56714701652526855,
               0.78061097860336304,
               -0.25855299830436707,
               0.02767222560942173,
               -0.75165641307830811,
               1
            ],
            [
               0.078459002077579498,
               0.9969170093536377,
               0,
               0.90000253915786743,
               -0.37429600954055786,
               1
            ],
            [
               0.072486996650695801,
               0.92103201150894165,
               0.38268300890922546,
               0.96244502067565918,
               0.59515839815139771,
               1
            ],
            [
               -0.54304301738739014,
               0.74743402004241943,
               0.38268300890922546,
               0.025793028995394707,
               0.66275930404663086,
               1
            ]
         ],
         "colorMixMatrix" : [
            [
               0.9990505576133728,
               -0.09635133296251297,
               -0.10584014654159546,
               0.012680312618613243,
               1.0000276565551758,
               -0.1018490269780159,
               -0.0025098994374275208,
               -0.012216097675263882,
               1.0015164613723755
            ]
         ],
         "colorTemperature" : [ 6500 ],
         "eye" : [ 0.51582992076873779, -0.683624267578125, 0.52656310796737671 ],
         "fov" : [ 27.844892501831055 ],
         "principalPoint" : [ 0.53475785255432129, -0.027030035853385925 ],
         "size" : [ 1920, 1080 ],
         "target" : [ -0.50741869211196899, 0.76179522275924683, -0.40273356437683105 ],
         "type" : "camera",
         "up" : [ -0.24076473712921143, 0.32341822981834412, 0.91511362791061401 ]
      },
      "cam8" : {
         "activateColorLUT" : [ 0 ],
         "blackLevel" : [ 0 ],
         "blendPrecision" : [ 0.10000000149011612 ],
         "blendWidth" : [ 0.15000000596046448 ],
         "brightness" : [ 1 ],
         "calibrationPoints" : [
            [
               0.078459002077579498,
               0.9969170093536377,
               0,
               -0.79058051109313965,
               -0.40423041582107544,
               1
            ],
            [
               0.072486996650695801,
               0.92103201150894165,
               0.38268300890922546,
               -0.845600426197052,
               0.62975877523422241,
               1
            ],
            [
               0.9969170093536377,
               0.078459002077579498,
               0,
               0.97185933589935303,
               -0.42860099673271179,
               1
            ],
            [
               0.91250497102737427,
               0.14452700316905975,
               0.38268300890922546,
               0.94327104091644287,
               0.51501685380935669,
               1
            ],
            [
               0.70710700750350952,
               0.70710700750350952,
               0,
               0.11677394807338715,
               -0.25068077445030212,
               1
            ],
            [
               0.65328198671340942,
               0.65328198671340942,
               0.38268300890922546,
               0.13136516511440277,
               0.61662524938583374,
               1
            ],
            [
               0.68227899074554443,
               0.68227899074554443,
               -0.25855299830436707,
               0.11677394807338715,
               -0.79711616039276123,
               1
            ]
         ],
         "colorMixMatrix" : [
            [
               1.0001401901245117,
               -0.025031274184584618,
               -0.12328020483255386,
               0.00083003833424299955,
               1.0008518695831299,
               -0.15862227976322174,
               -0.0012695579789578915,
               -0.0054781395010650158,
               1.0010291337966919
            ]
         ],
         "colorTemperature" : [ 6500 ],
         "eye" : [ -0.66645669937133789, -0.5022321343421936, 0.53012245893478394 ],
         "fov" : [ 28.261770248413086 ],
         "principalPoint" : [ 0.64033013582229614, -0.053452041000127792 ],
         "size" : [ 1920, 1080 ],
         "target" : [ 0.74125248193740845, 0.53648632764816284, -0.40339455008506775 ],
         "type" : "camera",
         "up" : [ 0.29154694080352783, 0.28399768471717834, 0.9134252667427063 ]
      },
      "image" : {
         "file" : [ "/tmp/videocapture" ],
         "flip" : [ 0 ],
         "flop" : [ 0 ],
         "loop" : [ 1 ],
         "srgb" : [ 1 ],
         "type" : "image_shmdata",
         "useClock" : [ 0 ]
      },
      //"type" : "image_ffmpeg"
      "links" : [
         [ "mesh", "object" ],
         [ "object", "cam5" ],
         [ "object", "cam6" ],
         [ "object", "cam7" ],
         [ "object", "cam8" ],
         [ "image", "object" ],
         [ "cam5", "win2" ],
         [ "cam6", "win2" ],
         [ "cam7", "win2" ],
         [ "cam8", "win2" ]
      ],
      "mesh" : {
         "benchmark" : 0,
         "file" : [ "/home/metalab/splash_data/Satosphere/dome_210_alt.obj" ],
         "type" : "mesh"
      },
      "object" : {
         "fill" : [ "texture" ],
         "normalExponent" : [ 0 ],
         "position" : [ 0, 0, 0 ],
         "rotation" : [ 0, 0, 115 ],
         "scale" : [ 1, 1, 1 ],
         "sideness" : [ 2 ],
         "type" : "object"
      },
      "second" : {
         "blendingResolution" : [ 2048 ],
         "type" : "scene"
      },
      "win2" : {
         "decorated" : [ 0 ],
         "fullscreen" : [ -1 ],
         "gamma" : [ 2.2000000476837158 ],
         "layout" : [ 0, 1, 2, 3 ],
         "position" : [ 0, 0 ],
         "size" : [ 7680, 1080 ],
         "srgb" : [ 1 ],
         "type" : "window"
      }
   },
   "world" : {
      "computeBlending" : 1,
      "framerate" : 300
   }
}
