File Name, X-coord, Y-coord, Z-coord
use_cases/ambisonic_irs_MS/iteration3_timed/iteration3_01-up_1_edited.wav, 0, 12, 1
use_cases/ambisonic_irs_MS/iteration3_timed/iteration3_01-up_2_edited.wav, 4, 12.5, 1
use_cases/ambisonic_irs_MS/iteration3_timed/iteration3_01-up_3_edited.wav, 6.5, 15.5, 1
use_cases/ambisonic_irs_MS/iteration3_timed/iteration3_01-up_4_edited.wav, 0, 16, 1
use_cases/ambisonic_irs_MS/iteration3_timed/iteration3_01-up_5_edited.wav, -6.5, 15.5, 1
use_cases/ambisonic_irs_MS/iteration3_timed/iteration3_01-up_6_edited.wav, -4, 12.5, 1
use_cases/ambisonic_irs_MS/iteration3_timed/iteration3_01-up_7_edited.wav, 7, 10.5, 1
use_cases/ambisonic_irs_MS/iteration3_timed/iteration3_01-up_8_edited.wav, 7, 6.5, 1
use_cases/ambisonic_irs_MS/iteration3_timed/iteration3_01-up_9_edited.wav, 7, 2.5, 1
use_cases/ambisonic_irs_MS/iteration3_timed/iteration3_01-up_10_edited.wav, 7, -3, 1
use_cases/ambisonic_irs_MS/iteration3_timed/iteration3_01-up_11_edited.wav, 8, -7, 1