repo,11/12,12/13,13/14,14/15,15/16,16/17,17/18,18/19,19/20,20/21,21/22
EditionInSitu,0,0,0,0,0,0,5,4,7,7,2
calimiro,0,0,0,0,0,0,0,2,2,3,2
doc-satie,0,0,0,0,0,0,0,0,0,1,5
doc-shmdata,0,0,0,0,0,0,0,0,0,1,3
doc-splash,0,0,0,0,0,0,0,0,0,1,3
ndi2shmdata,0,0,0,0,0,0,0,1,2,1,2
poire,0,0,0,0,0,0,0,0,0,5,4
pysatie,0,0,0,0,0,0,1,1,1,4,2
satie,0,0,0,0,0,0,3,7,5,5,1
satie4blender,0,0,0,0,0,3,2,0,1,2,1
satie4unity,0,0,0,0,0,0,1,1,1,1,0
satie4unityExample,0,0,0,0,0,0,1,1,1,2,0
shmdata,2,4,5,2,2,4,2,3,4,4,3
splash,0,0,1,2,2,2,4,3,2,3,2
livepose,0,0,0,0,0,0,0,0,2,4,4
switcher,0,3,5,3,6,6,3,8,6,6,5
tools-ambir,0,0,0,0,0,0,0,0,4,4,4
varays,0,0,0,0,0,0,0,4,4,6,1
