repo,commits,contributors,versions
EditionInSitu,656,11,0
calimiro,183,3,4
doc-satie,64,5,0
doc-shmdata,64,3,0
doc-splash,118,3,0
ndi2shmdata,39,3,5
poire,150,8,0
pysatie,162,4,1
satie,1143,9,14
satie4blender,173,4,2
satie4unity,126,1,1
satie4unityExample,219,2,2
shmdata,698,12,91
splash,2121,9,78
livepose,187,5,0
switcher,3260,21,138
tools-ambir,163,9,0
varays,375,9,8
