{
    "device": "DeformableHapticSurfaces",
    "id": 1,
    "author": "",
    "institution": "",
    "APpasswd": "mappings",
    "wifiSSID": "",
    "wifiPSK": "",
    "persistentAP": 1,
    "oscIP1": "10.10.200.37",
    "oscPORT1": 8000,
    "oscIP2": "192.168.4.2",
    "oscPORT2": 8000,
    "localPORT": 8000
}
