8,2008-02-04 07:01:13,116.36606,39.6841
8,2008-02-05 07:01:35,116.36606,39.68409
8,2008-02-06 07:02:00,116.36605,39.68409
8,2008-02-07 07:02:45,116.36611,39.68408
8,2008-02-08 07:00:37,116.36615,39.68413