// Jest Snapshot v1, https://goo.gl/fbAQLP

exports[`The Add Todo Component should match the snapshot 1`] = `
<form
  className="add-todo"
  onSubmit={[Function]}
>
  <input
    id="todo-add-action"
    name="todo-action"
    onChange={[Function]}
    value=""
  />
  <button
    title="Add todo item"
    type="submit"
  >
    +
  </button>
</form>
`;

exports[`The Todo App should render and match the snapshot 1`] = `
<div
  className="todo-app"
>
  <form
    className="add-todo"
    onSubmit={[Function]}
  >
    <input
      id="todo-add-action"
      name="todo-action"
      onChange={[Function]}
      value=""
    />
    <button
      title="Add todo item"
      type="submit"
    >
      +
    </button>
  </form>
</div>
`;
