[
"enode://1ea1b4b043fe556c8bad9c64945ffa4162224f9a80b81ca55db602f1a8cf12eb79f92c8e41d5b22510151a637bf830eabef2f8718856c1a4995e5113e8f8d872@192.168.0.2:30303",
"enode://383ea103d14afc8aed84854a8dd8ab5110018da599c3c36893d860124860930cd2163a1ec08b157f1bbecd9d57c83db37a0da44b07aecbb4b67abf17ef8785d6@192.168.0.110:30303",
"enode://7563915f86712b1e1ac13fe3175786f16412fe9146ab665991ae10563f30d17f77e098a5d652db061b9e87c409e93cf8043d5f8c6cfac95077f7db4435786f2d@192.168.0.111:30303",
"enode://59bb5c987cd7152bb504f5baadf76aded737801356c7d3bcc9cc16155fec8c712ff9f108e9d69a339acf3c664f740681ce75c65894f79db36c7f1cc4fdc99aa7@192.168.0.112:30303"
]
