module gitlab.com/sascha.l.teichmann/signcheck

go 1.19

require github.com/ProtonMail/gopenpgp/v2 v2.4.10

require (
	github.com/ProtonMail/go-crypto v0.0.0-20220822140716-1678d6eb0cbe // indirect
	github.com/ProtonMail/go-mime v0.0.0-20220302105931-303f85f7fe0f // indirect
	github.com/cloudflare/circl v1.1.0 // indirect
	github.com/konsorten/go-windows-terminal-sequences v1.0.1 // indirect
	github.com/pkg/errors v0.9.1 // indirect
	github.com/sirupsen/logrus v1.4.2 // indirect
	golang.org/x/crypto v0.0.0-20210921155107-089bfa567519 // indirect
	golang.org/x/sys v0.0.0-20211007075335-d3039528d8ac // indirect
	golang.org/x/text v0.3.3 // indirect
)
