{
   "result": {
      "person": {
         "cid": "0000000000010",
         "prefix": "นาย",
         "first_name": "ทดสอบสิบ",
         "last_name": "ทดสอบสิบ",
         "birth_date": "1951-05-12",
         "gender": 1,
         "gender_name": "ชาย",
         "person_type_id": 2,
         "person_type_name": "ผู้มีอายุ 60 ปีขึ้นไป",
         "person_risk_type_id": 201,
         "person_risk_type_name": "ผู้มีอายุ 60 ปีขึ้นไป",
         "need_vaccine": "Y",
         "person_need_vaccine": "Y",
         "vaccine_eligible": "Y",
         "hospital_code": "10671",
         "hospital_name": "โรงพยาบาลอุดรธานี",
         "province_code": "41",
         "district_code": "01",
         "tambol_code": "15",
         "hospital_province_code": "41",
         "hospital_province_name": "อุดรธานี",
         "mobile_phone": "",
         "address_moo": "03",
         "conflict_hospital_count": 1,
         "conflict_hospital": [
            {
               "hospital_code": "04497",
               "hospital_name": "โรงพยาบาลส่งเสริมสุขภาพตำบลบ้านโสกน้ำขาว  หนองไฮ"
            }
         ],
         "eligible_hospital": [
            {
               "hospital_code": "10671",
               "hospital_name": "โรงพยาบาลอุดรธานี (ศูนย์ฉีด: ม.ราชภัฏอุดรฯ สาขาในเมือง อาคารกิจกรรมนักศึกษา)",
               "person_type_id": 2
            }
         ],
         "domicile_hospital": []
      },
      "confirm_appointment_slot_count": 0,
      "last_confirm_slot_datetime": "",
      "confirm_appointment_slot": [],
      "vaccine_history_count": 2,
      "vaccine_history": [
         {
            "visit_guid": "DbnvrfHPe9LmdROKd-ru5DbnvrfHPe9LmdROKd-ru5",
            "immunization_datetime": "2021-08-31T09:41:32.000Z",
            "vaccine_name": "Coronavirus Astrazeneca [AstraZeneca]",
            "vaccine_manufacturer_id": 1,
            "vaccine_plan_no": 2,
            "hospital_code": "10671",
            "hospital_name": "โรงพยาบาลนากลาง",
            "province_name": "หนองบัวลำภู",
            "lot_number": "A1061",
            "serial_no": "10000003041229",
            "expiration_date": "2021-11-30",
            "appointment_count": 0,
            "appointment": [],
            "aefi_followup_count": 0,
            "aefi_followup": []
         },
         {
            "visit_guid": "nLgPiGE0-AZ0ImLteCBKDnLgPiGE0-AZ0ImLteCBKD",
            "immunization_datetime": "2021-08-13T09:56:26.000Z",
            "vaccine_name": "Coronavirus Sinovac [Sinovac Life Sciences]",
            "vaccine_manufacturer_id": 1,
            "vaccine_plan_no": 1,
            "hospital_code": "10991",
            "hospital_name": "โรงพยาบาลนากลาง",
            "province_name": "หนองบัวลำภู",
            "lot_number": "L202106050",
            "serial_no": "10000004482449",
            "expiration_date": "2021-10-11",
            "appointment_count": 1,
            "appointment": [
               {
                  "appointment_date": "2021-08-31",
                  "appointment_time": "10:59:02",
                  "appointment_cause": "ให้วัคซีนครั้งที่ 2 (31 ส.ค. 64)"
               }
            ],
            "aefi_followup_count": 0,
            "aefi_followup": []
         }
      ],
      "vaccine_certificate": [
         {
            "certificate_code": "{56BED5BF-2F83-47C7-BA8A-637382033583}",
            "certificate_datetime": "2021-08-31",
            "certificate_serial_no": "8000656510",
            "percent_complete": 100,
            "patient_name": "นายทดสอบสิบ ทดสอบสิบ",
            "patient_name_english": "Mr.",
            "patient_sex_name": "ชาย",
            "patient_sex_name_english": "MALE",
            "patient_date_of_birth": "1 พฤษภาคม 2498",
            "patient_date_of_birth_english": "1 May 1955",
            "patient_cid": "0000000000010",
            "patient_passport_no": "",
            "patient_address": "127 หมู่ 3  ตำบล หนองไฮ อำเภอ เมืองอุดรธานี จังหวัด อุดรธานี",
            "patient_address_english": "127 Moo 3 Nong Hai Subdistrict, Mueang Udon Thani District, Udon Thani Province",
            "vaccination_list": [
               {
                  "vaccine_dose_no": 1,
                  "vaccine_date": "2021-08-13",
                  "vaccine_name": "Coronavirus Sinovac [Sinovac Life Sciences]",
                  "vaccine_manufacturer_name": "Coronavirus Sinovac [Sinovac Life Sciences]",
                  "vaccine_lot_number": "L202106050",
                  "vaccine_place": "โรงพยาบาลนากลาง"
               },
               {
                  "vaccine_dose_no": 2,
                  "vaccine_date": "2021-08-31",
                  "vaccine_name": "Coronavirus Astrazeneca [AstraZeneca]",
                  "vaccine_manufacturer_name": "Coronavirus Astrazeneca [AstraZeneca]",
                  "vaccine_lot_number": "A1061",
                  "vaccine_place": "โรงพยาบาลนากลาง"
               }
            ]
         }
      ],
      "lab_test_results": [
         {
            "hospital_code": "11538",
            "hospital_name": "โรงพยาบาลลาดกระบังกรุงเทพมหานคร",
            "report_datetime": "2021-09-30T10:42:27.000",
            "tmlt_code": "350501",
            "tmlt_name": "SARS coronavirus 2 RNA [+/-] in Respiratory specimen by NAA with probe detection",
            "tmlt_component": "SARS coronavirus 2 RNA",
            "tmlt_specimen": "Respiratory specimen",
            "tmlt_method": "NAA with probe detection",
            "ref_code": "2288813262023847_20210817_024506",
            "lab_name": "RT_PCR",
            "lab_result": "Positive",
            "lab_normal_value": "-Negative"
         }
      ],
      "queue_status": {},
      "unread_message": []
   },
   "MessageCode": 200,
   "Message": "OK",
   "RequestTime": "2021-09-28T12:50:35.031Z",
   "EndpointIP": "10.0.6.28",
   "EndpointPort": 20016,
   "processing_ms": 1,
   "cache": "redis",
   "req_rate": 208,
   "rate_limit": -1,
   "ext_rate": "555:30000"
}