{
    "result": {
        "person": {
            "cid": "0000000000043",
            "prefix": "นาย",
            "first_name": "Hilton",
            "last_name": "Considine",
            "birth_date": "1959-04-24",
            "gender": 2,
            "gender_name": "ชาย",
            "person_type_id": 2,
            "person_type_name": "ผู้มีอายุ 60 ปีขึ้นไป",
            "person_risk_type_id": 201,
            "person_risk_type_name": "ผู้มีอายุ 60 ปีขึ้นไป",
            "need_vaccine": "Y",
            "person_need_vaccine": "Y",
            "vaccine_eligible": "Y",
            "hospital_code": "12499",
            "hospital_name": "สำนักอนามัยกรุงเทพมหานคร",
            "province_code": "10",
            "district_code": "11",
            "tambol_code": "01",
            "hospital_province_code": "10",
            "hospital_province_name": "กรุงเทพมหานคร",
            "mobile_phone": "",
            "address_moo": "",
            "conflict_hospital_count": 0,
            "conflict_hospital": [],
            "eligible_hospital": [
                {
                    "hospital_code": "12499A",
                    "hospital_name": "สำนักอนามัยกรุงเทพมหานคร เซ็นทรัล ลาดพร้าว - รพ.รามาธิบดี",
                    "person_type_id": 2
                },
                {
                    "hospital_code": "12499B",
                    "hospital_name": "สำนักอนามัยกรุงเทพมหานคร สามย่านมิตรทาวน์ - รพ.จุฬาลงกรณ์",
                    "person_type_id": 2
                },
                {
                    "hospital_code": "12499C",
                    "hospital_name": "สำนักอนามัยกรุงเทพมหานคร เดอะมอลล์ บางกะปิ - รพ.นพรัตน์ราชธานี",
                    "person_type_id": 2
                }
            ],
            "domicile_hospital": []
        },
        "confirm_appointment_slot_count": 0,
        "last_confirm_slot_datetime": "",
        "confirm_appointment_slot": [],
        "vaccine_history_count": 1,
        "vaccine_history": [
            {
                "visit_guid": "{0153f9ea-0e20-3107-b504-c313f46c2926}",
                "immunization_datetime": "2021-06-21T09:41:00.000Z",
                "vaccine_name": "Coronavirus Janssen [Johnson & Johnson]",
                "vaccine_manufacturer_id": 1,
                "vaccine_plan_no": 1,
                "hospital_code": "11771",
                "hospital_name": "โรงพยาบาลจุฬารัตน์ 3",
                "province_name": "สมุทรปราการ",
                "lot_number": "21C1602",
                "serial_no": "5413868120110",
                "expiration_date": "2021-08-31",
                "appointment_count": 0,
                "appointment": [],
                "aefi_followup_count": 0,
                "aefi_followup": []
            }
        ],
        "vaccine_certificate": [
            {
                "certificate_code": "{BE7D75B5-C31F-480E-9A61-D67D19E9C3EB}",
                "certificate_datetime": "",
                "certificate_serial_no": "8000656543",
                "percent_complete": 50,
                "patient_name": "Hilton Considine",
                "patient_name_english": "",
                "patient_sex_name": "ชาย",
                "patient_sex_name_english": "MALE",
                "patient_date_of_birth": "24 เมษายน 2502",
                "patient_date_of_birth_english": "24 April 1959",
                "patient_cid": "0000000000043",
                "patient_passport_no": "",
                "patient_address": "6/9 ปิยะโชคแมนชั่น ซ. ร่มเกล้า27  ถนน ร่มเกล้า ตำบล ลาดกระบัง อำเภอ ลาดกระบัง จังหวัด กรุงเทพมหานคร",
                "patient_address_english": "6/9 ปิยะโชคแมนชั่น ซ. ร่มเกล้า27 ร่มเกล้า Road Lat Krabang Subdistrict, Khet Lat Krabang District, Bangkok Province",
                "vaccination_list": [
                    {
                        "vaccine_dose_no": 1,
                        "vaccine_date": "2021-06-21",
                        "vaccine_name": "Janssen",
                        "vaccine_manufacturer_name": "Johnson & Johnson",
                        "vaccine_lot_number": "21C1602",
                        "vaccine_place": "โรงพยาบาลจุฬารัตน์ 3"
                    }
                ]
            }
        ],
        "lab_test_results": [
            {
                "hospital_code": "11541",
                "hospital_name": "โรงพยาบาลเจริญกรุงประชารักษ์",
                "report_datetime": "1911-11-11T11:11:11",
                "tmlt_code": "350506",
                "tmlt_name": "SARS coronavirus 2 IgG Ab [+/-] in Serum or Plasma by Rapid immunoassay",
                "tmlt_component": "SARS coronavirus 2 IgG Ab",
                "tmlt_specimen": "Serum or Plasma",
                "tmlt_method": "Rapid immunoassay",
                "ref_code": "5746581201720122_20210817_923488",
                "lab_name": "ATK",
                "lab_result": "not detected",
                "lab_normal_value": ""
            }
        ],
        "queue_status": {},
        "unread_message": []
    },
    "MessageCode": 200,
    "Message": "OK",
    "RequestTime": "2021-09-27T16:03:21.777Z",
    "EndpointIP": "10.0.6.28",
    "EndpointPort": 20002,
    "processing_ms": 1,
    "cache": "redis",
    "req_rate": 136,
    "rate_limit": -1,
    "ext_rate": "507:30000"
}