{
   "result": {
      "person": {
         "cid": "0000000000023",
         "prefix": "นาย",
         "first_name": "Carmine",
         "last_name": "Streich",
         "birth_date": "1995-12-26",
         "gender": 2,
         "gender_name": "ชาย",
         "person_type_id": 5,
         "person_type_name": "ประชาชนทั่วไป",
         "person_risk_type_id": 501,
         "person_risk_type_name": "ประชาชนทั่วไป",
         "need_vaccine": "Y",
         "person_need_vaccine": "Y",
         "vaccine_eligible": "Y",
         "hospital_code": "11703",
         "hospital_name": "โรงพยาบาลแพทย์ปัญญา",
         "province_code": "10",
         "district_code": "06",
         "tambol_code": "07",
         "hospital_province_code": "10",
         "hospital_province_name": "กรุงเทพมหานคร",
         "mobile_phone": "0632704961",
         "address_moo": "",
         "conflict_hospital_count": 3,
         "conflict_hospital": [
            {
               "hospital_code": "13766",
               "hospital_name": "โรงพยาบาลมหาวิทยาลัยบูรพา"
            },
            {
               "hospital_code": "13756",
               "hospital_name": "โรงพยาบาลจุฬาลงกรณ์สภากาชาดไทย"
            },
            {
               "hospital_code": "10662",
               "hospital_name": "โรงพยาบาลชลบุรี"
            }
         ],
         "eligible_hospital": [
            {
               "hospital_code": "10662",
               "hospital_name": "โรงพยาบาลชลบุรี",
               "person_type_id": 5
            },
            {
               "hospital_code": "11703",
               "hospital_name": "โรงพยาบาลแพทย์ปัญญา",
               "person_type_id": 5
            },
            {
               "hospital_code": "13766",
               "hospital_name": "โรงพยาบาลมหาวิทยาลัยบูรพา",
               "person_type_id": 5
            }
         ],
         "domicile_hospital": []
      },
      "confirm_appointment_slot_count": 0,
      "last_confirm_slot_datetime": "",
      "confirm_appointment_slot": [],
      "vaccine_history_count": 1,
      "vaccine_history": [
         {
            "visit_guid": "{0153f9ea-0e20-3107-b504-c313f46c2926}",
            "immunization_datetime": "2021-06-21T09:41:00.000Z",
            "vaccine_name": "Coronavirus Janssen [Johnson & Johnson]",
            "vaccine_manufacturer_id": 1,
            "vaccine_plan_no": 1,
            "hospital_code": "11771",
            "hospital_name": "โรงพยาบาลจุฬารัตน์ 3",
            "province_name": "สมุทรปราการ",
            "lot_number": "21C1602",
            "serial_no": "5413868120110",
            "expiration_date": "2021-08-31",
            "appointment_count": 0,
            "appointment": [],
            "aefi_followup_count": 0,
            "aefi_followup": []
         }
      ],
      "vaccine_certificate": [
         {
            "certificate_code": "{2481D84E-371E-44C9-BE3A-B7C9C49C941D}",
            "certificate_datetime": "2021-09-16",
            "certificate_serial_no": "8000656523",
            "percent_complete": 100,
            "patient_name": "Carmine Streich",
            "patient_name_english": "",
            "patient_sex_name": "ชาย",
            "patient_sex_name_english": "MALE",
            "patient_date_of_birth": "26 ธันวาคม 2538",
            "patient_date_of_birth_english": "26 December 1995",
            "patient_cid": "0000000000023",
            "patient_passport_no": "",
            "patient_address": "890/321 ลุมพินี พาร์ค พระราม9 ถนน จตุรทิศ แขวงบางกะปิ เขตห้วยขวาง จังหวัดกรุงเทพมหานคร",
            "patient_address_english": "",
            "vaccination_list": [
               {
                  "vaccine_dose_no": 1,
                  "vaccine_date": "2021-06-21",
                  "vaccine_name": "Janssen",
                  "vaccine_manufacturer_name": "Johnson & Johnson",
                  "vaccine_lot_number": "21C1602",
                  "vaccine_place": "โรงพยาบาลจุฬารัตน์ 3"
               }
            ]
         }
      ],
      "lab_test_results": [
         {
            "hospital_code": "11541",
            "hospital_name": "โรงพยาบาลเจริญกรุงประชารักษ์",
            "report_datetime": "2021-09-28T20:39:59.000",
            "tmlt_code": "350503",
            "tmlt_name": "SARS coronavirus 2 RdRp gene [+/-] in Respiratory specimen by NAA with probe detection",
            "tmlt_component": "SARS coronavirus 2 RdRp gene",
            "tmlt_specimen": "Respiratory specimen",
            "tmlt_method": "NAA with probe detection",
            "ref_code": "5713024367722585_20210817_797534",
            "lab_name": "RT_PCR",
            "lab_result": "detected",
            "lab_normal_value": ""
         },
         {
            "hospital_code": "11541",
            "hospital_name": "โรงพยาบาลเจริญกรุงประชารักษ์",
            "report_datetime": "2021-09-27T20:39:59.000",
            "tmlt_code": "350508",
            "tmlt_name": "SARS coronavirus 2 IgG+IgM Ab [+/-] in Serum or Plasma by Immunoassay",
            "tmlt_component": "SARS coronavirus 2 IgG+IgM Ab",
            "tmlt_specimen": "Serum or Plasma",
            "tmlt_method": "Immunoassay",
            "ref_code": "8507766399462366_20210817_797535",
            "lab_name": "ATK",
            "lab_result": "detected",
            "lab_normal_value": ""
         }
      ],
      "queue_status": {},
      "unread_message": []
   },
   "MessageCode": 200,
   "Message": "OK",
   "RequestTime": "2021-09-27T13:52:50.183Z",
   "EndpointIP": "10.0.6.31",
   "EndpointPort": 20017,
   "processing_ms": 1,
   "cache": "redis",
   "req_rate": 348,
   "rate_limit": -1,
   "ext_rate": "873:30000"
}