{
  "properties": {
    "name": "test",
    "description": "test",
    "redirectToMobile": "optional",
    "builtOnBuilder": true,
    "sdkVersions": {
      "mobile": { "maximum": "10.0.0", "minimum": "0.3.0" },
      "web": { "maximum": "10.0.0", "minimum": "5.0.0" }
    },
    "textConfigSource": { "en": "default" },
    "uiConfigSource": "custom"
  },
  "updatedAt": "2024-02-16T05:48:07.530Z",
  "conditions": {
    "condition_nameCheck": {
      "rule": "(form1.text_id1_tWt036.value != '')  && (id_verify.firstname != null)",
      "if_true": "approve",
      "if_false": "decline",

      "name": "condition_nameCheck"
    },
    "condition2": {
      "rule": true,
      "if_true": "approve",
      "if_false": "approve"
    }
  },
  "conditionalVariables": {},
  "modules": [
    {
      "type": "countries",
      "subType": "countries",
      "id": "module_countryPicker",
      "nextStep": "form1",
      "properties": { "countriesSupported": ["ind"] },
      "name": "Countries",
      "next_node_type": ""
    },
    {
      "type": "document",
      "subType": "id_card_validation",
      "id": "id_verify",
      "nextStep": "condition_nameCheck",
      "next_node_type": "",
      "properties": {
        "url": "{module_countryPicker.baseUrl}/v1/readId",
        "apiType": "multipart_post",
        "documentsSupported": { "ind": ["pan"] },
        "barcodeSkipDelay": 0,
        "autoCaptureDuration": 0,
        "requestParameters": [
          { "name": "preferences.returnLocalFields", "value": "no" },
          { "name": "preferences.returnConfidence", "value": "no" },
          { "name": "returnInputImageUrls", "value": "yes" },
          { "name": "ruleChecks.dateOfExpiry", "value": "yes" }
        ],
        "documentsOverride": { "ind": { "pan": { "sides": ["front"] } } },
        "autoCapture": false,
        "enableOverlay": false,
        "disableBarcodeSkip": false,
        "disableOCR": false,
        "allowUpload": false,
        "showReview": false,
        "showInstruction": false
      },
      "variables": [
        { "name": "attempts", "path": "response.result.attempts" },
        {
          "name": "inputImageUrls",
          "path": "response.result.inputImageUrls.image"
        },
        { "name": "front_status", "path": "front.response.status" },
        { "name": "front_statuscode", "path": "front.response.statusCode" },
        {
          "name": "front_cropped_image",
          "path": "front.response.result.details[0].croppedImageUrl"
        },
        {
          "name": "homeTown",
          "path": "front.response.result.details[0].fieldsExtracted.homeTown.value"
        },
        { "name": "backRequestId", "path": "back.response.metadata.requestId" },
        {
          "name": "frontRequestId",
          "path": "front.response.metadata.requestId"
        },
        {
          "name": "firstname",
          "path": "front.response.result.details[0].fieldsExtracted.firstName.value"
        },
        {
          "name": "lastname",
          "path": "front.response.result.details[0].fieldsExtracted.lastName.value"
        }
      ],
      "name": "ID Card Validation"
    },
    {
      "type": "dynamicForm",
      "subType": "form",
      "id": "form1",
      "nextStep": "",
      "next_node_type": {},
      "properties": {
        "sections": [
          {
            "id": "basic_details",
            "components": [
              {
                "id": "text_id1_tWt036",
                "title": "First name",
                "hint": "First Name",
                "subType": "singleLine",
                "type": "text",
                "keyboard": "text",
                "required": "no",
                "height": "fill",
                "width": "fill",
                "onChange": { "reloadComponents": [] }
              },
              {
                "id": "default_vertical_id1",
                "type": "vertical",
                "subComponents": [
                  {
                    "id": "default_vertical_text_id",
                    "text": "Pan Number",
                    "type": "label",
                    "subType": "title",
                    "onChange": { "reloadComponents": [] }
                  },
                  {
                    "id": "text_id1_RcqY5c",
                    "title": "Pan Number",
                    "hint": "Pan Number",
                    "subType": "singleLine",
                    "type": "text",
                    "keyboard": "text",
                    "required": "no",
                    "height": "fill",
                    "width": "fill",
                    "onChange": { "reloadComponents": [] }
                  },
                  {
                    "id": "state",
                    "type": "dropdown",
                    "title": "State",

                    "items": [
                      "-",
                      "Maharashtra",
                      "Delhi",
                      "Odisha",
                      "West Bengal",
                      "Assam",
                      "Meghalaya",
                      "Jharkhand",
                      "Rajasthan",
                      "Haryana",
                      "Chandigarh",
                      "Punjab",
                      "Uttar Pradesh",
                      "Himachal Pradesh",
                      "Karnataka",
                      "Tamil Nadu",
                      "Kerala",
                      "Andhra Pradesh",
                      "Gujarat",
                      "Goa",
                      "Pondicherry",
                      "Nagaland",
                      "Sikkim",
                      "Tripura",
                      "Bihar",
                      "Chhattisgarh",
                      "Madhya Pradesh",
                      "Arunachal Pradesh",
                      "Dadra And Nagar Haveli",
                      "Mizoram",
                      "Daman And Diu",
                      "Jammu And Kashmir",
                      "Manipur",
                      "Telangana",
                      "Uttarakhand",
                      "Andaman And Nicobar Islands",
                      "Lakshadweep",
                      "Ladakh"
                    ],
                    "labels": {
                      "-": "Select State",
                      "Maharashtra": "Maharashtra",
                      "Delhi": "Delhi",
                      "Odisha": "Odisha",
                      "West Bengal": "West Bengal",
                      "Assam": "Assam",
                      "Meghalaya": "Meghalaya",
                      "Jharkhand": "Jharkhand",
                      "Rajasthan": "Rajasthan",
                      "Haryana": "Haryana",
                      "Chandigarh": "Chandigarh",
                      "Punjab": "Punjab",
                      "Uttar Pradesh": "Uttar Pradesh",
                      "Himachal Pradesh": "Himachal Pradesh",
                      "Karnataka": "Karnataka",
                      "Tamil Nadu": "Tamil Nadu",
                      "Kerala": "Kerala",
                      "Andhra Pradesh": "Andhra Pradesh",
                      "Gujarat": "Gujarat",
                      "Goa": "Goa",
                      "Pondicherry": "Pondicherry",
                      "Nagaland": "Nagaland",
                      "Sikkim": "Sikkim",
                      "Tripura": "Tripura",
                      "Bihar": "Bihar",
                      "Chhattisgarh": "Chhattisgarh",
                      "Madhya Pradesh": "Madhya Pradesh",
                      "Arunachal Pradesh": "Arunachal Pradesh",
                      "Dadra And Nagar Haveli": "Dadra And Nagar Haveli",
                      "Mizoram": "Mizoram",
                      "Daman And Diu": "Daman And Diu",
                      "Jammu And Kashmir": "Jammu And Kashmir",
                      "Manipur": "Manipur",
                      "Telangana": "Telangana",
                      "Uttarakhand": "Uttarakhand",
                      "Andaman And Nicobar Islands": "Andaman And Nicobar Islands",
                      "Lakshadweep": "Lakshadweep",
                      "Ladakh": "Ladakh"
                    }
                  },
                  {
                    "id": "default_vertical_id2",
                    "type": "vertical",
                    "subComponents": [
                      {
                        "id": "default_vertical_text_id",
                        "text": "sub Sub box",
                        "type": "label",
                        "subType": "title",
                        "onChange": { "reloadComponents": [] }
                      },
                      {
                        "id": "text_id1_26f5ux",
                        "title": "this is a box",
                        "hint": "This is a box",
                        "subType": "singleLine",
                        "type": "text",
                        "keyboard": "text",
                        "required": "no",
                        "height": "fill",
                        "width": "fill",
                        "onChange": { "reloadComponents": [] }
                      }
                    ]
                  }
                ]
              },
              {
                "id": "text_id1_0mWijm",
                "title": "something",
                "hint": "we need somethinge here",
                "subType": "singleLine",
                "type": "text",
                "keyboard": "text",
                "required": "no",
                "height": "fill",
                "width": "fill",
                "onChange": { "reloadComponents": [] }
              },
              {
                "id": "file_id1_hW8Q8v",
                "title": "Provide pic of you pan",
                "type": "file",
                "required": "yes",
                "allowMultipleTypes": "yes",
                "subType": "file",
                "supportedFiles": [
                  {
                    "type": "documents",
                    "title": "PDF Document",
                    "extensions": ["pdf"]
                  },
                  {
                    "type": "images",
                    "title": "Pictures or Images",
                    "extensions": ["jpg", "jpeg", "png"]
                  }
                ],
                "onChange": { "reloadComponents": [] },
                "maxFileSize": 1
              },
              {
                "id": "buttonEnabled",
                "type": "button",
                "subType": "primary",
                "text": "Default Button",
                "width": "fill",
                "height": "fill",
                "enabled": "",
                "onClick": { "nextStep": "form2" },
                "onChange": { "reloadComponents": [] }
              }
            ]
          }
        ]
      },
      "name": "Dynamic Form Module"
    },
    {
      "type": "dynamicForm",
      "subType": "form",
      "id": "form2",
      "nextStep": "",
      "next_node_type": {},
      "properties": {
        "sections": [
          {
            "id": "basic_details",
            "components": [
              {
                "id": "firstName",
                "title": "First name",
                "hint": "First Name",
                "subType": "singleLine",
                "type": "text",
                "keyboard": "text",
                "required": "no",
                "height": "fill",
                "width": "fill",
                "onChange": { "reloadComponents": [] }
              },
              {
                "id": "lastName",
                "title": "last name",
                "hint": "last Name",
                "subType": "singleLine",
                "visible": "(form2.firstName != '' )",
                "type": "text",
                "keyboard": "text",
                "required": "no",
                "height": "fill",
                "width": "fill",
                "onChange": { "reloadComponents": [] }
              },
              {
                "id": "default_vertical_id1",
                "type": "vertical",
                "subComponents": [
                  {
                    "id": "default_vertical_text_id",
                    "text": "Pan Number",
                    "type": "label",
                    "subType": "title",
                    "onChange": { "reloadComponents": [] }
                  },
                  {
                    "id": "text_id1_RcqY5c",
                    "title": "Pan Number",
                    "hint": "Pan Number",
                    "subType": "singleLine",
                    "type": "text",
                    "keyboard": "text",
                    "required": "no",
                    "height": "fill",
                    "width": "fill",
                    "onChange": { "reloadComponents": [] }
                  }
                ]
              },
              {
                "id": "buttonEnabled",
                "type": "button",
                "subType": "primary",
                "text": "Default Button",
                "width": "fill",
                "height": "fill",
                "enabled": "(form1.text_id1_tWt036.value == 'sarthak' && form1.text_id1_tWt036.value != null && form1.text_id1_tWt036.value !='')  ",
                "onClick": { "nextStep": "id_verify" },
                "onChange": { "reloadComponents": [] }
              }
            ]
          }
        ]
      },
      "name": "Dynamic Form Module"
    }
  ]
}
