{
  "properties": {
    "name": "id_card_validation",
    "description": "check All id card",
    "builtOnBuilder": true,
    "sdkVersions": {
      "mobile": { "maximum": "10.0.0", "minimum": "0.3.0" },
      "web": { "maximum": "10.0.0", "minimum": "5.0.0" }
    },
    "builder": { "superModuleMetaData": {} }
  },
  "updatedAt": "2024-02-19T05:14:24.110Z",
  "conditions": {},
  "conditionalVariables": {},
  "modules": [
    {
      "type": "countries",
      "subType": "countries",
      "id": "module_countryPicker",
      "nextStep": "module_jL6cgD_id_card_validation",
      "properties": { "countriesSupported": ["ind"] },
      "name": "Countries",
      "next_node_type": ""
    },
    {
      "type": "document",
      "subType": "id_card_validation",
      "id": "module_jL6cgD_id_card_validation",
      "nextStep": "approve",
      "next_node_type": "",
      "properties": {
        "url": "{module_countryPicker.baseUrl}/v1/readId",
        "apiType": "multipart_post",
        "documentsSupported": {
          "ind": ["dl1", "dl2", "pan", "voterid", "passport"]
        },
        "barcodeSkipDelay": 10000,
        "autoCaptureDuration": 1000,
        "requestParameters": [
          { "name": "preferences.returnLocalFields", "value": "yes" },
          { "name": "preferences.returnConfidence", "value": "yes" },
          { "name": "returnInputImageUrls", "value": "yes" },
          { "name": "ruleChecks.dateOfExpiry", "value": "yes" }
        ],
        "documentsOverride": {
          "ind": {
            "dl1": { "sides": ["front"] },
            "dl2": { "sides": ["front", "back"] },
            "pan": { "sides": ["front"] },
            "voterid": { "sides": ["front", "back"] },
            "passport": { "sides": ["front", "back"] }
          }
        },
        "autoCapture": false,
        "enableOverlay": true,
        "disableBarcodeSkip": true,
        "disableOCR": true,
        "allowUpload": true,
        "showReview": true,
        "showInstruction": true,
        "supportedUploadFileTypes": ["pdf", "jpg", "png", "jpeg", "tiff"]
      },
      "variables": [
        { "name": "attempts", "path": "response.result.attempts" },
        {
          "name": "inputImageUrls",
          "path": "response.result.inputImageUrls.image"
        },
        { "name": "front_status", "path": "front.response.status" },
        { "name": "front_statuscode", "path": "front.response.statusCode" },
        {
          "name": "front_cropped_image",
          "path": "front.response.result.details[0].croppedImageUrl"
        },
        {
          "name": "front_action",
          "path": "front.response.result.summary.action"
        },
        {
          "name": "idNumberFront",
          "path": "front.response.result.details[0].fieldsExtracted.idNumber.value"
        },
        {
          "name": "idNumberFrontConfidence",
          "path": "front.response.result.details[0].fieldsExtracted.idNumber.confidence"
        },
        {
          "name": "idTypeFront",
          "path": "front.response.result.details[0].idType"
        },
        {
          "name": "fullNameFront",
          "path": "front.response.result.details[0].fieldsExtracted.fullName.value"
        },
        {
          "name": "fullNameConfidence",
          "path": "front.response.result.details[0].fieldsExtracted.fullName.confidence"
        },
        {
          "name": "dobFront",
          "path": "front.response.result.details[0].fieldsExtracted.dateOfBirth.value"
        },
        {
          "name": "dobConfidence",
          "path": "front.response.result.details[0].fieldsExtracted.dateOfBirth.confidence"
        },
        {
          "name": "fileNumFront",
          "path": "front.response.result.details[0].fieldsExtracted.fileNum.value"
        },
        {
          "name": "addressFront",
          "path": "front.response.result.details[0].fieldsExtracted.address.value"
        },
        {
          "name": "dateOfIssueFront",
          "path": "front.response.result.details[0].fieldsExtracted.dateOfIssue.value"
        },
        {
          "name": "dateOfExpiryFront",
          "path": "front.response.result.details[0].fieldsExtracted.dateOfExpiry.value"
        },
        {
          "name": "dateOfExpiryBackRuleCheck",
          "path": "back.response.result.details[0].ruleChecks.invalidDateOfExpiry.value"
        },
        {
          "name": "genderFront",
          "path": "front.response.result.details[0].fieldsExtracted.gender.value"
        },
        {
          "name": "fatherNameFront",
          "path": "front.response.result.details[0].fieldsExtracted.fatherName.value"
        },
        {
          "name": "front_errorCode",
          "path": "front.response.result.summary.details[0].code"
        },
        {
          "name": "front_errorMessage",
          "path": "front.response.result.summary.details[0].message"
        },
        { "name": "back_status", "path": "back.response.status" },
        { "name": "back_statuscode", "path": "back.response.statusCode" },
        {
          "name": "back_cropped_image",
          "path": "back.response.result.details[0].croppedImageUrl"
        },
        {
          "name": "back_action",
          "path": "back.response.result.summary.action"
        },
        {
          "name": "idNumberBack",
          "path": "back.response.result.details[0].fieldsExtracted.idNumber.value"
        },
        {
          "name": "idNumberBackConfidence",
          "path": "back.response.result.details[0].fieldsExtracted.idNumber.confidence"
        },
        {
          "name": "idTypeBack",
          "path": "back.response.result.details[0].idType"
        },
        {
          "name": "fullNameBack",
          "path": "back.response.result.details[0].fieldsExtracted.fullName.value"
        },
        {
          "name": "fullNameBackConfidence",
          "path": "back.response.result.details[0].fieldsExtracted.fullName.confidence"
        },
        {
          "name": "dobBack",
          "path": "back.response.result.details[0].fieldsExtracted.dateOfBirth.value"
        },
        {
          "name": "dobBackConfidence",
          "path": "back.response.result.details[0].fieldsExtracted.dateOfBirth.confidence"
        },
        {
          "name": "fileNumBack",
          "path": "back.response.result.details[0].fieldsExtracted.fileNum.value"
        },
        {
          "name": "addressBack",
          "path": "back.response.result.details[0].fieldsExtracted.address.value"
        },
        {
          "name": "dateOfIssueBack",
          "path": "back.response.result.details[0].fieldsExtracted.dateOfIssue.value"
        },
        {
          "name": "dateOfExpiryBack",
          "path": "back.response.result.details[0].fieldsExtracted.dateOfExpiry.value"
        },
        {
          "name": "dateOfExpiryFrontRuleCheck",
          "path": "front.response.result.details[0].ruleChecks.invalidDateOfExpiry.value"
        },
        {
          "name": "genderBack",
          "path": "back.response.result.details[0].fieldsExtracted.gender.value"
        },
        {
          "name": "fatherNameBack",
          "path": "back.response.result.details[0].fieldsExtracted.fatherName.value"
        },
        {
          "name": "yearOfBirth",
          "path": "front.response.result.details[0].fieldsExtracted.yearOfBirth.value"
        },
        {
          "name": "province",
          "path": "front.response.result.details[0].fieldsExtracted.address.province"
        },
        {
          "name": "houseNumber",
          "path": "front.response.result.details[0].fieldsExtracted.address.houseNumber"
        },
        {
          "name": "addressFrontLine1",
          "path": "front.response.result.details[0].fieldsExtracted.address.line1"
        },
        {
          "name": "addressBackLine1",
          "path": "back.response.result.details[0].fieldsExtracted.address.line1"
        },
        {
          "name": "zipCode",
          "path": "front.response.result.details[0].fieldsExtracted.address.zipCode"
        },
        {
          "name": "zipCodeBack",
          "path": "back.response.result.details[0].fieldsExtracted.address.zipCode"
        },
        {
          "name": "district",
          "path": "front.response.result.details[0].fieldsExtracted.address.district"
        },
        {
          "name": "street",
          "path": "front.response.result.details[0].fieldsExtracted.address.street"
        },
        {
          "name": "cityFront",
          "path": "front.response.result.details[0].fieldsExtracted.address.city"
        },
        {
          "name": "additionalInfo",
          "path": "front.response.result.details[0].fieldsExtracted.address.additionalInfo"
        },
        {
          "name": "nationality",
          "path": "front.response.result.details[0].fieldsExtracted.nationality.value"
        },
        {
          "name": "cityBack",
          "path": "back.response.result.details[0].fieldsExtracted.address.city"
        },
        {
          "name": "placeOfIssue",
          "path": "back.response.result.details[0].fieldsExtracted.placeOfIssue.value"
        },
        {
          "name": "homeTown",
          "path": "front.response.result.details[0].fieldsExtracted.homeTown.value"
        },
        { "name": "backRequestId", "path": "back.response.metadata.requestId" },
        {
          "name": "frontRequestId",
          "path": "front.response.metadata.requestId"
        },
        {
          "name": "firstname",
          "path": "front.response.result.details[0].fieldsExtracted.firstName.value"
        },
        {
          "name": "lastname",
          "path": "front.response.result.details[0].fieldsExtracted.lastName.value"
        },
        {
          "name": "middlename",
          "path": "front.response.result.details[0].fieldsExtracted.middleName.value"
        },
        {
          "name": "back_mrzValue",
          "path": "back.response.result.details[0].fieldsExtracted.mrzString.value"
        },
        {
          "name": "back_mrzIdNumber",
          "path": "back.response.result.details[0].fieldsExtracted.mrzString.idNumber"
        },
        {
          "name": "back_mrzNationality",
          "path": "back.response.result.details[0].fieldsExtracted.mrzString.nationality"
        },
        {
          "name": "back_mrzGender",
          "path": "back.response.result.details[0].fieldsExtracted.mrzString.gender"
        },
        {
          "name": "back_mrzFullName",
          "path": "back.response.result.details[0].fieldsExtracted.mrzString.fullName"
        },
        {
          "name": "back_mrzDOB",
          "path": "back.response.result.details[0].fieldsExtracted.mrzString.dateOfBirth"
        },
        {
          "name": "back_mrzDOE",
          "path": "back.response.result.details[0].fieldsExtracted.mrzString.dateOfExpiry"
        },
        {
          "name": "back_signature",
          "path": "back.headers.x-hv-response-signature"
        },
        {
          "name": "back_errorCode",
          "path": "back.response.result.summary.details[0].code"
        },
        {
          "name": "back_errorMessage",
          "path": "back.response.result.summary.details[0].message"
        },
        {
          "name": "qrHouseNoFront",
          "path": "front.response.result.details[0].fieldsExtracted.qr.house_number"
        },
        {
          "name": "qrHouseNoBack",
          "path": "back.response.result.details[0].fieldsExtracted.qr.house_number"
        },
        {
          "name": "qrStreetFront",
          "path": "front.response.result.details[0].fieldsExtracted.qr.street"
        },
        {
          "name": "qrStreetBack",
          "path": "back.response.result.details[0].fieldsExtracted.qr.street"
        },
        {
          "name": "qrLocalityFront",
          "path": "front.response.result.details[0].fieldsExtracted.qr.locality"
        },
        {
          "name": "qrLocalityBack",
          "path": "back.response.result.details[0].fieldsExtracted.qr.locality"
        },
        {
          "name": "qrDistrictFront",
          "path": "front.response.result.details[0].fieldsExtracted.qr.district"
        },
        {
          "name": "qrDistrictBack",
          "path": "back.response.result.details[0].fieldsExtracted.qr.district"
        },
        {
          "name": "qrStateFront",
          "path": "front.response.result.details[0].fieldsExtracted.qr.state"
        },
        {
          "name": "qrStateBack",
          "path": "back.response.result.details[0].fieldsExtracted.qr.state"
        },
        {
          "name": "qrPinFront",
          "path": "front.response.result.details[0].fieldsExtracted.qr.pin"
        },
        {
          "name": "qrPinBack",
          "path": "back.response.result.details[0].fieldsExtracted.qr.pin"
        },
        {
          "name": "qrNameFront",
          "path": "front.response.result.details[0].fieldsExtracted.qr.name"
        },
        {
          "name": "qrNameBack",
          "path": "back.response.result.details[0].fieldsExtracted.qr.name"
        },
        {
          "name": "qrValueFront",
          "path": "front.response.result.details[0].fieldsExtracted.qr.value"
        },
        {
          "name": "qrValueBack",
          "path": "back.response.result.details[0].fieldsExtracted.qr.value"
        },
        {
          "name": "qrCOBack",
          "path": "back.response.result.details[0].fieldsExtracted.qr.care_of"
        },
        {
          "name": "qrCOFront",
          "path": "front.response.result.details[0].fieldsExtracted.qr.care_of"
        },
        {
          "name": "qrLandmarkBack",
          "path": "back.response.result.details[0].fieldsExtracted.qr.landmark"
        },
        {
          "name": "qrLandmarkFront",
          "path": "front.response.result.details[0].fieldsExtracted.qr.landmark"
        },
        {
          "name": "qrCityBack",
          "path": "back.response.result.details[0].fieldsExtracted.qr.city"
        },
        {
          "name": "qrCityFront",
          "path": "front.response.result.details[0].fieldsExtracted.qr.city"
        }
      ],
      "name": "ID Card Validation"
    }
  ]
}
