<?xml version="1.0" encoding="utf-8"?>
<!-- Generator: Adobe Illustrator 24.2.3, SVG Export Plug-In . SVG Version: 6.00 Build 0)  -->
<svg version="1.1" id="Capa_1" xmlns="http://www.w3.org/2000/svg" xmlns:xlink="http://www.w3.org/1999/xlink" x="0px" y="0px"
	 viewBox="0 0 512 512" style="enable-background:new 0 0 512 512;" xml:space="preserve">
<style type="text/css">
	.st0{fill:#05CFBB;}
</style>
<g>
	<g>
		<path class="st0" d="M401.2,60.1C362.4,21.3,310.8,0,256,0c-0.1,0-0.3,0-0.4,0c-54.8,0.1-106.4,21.7-145.2,60.8
			c-38.9,39.1-60.1,90.8-59.9,145.6c0,1.4,0,2.8,0.1,4.2c1,42,16.3,83.9,42.9,117.9l20.5,26.1c2.6,3.3,7.3,3.8,10.6,1.3
			c3.3-2.6,3.8-7.3,1.3-10.6l-20.5-26.1c-24.7-31.5-38.8-70.2-39.7-109c0-1.3-0.1-2.6-0.1-3.9c-0.2-50.8,19.5-98.7,55.5-135
			c36-36.2,83.8-56.3,134.6-56.4h0.4c50.8,0,98.6,19.8,134.6,55.7c36.1,36,55.9,83.9,55.9,134.8c0,1.3,0,2.6,0,3.8
			c-0.8,39.1-14.9,78.2-39.7,109.9L274.6,487.9c-4.5,5.8-11.3,9.1-18.6,9.1c-7.3,0-14.1-3.3-18.6-9.1l-90-114.9
			c-2.6-3.3-7.3-3.8-10.6-1.3c-3.3,2.6-3.8,7.3-1.3,10.6l90,114.9c7.4,9.4,18.5,14.8,30.5,14.8c12,0,23.1-5.4,30.5-14.8l132.1-168.7
			c26.8-34.3,42.1-76.5,42.9-118.9c0-1.4,0-2.8,0-4.1C461.5,150.5,440.1,98.9,401.2,60.1L401.2,60.1z"/>
		<path class="st0" d="M389.8,240c4,0.9,8.1-1.6,9-5.6c2.6-10.9,3.9-22.2,3.9-33.6c0-80.9-65.8-146.7-146.7-146.7
			c-80.9,0-146.7,65.8-146.7,146.7S175.1,347.5,256,347.5c54.7,0,104.4-30.1,129.9-78.5c1.9-3.7,0.5-8.2-3.2-10.2
			c-3.7-1.9-8.2-0.5-10.2,3.2c-22.9,43.4-67.5,70.4-116.6,70.4c-72.6,0-131.7-59.1-131.7-131.7S183.4,69.2,256,69.2
			s131.7,59.1,131.7,131.7c0,10.2-1.2,20.3-3.5,30.1C383.3,235,385.8,239,389.8,240L389.8,240z"/>
		<path class="st0" d="M333.1,137.6c-5.9-5.4-13.5-8.3-21.5-7.9c-8,0.3-15.4,3.7-20.8,9.6l-55.2,59.7l-15.4-14.9
			c-11.9-11.5-30.9-11.2-42.4,0.7c-11.5,11.9-11.2,30.9,0.7,42.4c0,0,37.4,36.2,37.4,36.2c12.1,11.7,31.4,11.3,42.9-1.2l76-82.3
			c5.4-5.9,8.3-13.5,7.9-21.5C342.4,150.5,338.9,143.1,333.1,137.6L333.1,137.6z M323.7,169.8c0,0-76,82.3-76,82.3
			c-2.7,2.9-6.6,4.7-10.6,4.8c-4,0.1-7.9-1.4-10.8-4.2l-37.4-36.2c-5.9-5.7-6.1-15.2-0.4-21.2c2.9-3,6.8-4.6,10.8-4.6
			c3.7,0,7.5,1.4,10.4,4.2l20.9,20.2c1.5,1.4,3.4,2.2,5.4,2.1c2-0.1,3.9-0.9,5.3-2.4c0,0,60.2-65.3,60.4-65.4
			c7.1-7.6,20.5-5.4,24.7,4.1C328.7,158.9,327.6,165.6,323.7,169.8L323.7,169.8z"/>
	</g>
</g>
</svg>
