[
  {
    "inputs": [],
    "stateMutability": "nonpayable",
    "type": "constructor"
  },
  {
    "anonymous": false,
    "inputs": [
      {
        "indexed": true,
        "internalType": "address",
        "name": "previousOwner",
        "type": "address"
      },
      {
        "indexed": true,
        "internalType": "address",
        "name": "newOwner",
        "type": "address"
      }
    ],
    "name": "OwnershipTransferred",
    "type": "event"
  },
  {
    "stateMutability": "payable",
    "type": "fallback"
  },
  {
    "inputs": [
      {
        "internalType": "contract IERC20",
        "name": "_token",
        "type": "address"
      },
      {
        "internalType": "address",
        "name": "_to",
        "type": "address"
      },
      {
        "internalType": "uint256",
        "name": "_getAmountsIn",
        "type": "uint256"
      },
      {
        "internalType": "uint256",
        "name": "_amountTokenMin",
        "type": "uint256"
      },
      {
        "internalType": "uint256",
        "name": "_amountETHMin",
        "type": "uint256"
      },
      {
        "internalType": "uint256",
        "name": "deadline",
        "type": "uint256"
      }
    ],
    "name": "addLiquidityETH",
    "outputs": [
      {
        "internalType": "uint256[3]",
        "name": "amounts",
        "type": "uint256[3]"
      }
    ],
    "stateMutability": "payable",
    "type": "function"
  },
  {
    "inputs": [
      {
        "internalType": "contract IUniswapV2Pair",
        "name": "_lptoken",
        "type": "address"
      },
      {
        "internalType": "address",
        "name": "_to",
        "type": "address"
      },
      {
        "internalType": "uint256",
        "name": "_getAmountsIn",
        "type": "uint256"
      },
      {
        "internalType": "uint256",
        "name": "_amountTokenMin",
        "type": "uint256"
      },
      {
        "internalType": "uint256",
        "name": "_amountETHMin",
        "type": "uint256"
      },
      {
        "internalType": "uint256",
        "name": "deadline",
        "type": "uint256"
      }
    ],
    "name": "addLiquidityETHByPair",
    "outputs": [
      {
        "internalType": "uint256[]",
        "name": "outputAmounts",
        "type": "uint256[]"
      }
    ],
    "stateMutability": "payable",
    "type": "function"
  },
  {
    "inputs": [],
    "name": "owner",
    "outputs": [
      {
        "internalType": "address",
        "name": "",
        "type": "address"
      }
    ],
    "stateMutability": "view",
    "type": "function"
  },
  {
    "inputs": [
      {
        "internalType": "address",
        "name": "_token",
        "type": "address"
      },
      {
        "internalType": "uint256",
        "name": "_liquidity",
        "type": "uint256"
      },
      {
        "internalType": "uint8",
        "name": "_choise",
        "type": "uint8"
      },
      {
        "internalType": "uint256",
        "name": "_amountTokenMin",
        "type": "uint256"
      },
      {
        "internalType": "uint256",
        "name": "_amountETHMin",
        "type": "uint256"
      },
      {
        "internalType": "uint256",
        "name": "_amountOutMin",
        "type": "uint256"
      },
      {
        "internalType": "address payable",
        "name": "_to",
        "type": "address"
      },
      {
        "internalType": "uint256",
        "name": "_deadline",
        "type": "uint256"
      }
    ],
    "name": "removeLiquidityETH",
    "outputs": [
      {
        "internalType": "uint256",
        "name": "amountToken",
        "type": "uint256"
      },
      {
        "internalType": "uint256",
        "name": "amountETH",
        "type": "uint256"
      }
    ],
    "stateMutability": "nonpayable",
    "type": "function"
  },
  {
    "inputs": [
      {
        "internalType": "contract IUniswapV2Pair",
        "name": "_lptoken",
        "type": "address"
      },
      {
        "internalType": "uint256",
        "name": "_liquidity",
        "type": "uint256"
      },
      {
        "internalType": "uint8",
        "name": "_choise",
        "type": "uint8"
      },
      {
        "internalType": "uint256",
        "name": "_amountTokenMin",
        "type": "uint256"
      },
      {
        "internalType": "uint256",
        "name": "_amountETHMin",
        "type": "uint256"
      },
      {
        "internalType": "uint256",
        "name": "_amountOutMin",
        "type": "uint256"
      },
      {
        "internalType": "address payable",
        "name": "_to",
        "type": "address"
      },
      {
        "internalType": "uint256",
        "name": "_deadline",
        "type": "uint256"
      }
    ],
    "name": "removeLiquidityETHByPair",
    "outputs": [
      {
        "internalType": "uint256",
        "name": "amountToken",
        "type": "uint256"
      },
      {
        "internalType": "uint256",
        "name": "amountETH",
        "type": "uint256"
      }
    ],
    "stateMutability": "nonpayable",
    "type": "function"
  },
  {
    "inputs": [
      {
        "internalType": "address",
        "name": "_token",
        "type": "address"
      },
      {
        "internalType": "uint256",
        "name": "_liquidity",
        "type": "uint256"
      },
      {
        "internalType": "uint256",
        "name": "_amountTokenMin",
        "type": "uint256"
      },
      {
        "internalType": "uint256",
        "name": "_amountETHMin",
        "type": "uint256"
      },
      {
        "internalType": "uint256",
        "name": "_amountOutMin",
        "type": "uint256"
      },
      {
        "internalType": "uint256",
        "name": "_deadline",
        "type": "uint256"
      },
      {
        "internalType": "address",
        "name": "_to",
        "type": "address"
      },
      {
        "internalType": "uint8",
        "name": "_choise",
        "type": "uint8"
      },
      {
        "internalType": "uint8",
        "name": "_v",
        "type": "uint8"
      },
      {
        "internalType": "bytes32",
        "name": "_r",
        "type": "bytes32"
      },
      {
        "internalType": "bytes32",
        "name": "_s",
        "type": "bytes32"
      }
    ],
    "name": "removeLiquidityETHWithPermit",
    "outputs": [
      {
        "internalType": "uint256[2]",
        "name": "amounts",
        "type": "uint256[2]"
      }
    ],
    "stateMutability": "nonpayable",
    "type": "function"
  },
  {
    "inputs": [],
    "name": "renounceOwnership",
    "outputs": [],
    "stateMutability": "nonpayable",
    "type": "function"
  },
  {
    "inputs": [
      {
        "internalType": "address",
        "name": "newOwner",
        "type": "address"
      }
    ],
    "name": "transferOwnership",
    "outputs": [],
    "stateMutability": "nonpayable",
    "type": "function"
  },
  {
    "inputs": [
      {
        "internalType": "address",
        "name": "_token",
        "type": "address"
      },
      {
        "internalType": "address",
        "name": "_to",
        "type": "address"
      },
      {
        "internalType": "uint256",
        "name": "_amount",
        "type": "uint256"
      }
    ],
    "name": "withdrawAbandonedAssets",
    "outputs": [],
    "stateMutability": "nonpayable",
    "type": "function"
  },
  {
    "stateMutability": "payable",
    "type": "receive"
  }
]
