﻿<?xml version="1.0" encoding="utf-8"?>
<svg xmlns="http://www.w3.org/2000/svg" viewBox="0 0 24 24" width="192" height="192">
  <path d="M23,5c0-2.209-1.791-4-4-4c-1.477,0-2.752,0.809-3.445,2H5C3.343,3,2,4.343,2,6v13v0.828 c0,1.746,1.974,2.762,3.395,1.747l2.823-2.016C8.727,19.195,9.336,19,9.961,19H19c1.657,0,3-1.343,3-3V7.62 C22.615,6.917,23,6.008,23,5z" opacity=".35" fill="#5B5B5B" />
  <path d="M19,0c-2.761,0-5,2.239-5,5s2.239,5,5,5s5-2.239,5-5S21.761,0,19,0z M21.619,4.619l-2.5,2.5 c-0.165,0.165-0.385,0.256-0.619,0.256s-0.454-0.091-0.619-0.256l-1.5-1.5c-0.341-0.342-0.341-0.896,0-1.238 c0.341-0.34,0.896-0.34,1.237,0L18.5,5.263l1.881-1.882c0.341-0.34,0.896-0.34,1.237,0C21.96,3.723,21.96,4.277,21.619,4.619z" fill="#5B5B5B" />
</svg>