0.102011 0.0266429 -0.0932612 -0.0241112 0.111123 0.244448 0.0684901 -0.0502583 -0.0898948 -0.0436189 0.0216597 0.108188 0.0917465 -0.1626 -0.0438484 -0.0154932 -0.114669 0.0940069 -0.100472 0.152313 0.154448 -0.0162768 0.0380206 0.149771 -0.051679 -0.00480228 -0.106063 -0.253097 0.0322634 0.111696 -0.0264329 0.0591613 -0.11035 0.0899952 0.0427909 0.0200765 -0.0385083 0.0398741 -0.00978078 -0.0586757 0.0677051 -0.064298 -0.0119049 0.106781 -0.174764 -0.0510488 0.195985 0.0357832 -0.17461 0.099223 0.0168955 -0.106488 -0.0460902 0.034183 0.122269 0.013595 -0.0167021 0.17419 -0.0503069 -0.121081 -0.055842 0.0576952 0.267078 -0.149076 0.087503 -0.0744402 0.00229867 -0.0167332 -0.110472 0.050192 -0.0150538 0.0924257 -0.0479444 0.034935 -0.0168324 -0.0060345 -0.0585728 0.0296598 0.0567012 0.0516222 0.00092072 0.100852 -0.0262072 -0.0459163 -0.0713529 0.0429788 0.0768247 0.0129999 0.00857002 0.0813618 0.14322 -0.150924 -0.0896463 -0.00362129 -0.0785877 -0.0649389 -0.0159613 0.0963053 0.0155172 -0.0196303 0.0468881 0.0130159 -0.0411478 0.0948813 -0.120221 0.0847624 -0.083612 0.102991 -0.064008 0.0150425 0.0659339 0.114856 -0.0535314 -0.0322875 0.0327191 0.0692813 -0.100646 -0.0991584 -0.0119374 0.125046 0.0578801 -0.0437837 0.0611827 0.0376643 -0.0874408 0.0788839 -0.0100237 -0.0452708 
0.119075 -0.0327996 -0.0471736 0.0131789 0.18764 0.233165 0.103473 -0.0430285 -0.138189 -0.00277248 -0.0100161 0.152798 0.0925818 -0.125588 0.00811061 -0.0149405 -0.0421298 0.155922 -0.0667765 0.13139 0.174414 -0.00992177 0.0362503 0.158732 -0.00402096 -0.0213 -0.153858 -0.256593 0.0136839 0.142069 -0.0382303 0.0968018 -0.129241 0.0828148 0.0513998 -0.0113241 -0.0543271 -0.00161884 0.0251655 -0.0813453 0.087813 -0.00644552 0.0146074 0.0578128 -0.204108 -0.0732892 0.165802 -0.0112895 -0.125732 0.0386489 0.0940017 -0.145568 -0.0370788 0.0137184 0.119654 0.0212439 0.00855015 0.179863 -0.0396309 -0.0692143 -0.0164521 0.046193 0.176863 -0.164982 0.131749 -0.0816271 -0.0265806 0.000170013 -0.125887 0.0419584 0.0201271 0.157281 -0.0361681 -0.0245072 -0.0813311 0.0641189 -0.0490676 0.0108153 0.0618513 0.0329364 -0.0261846 0.113793 0.0249635 -0.000131453 -0.0502249 -0.0062048 0.126781 0.0354857 -0.0172968 0.0448565 0.0792785 -0.10776 -0.0779967 0.0282303 -0.108649 -0.0586203 -0.0112412 0.0795848 -0.00737335 0.0145472 0.0538086 0.0240192 -0.0312426 0.115581 -0.10805 0.0517671 -0.0715838 0.0667119 -0.054531 0.0261782 0.031847 0.0699546 -0.0494628 -0.0360154 0.0448384 0.0729647 -0.121861 -0.0754948 -0.0913463 0.12523 0.0389735 -0.0340676 0.0177054 -0.00482294 -0.0555431 0.109991 -0.0423914 -0.0587818 
0.119075 -0.0327996 -0.0471736 0.0131789 0.18764 0.233165 0.103473 -0.0430285 -0.138189 -0.00277248 -0.0100161 0.152798 0.0925818 -0.125588 0.00811061 -0.0149405 -0.0421298 0.155922 -0.0667765 0.13139 0.174414 -0.00992177 0.0362503 0.158732 -0.00402096 -0.0213 -0.153858 -0.256593 0.0136839 0.142069 -0.0382303 0.0968018 -0.129241 0.0828148 0.0513998 -0.0113241 -0.0543271 -0.00161884 0.0251655 -0.0813453 0.087813 -0.00644552 0.0146074 0.0578128 -0.204108 -0.0732892 0.165802 -0.0112895 -0.125732 0.0386489 0.0940017 -0.145568 -0.0370788 0.0137184 0.119654 0.0212439 0.00855015 0.179863 -0.0396309 -0.0692143 -0.0164521 0.046193 0.176863 -0.164982 0.131749 -0.0816271 -0.0265806 0.000170013 -0.125887 0.0419584 0.0201271 0.157281 -0.0361681 -0.0245072 -0.0813311 0.0641189 -0.0490676 0.0108153 0.0618513 0.0329364 -0.0261846 0.113793 0.0249635 -0.000131453 -0.0502249 -0.0062048 0.126781 0.0354857 -0.0172968 0.0448565 0.0792785 -0.10776 -0.0779967 0.0282303 -0.108649 -0.0586203 -0.0112412 0.0795848 -0.00737335 0.0145472 0.0538086 0.0240192 -0.0312426 0.115581 -0.10805 0.0517671 -0.0715838 0.0667119 -0.054531 0.0261782 0.031847 0.0699546 -0.0494628 -0.0360154 0.0448384 0.0729647 -0.121861 -0.0754948 -0.0913463 0.12523 0.0389735 -0.0340676 0.0177054 -0.00482294 -0.0555431 0.109991 -0.0423914 -0.0587818 
0.0775756 0.0412276 -0.0405892 0.0357093 0.11076 0.187645 0.0965854 -0.0566155 -0.113146 0.0535695 0.0359647 0.0892812 0.100584 -0.154396 -0.0228942 -0.00620455 -0.0993373 0.144393 -0.0755463 0.156998 0.17182 -0.120486 0.0878382 0.145831 0.00746146 -0.0358902 -0.155231 -0.253836 0.0721951 0.122631 -0.03062 0.0790363 -0.086622 0.0818959 0.0583268 -0.0244532 -0.0633119 0.104182 0.00845202 -0.127181 0.0293158 -0.0967409 -0.00928528 0.0736942 -0.196603 -0.0923552 0.162742 0.0367479 -0.146952 0.0608463 0.065537 -0.0606335 -0.052578 0.00296354 0.127573 0.0119584 0.0221683 0.123765 -0.0456534 -0.109154 -0.0450538 -0.00538753 0.216082 -0.137999 0.144491 -0.0388339 -0.0561712 -0.0358293 -0.155101 0.0683383 -0.0453571 0.131393 -0.0721401 0.042282 -0.0398596 -0.0321239 -0.009684 0.0467314 0.0909112 0.0647963 -0.0639725 0.0247795 -0.0140866 -0.0307786 -0.0397542 -0.0209147 0.0558368 0.0630267 0.0684912 0.0567543 0.101603 -0.10194 -0.0488571 -0.00494418 -0.092427 -0.11366 -0.0224975 0.126801 0.0328575 -0.0187481 0.0849133 0.0382451 -0.0344884 0.0874104 -0.0301644 0.0692844 -0.0145124 0.11422 0.0924749 -0.0175161 -0.0208713 0.146196 -0.0504004 -0.0303045 0.101308 0.0661336 -0.0611492 -0.0567524 -0.0036234 0.171331 0.0210979 -0.0440212 -0.000434598 0.028315 -0.06789 0.111066 0.0363848 -0.0253136 
0.123746 0.0389544 -0.0993731 -0.00813429 0.120896 0.214256 0.0882922 -0.0100901 -0.0887775 -0.0123086 0.0280669 0.12702 0.101739 -0.199819 -0.046735 0.00534948 -0.0319692 0.119963 -0.13797 0.141851 0.154159 -0.00577829 0.046629 0.122907 -0.0657362 -0.038096 -0.0832039 -0.25846 0.00449853 0.133451 -0.054396 0.094462 -0.0660311 0.129895 0.0383273 -0.0460993 0.00381368 0.0578068 -0.0295411 -0.0609477 0.0364705 -0.0768282 0.0224052 0.117495 -0.172608 -0.048351 0.171496 0.00828861 -0.182708 0.105244 0.118194 -0.134349 -0.0878423 0.0230419 0.0949752 0.0049169 -0.0227157 0.107157 -0.0275164 -0.0864951 -0.03573 -0.0255384 0.185628 -0.173053 0.127594 -0.176805 -0.0419454 -0.0120106 -0.139977 0.0486345 -0.0268301 0.0510135 -0.0619965 -0.022325 -0.0797727 0.00983658 -0.0190441 0.0701095 0.0237 0.0517279 -0.0324809 0.0536418 -0.0214475 -0.0172444 -0.0603226 0.010685 0.0806568 -0.0209793 0.00523309 0.101816 0.0496497 -0.179484 -0.145529 -0.00242556 -0.071483 -0.00725567 -0.00868764 0.0591561 -0.0299659 0.00238457 0.0415268 0.04699 -0.0558453 0.153986 -0.0782514 -0.0105303 -0.0954477 0.11911 -0.065436 -0.0132888 0.0163541 0.0948177 -0.0586103 -0.0101934 0.0356591 0.0384474 -0.0990506 -0.103613 -0.0303037 0.14208 0.0342947 0.0140102 0.0467644 0.0710108 0.0264909 0.007293 -0.000128011 -0.0980049 
0.102388 0.0146419 -0.0662603 -0.00288792 0.12109 0.206264 0.0625816 -0.00790855 -0.00103716 -0.0256882 0.0285637 0.127157 0.0859041 -0.217486 -0.0610139 0.0195236 -0.113861 0.107812 -0.16572 0.137958 0.203888 -0.0126325 0.0720037 0.119568 -0.062693 -0.0674858 -0.0883628 -0.280155 -0.0216069 0.149798 -0.0312004 0.0388467 -0.0319581 0.119948 0.0701638 -0.0273413 -0.00856767 0.0585003 -0.0501786 -0.0838019 0.0058909 -0.083248 -0.00947794 0.109943 -0.148724 -0.0729989 0.131835 0.022946 -0.126788 0.127585 0.0930254 -0.113161 -0.067199 0.0223792 0.128696 0.0121352 -0.0102379 0.0611627 -0.0679804 -0.0892842 -0.0321141 -0.059341 0.183905 -0.131842 0.128377 -0.210072 -0.0621812 0.0172682 -0.110799 0.0742293 -0.015474 0.0540481 -0.0871623 -0.0706218 -0.0913867 0.030249 -0.0295942 0.0668745 0.0227071 0.0973157 -0.0149253 0.0372405 -0.0196046 0.0242812 -0.05456 0.0169243 0.074904 0.0244685 0.0258555 0.122436 0.0453498 -0.177897 -0.148959 0.0248512 -0.111231 -0.0209485 -0.0602004 0.041738 -0.00194859 0.0090876 0.116713 0.0244258 -0.0800097 0.0606298 -0.0246646 -0.0196545 -0.0766609 0.0773163 -0.0353089 0.0180511 -0.0199734 0.0833131 -0.0657944 -0.0188796 0.0637312 0.104388 -0.0847576 -0.0571846 -0.0481476 0.16419 0.0481714 0.0322929 0.0396643 0.0644686 0.03271 0.0414317 0.0573711 -0.0497983 
0.102388 0.0146419 -0.0662603 -0.00288792 0.12109 0.206264 0.0625816 -0.00790855 -0.00103716 -0.0256882 0.0285637 0.127157 0.0859041 -0.217486 -0.0610139 0.0195236 -0.113861 0.107812 -0.16572 0.137958 0.203888 -0.0126325 0.0720037 0.119568 -0.062693 -0.0674858 -0.0883628 -0.280155 -0.0216069 0.149798 -0.0312004 0.0388467 -0.0319581 0.119948 0.0701638 -0.0273413 -0.00856767 0.0585003 -0.0501786 -0.0838019 0.0058909 -0.083248 -0.00947794 0.109943 -0.148724 -0.0729989 0.131835 0.022946 -0.126788 0.127585 0.0930254 -0.113161 -0.067199 0.0223792 0.128696 0.0121352 -0.0102379 0.0611627 -0.0679804 -0.0892842 -0.0321141 -0.059341 0.183905 -0.131842 0.128377 -0.210072 -0.0621812 0.0172682 -0.110799 0.0742293 -0.015474 0.0540481 -0.0871623 -0.0706218 -0.0913867 0.030249 -0.0295942 0.0668745 0.0227071 0.0973157 -0.0149253 0.0372405 -0.0196046 0.0242812 -0.05456 0.0169243 0.074904 0.0244685 0.0258555 0.122436 0.0453498 -0.177897 -0.148959 0.0248512 -0.111231 -0.0209485 -0.0602004 0.041738 -0.00194859 0.0090876 0.116713 0.0244258 -0.0800097 0.0606298 -0.0246646 -0.0196545 -0.0766609 0.0773163 -0.0353089 0.0180511 -0.0199734 0.0833131 -0.0657944 -0.0188796 0.0637312 0.104388 -0.0847576 -0.0571846 -0.0481476 0.16419 0.0481714 0.0322929 0.0396643 0.0644686 0.03271 0.0414317 0.0573711 -0.0497983 
0.118141 0.033512 -0.105028 -0.0254236 0.120294 0.218908 0.0609057 -0.015337 -0.0766341 -0.00249449 0.0232185 0.110617 0.116428 -0.192544 -0.0515613 0.0396834 -0.0466683 0.108065 -0.160204 0.148928 0.170303 -0.0100407 0.0622702 0.133181 -0.07487 -0.0244881 -0.0872942 -0.269 0.00389602 0.122331 -0.0408471 0.0808965 -0.0756759 0.116738 0.0343799 -0.0196867 -0.0177058 0.0753433 -0.0318362 -0.0509755 0.0108869 -0.0695759 -0.00346191 0.11674 -0.140356 -0.0454761 0.167589 0.0389825 -0.173443 0.103957 0.111212 -0.131176 -0.0867405 0.0170633 0.100516 -0.00153694 -0.0114799 0.117711 -0.00884994 -0.109695 -0.0391832 -0.0170562 0.193826 -0.155409 0.115668 -0.184676 -0.0465297 0.0286782 -0.11318 0.0406242 -0.0178432 0.0656099 -0.0613629 -0.0378306 -0.0722494 0.0156168 -0.0353867 0.0867277 0.0293392 0.0680879 0.00182129 0.0517588 -0.0291046 -0.02066 -0.0812786 0.0263583 0.0835763 -0.0062519 0.0155638 0.0901798 0.0401195 -0.170288 -0.138425 0.0115684 -0.0807193 0.00390455 -0.0145845 0.0587982 -0.0301829 -0.00327719 0.0724481 0.029483 -0.0721642 0.138471 -0.0760094 -0.00586173 -0.119678 0.0992913 -0.0474512 -0.00632483 0.0133247 0.114531 -0.0570218 -0.00114753 0.0374721 0.0688515 -0.132275 -0.0898555 -0.0596376 0.131879 0.0305384 0.0140213 0.0635293 0.065951 -0.00356299 0.0238356 -0.0269447 -0.0898642 
0.118141 0.033512 -0.105028 -0.0254236 0.120294 0.218908 0.0609057 -0.015337 -0.0766341 -0.00249449 0.0232185 0.110617 0.116428 -0.192544 -0.0515613 0.0396834 -0.0466683 0.108065 -0.160204 0.148928 0.170303 -0.0100407 0.0622702 0.133181 -0.07487 -0.0244881 -0.0872942 -0.269 0.00389602 0.122331 -0.0408471 0.0808965 -0.0756759 0.116738 0.0343799 -0.0196867 -0.0177058 0.0753433 -0.0318362 -0.0509755 0.0108869 -0.0695759 -0.00346191 0.11674 -0.140356 -0.0454761 0.167589 0.0389825 -0.173443 0.103957 0.111212 -0.131176 -0.0867405 0.0170633 0.100516 -0.00153694 -0.0114799 0.117711 -0.00884994 -0.109695 -0.0391832 -0.0170562 0.193826 -0.155409 0.115668 -0.184676 -0.0465297 0.0286782 -0.11318 0.0406242 -0.0178432 0.0656099 -0.0613629 -0.0378306 -0.0722494 0.0156168 -0.0353867 0.0867277 0.0293392 0.0680879 0.00182129 0.0517588 -0.0291046 -0.02066 -0.0812786 0.0263583 0.0835763 -0.0062519 0.0155638 0.0901798 0.0401195 -0.170288 -0.138425 0.0115684 -0.0807193 0.00390455 -0.0145845 0.0587982 -0.0301829 -0.00327719 0.0724481 0.029483 -0.0721642 0.138471 -0.0760094 -0.00586173 -0.119678 0.0992913 -0.0474512 -0.00632483 0.0133247 0.114531 -0.0570218 -0.00114753 0.0374721 0.0688515 -0.132275 -0.0898555 -0.0596376 0.131879 0.0305384 0.0140213 0.0635293 0.065951 -0.00356299 0.0238356 -0.0269447 -0.0898642 
0.124363 -0.021139 -0.0866263 0.0182126 0.1362 0.247719 0.066681 -0.0478687 -0.0425786 -0.0726309 0.0064252 0.14113 0.0631442 -0.181338 -0.0423105 -0.0233002 -0.0435478 0.146289 -0.112888 0.12522 0.151822 0.0175758 0.0624447 0.205197 -0.0556965 -0.0594918 -0.0792985 -0.28561 -0.0488791 0.117043 -0.00203555 0.0612341 -0.0797733 0.116285 0.0715485 -0.00653081 0.00330569 0.0138649 -0.041312 -0.0644937 0.064533 -0.0354242 -0.013842 0.0890414 -0.176254 -0.0755565 0.155681 0.0192492 -0.124995 0.122089 0.0845899 -0.163229 -0.00553312 0.0157224 0.107645 0.0329539 0.00806278 0.150364 -0.0194695 -0.0938307 -0.0441995 0.0416519 0.192822 -0.206666 0.111185 -0.160041 -0.00974764 -0.034412 -0.138679 0.0771598 -0.0302835 0.0539145 -0.0623948 -0.0232608 -0.0817923 0.0117541 -0.0389867 0.0477687 0.0330229 0.0456539 -0.0295822 0.10829 -0.0325177 -0.0469624 -0.0404846 0.0187211 0.0767127 -0.0189893 -0.0459377 0.093297 0.0993924 -0.15776 -0.0856368 -0.0209206 -0.0513852 -0.00448772 -0.0318657 0.0598948 -0.0113833 0.0163403 0.0713975 0.0206846 -0.0583637 0.110893 -0.0556711 -0.00585581 -0.0785042 0.0248767 -0.115074 0.0494999 0.0286075 0.0853798 -0.00204923 -0.0359253 0.00839502 0.0709922 -0.0982675 -0.108116 -0.0467832 0.13088 0.0634741 -0.0105011 0.0237125 0.0310137 -0.0311661 0.0443255 -0.0276165 -0.0785622 
0.115515 0.0433278 -0.0977041 -0.0321568 0.110803 0.260334 0.0485537 -0.0636519 -0.0440181 -0.113682 0.0253826 0.126448 0.074299 -0.155568 -0.081811 -0.0511179 -0.0650765 0.0917955 -0.129675 0.135315 0.133909 0.0472014 0.0189506 0.166145 -0.0782738 -0.0397075 -0.0460815 -0.201691 -0.0235932 0.115612 -0.0142689 -0.0175226 -0.0831407 0.10833 0.0686033 0.0170092 0.00393734 0.00786001 -0.0515883 -0.0352514 0.0544217 -0.0367509 0.00927843 0.126403 -0.163868 -0.0414948 0.173202 0.0394953 -0.158032 0.147902 0.0409135 -0.111382 -0.0456634 0.040004 0.117517 0.0202253 -0.0606395 0.176818 -0.0445669 -0.107801 -0.067391 0.053565 0.259599 -0.181758 0.0816378 -0.161928 0.0117885 -0.0286666 -0.141998 0.07866 0.0100941 0.0273838 -0.0342848 -0.00910815 -0.038677 0.0231854 -0.0429962 0.0410756 0.0371749 0.0466258 0.00881449 0.0991023 -0.00547913 -0.0204258 -0.0684437 0.0232925 0.0704371 -0.0175867 -0.0181752 0.127594 0.108942 -0.206773 -0.0786281 -0.007704 -0.0475785 -0.0441488 -0.0191588 0.0553741 -0.0131666 -0.00909884 0.0414392 0.0754078 -0.0601556 0.0969907 -0.116142 0.0498424 -0.0909842 0.0650472 -0.13184 0.0361964 0.0982503 0.0630386 -0.0340319 0.0298802 -0.0288876 0.0681338 -0.097934 -0.0784351 -0.0357251 0.122699 0.0439087 -0.036343 0.0387845 0.0244345 -0.026624 0.0489495 -0.0117875 -0.0770131 
0.11571 0.0400987 -0.100577 -0.0218343 0.112147 0.242149 0.0529151 -0.0622365 -0.0562718 -0.0815466 0.0380168 0.151039 0.0893 -0.151311 -0.0961454 -0.0436763 -0.0364563 0.12217 -0.124124 0.149833 0.146323 0.0398284 0.0153281 0.158514 -0.0904949 -0.0406398 -0.0526896 -0.202101 -0.031209 0.152864 -0.0559511 0.0024453 -0.0622538 0.108223 0.0584207 -0.00482851 0.00823876 0.0122185 -0.0452307 -0.0385114 0.0238417 -0.0319783 0.01931 0.100685 -0.165247 -0.0532454 0.174284 0.0123551 -0.159075 0.149966 0.0813271 -0.118247 -0.0601595 0.0527832 0.116822 0.0253554 -0.0446982 0.15012 -0.0541913 -0.0855844 -0.0455561 0.0315339 0.24005 -0.192446 0.0983437 -0.182349 -0.00523481 -0.0278117 -0.160845 0.0652007 0.0226636 0.021356 -0.0403412 -0.024509 -0.060933 0.0513856 -0.0206896 0.0355649 0.0314539 0.0301711 -0.0107646 0.092757 -0.00424766 0.000247096 -0.0669494 0.026958 0.068739 -0.0271965 0.00242151 0.128688 0.0659087 -0.217778 -0.0768498 0.0225234 -0.0510094 -0.0388992 -0.0298401 0.0460601 -0.0188895 0.00413971 0.0528075 0.0844036 -0.0705724 0.113852 -0.0959257 0.0450943 -0.0817119 0.0542426 -0.144115 0.0325802 0.0648644 0.0438398 -0.021017 0.0318009 -0.0348641 0.0678905 -0.0921611 -0.0713931 -0.0526473 0.124042 0.0273947 -0.030678 0.0354934 0.0133463 0.00283029 0.0619327 -0.00930037 -0.091972 
0.11571 0.0400987 -0.100577 -0.0218343 0.112147 0.242149 0.0529151 -0.0622365 -0.0562718 -0.0815466 0.0380168 0.151039 0.0893 -0.151311 -0.0961454 -0.0436763 -0.0364563 0.12217 -0.124124 0.149833 0.146323 0.0398284 0.0153281 0.158514 -0.0904949 -0.0406398 -0.0526896 -0.202101 -0.031209 0.152864 -0.0559511 0.0024453 -0.0622538 0.108223 0.0584207 -0.00482851 0.00823876 0.0122185 -0.0452307 -0.0385114 0.0238417 -0.0319783 0.01931 0.100685 -0.165247 -0.0532454 0.174284 0.0123551 -0.159075 0.149966 0.0813271 -0.118247 -0.0601595 0.0527832 0.116822 0.0253554 -0.0446982 0.15012 -0.0541913 -0.0855844 -0.0455561 0.0315339 0.24005 -0.192446 0.0983437 -0.182349 -0.00523481 -0.0278117 -0.160845 0.0652007 0.0226636 0.021356 -0.0403412 -0.024509 -0.060933 0.0513856 -0.0206896 0.0355649 0.0314539 0.0301711 -0.0107646 0.092757 -0.00424766 0.000247096 -0.0669494 0.026958 0.068739 -0.0271965 0.00242151 0.128688 0.0659087 -0.217778 -0.0768498 0.0225234 -0.0510094 -0.0388992 -0.0298401 0.0460601 -0.0188895 0.00413971 0.0528075 0.0844036 -0.0705724 0.113852 -0.0959257 0.0450943 -0.0817119 0.0542426 -0.144115 0.0325802 0.0648644 0.0438398 -0.021017 0.0318009 -0.0348641 0.0678905 -0.0921611 -0.0713931 -0.0526473 0.124042 0.0273947 -0.030678 0.0354934 0.0133463 0.00283029 0.0619327 -0.00930037 -0.091972 
0.110446 0.0141047 -0.118737 -0.0542197 0.0835006 0.211592 -0.00838719 -0.0248632 -0.0859251 -0.0731942 0.0361354 0.112716 0.104553 -0.123244 -0.116146 -0.00780677 -0.0460606 0.0408004 -0.0896709 0.212226 0.158904 -0.00516911 0.0404994 0.114447 -0.101796 0.0588785 -0.0300655 -0.217395 -0.0107803 0.0845154 -0.0581572 -0.0429005 -0.0636458 0.0827587 0.0257363 0.0370755 -0.0235165 0.125715 -0.0439734 -0.051911 -0.0249344 -0.0205456 -0.0373324 0.119266 -0.130839 -0.0160749 0.192528 0.0183961 -0.174537 0.14448 0.022402 -0.074793 -0.0805874 0.0737511 0.154284 -0.0171206 -0.0296338 0.156994 -0.0448312 -0.146874 -0.0326304 0.00582629 0.290653 -0.145937 0.10393 -0.178013 -0.000309676 0.0453766 -0.0691443 0.0510862 0.0339874 0.0355777 -0.0375274 -0.0130715 -0.0312011 0.0199217 -0.0379352 0.0881386 0.0685551 0.0624787 -0.0184489 0.0696072 -0.00956832 -0.0340742 -0.0833601 -0.00756386 0.0835459 0.0510677 0.0816812 0.0759408 0.0789072 -0.18357 -0.0626891 0.0440947 -0.0404857 -0.0693669 0.0307598 0.0610812 -0.0188017 -0.0395958 0.0262043 0.0859373 -0.0988849 0.082619 -0.130503 0.0831452 -0.0931801 0.0478238 -0.0773951 -0.0157588 0.0749551 0.102096 -0.045127 0.0475702 0.0225772 0.079355 -0.123956 -0.121727 -0.0689339 0.0910477 -0.0272925 -0.00269847 0.0893865 0.0183238 -0.0184441 0.0750558 0.017702 -0.0673366 
0.104002 0.00536636 -0.122744 -0.0480058 0.102119 0.20936 -0.000784242 -0.0254074 -0.0809929 -0.0674513 0.0257794 0.113635 0.0949663 -0.133913 -0.114994 0.0011387 -0.039329 0.0617526 -0.0870966 0.208252 0.167236 -0.0103413 0.0247447 0.116009 -0.0927955 0.0606886 -0.0381558 -0.228426 -0.00763399 0.085064 -0.0506266 -0.0164307 -0.0645073 0.0840316 0.04353 0.0404671 -0.0131306 0.104116 -0.03856 -0.0817651 -0.00159283 -0.0206164 -0.0142794 0.130175 -0.127862 -0.0154544 0.203476 0.0232817 -0.180253 0.117357 0.0115415 -0.102528 -0.070654 0.0597083 0.161849 -0.00524559 -0.0419554 0.152631 -0.0471453 -0.155856 -0.0249302 0.0063314 0.28596 -0.144888 0.11679 -0.160756 -0.0184257 0.0368344 -0.0654693 0.0433266 0.0208812 0.0327526 -0.0390021 -0.0303294 -0.0438202 0.0190302 -0.0354136 0.106193 0.0669676 0.0323106 -0.0224866 0.0945621 -0.024521 -0.0397404 -0.0798901 -0.00484729 0.0843571 0.060559 0.0771214 0.0836556 0.0945006 -0.173045 -0.0801885 0.0334779 -0.0339135 -0.0472878 0.0273705 0.0650871 -0.0249498 -0.0363106 0.030695 0.0662 -0.0901718 0.0720169 -0.127017 0.0821242 -0.0930018 0.0441706 -0.0834446 -0.00857704 0.0676488 0.0929496 -0.0495301 0.0313874 0.0341064 0.0602735 -0.129121 -0.140659 -0.0662665 0.0805396 -0.0117118 0.00733799 0.0966216 0.0252805 -0.0281558 0.0698635 0.013112 -0.0816935 
