{
  "descriptor": [
    -0.10217345505952835,
    0.07213402539491653,
    0.10908740758895874,
    -0.03557450696825981,
    -0.09216836094856262,
    -0.07180780172348022,
    0.0030416790395975113,
    -0.14588402211666107,
    0.16189493238925934,
    -0.1282743662595749,
    0.1955430656671524,
    -0.086396224796772,
    -0.21370120346546173,
    0.007557680830359459,
    -0.05839141830801964,
    0.1984684020280838,
    -0.1224091649055481,
    -0.13384388387203217,
    -0.03244560584425926,
    -0.03373544290661812,
    0.025143861770629883,
    0.01538032665848732,
    0.022421633824706078,
    0.15784120559692383,
    -0.06048090383410454,
    -0.3627293109893799,
    -0.09222474694252014,
    -0.08261363953351974,
    -0.03243345022201538,
    -0.0075425803661346436,
    -0.007700040470808744,
    0.15783658623695374,
    -0.1898544877767563,
    0.007919262163341045,
    -0.001527130138128996,
    0.0018811119953170419,
    -0.005359080154448748,
    -0.030314313247799873,
    0.12848074734210968,
    0.012545694597065449,
    -0.2647874057292938,
    -0.06994075328111649,
    0.06504053622484207,
    0.2714758813381195,
    0.21715302765369415,
    -0.037158023566007614,
    0.020618999376893044,
    -0.05710788071155548,
    -0.0026055898051708937,
    -0.19989334046840668,
    -0.043907370418310165,
    0.10502108186483383,
    0.12488296627998352,
    0.042586494237184525,
    -0.03423431143164635,
    -0.1849532574415207,
    -0.03336799889802933,
    0.04066566750407219,
    -0.1147339940071106,
    -0.0014338911278173327,
    0.008553584106266499,
    -0.08370820432901382,
    -0.05021972954273224,
    -0.06147696077823639,
    0.316506028175354,
    0.1049986258149147,
    -0.1779574751853943,
    -0.10127081722021103,
    0.1792878955602646,
    -0.18028007447719574,
    -0.029065407812595367,
    0.030227653682231903,
    -0.17436224222183228,
    -0.1621256321668625,
    -0.2817339599132538,
    -0.014361693523824215,
    0.42468205094337463,
    0.08423145860433578,
    -0.21446187794208527,
    0.062323931604623795,
    -0.17762158811092377,
    0.06725171953439713,
    -0.018419967964291573,
    0.16212551295757294,
    -0.06988367438316345,
    0.06402919441461563,
    -0.026456302031874657,
    -0.02433011680841446,
    0.1546282023191452,
    -0.04782263934612274,
    -0.03969811275601387,
    0.26056960225105286,
    -0.024711018428206444,
    0.00028030379326082766,
    0.02394307218492031,
    -0.015257430262863636,
    -0.03910014405846596,
    -0.039095688611269,
    -0.17342977225780487,
    -0.0646238699555397,
    -0.10796935111284256,
    -0.050114866346120834,
    0.0006342618726193905,
    0.12835513055324554,
    -0.27762874960899353,
    0.16801510751247406,
    0.058130111545324326,
    0.015854794532060623,
    0.056580375880002975,
    0.13294140994548798,
    -0.10095956921577454,
    -0.13438059389591217,
    0.13228905200958252,
    -0.2296350598335266,
    0.10948032885789871,
    0.16839022934436798,
    0.0891786515712738,
    0.1771824210882187,
    0.06371010094881058,
    0.11579691618680954,
    -0.018405010923743248,
    -0.020827969536185265,
    -0.09174006432294846,
    0.02680143527686596,
    0.14053338766098022,
    -0.08402279019355774,
    0.013042193837463856,
    0.019500676542520523
  ]
}