0.0273932 0.0308442 -0.105922 -0.0280929 0.111773 0.129602 0.0424272 -0.135048 -0.167212 0.0104998 -0.0771723 0.0884433 0.099041 -0.0554046 -0.0233941 -0.039079 -0.0926249 0.0748172 -0.0276013 0.160849 0.0380769 -0.0445156 0.0598689 0.0730723 -0.048496 0.0926659 -0.120534 -0.232626 -0.00853804 0.101905 -0.0602934 0.144027 -0.109981 0.0163646 0.0641001 0.031618 -0.0290417 0.119165 -0.0302364 -0.074886 0.0622751 -0.0441642 0.0153705 0.115117 -0.188531 0.109035 0.230755 0.0596201 -0.147043 0.0275696 0.042097 -0.105003 0.00761953 0.00967662 0.159759 -0.0165775 0.0182111 0.149009 0.0697109 -0.151731 -0.000540745 0.0734954 0.162594 -0.0535538 0.110325 -0.0767544 0.0116746 0.0374902 -0.0242787 0.0170659 -0.00759138 0.0897253 0.0214716 0.0316358 -0.00814684 0.0322441 -0.136961 0.0328804 0.0795283 0.0248829 0.032776 0.120398 -0.0751932 -0.0474542 -0.0658201 -0.0527712 0.0726213 0.0387092 0.00226391 0.0230901 0.0694456 -0.0369941 0.0122209 -0.100738 -0.127631 -0.0539288 0.0657925 0.152067 0.0788573 -0.0821039 0.0291171 0.062257 0.0335198 0.109634 -0.159258 0.00262319 -0.147808 0.161493 -0.0353269 0.0618959 0.0945609 0.133659 -0.0999427 -0.0647487 -0.0565529 0.0432184 -0.144557 -0.174147 -0.0596854 0.0534908 0.0411484 -0.000457384 0.0528191 0.0117028 -0.117092 0.0371233 -0.0961621 -0.053705 
0.0507245 -0.00973233 -0.118641 -0.0238433 0.112157 0.121859 0.0600559 -0.133606 -0.165948 0.0146563 -0.0651766 0.107585 0.106503 -0.0417176 -0.0460325 -0.0411592 -0.0899241 0.0939093 -0.016567 0.156979 0.0585391 -0.0421003 0.057447 0.0873976 -0.0567078 0.100787 -0.10068 -0.237688 -0.00386445 0.128842 -0.0893625 0.138583 -0.11943 0.00713684 0.0663796 0.0123616 -0.0497802 0.117428 -0.0219947 -0.0860463 0.0323534 -0.0291027 -0.00816117 0.127742 -0.195291 0.0875611 0.210476 0.060351 -0.127559 0.0262817 0.0499431 -0.096382 0.0100583 0.014787 0.164566 -0.0257375 0.0324736 0.163316 0.053858 -0.140714 0.0237752 0.0533058 0.185356 -0.0314651 0.0989486 -0.0940415 0.00439861 0.0439992 -0.0112302 0.0172306 -0.00845575 0.0954684 0.0182014 0.017596 -0.0442532 0.0253866 -0.118154 0.0226361 0.0803741 0.0294465 0.0406678 0.116097 -0.0773864 -0.0620651 -0.0592624 -0.0754482 0.0765292 0.0409912 0.0138089 0.0142153 0.07212 -0.0268333 -0.00166463 -0.0858561 -0.12803 -0.0625035 0.0611707 0.139942 0.0983721 -0.0800645 0.0567973 0.0660838 0.0297274 0.100711 -0.151538 -0.0083342 -0.141162 0.144439 -0.0315505 0.0623759 0.102412 0.135533 -0.0911052 -0.06901 -0.0433072 0.0694966 -0.127871 -0.163939 -0.0714474 0.0490813 0.0170969 -0.00929274 0.0546219 -0.00182142 -0.125923 0.0507768 -0.0941322 -0.052918 
0.0580405 0.010665 -0.101975 -0.0195563 0.107767 0.139156 0.0653075 -0.134093 -0.171589 0.00796953 -0.0671264 0.0894442 0.100972 -0.0604813 -0.0320029 -0.0349662 -0.0963358 0.0914398 -0.0306171 0.1444 0.0585711 -0.032885 0.0571062 0.0941821 -0.04986 0.0863276 -0.117285 -0.23688 0.0112293 0.123059 -0.0749573 0.153138 -0.136499 0.0186441 0.0695934 0.00847867 -0.0513898 0.106312 -0.0106399 -0.0801439 0.0387934 -0.0449371 -0.00655721 0.115984 -0.182303 0.0905871 0.210851 0.0684168 -0.145586 0.0317529 0.0532936 -0.0830822 0.0190818 0.006506 0.150861 -0.0278056 0.037008 0.165283 0.0557838 -0.143195 0.0124836 0.0738418 0.181585 -0.0414262 0.0857355 -0.0737176 0.010561 0.0314851 -0.0300467 0.0243768 -0.0219302 0.0955505 0.0117229 0.0390011 -0.0375293 0.00969684 -0.117159 0.00999398 0.0837956 0.0464394 0.0576629 0.112839 -0.0779577 -0.07359 -0.0528386 -0.0703181 0.0644271 0.028445 0.000956954 0.0296419 0.0929364 -0.024306 -0.00941254 -0.0789322 -0.129655 -0.0512413 0.0637469 0.144916 0.0949169 -0.0777147 0.0605817 0.0661683 0.0242152 0.113536 -0.152247 -0.00608482 -0.135509 0.154129 -0.0142951 0.0604489 0.109892 0.14735 -0.0965285 -0.0738179 -0.0346511 0.0682261 -0.130367 -0.153334 -0.0578008 0.0588367 0.0301935 -0.0155036 0.0596586 -0.000182108 -0.125869 0.0470951 -0.0855818 -0.0616546 
0.0607433 -0.0205184 -0.0953859 -0.040291 0.0952091 0.133355 0.0772046 -0.11029 -0.15023 -0.0388971 -0.0922833 0.0736251 0.103056 -0.0515428 -0.0402499 -0.0541959 -0.115622 0.0513429 -0.0525727 0.140598 0.0572041 -0.0314427 0.0601288 0.0706725 -0.0755393 0.0805068 -0.11744 -0.236149 -0.017908 0.0915681 -0.0740329 0.132433 -0.150472 0.022729 0.0717069 0.00643059 -0.0442727 0.135841 -0.0349532 -0.0796209 0.0448773 -0.0294773 -0.0232288 0.107332 -0.165213 0.0962719 0.18161 0.0700718 -0.130619 0.0440731 0.00948333 -0.116108 0.0392177 0.0245941 0.147043 -0.0415693 0.0329226 0.174151 0.046334 -0.15855 0.0324597 0.0986629 0.173628 -0.029828 0.0846141 -0.0686095 0.024648 0.046894 -0.00591881 -0.00238997 -0.0257267 0.0761659 0.0292364 0.0409471 -0.0446042 0.0184178 -0.11832 -0.0195355 0.0982809 0.0493132 0.0639836 0.089471 -0.0924025 -0.0885219 -0.0604336 -0.0741797 0.0751937 0.0416607 -0.0100901 0.0233501 0.121715 -0.0403257 0.0154776 -0.0870001 -0.13688 -0.0355032 0.0701044 0.127263 0.0986339 -0.0541052 0.0609875 0.0595013 0.00558346 0.112789 -0.145837 -0.024923 -0.146173 0.155146 -0.0493096 0.0600558 0.123824 0.148776 -0.102875 -0.0674049 -0.0459026 0.0906174 -0.142923 -0.13458 -0.0692454 0.039882 0.0058042 -0.00129209 0.0590085 0.00788028 -0.116639 0.0262496 -0.116582 -0.0793449 
0.0600038 -0.0151976 -0.0930919 -0.0444682 0.0991125 0.144393 0.0686133 -0.100692 -0.157379 -0.0241292 -0.0981853 0.0652021 0.0956457 -0.070956 -0.022795 -0.0410037 -0.111589 0.057787 -0.0464544 0.134492 0.0522563 -0.0220165 0.0610673 0.0749391 -0.0715963 0.0843879 -0.117237 -0.246036 -0.0126644 0.0795281 -0.0617999 0.132401 -0.152926 0.0272074 0.0773519 0.010585 -0.0431663 0.125301 -0.031363 -0.0759831 0.0474223 -0.0352344 -0.0201743 0.114105 -0.157398 0.099053 0.187409 0.0777231 -0.139151 0.0435988 0.0212542 -0.122082 0.036775 0.0112483 0.137932 -0.0379146 0.0368166 0.169676 0.0586166 -0.16008 0.0283142 0.0984063 0.166473 -0.0355441 0.0915304 -0.076695 0.0181792 0.0447599 -0.00654949 0.00129513 -0.0326172 0.0803304 0.0242893 0.0379791 -0.0477696 0.00887317 -0.123846 -0.000898828 0.100011 0.046567 0.0688754 0.0942019 -0.0936067 -0.0868048 -0.0602104 -0.0767478 0.0738946 0.040809 -0.00881216 0.0274802 0.117902 -0.027738 0.00385086 -0.0889711 -0.130501 -0.0183901 0.0767276 0.130719 0.085158 -0.0530663 0.0595081 0.0549227 0.00395183 0.10704 -0.147358 -0.031356 -0.150957 0.142856 -0.0449427 0.0650132 0.124351 0.152728 -0.0970448 -0.0751447 -0.039995 0.082356 -0.145632 -0.144049 -0.0729885 0.0366683 0.0178444 -0.00258717 0.0698617 0.00998761 -0.116475 0.0190909 -0.114767 -0.084133 
0.0577978 -0.0108939 -0.1074 -0.0388001 0.113586 0.14755 0.0786375 -0.106986 -0.15533 -0.0133308 -0.0889267 0.0884696 0.0929735 -0.0782457 -0.0295695 -0.0412993 -0.104131 0.0754211 -0.0405874 0.14445 0.0528179 -0.0250075 0.0555446 0.0750815 -0.0760626 0.0842069 -0.117614 -0.245639 -0.0128734 0.0932262 -0.0741135 0.141076 -0.133538 0.0375083 0.0811895 0.00945495 -0.0210118 0.111685 -0.0272184 -0.092806 0.0647458 -0.0453474 0.00828382 0.114661 -0.184324 0.0918583 0.201254 0.073352 -0.144086 0.0504114 0.0193184 -0.1285 0.0209826 0.0224635 0.15741 -0.026901 0.0325032 0.160745 0.0371209 -0.147226 0.0197447 0.0872131 0.180778 -0.0564724 0.107343 -0.0732544 -0.00225523 0.0287266 -0.0229362 0.0111407 -0.033868 0.0759957 0.0136788 0.0431938 -0.0421918 0.0181531 -0.107387 0.0144231 0.0957059 0.0133868 0.0498392 0.108404 -0.0860359 -0.0668903 -0.0599901 -0.0630103 0.0746786 0.0446858 0.000385592 0.0461029 0.121106 -0.043008 -0.00942097 -0.0939039 -0.120915 -0.0278701 0.0651981 0.140053 0.0817003 -0.0531916 0.0587766 0.0529785 0.0126608 0.102259 -0.137775 -0.0187178 -0.141483 0.146172 -0.0578752 0.0668499 0.108878 0.13837 -0.0844751 -0.0718782 -0.0373223 0.0635583 -0.119693 -0.155396 -0.0620217 0.0499509 0.0376385 -0.00753576 0.0740859 0.0151626 -0.120516 0.0253304 -0.0961721 -0.0790898 
0.0663963 -0.0346724 -0.0815818 -0.0391671 0.0986107 0.117572 0.0840923 -0.0883775 -0.132866 -0.0541496 -0.118777 0.0624857 0.0843164 -0.0632639 -0.007954 -0.0568076 -0.107753 0.0299555 -0.0534325 0.143274 0.0395736 -0.0177571 0.0597393 0.0559265 -0.080144 0.080868 -0.129988 -0.24742 -0.0447308 0.0681565 -0.0605004 0.131341 -0.136186 0.0383268 0.0876648 0.011603 -0.00867017 0.156318 -0.0502113 -0.0925648 0.061857 -0.0174681 -0.00625777 0.101034 -0.157171 0.113549 0.176768 0.0657912 -0.113648 0.0605334 -0.00432441 -0.147122 0.0486127 0.0345313 0.166469 -0.0490919 0.0257444 0.15219 0.0492679 -0.163691 0.0299834 0.08902 0.138532 -0.0421173 0.0989803 -0.0726403 0.0244026 0.0412246 0.000547703 -0.0233804 -0.0245571 0.0640135 0.0349568 0.0458647 -0.0458084 0.0163452 -0.119705 -0.0127464 0.108097 0.0419508 0.0656554 0.0941413 -0.106667 -0.0904958 -0.0439466 -0.0852875 0.0731129 0.0509264 -0.00767136 0.0342172 0.126761 -0.0387584 0.0126447 -0.11203 -0.135058 -0.0095943 0.0864075 0.114473 0.0889293 -0.0445772 0.0430954 0.0487513 0.0117677 0.0949375 -0.157821 -0.0449742 -0.153341 0.138868 -0.0522791 0.0751207 0.125772 0.147262 -0.108026 -0.0750344 -0.0432134 0.0776381 -0.129031 -0.157556 -0.0847659 0.0246054 0.0186141 0.0308409 0.0790197 0.032221 -0.0952686 -0.00882107 -0.0975716 -0.0937094 
0.069213 -0.0309624 -0.087649 -0.0469269 0.103907 0.144919 0.091728 -0.0878731 -0.142248 -0.0289102 -0.109391 0.0675729 0.10422 -0.0669459 -0.0113366 -0.0484687 -0.115168 0.037971 -0.0555724 0.140913 0.0529943 -0.0244999 0.0439166 0.0652858 -0.0862178 0.075053 -0.144089 -0.249775 -0.0362713 0.0880712 -0.069785 0.13187 -0.151625 0.0386497 0.0833015 0.0169007 -0.0186672 0.124431 -0.0341375 -0.0910114 0.0587752 -0.0354679 -0.00365405 0.0857232 -0.148592 0.100396 0.172513 0.0783678 -0.121771 0.0493753 0.00585841 -0.15158 0.04614 0.0326213 0.164498 -0.0364305 0.0220361 0.159362 0.0347369 -0.1491 0.0303603 0.103468 0.150196 -0.0558456 0.100386 -0.0597466 0.0122181 0.0466668 -0.0151273 -0.0368626 -0.0260403 0.0774913 0.0220111 0.0305532 -0.0428616 0.0408093 -0.10384 -0.0147703 0.119723 0.0453003 0.0751166 0.0771012 -0.0956632 -0.07048 -0.0604953 -0.0628906 0.0821618 0.0482839 -0.00491919 0.0431005 0.122913 -0.0453159 0.0163762 -0.0749356 -0.153985 -0.00764323 0.0726683 0.107325 0.090482 -0.0336321 0.0746605 0.049362 -0.00710763 0.0899818 -0.145363 -0.0271356 -0.153235 0.13405 -0.0720432 0.0789701 0.116491 0.135735 -0.0944855 -0.0801876 -0.0420607 0.0963931 -0.141463 -0.117763 -0.100599 0.0336333 0.0157396 -0.00488401 0.080116 0.021407 -0.109007 0.0280403 -0.115956 -0.0955478 
0.063742 -0.0320427 -0.0819621 -0.0443909 0.117343 0.137849 0.0823362 -0.0946863 -0.131376 -0.0343413 -0.11721 0.081491 0.0885283 -0.0690288 0.000541079 -0.044422 -0.112304 0.0385156 -0.0531424 0.149802 0.0459951 -0.0116213 0.0482284 0.0628226 -0.0816513 0.0816233 -0.14077 -0.251519 -0.0493104 0.0868802 -0.0622445 0.130789 -0.132296 0.0425111 0.091964 0.0273633 -0.00249218 0.125581 -0.0391384 -0.0938753 0.0659562 -0.0249849 0.0105411 0.0877356 -0.157092 0.108585 0.183412 0.0717911 -0.113473 0.0598318 0.010709 -0.160295 0.039577 0.035598 0.18542 -0.0358561 0.0154556 0.152149 0.0296675 -0.145096 0.0232875 0.0895613 0.143468 -0.0610548 0.113342 -0.0750507 0.00435898 0.0483875 -0.0167607 -0.0244074 -0.014055 0.0788873 0.0230927 0.0262555 -0.0423816 0.0456275 -0.111855 -0.00439655 0.114382 0.0341754 0.0728823 0.0994324 -0.093598 -0.0591896 -0.0565494 -0.0709247 0.0820562 0.0589317 -0.00466251 0.0528788 0.112475 -0.0469372 0.00915687 -0.0831527 -0.147344 -0.0029415 0.0726045 0.107379 0.0848164 -0.0392447 0.0597763 0.0436281 -0.00231915 0.0776291 -0.152209 -0.0279257 -0.160431 0.120529 -0.0717397 0.0862955 0.11416 0.13114 -0.0950771 -0.0773332 -0.0417911 0.0858011 -0.131601 -0.138534 -0.106511 0.0378332 0.0341893 0.014441 0.0868528 0.0260423 -0.100863 0.0197254 -0.0953719 -0.0914368 
0.0444719 0.00733663 -0.0799784 -0.0329987 0.10474 0.13886 0.070254 -0.115294 -0.130501 0.0011223 -0.103586 0.0788743 0.0880322 -0.0791257 0.0123832 -0.0250329 -0.11213 0.0398784 -0.0455727 0.147794 0.0379142 -0.0102235 0.0302545 0.0508513 -0.0745324 0.100732 -0.155823 -0.253438 -0.0402449 0.103801 -0.0614092 0.156792 -0.114731 0.0407257 0.0987043 0.0433072 0.0149423 0.117685 -0.0174535 -0.0877578 0.0678471 -0.047031 0.030183 0.0722583 -0.148259 0.120617 0.212014 0.0682392 -0.134043 0.0373538 0.0324358 -0.141101 0.0321961 0.0366177 0.197389 -0.0214594 0.0101374 0.121881 0.0312605 -0.142215 0.00574997 0.0697668 0.137959 -0.0753926 0.12345 -0.0623038 0.00502168 0.0507329 -0.0210511 -0.0238708 -0.0081228 0.0792984 0.0100878 0.0222543 -0.0164946 0.0502055 -0.123062 0.0149111 0.105488 0.0290185 0.0767492 0.117222 -0.0865857 -0.043343 -0.064173 -0.0500689 0.0775 0.0474658 0.00315092 0.0652042 0.0836895 -0.048977 0.007193 -0.0738772 -0.16373 -0.00264206 0.0769013 0.110825 0.0897674 -0.0529115 0.0561355 0.0447339 0.00451769 0.0717223 -0.156589 -0.0118877 -0.158149 0.123425 -0.0684741 0.0948027 0.097877 0.120621 -0.102353 -0.0935796 -0.0359562 0.0656729 -0.141632 -0.153418 -0.106801 0.0321722 0.0601127 0.0104438 0.108205 0.0289076 -0.0894615 0.0344449 -0.0714819 -0.080093 
0.0444824 0.00636283 -0.0817393 -0.0319728 0.108694 0.138919 0.0724168 -0.117655 -0.14048 0.0195 -0.101876 0.0791791 0.0910571 -0.0656506 0.0245079 -0.0337707 -0.104353 0.0442862 -0.0205829 0.143854 0.029457 -0.0099658 0.0251307 0.0671539 -0.0675187 0.0927691 -0.154725 -0.246302 -0.0354969 0.117367 -0.0723316 0.142232 -0.111425 0.027483 0.10272 0.0423467 0.0211994 0.0981722 -0.0188047 -0.0937812 0.066797 -0.0469766 0.0351634 0.0708209 -0.159243 0.125497 0.209677 0.0750546 -0.123438 0.030172 0.0404378 -0.135768 0.0435758 0.0328565 0.20747 -0.013401 0.0132897 0.120311 0.0400817 -0.137065 0.00607059 0.0726861 0.130878 -0.0770142 0.118396 -0.0515667 0.00423187 0.0462073 -0.0217579 -0.0324883 -0.00635946 0.0865123 0.00627665 0.0123848 -0.00809764 0.0647389 -0.123549 0.0190514 0.118408 0.0288553 0.0815913 0.114474 -0.0802247 -0.0335924 -0.0502779 -0.0471211 0.0763451 0.0478351 0.00708204 0.0667605 0.0783856 -0.0366513 0.0182171 -0.0724521 -0.173656 -0.0197138 0.0749322 0.113399 0.0984527 -0.0609178 0.0749458 0.0558998 0.0211106 0.0519896 -0.165024 -0.00872464 -0.150812 0.111266 -0.0705433 0.107548 0.105358 0.108061 -0.0890205 -0.104395 -0.0453106 0.0716955 -0.139066 -0.144902 -0.121028 0.0307906 0.0589419 -0.0114676 0.0971564 0.0212156 -0.104785 0.0544395 -0.0748387 -0.0691024 
0.0282843 0.0274891 -0.0866627 -0.0435995 0.0896858 0.140701 0.0552932 -0.137341 -0.121587 0.0247879 -0.101593 0.051649 0.0936776 -0.0377785 0.0427733 -0.0380972 -0.119868 0.0213974 -0.00741261 0.120188 0.0127039 -0.00187512 0.0199551 0.0600234 -0.0682199 0.0840326 -0.163957 -0.230971 -0.0389778 0.125774 -0.0631263 0.13236 -0.097975 0.00973865 0.108471 0.0662815 0.0337089 0.0819336 -0.0147201 -0.0795393 0.051285 -0.0475082 0.0286886 0.048325 -0.137987 0.152142 0.205021 0.0930319 -0.114796 0.0244842 0.0198848 -0.115958 0.0728111 0.0357612 0.203711 -5.41375e-05 0.0208455 0.112628 0.0446773 -0.138977 -0.00506147 0.097416 0.122189 -0.0764996 0.0903019 -0.0161805 0.0202735 0.0648821 -0.00706203 -0.0404064 0.00168268 0.0779784 -0.00254959 0.00583964 0.021916 0.0794987 -0.140752 -0.00743887 0.122032 0.0342521 0.104101 0.114496 -0.0903155 -0.0262168 -0.0492882 -0.0179357 0.0558032 0.0270963 0.00280798 0.0765315 0.0830861 -0.0320859 0.0452277 -0.0705169 -0.181051 -0.0263722 0.0605737 0.116498 0.115751 -0.0653728 0.0949906 0.0538479 0.0318694 0.0184223 -0.181028 0.00680773 -0.155071 0.0923139 -0.0818242 0.13042 0.122851 0.0887011 -0.0842041 -0.125955 -0.0587597 0.090816 -0.141064 -0.131436 -0.122348 0.0229314 0.0767092 -0.0349786 0.102443 0.0210343 -0.127626 0.0697398 -0.0727821 -0.047053 
0.0517888 0.0151108 -0.0871277 -0.0396796 0.101269 0.133777 0.0640925 -0.109454 -0.124563 0.0118311 -0.109868 0.0575566 0.0938773 -0.0604009 0.0252554 -0.018654 -0.104086 0.0290074 -0.0379942 0.140533 0.0322366 -0.00102296 0.0303251 0.05796 -0.0718939 0.0855852 -0.152905 -0.239727 -0.0415772 0.115797 -0.0674985 0.14002 -0.110735 0.0261376 0.0959336 0.0430006 0.0288198 0.113421 -0.0241351 -0.0832769 0.0494316 -0.0319988 0.0391089 0.0697613 -0.139751 0.124867 0.206483 0.0791598 -0.109618 0.0442617 0.0505113 -0.133422 0.0424879 0.0436213 0.209648 -0.0223191 0.0246194 0.111083 0.0646443 -0.160705 0.00405359 0.0675382 0.117632 -0.0733972 0.096295 -0.0596942 0.0130335 0.0626658 -0.00546556 -0.0437636 0.00082263 0.0840792 0.0139568 0.00458468 -0.00881927 0.0665453 -0.127873 0.0144866 0.111975 0.0356562 0.107654 0.116634 -0.0846748 -0.0342796 -0.0426797 -0.0393008 0.0673908 0.0486605 0.012883 0.0645316 0.0644164 -0.0445359 0.0112001 -0.0813094 -0.173034 -0.0064769 0.0775907 0.11503 0.0953321 -0.0578869 0.074416 0.0535165 0.0279221 0.0620298 -0.182067 -0.0225793 -0.173118 0.10419 -0.0694802 0.106947 0.113739 0.11439 -0.0957199 -0.0940156 -0.052227 0.0811901 -0.141958 -0.140171 -0.137553 0.0139781 0.0555497 0.00582841 0.118791 0.0222321 -0.100581 0.035552 -0.0789205 -0.0702297 
0.0493542 0.00950393 -0.0859136 -0.0419523 0.0934684 0.113389 0.0798158 -0.110475 -0.128016 -0.01882 -0.105984 0.0588513 0.0964358 -0.0544434 0.00464306 -0.0436969 -0.109507 0.012684 -0.0465013 0.155783 0.0254208 -0.0206297 0.027467 0.0290284 -0.0782895 0.102818 -0.163724 -0.228198 -0.0354557 0.0916526 -0.0666649 0.145181 -0.12498 0.0245128 0.0962372 0.0354303 0.0165063 0.148736 -0.019449 -0.0959813 0.0628152 -0.0257233 0.0236217 0.0744095 -0.145158 0.127843 0.198308 0.0723836 -0.11711 0.0413304 -0.00302953 -0.128141 0.0347259 0.0481554 0.193138 -0.0432851 0.00287576 0.130449 0.0372758 -0.161605 0.0112118 0.074486 0.142418 -0.0580457 0.0978676 -0.0375604 0.0275422 0.0551788 -0.00128576 -0.0531354 0.00241316 0.076356 0.0320969 0.0442817 -0.0138349 0.0430559 -0.125477 -0.00699954 0.119948 0.033649 0.0827715 0.110826 -0.0956947 -0.0586514 -0.0456898 -0.0606766 0.0694272 0.0596176 0.0213717 0.0442857 0.101728 -0.0455811 0.0305154 -0.0949552 -0.158698 -0.0327137 0.0921841 0.110118 0.0921724 -0.0626014 0.0419786 0.0521711 0.0223308 0.0730718 -0.180865 -0.00399384 -0.149801 0.140201 -0.0509334 0.0949282 0.121029 0.121456 -0.117834 -0.0750711 -0.0452981 0.0645342 -0.137065 -0.14815 -0.104217 0.00925212 0.0302943 0.0204609 0.108014 0.0366827 -0.099233 0.0152286 -0.0818523 -0.078998 
0.057432 0.0143895 -0.0897677 -0.0304149 0.106281 0.129157 0.0795484 -0.108982 -0.136854 0.0217206 -0.101062 0.0672817 0.102998 -0.071255 0.01358 -0.020144 -0.0931136 0.0446 -0.0395593 0.152145 0.0361836 -0.0100167 0.023218 0.0694538 -0.0763459 0.0806413 -0.160912 -0.240181 -0.0260062 0.126987 -0.0775365 0.147807 -0.119293 0.0231563 0.0966204 0.0293025 0.0173035 0.106907 -0.0217154 -0.0922933 0.0432274 -0.0360379 0.0354979 0.0751318 -0.145695 0.119004 0.205659 0.0827996 -0.115501 0.0414282 0.056452 -0.128413 0.0350706 0.0315691 0.200628 -0.0292766 0.017835 0.113541 0.0616007 -0.147167 0.00912251 0.0661298 0.125223 -0.0720242 0.0963577 -0.0684839 0.0103462 0.0472181 -0.0205453 -0.0550942 -0.00147617 0.0862921 0.0156751 0.0119321 -0.0242403 0.0632649 -0.114348 0.0222642 0.117254 0.0382564 0.106081 0.106744 -0.0889545 -0.0374804 -0.0357437 -0.0437995 0.0653615 0.0446582 0.0166659 0.0615552 0.0664745 -0.0361204 0.00378801 -0.072667 -0.171024 -0.0133257 0.0788511 0.110166 0.0894167 -0.0609705 0.0811765 0.0596127 0.0249963 0.0683718 -0.177797 -0.0200737 -0.157065 0.11474 -0.0525178 0.111279 0.10941 0.114978 -0.0938257 -0.0917343 -0.0542208 0.0786553 -0.13969 -0.131994 -0.136885 0.0188649 0.0356423 -0.000536247 0.108126 0.0225323 -0.106483 0.0410577 -0.0876473 -0.0829948 
0.0650764 0.0142751 -0.100926 -0.036413 0.111762 0.125255 0.0942666 -0.100362 -0.144722 0.0266193 -0.0876576 0.069189 0.119423 -0.0723711 0.00295686 -0.0259665 -0.0870402 0.0450355 -0.052696 0.168186 0.0402633 -0.0308495 0.0289718 0.0674023 -0.0817121 0.0784516 -0.163002 -0.233488 -0.0114141 0.117502 -0.0803456 0.143493 -0.133245 0.0283796 0.081273 0.0214011 0.00198596 0.124628 -0.0198942 -0.0922628 0.0437611 -0.0372574 0.0238114 0.0854523 -0.158091 0.102272 0.195686 0.0912465 -0.116122 0.046235 0.0444544 -0.124405 0.00581303 0.0294069 0.187408 -0.040131 0.00160755 0.133555 0.0504309 -0.14339 0.00597976 0.0589836 0.147095 -0.0705573 0.0965834 -0.0701663 0.0100742 0.0468855 -0.0286674 -0.061098 -0.00120808 0.0987529 0.0211656 0.0336426 -0.0326707 0.0498389 -0.0995964 0.0271197 0.12206 0.0376959 0.0895574 0.0907752 -0.0876577 -0.0428808 -0.0422276 -0.0507932 0.0713401 0.0505039 0.0350885 0.0455855 0.074561 -0.0458969 0.00631411 -0.0758401 -0.159381 -0.0364354 0.0800655 0.104312 0.0789876 -0.0630201 0.0672972 0.0602076 0.0195565 0.0887871 -0.17349 -0.00835193 -0.154421 0.135191 -0.0305188 0.0971643 0.106026 0.129158 -0.0989936 -0.064341 -0.0493115 0.073535 -0.13205 -0.127585 -0.12431 0.028515 0.0148252 0.00148935 0.0976178 0.0391361 -0.112652 0.0329163 -0.102643 -0.088783 
0.0630524 -0.00264139 -0.0588461 -0.0539081 0.11283 0.133336 0.102436 -0.0383095 -0.0894614 -0.0534137 -0.102955 0.063701 0.083361 -0.137167 -0.00313636 -0.0155196 -0.12703 0.00101426 -0.143944 0.156002 0.0768134 -0.0245782 0.0347508 0.0418203 -0.0794201 0.0575115 -0.163706 -0.246036 -0.0181966 0.0437159 -0.00661316 0.13594 -0.144515 0.0839318 0.0510975 0.011123 -0.0243992 0.169721 -0.0492961 -0.063507 0.0823181 -0.0386432 -0.000651079 0.112497 -0.111771 0.064643 0.159997 0.0648887 -0.122938 0.0703533 -0.000108411 -0.158752 -0.0312206 0.0115379 0.154114 -0.0460357 -0.039549 0.156882 0.0228167 -0.157227 -0.000734925 0.0444671 0.142092 -0.0531839 0.103031 -0.101208 0.00942249 0.0474168 -0.0241706 -0.0269294 -0.0113863 0.0883087 0.0299248 0.063246 -0.0480064 0.00461149 -0.0987218 0.0237599 0.087768 0.0576133 0.0551422 0.0766818 -0.0822495 -0.061163 -0.066845 -0.0746069 0.101908 0.0703802 0.0152073 0.0384691 0.105894 -0.0897575 -0.0410729 -0.0839865 -0.122084 0.0243958 0.0734649 0.0550002 0.0322596 -0.0199568 0.00334465 0.00839533 -0.0396477 0.125762 -0.156555 -0.0305524 -0.178659 0.157889 -0.0192675 0.0347604 0.0949645 0.169697 -0.15391 -0.0292536 0.00264909 0.0613527 -0.135285 -0.132199 -0.0756344 0.0558055 0.0283928 0.0904502 0.0928609 0.0833117 -0.0608715 -0.039805 -0.0882384 -0.11878 
0.0681026 -0.00289013 -0.071106 -0.0432832 0.104867 0.105281 0.0939888 -0.0509522 -0.0923395 -0.0690772 -0.0963276 0.0678438 0.0822147 -0.123872 -0.024943 -0.00264362 -0.122955 -0.0195342 -0.14586 0.175064 0.0806226 -0.0406367 0.0441973 0.0207115 -0.0740395 0.0726708 -0.155354 -0.234007 -0.0197956 0.048264 -0.0227094 0.152537 -0.139659 0.0866057 0.0305275 0.0034291 -0.0289829 0.201907 -0.0356948 -0.0637372 0.0648781 -0.0373433 0.00526954 0.0996988 -0.100964 0.0636561 0.161438 0.0519848 -0.113277 0.0810077 -0.000397718 -0.13811 -0.0414186 0.0271762 0.161262 -0.0684786 -0.0339122 0.151212 0.0142773 -0.153524 0.00414159 0.0288943 0.150177 -0.042776 0.0959062 -0.0985574 0.00743588 0.0539825 -0.0175164 -0.0299351 -0.0128993 0.0888233 0.033234 0.0862623 -0.042418 -0.0069424 -0.0797647 0.0063754 0.0745563 0.0721145 0.0538634 0.0636974 -0.0811504 -0.0698413 -0.0716031 -0.0782468 0.0908928 0.0779417 0.029542 0.0219849 0.0992336 -0.0945258 -0.0402635 -0.0792435 -0.11446 0.0161411 0.0817327 0.0548271 0.0416085 -0.0264389 -0.0128823 0.00609939 -0.0421955 0.149207 -0.151878 -0.0277624 -0.176325 0.182268 -0.00470611 0.0159765 0.0851208 0.180854 -0.166759 -0.00836479 0.00865487 0.0571012 -0.122386 -0.124614 -0.0594028 0.0601704 0.0107108 0.113451 0.104495 0.0810845 -0.0532234 -0.0467062 -0.0759157 -0.117444 
0.0624246 0.000262495 -0.0673973 -0.0391821 0.107939 0.113397 0.101528 -0.0439107 -0.0906782 -0.0760007 -0.0951281 0.0681913 0.0744019 -0.138165 -0.0291862 -0.0124224 -0.123756 -0.0171306 -0.149042 0.170514 0.0771962 -0.0414606 0.0324631 0.0158087 -0.0745282 0.0683307 -0.160555 -0.232552 -0.0223006 0.0343069 -0.0142342 0.147883 -0.143396 0.089256 0.0315035 0.00244683 -0.0229537 0.187576 -0.0413621 -0.0641222 0.0911101 -0.0412854 0.0109117 0.106513 -0.108624 0.0605263 0.164364 0.0450891 -0.115187 0.0735055 -0.0108316 -0.149177 -0.046974 0.0261635 0.155412 -0.0606792 -0.0441581 0.148081 0.014841 -0.152964 0.00384589 0.0330385 0.146695 -0.0467576 0.101941 -0.0976059 0.0137298 0.0390127 -0.0131962 -0.0298557 -0.0129004 0.0850483 0.0413097 0.0905311 -0.0389362 -0.00675951 -0.0853766 0.0204957 0.0681092 0.0581575 0.0407724 0.072671 -0.0757708 -0.0633097 -0.071764 -0.0675688 0.100836 0.0788469 0.0177336 0.0206672 0.10751 -0.0990856 -0.0424184 -0.0923814 -0.114202 0.0145918 0.0834695 0.04886 0.0300566 -0.019251 -0.0265966 0.00610474 -0.0358614 0.150544 -0.147263 -0.0243476 -0.168181 0.190907 -0.0201621 0.0200313 0.0839466 0.170183 -0.166605 -0.00957161 0.00326718 0.0413941 -0.123823 -0.132435 -0.0545412 0.0521576 0.0131454 0.116265 0.0977548 0.0861167 -0.04754 -0.0526428 -0.0814425 -0.117132 
0.0572165 0.0162625 -0.0595525 -0.0397392 0.105648 0.127431 0.080737 -0.0650687 -0.112525 -0.0367165 -0.0980645 0.061522 0.0750781 -0.12838 -0.00921878 -0.000477631 -0.100848 0.0117323 -0.115248 0.153593 0.0670603 -0.0131725 0.0135018 0.0267743 -0.06792 0.103124 -0.163643 -0.238922 -0.0117968 0.04772 -0.015792 0.1667 -0.145277 0.0755413 0.0559116 0.0154309 -0.0121786 0.16892 -0.0189926 -0.0702507 0.0875423 -0.0365215 0.0207537 0.102151 -0.101874 0.0794728 0.186958 0.049834 -0.137655 0.0356462 0.0242431 -0.141588 -0.0273722 0.0177552 0.158577 -0.0471409 -0.02713 0.136913 0.0430171 -0.168215 0.00781172 0.0346555 0.133053 -0.0521071 0.107828 -0.0871021 0.0186135 0.0482424 -0.00443725 -0.0263241 -0.0108724 0.0826758 0.0371667 0.0626261 -0.0380208 -0.00462269 -0.111867 0.0406139 0.0775485 0.044416 0.0606163 0.11174 -0.0708659 -0.0677085 -0.0631519 -0.0800729 0.103809 0.0689601 0.0139326 0.0300365 0.0861356 -0.0706605 -0.0348598 -0.0836306 -0.12798 0.0230002 0.0987974 0.0689462 0.0329142 -0.0348286 -0.00908509 0.0251583 -0.0242511 0.140771 -0.161748 -0.0321276 -0.168239 0.161192 -0.0247675 0.0394185 0.0921825 0.158431 -0.163183 -0.0326362 0.00202169 0.0275239 -0.155774 -0.165291 -0.0835805 0.0201676 0.0358627 0.0956525 0.116235 0.0611981 -0.0502377 -0.0353292 -0.078103 -0.116339 
0.0560828 0.00643006 -0.0679623 -0.043703 0.105622 0.114785 0.0783152 -0.0668894 -0.095014 -0.0550357 -0.103229 0.0518356 0.0739122 -0.113466 -0.0116724 -0.00698303 -0.113142 -0.00361479 -0.121684 0.157798 0.0650064 -0.0225254 0.0221656 0.00908294 -0.0679704 0.0959524 -0.163157 -0.235935 -0.027683 0.0409226 -0.0103466 0.157971 -0.14233 0.0715283 0.0569458 0.024872 -0.0121753 0.18317 -0.0283201 -0.0764088 0.0834064 -0.0282231 0.0144391 0.102976 -0.0975814 0.0888589 0.176015 0.0570498 -0.124171 0.0441831 -0.00590965 -0.145037 -0.0202717 0.0230383 0.160933 -0.0550781 -0.0317502 0.138749 0.0383598 -0.173199 0.0101488 0.0389215 0.137089 -0.0421231 0.102226 -0.0803024 0.0204042 0.0647249 0.0105213 -0.030892 -0.00341335 0.0801937 0.0436902 0.0592842 -0.0394093 -0.00201499 -0.113234 0.0259211 0.0749876 0.0453596 0.0602216 0.10511 -0.0852835 -0.0731933 -0.0711212 -0.0761367 0.0972547 0.0747434 0.0192406 0.0256625 0.0988123 -0.0748586 -0.0260749 -0.0963179 -0.125419 0.0201987 0.0918837 0.064504 0.0398819 -0.0357167 -0.012622 0.0156658 -0.0211125 0.125302 -0.164712 -0.028657 -0.175181 0.163596 -0.0256346 0.0430828 0.0983621 0.158586 -0.168104 -0.0289203 0.000956258 0.0372407 -0.151314 -0.158885 -0.0778306 0.016747 0.0290703 0.106244 0.117881 0.075078 -0.0536299 -0.0459905 -0.0789597 -0.11169 
0.0682181 -0.00682484 -0.0255929 -0.049466 0.0835079 0.133651 0.108205 -0.0397869 -0.0885959 -0.0414869 -0.108217 0.0415598 0.0872417 -0.123859 0.0383811 -0.0472903 -0.131587 -0.00504567 -0.11285 0.134022 0.0579696 0.000472337 0.0225177 0.0561811 -0.0748355 0.0737875 -0.167276 -0.250727 -0.012142 0.0441413 -0.00401194 0.135044 -0.144051 0.0792032 0.0856414 0.00486566 0.00716564 0.184776 -0.0270263 -0.080959 0.0885996 -0.0457015 -0.0127462 0.0978734 -0.124842 0.0567124 0.149818 0.0711358 -0.109242 0.0566529 0.00225276 -0.14393 0.0142193 0.0276287 0.170035 -0.0477162 -0.0236814 0.140531 0.0240312 -0.187504 -0.00875365 0.0360829 0.122358 -0.0548211 0.0850167 -0.0593215 0.0445554 0.0344931 -0.0178723 -0.0396096 -0.0266905 0.0753912 0.019982 0.0704359 -0.0341883 -0.0202227 -0.120323 -0.00141629 0.125877 0.0891935 0.0732419 0.0821036 -0.0722551 -0.0821374 -0.0188132 -0.112916 0.1007 0.074703 0.0267476 0.0468712 0.12255 -0.0699692 -0.00524531 -0.0885271 -0.157211 -0.002191 0.0907796 0.0659638 0.0517045 -0.0352259 0.0252541 0.0322268 -0.0218724 0.106415 -0.162024 -0.0408291 -0.154865 0.13231 -0.00196488 0.0533934 0.109936 0.170767 -0.16328 -0.0543564 0.00924811 0.0635454 -0.129804 -0.153091 -0.0869546 0.0333616 0.0500988 0.0649297 0.100063 0.0729598 -0.0574269 -0.0412043 -0.0569653 -0.0979936 
0.108022 -0.0107041 -0.0527447 -0.0229697 0.107523 0.123795 0.167558 -0.00462909 -0.123338 -0.0613011 -0.0777681 0.0591352 0.120495 -0.0866225 0.0170536 -0.0470665 -0.0902131 -0.0240227 -0.140172 0.155311 0.105979 -0.0799998 0.0354649 0.0742296 -0.0391061 -0.0102131 -0.187398 -0.212236 0.0163023 0.0830703 -0.0308271 0.147591 -0.147393 0.113935 0.00415323 -0.0258462 -0.0358731 0.180673 -0.04207 -0.0880291 0.0783624 -0.052789 0.0158865 0.0681926 -0.12611 0.0339278 0.123513 0.0435336 -0.111776 0.0743001 -0.00597651 -0.11837 -0.0245498 0.0210928 0.160296 -0.0489219 -0.053177 0.180214 -0.000225874 -0.127194 -0.0224293 0.0421627 0.130745 -0.0863367 0.0678773 -0.0184659 -0.00170762 0.0179871 -0.089954 -0.0521449 -0.0295048 0.0995269 -0.01304 0.0951731 -0.0231234 0.0124364 -0.0175228 -0.0401975 0.108229 0.104366 0.014053 -0.0109627 -0.054971 -0.0784021 -0.0353278 -0.0679902 0.0903498 0.0451627 0.0251583 0.0349764 0.126531 -0.114704 -0.0361678 -0.0620819 -0.126239 -0.0136277 0.0665935 0.0567956 0.0584077 -0.0103414 0.00571142 0.028607 -0.0189165 0.169894 -0.178234 0.00304508 -0.157484 0.202675 0.0292809 -0.0323334 0.0793326 0.173174 -0.174975 -0.0280319 0.0418642 0.085716 -0.0733683 -0.0790528 -0.0304506 0.134323 -0.00295919 0.0505102 0.0499513 0.0990896 -0.0666956 -0.0210177 -0.051174 -0.110274 
0.10238 0.0070169 -0.0547589 -0.0461799 0.118207 0.108957 0.127448 -0.0416292 -0.115324 -0.0520799 -0.0718604 0.0311166 0.133314 -0.0551193 0.00170682 -0.0489696 -0.0751175 0.0179461 -0.150007 0.161924 0.107115 -0.0573801 0.0684683 0.0460767 -0.0586981 -0.00327773 -0.191134 -0.207643 0.0165636 0.0817025 -0.0313377 0.12902 -0.152646 0.0743169 0.0411898 -0.01343 -0.0461171 0.230506 -0.040487 -0.086922 0.0340124 -0.00335518 -0.039544 0.080138 -0.141648 0.0641767 0.109011 0.0765305 -0.107796 0.0640563 -0.0105197 -0.0785634 -0.0321578 0.0196664 0.128986 -0.0789235 -0.0106151 0.165926 0.0199196 -0.158756 -0.000242593 0.0474934 0.132788 -0.0550734 0.0715073 -0.0759671 0.0196758 0.0819522 -0.0456255 -0.0239319 0.0223452 0.0959475 0.0234346 0.0533044 -0.0616935 0.00750814 -0.079853 -0.0288625 0.112055 0.089726 0.0251311 0.0294965 -0.0719871 -0.0799842 -0.0366161 -0.0925861 0.0822919 0.062227 0.0348083 0.015345 0.114218 -0.0996604 0.000851902 -0.0759562 -0.132588 -0.0623911 0.0695038 0.0741707 0.0390411 -0.0331956 0.0377717 0.0634581 -0.0218457 0.161463 -0.168107 -0.0185583 -0.157409 0.179705 0.0715167 0.00500212 0.0976213 0.166754 -0.17772 0.0117283 0.0133502 0.0985048 -0.133603 -0.0952266 -0.0711272 0.0876463 -0.0377292 0.0711091 0.0375737 0.0933944 -0.0571881 -0.0283494 -0.0779106 -0.103298 
0.104555 0.0891651 -0.0976552 -0.00701351 0.111092 0.182558 0.12151 -0.0870512 -0.123345 0.00504603 0.00929074 -0.00668846 0.176151 -0.00503716 -0.0368516 -0.0301049 -0.00654623 0.0802583 -0.125104 0.122381 0.155894 -0.124842 0.0373518 0.133265 0.00740516 -0.0932694 -0.215515 -0.147584 0.11078 0.142716 0.0170461 0.135215 -0.180869 0.0589541 0.00875753 0.0208608 -0.0760956 0.100381 0.0241299 -0.0843808 0.0135132 -0.0357878 -0.0210492 0.0301045 -0.104925 -0.0251184 0.107066 0.121327 -0.109569 -0.000484741 -0.00394773 0.00877463 -0.0163288 -0.0245156 0.0508921 -0.0108509 0.000751822 0.193711 0.0416168 -0.144574 -0.052647 0.123857 0.170073 -0.14164 0.00357858 0.0321991 0.0300695 0.0301489 -0.126245 0.000420113 -0.00569844 0.116568 -0.0409827 0.044933 -0.0300374 -0.00990616 -0.00122457 -0.00926011 0.0923057 0.0815503 0.0062628 0.0108887 -0.0328162 -0.0707086 -0.0334618 0.0132055 0.0322599 -0.00991243 0.025321 -0.00140157 0.132657 -0.100693 0.0322388 -0.02759 -0.0832142 -0.113367 -0.00153934 0.132123 0.0166391 -0.0197279 0.0947033 0.0829904 -0.011245 0.195615 -0.13283 0.0856847 -0.097275 0.161688 0.0910061 0.00233149 0.0327592 0.119837 -0.131527 0.0234452 0.0149852 0.110538 -0.106252 -0.0165863 -0.0247672 0.137616 -0.053828 -0.0523681 -0.0215175 0.0612649 -0.1626 0.0651992 -0.118381 -0.0546441 
0.0816296 0.0343264 -0.119635 0.00786025 0.148639 0.111656 0.0994954 -0.0959058 -0.0893789 -0.0225881 0.0060053 0.0200643 0.172261 0.0172985 -0.0741789 -0.05291 -0.011989 0.100635 -0.131535 0.181408 0.167497 -0.162371 0.0645985 0.119103 0.0207399 -0.0864836 -0.194658 -0.156847 0.077188 0.138895 0.0147891 0.108775 -0.132202 0.0298991 0.01273 0.0231312 -0.0963628 0.124838 -0.0306038 -0.140967 0.0165117 -0.00241046 -0.0253297 0.0959553 -0.146109 -0.017569 0.111902 0.117715 -0.0574669 0.000550784 -0.0436562 -0.0200115 -0.0213486 -0.0339497 0.0781765 -0.0282125 -0.0271953 0.172785 0.0544738 -0.168775 -0.0291412 0.0825208 0.17104 -0.0607869 0.00551205 -0.0136488 0.00881476 0.0500917 -0.0689942 -0.00505509 0.0259524 0.107893 0.000117695 -0.0123386 -0.0600508 0.00318397 -0.0316929 0.0148617 0.0789418 0.0737513 -0.0269124 0.0366047 -0.0624417 -0.062669 -0.0268979 0.000237539 0.0404069 0.0493504 0.0482379 -0.0315078 0.12259 -0.0846101 0.0200727 -0.0757654 -0.0915703 -0.150566 -0.0230164 0.132524 0.0164555 -0.0633926 0.0786114 0.0683387 0.0379966 0.149805 -0.139701 0.0768485 -0.103478 0.176183 0.116795 0.00797878 0.0348238 0.115594 -0.162692 0.0373497 -0.00103367 0.102747 -0.110666 -0.0568122 -0.03067 0.124211 -0.0853268 0.00506355 -0.0610302 0.0736454 -0.167575 0.0446272 -0.107964 -0.0359119 
0.0816296 0.0343264 -0.119635 0.00786025 0.148639 0.111656 0.0994954 -0.0959058 -0.0893789 -0.0225881 0.0060053 0.0200643 0.172261 0.0172985 -0.0741789 -0.05291 -0.011989 0.100635 -0.131535 0.181408 0.167497 -0.162371 0.0645985 0.119103 0.0207399 -0.0864836 -0.194658 -0.156847 0.077188 0.138895 0.0147891 0.108775 -0.132202 0.0298991 0.01273 0.0231312 -0.0963628 0.124838 -0.0306038 -0.140967 0.0165117 -0.00241046 -0.0253297 0.0959553 -0.146109 -0.017569 0.111902 0.117715 -0.0574669 0.000550784 -0.0436562 -0.0200115 -0.0213486 -0.0339497 0.0781765 -0.0282125 -0.0271953 0.172785 0.0544738 -0.168775 -0.0291412 0.0825208 0.17104 -0.0607869 0.00551205 -0.0136488 0.00881476 0.0500917 -0.0689942 -0.00505509 0.0259524 0.107893 0.000117695 -0.0123386 -0.0600508 0.00318397 -0.0316929 0.0148617 0.0789418 0.0737513 -0.0269124 0.0366047 -0.0624417 -0.062669 -0.0268979 0.000237539 0.0404069 0.0493504 0.0482379 -0.0315078 0.12259 -0.0846101 0.0200727 -0.0757654 -0.0915703 -0.150566 -0.0230164 0.132524 0.0164555 -0.0633926 0.0786114 0.0683387 0.0379966 0.149805 -0.139701 0.0768485 -0.103478 0.176183 0.116795 0.00797878 0.0348238 0.115594 -0.162692 0.0373497 -0.00103367 0.102747 -0.110666 -0.0568122 -0.03067 0.124211 -0.0853268 0.00506355 -0.0610302 0.0736454 -0.167575 0.0446272 -0.107964 -0.0359119 
0.0816296 0.0343264 -0.119635 0.00786025 0.148639 0.111656 0.0994954 -0.0959058 -0.0893789 -0.0225881 0.0060053 0.0200643 0.172261 0.0172985 -0.0741789 -0.05291 -0.011989 0.100635 -0.131535 0.181408 0.167497 -0.162371 0.0645985 0.119103 0.0207399 -0.0864836 -0.194658 -0.156847 0.077188 0.138895 0.0147891 0.108775 -0.132202 0.0298991 0.01273 0.0231312 -0.0963628 0.124838 -0.0306038 -0.140967 0.0165117 -0.00241046 -0.0253297 0.0959553 -0.146109 -0.017569 0.111902 0.117715 -0.0574669 0.000550784 -0.0436562 -0.0200115 -0.0213486 -0.0339497 0.0781765 -0.0282125 -0.0271953 0.172785 0.0544738 -0.168775 -0.0291412 0.0825208 0.17104 -0.0607869 0.00551205 -0.0136488 0.00881476 0.0500917 -0.0689942 -0.00505509 0.0259524 0.107893 0.000117695 -0.0123386 -0.0600508 0.00318397 -0.0316929 0.0148617 0.0789418 0.0737513 -0.0269124 0.0366047 -0.0624417 -0.062669 -0.0268979 0.000237539 0.0404069 0.0493504 0.0482379 -0.0315078 0.12259 -0.0846101 0.0200727 -0.0757654 -0.0915703 -0.150566 -0.0230164 0.132524 0.0164555 -0.0633926 0.0786114 0.0683387 0.0379966 0.149805 -0.139701 0.0768485 -0.103478 0.176183 0.116795 0.00797878 0.0348238 0.115594 -0.162692 0.0373497 -0.00103367 0.102747 -0.110666 -0.0568122 -0.03067 0.124211 -0.0853268 0.00506355 -0.0610302 0.0736454 -0.167575 0.0446272 -0.107964 -0.0359119 
