{
  "descriptor": [
    -0.08231151849031448,
    0.07415305078029633,
    0.06231938675045967,
    -0.08354354649782181,
    -0.12098800390958786,
    0.04614299535751343,
    -0.04788326844573021,
    -0.09214482456445694,
    0.14800047874450684,
    -0.11175569146871567,
    0.17779774963855743,
    -0.054538678377866745,
    -0.2796078324317932,
    0.02667439728975296,
    -0.0581737719476223,
    0.14861032366752625,
    -0.1637985110282898,
    -0.15359584987163544,
    -0.14078883826732635,
    -0.016512874513864517,
    -0.04368672892451286,
    0.024944128468632698,
    0.03643706440925598,
    0.051895808428525925,
    -0.10222575068473816,
    -0.33870649337768555,
    -0.0530831515789032,
    -0.09627493470907211,
    0.05963608995079994,
    -0.09982522577047348,
    0.003139926353469491,
    0.0962044969201088,
    -0.12184210866689682,
    0.007782879751175642,
    0.022216642275452614,
    0.09723673015832901,
    -0.10993949323892593,
    -0.12351854890584946,
    0.30289605259895325,
    -0.005265817977488041,
    -0.2586376667022705,
    -0.051241204142570496,
    0.08634288609027863,
    0.24055323004722595,
    0.1981869786977768,
    0.021456941962242126,
    0.06413987278938293,
    -0.09609394520521164,
    0.05218106135725975,
    -0.2996788024902344,
    0.026849497109651566,
    0.2060694545507431,
    0.04818066209554672,
    0.10828894376754761,
    0.032654717564582825,
    -0.19577334821224213,
    0.06695602834224701,
    0.10486378520727158,
    -0.1527605801820755,
    0.04035200551152229,
    0.08785780519247055,
    -0.1504393368959427,
    -0.019612368196249008,
    0.022033726796507835,
    0.2248740941286087,
    0.08358626812696457,
    -0.08859145641326904,
    -0.1654731184244156,
    0.24271605908870697,
    -0.17357881367206573,
    -0.062423575669527054,
    0.12395180016756058,
    -0.08115989714860916,
    -0.17321762442588806,
    -0.20579150319099426,
    -0.04088903218507767,
    0.36940401792526245,
    0.13821084797382355,
    -0.10217812657356262,
    0.05793822184205055,
    -0.12855440378189087,
    -0.08622101694345474,
    0.031404174864292145,
    0.11396176367998123,
    -0.04975816234946251,
    -0.09382601827383041,
    -0.0941133126616478,
    0.016943542286753654,
    0.2433532178401947,
    -0.049116749316453934,
    0.057653214782476425,
    0.2092876136302948,
    0.08647269010543823,
    -0.0648047924041748,
    0.019727757200598717,
    0.08421850949525833,
    -0.10616011172533035,
    0.037645161151885986,
    -0.1150849461555481,
    -0.0033469884656369686,
    0.06582191586494446,
    -0.04917330667376518,
    0.03324292227625847,
    0.10524296760559082,
    -0.2362295687198639,
    0.17525076866149902,
    -0.013608475215733051,
    -0.06803222745656967,
    0.07508797198534012,
    -0.06730862706899643,
    -0.0384732149541378,
    -0.045261282473802567,
    0.22180941700935364,
    -0.27408137917518616,
    0.13857585191726685,
    0.20277948677539825,
    0.06206675246357918,
    0.1383276730775833,
    0.11804483830928802,
    0.10532285273075104,
    0.049093540757894516,
    -0.08279544115066528,
    -0.24009159207344055,
    -0.07760218530893326,
    0.013390575535595417,
    -0.012186410836875439,
    -0.03874940797686577,
    0.07064401358366013
  ]
}