0.0522302 0.0469538 -0.0442797 -0.0131687 0.0319545 0.225875 0.0101404 0.00218227 -0.0776372 -0.0443932 0.0270136 0.110174 0.0123023 -0.238847 -0.0596046 -0.00660034 -0.216051 0.00647603 -0.0480621 0.0365566 0.170324 -0.0102967 0.0679693 0.0980684 0.0257794 0.0045739 0.0257752 -0.273472 0.005865 0.104057 -0.0175068 -0.0643292 -0.0354114 0.0760055 0.0113979 -0.0585449 -0.0917511 0.000744936 -0.011938 0.0221057 0.0288292 -0.143341 -0.0268552 0.174563 -0.125351 -0.0385366 0.186516 -0.0596377 -0.179825 0.0811695 0.11037 -0.018271 -0.0285213 0.0124051 0.0965111 0.0425326 0.0416346 0.111124 -0.0471036 -0.0983466 -0.0346079 -0.0520365 0.222854 -0.0466713 0.103301 -0.172027 -0.0258126 -0.027411 -0.0477721 0.123544 -0.0507957 0.0821101 -0.107923 -0.0309885 0.0303014 -0.000489703 -0.0865389 0.0399406 -0.0103882 0.198429 -0.0533754 0.00278991 0.0634692 0.0326113 -0.0911113 0.0157973 0.097736 -0.00774683 -0.0221294 0.0401622 0.0225977 -0.130258 -0.148246 0.0313156 -0.120914 -0.0418498 -0.010172 0.0798628 0.0619285 -0.0227018 0.0404946 0.0397046 -0.0431207 0.0766392 -0.0556915 -0.00690602 -0.0770731 0.159078 -0.0784987 -0.0746934 0.0461445 0.0991526 -0.0785975 -0.0778783 0.0812719 0.122251 -0.0878163 -0.0548087 0.0534536 0.173738 0.0891173 -0.0282566 0.00490799 -0.0358652 0.0181043 0.0879537 0.0874273 0.0458699 
0.0360349 0.0445197 -0.0391008 -0.0133872 0.0231752 0.220197 -0.00271808 0.00266189 -0.0733061 -0.0280172 0.0348707 0.109339 0.0192339 -0.231622 -0.0559647 -0.00147198 -0.215205 0.0178961 -0.037915 0.0286508 0.174009 -0.0182171 0.074843 0.0931149 0.0287797 0.0120455 0.035114 -0.27522 0.00662829 0.102937 -0.0145877 -0.0625847 -0.0140442 0.073938 0.0119695 -0.0563306 -0.0876136 0.00224844 -0.00871398 0.0181956 0.0297601 -0.154816 -0.0257598 0.172555 -0.132546 -0.0529614 0.184476 -0.0638729 -0.176674 0.0627678 0.11624 -0.020545 -0.0253341 0.0161906 0.0934755 0.0555288 0.0529327 0.0933532 -0.0462407 -0.0996071 -0.0366209 -0.065771 0.213494 -0.0419665 0.114963 -0.162808 -0.0310235 -0.0258357 -0.0431353 0.129046 -0.0600987 0.0741442 -0.115192 -0.0500392 0.0384985 0.00242447 -0.0892719 0.0469625 -0.0152976 0.189931 -0.0656027 0.00013664 0.0716532 0.0423102 -0.0952011 0.0196107 0.104274 -0.00222927 -0.0198467 0.0390063 0.0091782 -0.12897 -0.142522 0.0335466 -0.130785 -0.0475067 -0.0238331 0.090828 0.0679396 -0.0232166 0.0509532 0.0349216 -0.0405365 0.0699993 -0.0292512 -0.0108019 -0.0707234 0.152297 -0.0776948 -0.0831117 0.0226894 0.0923355 -0.0724224 -0.0866363 0.0853844 0.118868 -0.0892563 -0.0581477 0.0551364 0.175402 0.09789 -0.0375061 -0.00361541 -0.0428211 0.0218106 0.0985974 0.0905216 0.0633276 
0.0300245 0.0553436 -0.035615 -0.00818647 0.0262623 0.218446 -0.00194231 0.000631105 -0.0750403 -0.0177217 0.0392672 0.105151 0.0166683 -0.236206 -0.0517957 0.0126172 -0.214158 0.0224424 -0.0394453 0.0239208 0.177976 -0.0235117 0.071734 0.0923163 0.0369541 0.0158417 0.0280176 -0.276634 0.0179468 0.101182 -0.00903467 -0.0519959 -0.01732 0.0737246 0.010645 -0.055279 -0.0858779 0.00255635 -0.000110703 0.0215487 0.0354444 -0.153765 -0.0178924 0.167675 -0.126391 -0.0552882 0.193844 -0.0680608 -0.180062 0.048307 0.118709 -0.0223179 -0.0332581 0.0141632 0.0918566 0.061132 0.0564152 0.0914289 -0.0410362 -0.098921 -0.0396816 -0.0701305 0.209577 -0.044905 0.121078 -0.154407 -0.0327577 -0.0299078 -0.0409998 0.131041 -0.063009 0.0855995 -0.11478 -0.0443091 0.0449578 -0.00238071 -0.0899265 0.0627605 -0.0215131 0.180622 -0.0659829 0.00816359 0.0733333 0.0444718 -0.0983527 0.0268373 0.104981 -7.00054e-05 -0.0221622 0.0318322 0.00651412 -0.124102 -0.146676 0.0283048 -0.126178 -0.0426575 -0.0238071 0.0972052 0.0648169 -0.0180101 0.0412517 0.0262671 -0.0378227 0.0786528 -0.0254466 -0.00745391 -0.0696648 0.15599 -0.0688034 -0.0883741 0.0106151 0.0956074 -0.0737622 -0.087444 0.0937528 0.111858 -0.0910166 -0.0614348 0.0530159 0.171623 0.100869 -0.0301111 -0.00120995 -0.0405964 0.0153138 0.101224 0.0847535 0.0643223 
0.024927 0.0519326 -0.0294997 0.00245469 0.021289 0.213732 -0.000231062 0.00332601 -0.067641 -0.00715013 0.0449672 0.106656 0.0210876 -0.244619 -0.0485798 0.0178942 -0.217492 0.0253655 -0.0415632 0.0277523 0.17804 -0.030533 0.074938 0.0912512 0.0314509 0.0156175 0.0218081 -0.283621 0.0138474 0.0999918 -0.00955072 -0.0451841 -0.00764874 0.0783025 0.0133779 -0.0564824 -0.0763838 0.00702406 -0.00404601 0.0148557 0.0385801 -0.163 -0.0191908 0.158414 -0.129071 -0.0662622 0.191362 -0.0689243 -0.173239 0.0464841 0.122128 -0.0299181 -0.0337457 0.0182306 0.096552 0.0650864 0.0594624 0.0715791 -0.0419119 -0.0949059 -0.0426421 -0.0802567 0.198726 -0.049223 0.130993 -0.150388 -0.0344298 -0.0347596 -0.0432888 0.125653 -0.0721397 0.0825879 -0.116937 -0.0445322 0.0464093 -0.000977102 -0.0848476 0.0693449 -0.0216754 0.178044 -0.0682402 -0.00107466 0.0726518 0.0488934 -0.095555 0.0319603 0.106616 0.00393557 -0.0191403 0.0344249 0.00263229 -0.123559 -0.143263 0.0286639 -0.136955 -0.0426399 -0.0302045 0.0956003 0.067797 -0.0133101 0.0506481 0.0214282 -0.0393069 0.071175 -0.00498793 -0.0117039 -0.0593897 0.152712 -0.0667517 -0.0827738 -0.00958328 0.0945937 -0.0660005 -0.0964262 0.0967642 0.109626 -0.0863319 -0.057182 0.0476213 0.171974 0.102245 -0.0299812 -0.000956805 -0.0360788 0.0225712 0.106357 0.0886405 0.0688901 
0.0269931 0.0426424 -0.031703 0.00119667 0.0285338 0.210014 0.00783518 0.00790149 -0.0656871 -0.0137276 0.03918 0.104934 0.0283928 -0.243876 -0.0503707 0.0225739 -0.219911 0.0302439 -0.0586927 0.0357233 0.186115 -0.0403941 0.0830483 0.0894296 0.025432 0.0080073 0.00688743 -0.293722 0.00734437 0.0972505 -0.00871017 -0.0276031 -0.0120885 0.086128 0.0105107 -0.0580387 -0.0791235 0.0200807 -0.00873027 0.0102611 0.0412428 -0.160585 -0.0223153 0.153307 -0.128887 -0.0643938 0.188519 -0.0661595 -0.175304 0.0500972 0.111824 -0.0451186 -0.03513 0.0198487 0.0935149 0.061393 0.0628802 0.0740802 -0.0396195 -0.0959806 -0.0383075 -0.0706115 0.193582 -0.0516911 0.131462 -0.147828 -0.0395643 -0.028164 -0.0443788 0.119039 -0.0734902 0.0826746 -0.114794 -0.0403603 0.0387533 -0.00264916 -0.0823167 0.0616703 -0.0201307 0.173884 -0.069845 -0.00430518 0.0599027 0.0394857 -0.103952 0.0392738 0.107743 0.00478256 -0.0220971 0.031039 0.0126044 -0.126903 -0.143386 0.0201176 -0.136414 -0.032528 -0.0357632 0.0983909 0.0652585 -0.00675172 0.0520734 0.0089675 -0.0418011 0.0823427 0.000327727 -0.0152879 -0.0677604 0.160356 -0.0637684 -0.0848548 -0.0168039 0.101518 -0.0701819 -0.0971943 0.0975495 0.112052 -0.0880253 -0.05843 0.0493586 0.176783 0.0986668 -0.0195126 -0.00127302 -0.0250599 0.0173301 0.0966946 0.0759734 0.0588785 
0.0281877 0.0333113 -0.0232619 0.0141509 0.0238575 0.202684 0.0157434 0.0108998 -0.0594176 -0.010154 0.0413866 0.105927 0.034551 -0.251878 -0.0432592 0.0253708 -0.222216 0.0312598 -0.0700775 0.0463364 0.181973 -0.0429852 0.0885441 0.104828 0.0153403 -0.00335669 -0.00256586 -0.301166 0.000457773 0.0962771 -0.0116073 -0.0171006 -0.00949473 0.0980692 0.00595649 -0.0578465 -0.0718016 0.024161 -0.0249479 0.0105688 0.0441064 -0.170189 -0.0263692 0.142854 -0.130497 -0.068414 0.184863 -0.059446 -0.166795 0.0584882 0.118852 -0.0612402 -0.0340532 0.0215664 0.09938 0.0618611 0.0620597 0.062551 -0.0314637 -0.0853372 -0.0403936 -0.0680848 0.174015 -0.0566998 0.133232 -0.149262 -0.0383466 -0.0388811 -0.0526726 0.110836 -0.0855558 0.0796956 -0.114145 -0.0299822 0.0378501 -0.0050813 -0.0720112 0.0659243 -0.0167604 0.174536 -0.0616263 -0.019262 0.0485825 0.0321668 -0.100035 0.0465378 0.105553 -0.000557659 -0.0315994 0.038132 0.0158886 -0.12655 -0.138337 0.0164827 -0.147789 -0.022247 -0.045125 0.0908873 0.0763599 -0.00205783 0.0606058 0.00431426 -0.0423756 0.0824987 0.0159039 -0.0259254 -0.0660209 0.159455 -0.0629625 -0.0773331 -0.0306461 0.110201 -0.0606756 -0.107819 0.0907656 0.114587 -0.0778105 -0.0528 0.0391274 0.182918 0.0968131 -0.0161075 -0.00620863 -0.0119445 0.0153397 0.0974746 0.0695961 0.0520745 
0.0306518 0.0283604 -0.0494836 0.0134929 0.0227492 0.180353 0.00340168 0.00597848 -0.0714404 -0.013789 0.0369359 0.116149 0.0404964 -0.235547 -0.0722023 0.024536 -0.204388 0.0297194 -0.0598051 0.0672642 0.17986 -0.0585576 0.10108 0.10403 0.0141391 0.00667942 0.0156974 -0.297609 -0.00128372 0.106285 -0.0310838 -0.0174605 0.00575589 0.0877601 -0.0127965 -0.0657381 -0.0835452 0.0447704 -0.032095 0.00809691 0.0233001 -0.16255 -0.0238432 0.152826 -0.134358 -0.0578312 0.193561 -0.0673451 -0.166238 0.0648609 0.122715 -0.0462241 -0.0287042 0.0238818 0.102945 0.0526656 0.076739 0.0653129 -0.0209728 -0.0943025 -0.0325828 -0.0701999 0.183192 -0.0422939 0.12116 -0.16209 -0.0478277 -0.0276538 -0.0474204 0.10354 -0.0825361 0.0687913 -0.115504 -0.0310961 0.03928 0.00266887 -0.0667308 0.0619968 -0.0211785 0.176835 -0.076427 -0.0214114 0.0453348 0.0293748 -0.101715 0.0464351 0.0971631 0.00132072 -0.0190974 0.0217624 -0.00216793 -0.124471 -0.136533 0.0181774 -0.132657 -0.0281483 -0.0388179 0.104481 0.0780944 -0.0194765 0.0563109 0.0131232 -0.0330851 0.101097 0.000974394 -0.0290162 -0.0756704 0.17016 -0.0577888 -0.0941425 -0.0233212 0.116322 -0.0624197 -0.0984098 0.0784352 0.117995 -0.0794194 -0.0636168 0.0482492 0.185438 0.0781812 -0.0108639 -0.010919 -0.0251289 0.00620044 0.0975564 0.0664206 0.0523116 
0.0249311 0.0384144 -0.0306443 0.0191183 0.0159684 0.191825 0.00935625 0.010027 -0.0616883 -0.012505 0.0359972 0.101726 0.0346515 -0.251171 -0.0536036 0.0265678 -0.217294 0.0250681 -0.0641371 0.0544903 0.181134 -0.0574775 0.0955642 0.10078 0.0150713 -0.00814143 -0.00305376 -0.304878 -0.0038687 0.0977598 -0.0166904 -0.0181901 7.31878e-05 0.0942498 0.0020391 -0.0599405 -0.0685239 0.0336039 -0.030441 0.00722914 0.0344479 -0.175074 -0.0232575 0.136822 -0.124893 -0.0537041 0.191611 -0.0640769 -0.171651 0.0606693 0.116094 -0.0548933 -0.0255876 0.0246671 0.100868 0.0587045 0.074144 0.0502095 -0.0248648 -0.0895747 -0.034926 -0.0627059 0.166341 -0.0584374 0.133962 -0.152798 -0.0415258 -0.0380912 -0.0517197 0.105068 -0.088292 0.0711515 -0.120512 -0.030969 0.0430057 0.00104346 -0.0658073 0.0695786 -0.0163196 0.177389 -0.0738841 -0.028174 0.0404673 0.0335379 -0.101359 0.0573015 0.0943152 -0.00287195 -0.0312349 0.0331319 0.00785931 -0.126084 -0.131521 0.0148954 -0.146023 -0.021911 -0.0419174 0.0993366 0.079062 -0.00579496 0.0623487 0.007272 -0.0419458 0.0894333 0.0186582 -0.028665 -0.0644077 0.168815 -0.0639033 -0.080729 -0.0369595 0.108126 -0.0591783 -0.112557 0.0833069 0.119122 -0.0800421 -0.0553362 0.0420173 0.185621 0.0861235 -0.0121551 -0.00951072 -0.0116666 0.0171299 0.0975103 0.0695385 0.0490839 
0.0294441 0.0477132 -0.0416696 0.00943006 0.0107998 0.191804 0.00900661 0.0118992 -0.0792662 -0.00823701 0.0364621 0.104782 0.0383543 -0.245033 -0.0642173 0.0233832 -0.208382 0.0251697 -0.056564 0.0520051 0.176671 -0.0561688 0.0923925 0.0889742 0.0130049 -0.000883888 0.00632073 -0.294508 -0.0015877 0.105058 -0.0317182 -0.0222152 0.00190905 0.0880302 -0.00406286 -0.0726047 -0.0740679 0.0366096 -0.0204688 0.0137618 0.0192371 -0.172117 -0.0168751 0.141298 -0.125185 -0.0513059 0.19448 -0.0741051 -0.183389 0.0653283 0.125944 -0.0424411 -0.03061 0.0292576 0.0914989 0.0547627 0.078257 0.0554311 -0.0264492 -0.0918225 -0.0307608 -0.0644431 0.177116 -0.0572062 0.127822 -0.15577 -0.0456257 -0.0335509 -0.0563973 0.0989652 -0.0813296 0.0647762 -0.120766 -0.0302213 0.0429072 0.00660347 -0.0646697 0.0562054 -0.0170776 0.178179 -0.0797042 -0.0331912 0.0475122 0.0383834 -0.104774 0.0544331 0.0905458 -0.0121646 -0.019596 0.028954 -0.00633013 -0.13214 -0.135475 0.0228292 -0.137014 -0.0251303 -0.0321022 0.105282 0.0719944 -0.00796142 0.0550753 0.0194193 -0.0407253 0.103852 0.00743182 -0.0268033 -0.067188 0.177333 -0.0690358 -0.0927482 -0.0272906 0.103015 -0.0602668 -0.10332 0.0796097 0.116407 -0.0809673 -0.0526034 0.0524495 0.182493 0.0793715 -0.0225276 -0.00526679 -0.0238465 0.0257642 0.094041 0.0730872 0.0482526 
0.0813728 0.090406 -0.0903082 0.0149677 0.0453195 0.171136 0.0710079 -0.0465869 -0.100791 -0.00820417 0.0716841 0.143198 0.0315965 -0.209069 -0.110265 -0.00269975 -0.1679 0.0502894 -0.0538395 0.0651078 0.156958 -0.0322111 0.0607922 0.0424441 0.00715 0.00184702 -0.00398236 -0.226845 0.0405513 0.183058 -0.114891 0.0216064 -0.0236338 0.0614974 -0.000136235 -0.122996 -0.0706854 0.052006 0.0549165 0.019441 -0.0087259 -0.128956 -0.01125 0.111951 -0.168771 -0.0294078 0.175522 -0.0879938 -0.167702 0.0718886 0.132268 0.0624598 -0.0696446 0.0544985 0.0707606 0.0101871 0.069665 0.0840057 -0.100177 -0.0360233 -0.0271817 -0.0912182 0.247535 -0.0752015 0.0963113 -0.157647 -0.040156 -0.0367293 -0.0821398 0.0765749 -0.0303945 0.0725094 -0.0987941 0.0234919 0.0154192 0.0161881 -0.039664 -0.0103907 -0.0343523 0.155735 -0.0626869 0.00331652 0.067164 0.0485309 -0.0681469 0.0360963 0.0659835 -0.036966 0.00740167 0.0203607 -0.00133118 -0.168596 -0.141007 0.0539934 -0.101801 -0.114718 -0.00871122 0.0761137 0.0902676 -0.0208928 0.0371301 0.0643375 -0.0217131 0.162975 -0.0311666 0.00726245 -0.021644 0.225227 -0.0387655 -0.0764246 0.0201715 0.0638851 -0.0819633 -0.0266459 0.0549545 0.0959169 -0.0691637 -0.0218005 0.0771312 0.159363 0.0445958 -0.0299869 -0.00254615 -0.0296947 0.0522462 0.0891005 0.086681 0.0265015 
