0.0654824 -0.00530724 -0.0652157 -0.0349237 0.144738 0.11002 -0.0180893 -0.131255 -0.182011 -0.0196798 -0.0428091 0.0759426 0.0927238 0.0803361 0.0194893 0.00254262 0.0623709 0.102587 0.0731987 0.121986 0.116699 0.0267094 0.107707 0.147234 0.00588912 0.0838857 -0.0441178 -0.206984 0.066708 0.144439 -0.031193 0.0592232 -0.0447509 -0.00354921 0.092356 0.0613303 -0.0142397 0.137044 0.0105801 -0.0785974 -0.05818 0.0964531 -0.00491447 0.080102 -0.161365 0.119496 0.214882 0.0241069 -0.115768 -0.0040377 0.0489976 -0.0498714 0.0366659 -0.00637628 0.158843 0.0156958 0.0862477 0.22122 0.0469138 -0.121838 0.00367503 0.0501181 0.167858 -0.106032 0.136256 -0.0921158 -0.00909953 0.0626393 -0.0232411 0.108213 0.025959 0.099119 -0.0551922 -0.0520263 -0.0462798 0.0146515 -0.083278 0.0670956 0.0886859 -0.00946197 0.00294743 0.163294 -0.0609126 -0.0764085 -0.00842644 -0.134187 0.0252681 0.0366075 -0.0150293 0.026566 0.0724661 0.000915872 0.000111922 -0.0288038 0.00152764 -0.0680425 0.0523528 0.204234 0.0607143 -0.0656114 0.0258451 0.0823075 0.011721 0.080093 -0.191788 0.0265551 -0.0983471 -0.0262919 0.0674399 -0.00645385 0.081867 0.100896 -0.0658658 -0.0256248 0.0183313 0.0925731 -0.11222 -0.219325 -0.118854 0.0829645 0.00481624 0.0179435 0.0119491 -0.0220803 -0.13559 0.100433 -0.0320497 -0.0417321 
0.0714569 -0.00864746 -0.0922955 -0.0445093 0.152689 0.1231 -0.0057623 -0.119973 -0.1842 -0.0218347 -0.0452062 0.0880862 0.095411 0.0470184 -0.0138846 0.000560981 0.0402125 0.104113 0.0437056 0.136701 0.117873 0.0152178 0.106377 0.124276 -0.012082 0.0917816 -0.0447835 -0.210852 0.0631566 0.127325 -0.043687 0.0675726 -0.064754 0.00769245 0.083242 0.0467192 -0.0267896 0.144704 0.00400526 -0.0864311 -0.0392046 0.082446 -0.00671898 0.102406 -0.174213 0.102495 0.212156 0.0351125 -0.126337 0.011966 0.036943 -0.0581656 0.00990031 -0.000981964 0.152239 0.000248455 0.0731758 0.223798 0.0378282 -0.132068 0.00401669 0.0482691 0.20051 -0.096762 0.138547 -0.102328 -0.0201972 0.0678837 -0.0198769 0.104454 0.0216852 0.0999497 -0.0372949 -0.0309434 -0.0606212 0.00871775 -0.0808849 0.0663576 0.0823596 -0.0217557 -0.00156608 0.156806 -0.0566424 -0.07665 -0.0273641 -0.129139 0.0412281 0.0555032 0.00233923 0.0247561 0.0883362 -0.0169234 -0.0153613 -0.0386631 0.00129411 -0.0703888 0.0576953 0.197953 0.0470457 -0.0622169 0.0224357 0.0790067 0.00476335 0.0943456 -0.183597 0.0237699 -0.108341 0.0086718 0.0538969 -0.0072234 0.0887884 0.115034 -0.0697415 -0.00409163 0.0198543 0.0786637 -0.113968 -0.210838 -0.098768 0.0800548 -0.00203472 0.0204051 0.0283536 -0.0170557 -0.13054 0.0798171 -0.0452206 -0.0523651 
0.0795073 -0.0201938 -0.0871776 -0.0439502 0.164787 0.120039 -0.000547897 -0.113003 -0.177705 -0.0297841 -0.0599122 0.0885494 0.0951599 0.0466956 -0.0207897 0.0132658 0.0507233 0.112204 0.0280032 0.138899 0.133454 0.0225636 0.107126 0.130113 -0.0183802 0.0778917 -0.0513856 -0.207699 0.0541249 0.13397 -0.0542264 0.0743449 -0.0678403 0.014331 0.0914554 0.0344915 -0.0159191 0.141376 0.00351157 -0.10094 -0.0458187 0.0908062 0.00581263 0.0895147 -0.162706 0.102539 0.204838 0.040211 -0.121518 0.0219511 0.0481799 -0.0720608 0.0186756 0.0036321 0.159382 -0.00967672 0.0864653 0.210696 0.0359666 -0.141181 0.0208782 0.0552301 0.17969 -0.0937184 0.130229 -0.108271 -0.0337651 0.0779947 -0.0199975 0.0918821 0.0201431 0.0925721 -0.0376267 -0.047567 -0.0750723 0.0216497 -0.069749 0.06506 0.090153 -0.0227631 0.0139225 0.161194 -0.060529 -0.0740499 -0.0155323 -0.127404 0.0353017 0.0641881 0.00213015 0.0357019 0.0848849 -0.0169355 -0.0243491 -0.0300684 -0.00581303 -0.0511666 0.052347 0.196187 0.037487 -0.0572529 0.0485926 0.073638 -0.00211317 0.100445 -0.175393 0.00847475 -0.115815 -0.000531103 0.0425655 -0.000420313 0.0856711 0.111088 -0.066261 0.000252445 0.015904 0.0861452 -0.124514 -0.196442 -0.11952 0.073836 -0.0109608 0.0343294 0.0357033 -0.0235967 -0.127604 0.0770113 -0.053771 -0.071735 
0.0745083 -0.0142641 -0.0794262 -0.0527091 0.166842 0.122908 -0.00879779 -0.114065 -0.179584 -0.0310349 -0.0591534 0.087965 0.0914116 0.0504023 -0.0122504 0.0177869 0.0416041 0.107597 0.0279885 0.133122 0.135957 0.0323781 0.107125 0.13136 -0.0127306 0.0756903 -0.0448058 -0.202288 0.0559301 0.136872 -0.0528521 0.0623931 -0.0683571 0.0145769 0.0904705 0.0443072 -0.0199185 0.13064 0.00560135 -0.0872965 -0.0498611 0.0903653 0.0110151 0.0893621 -0.156342 0.109068 0.209619 0.042262 -0.125288 0.0249419 0.0528184 -0.0715118 0.0107016 0.00250014 0.162746 -0.00512423 0.0815959 0.219187 0.0312627 -0.132538 0.021425 0.0567622 0.18057 -0.0906153 0.130296 -0.11383 -0.0357393 0.0825344 -0.0188737 0.102003 0.0254042 0.101508 -0.0403093 -0.0514839 -0.068148 0.0247915 -0.0713836 0.0678169 0.087718 -0.0216276 0.024579 0.164337 -0.0582865 -0.0679892 -0.0257207 -0.124557 0.0345897 0.0639134 -0.00216716 0.0430424 0.0814726 -0.0196316 -0.0285372 -0.0248614 -0.00645196 -0.0457894 0.0459777 0.193919 0.0408305 -0.0556069 0.0432577 0.0696695 -0.00798121 0.0939425 -0.177858 0.0143419 -0.125322 -0.00439763 0.0383089 -0.00439867 0.0890072 0.110196 -0.066441 0.00409025 0.0152062 0.0920677 -0.122342 -0.189983 -0.12397 0.0785604 -0.00451436 0.0334754 0.0368572 -0.0230981 -0.130852 0.0820749 -0.0537661 -0.0700263 
0.0747913 -0.00138739 -0.0666464 -0.0476267 0.171426 0.10997 -0.00335759 -0.126997 -0.170641 -0.029782 -0.0588666 0.0853354 0.0907841 0.0690139 -0.00341152 0.0183337 0.0541625 0.107509 0.0261191 0.129768 0.131961 0.0443561 0.0996153 0.137084 -0.00871635 0.0685861 -0.0519428 -0.184661 0.065129 0.152445 -0.0557118 0.0703832 -0.0622656 0.00999057 0.0938554 0.0438843 -0.00593758 0.133635 0.00749642 -0.0854123 -0.055129 0.101788 0.0178824 0.0729203 -0.151903 0.122197 0.207458 0.0398259 -0.113166 0.0182634 0.0624875 -0.0554548 0.0137535 0.00212939 0.171216 -0.00476199 0.0814693 0.214464 0.0323268 -0.127325 0.0200491 0.052548 0.16227 -0.090587 0.12226 -0.10975 -0.0278225 0.0833595 -0.0228355 0.102778 0.0366411 0.101784 -0.0381482 -0.0529228 -0.0606275 0.0354352 -0.0710368 0.067782 0.089207 -0.0268673 0.0396621 0.177915 -0.0550454 -0.0616346 -0.00690288 -0.128814 0.0257708 0.0610169 -0.0087656 0.0498331 0.0723688 -0.018859 -0.0219393 -0.021447 -0.0105943 -0.0525688 0.0459256 0.190619 0.0514137 -0.0589327 0.047384 0.075688 0.000322908 0.0974794 -0.190267 0.0138739 -0.122631 -0.0132959 0.0508899 -0.000168311 0.0904797 0.103534 -0.0725897 0.007766 0.0114651 0.0934296 -0.124845 -0.188625 -0.138639 0.0764193 -0.00348854 0.0438562 0.0341988 -0.0242088 -0.129892 0.0905774 -0.0499096 -0.0706786 
0.0786904 -0.0058701 -0.0657058 -0.0475216 0.165924 0.126506 0.00357017 -0.117046 -0.184513 -0.0254174 -0.0548503 0.0822622 0.0897835 0.0517256 -0.000345003 0.0102683 0.0454808 0.107836 0.0280512 0.131633 0.127724 0.0385088 0.0986275 0.126622 -0.0147145 0.0804315 -0.0629462 -0.198487 0.0678023 0.133307 -0.0555813 0.0762369 -0.073037 0.0158181 0.0933072 0.0443165 -0.0159614 0.138952 0.00824947 -0.08957 -0.0406991 0.0876449 0.0032679 0.0762228 -0.16286 0.117679 0.204784 0.0410049 -0.129804 0.0158122 0.0506869 -0.0500532 0.0112071 0.00457321 0.16391 -0.00757039 0.0829472 0.214935 0.0270388 -0.127976 0.0149422 0.0577429 0.177481 -0.0972266 0.133714 -0.100648 -0.0249686 0.0777774 -0.0248733 0.107247 0.0294148 0.100196 -0.0365646 -0.0361004 -0.0606472 0.023155 -0.076094 0.0644639 0.0923732 -0.0249533 0.0244988 0.168714 -0.0516705 -0.0697082 -0.0134692 -0.130338 0.0371902 0.0633552 -0.00576766 0.0498225 0.0904684 -0.0165571 -0.0206025 -0.0224921 -0.0141045 -0.0585169 0.0583894 0.189866 0.0471158 -0.0567604 0.0455753 0.0825198 -0.00463199 0.0949331 -0.182247 0.0188181 -0.111844 -0.00157818 0.0551602 -0.00399232 0.0924612 0.110867 -0.0721172 -0.00177412 0.0252633 0.0858996 -0.125186 -0.196542 -0.121151 0.0775211 0.000592471 0.0273706 0.0390282 -0.0216143 -0.12028 0.0894307 -0.0407229 -0.0688615 
0.0853792 -0.0188875 -0.0709476 -0.0539739 0.16207 0.127178 0.00809259 -0.100229 -0.188782 -0.0318802 -0.0600112 0.0904539 0.0931546 0.0372688 -0.011011 0.00263665 0.0313504 0.105516 0.0158092 0.137284 0.132572 0.0256454 0.105747 0.125899 -0.0174209 0.0798029 -0.05652 -0.20671 0.0601418 0.123378 -0.0611783 0.0713219 -0.0821363 0.0230321 0.0790483 0.0263821 -0.0341501 0.149599 0.00407916 -0.0886401 -0.0383169 0.0799127 -0.00757615 0.0889594 -0.167847 0.100496 0.196286 0.0365002 -0.134134 0.0285903 0.0520002 -0.0588936 0.00486573 0.00605578 0.156834 -0.01777 0.0818205 0.223923 0.0259675 -0.136618 0.0220097 0.0556706 0.185629 -0.0837769 0.125061 -0.107133 -0.0298019 0.0811975 -0.0244914 0.0997022 0.0231048 0.101501 -0.0337198 -0.0281177 -0.0699349 0.0166632 -0.0756193 0.0502267 0.0954836 -0.00718373 0.0135757 0.151146 -0.0479659 -0.0768038 -0.0198244 -0.136907 0.0483299 0.068193 0.00519868 0.0380287 0.0886556 -0.0242674 -0.0246443 -0.0229851 -0.0189291 -0.0594356 0.0601608 0.184197 0.0414435 -0.0569752 0.0416644 0.0775539 -0.0109268 0.108611 -0.179185 0.0102701 -0.120935 0.01637 0.0514568 -0.0174281 0.0996246 0.126641 -0.0780315 0.00512937 0.0272696 0.0880196 -0.128602 -0.188235 -0.108267 0.0828991 -0.00786648 0.0292084 0.0331505 -0.0234292 -0.115693 0.0772048 -0.0468382 -0.0737243 
0.0866782 -0.0261857 -0.065647 -0.0442098 0.170316 0.113002 0.00701592 -0.111962 -0.170427 -0.0574761 -0.0694515 0.0970521 0.0825728 0.044732 -0.0229306 0.00711398 0.0274337 0.102102 0.00604964 0.142423 0.138714 0.0306747 0.109108 0.136157 -0.0124239 0.0667281 -0.0538202 -0.194938 0.0474319 0.132522 -0.0640333 0.0628972 -0.0789881 0.0232849 0.0826715 0.0221571 -0.0271662 0.147984 -0.00476399 -0.0936353 -0.042166 0.0974052 0.0073835 0.0832086 -0.159738 0.0989515 0.195283 0.0336663 -0.111484 0.0450731 0.0526899 -0.0717131 0.015611 0.0110038 0.175239 -0.0266558 0.0826266 0.221794 0.0272741 -0.144347 0.0296814 0.0603776 0.175909 -0.0734786 0.11185 -0.107893 -0.0303216 0.0806298 -0.0221509 0.0948234 0.0267767 0.10222 -0.0246193 -0.0309886 -0.0702368 0.0249984 -0.0700198 0.04197 0.09367 -0.00507394 0.034945 0.163485 -0.0501285 -0.0778942 -0.00995889 -0.136173 0.0371675 0.0771683 -0.000176904 0.0422151 0.0885587 -0.0266128 -0.0261367 -0.0259179 -0.0212935 -0.0514903 0.0487911 0.181257 0.0489999 -0.0576356 0.04636 0.067205 -0.00508917 0.104718 -0.185655 0.00425826 -0.126468 0.00895867 0.041959 -0.00936936 0.10712 0.127323 -0.0753845 0.0135552 0.0159709 0.097482 -0.125869 -0.172719 -0.122898 0.0769089 -0.0146551 0.0530833 0.0343915 -0.0316006 -0.124452 0.0793724 -0.0475395 -0.0794075 
0.0893209 -0.0154665 -0.0555869 -0.0468873 0.154916 0.101696 0.00523875 -0.117909 -0.173866 -0.0527084 -0.0617778 0.0923825 0.0854311 0.0561475 -0.0119557 0.00643397 0.0238257 0.0865003 0.0128868 0.13744 0.133969 0.0346167 0.105357 0.140395 -0.00569943 0.076181 -0.0444525 -0.188105 0.0554725 0.141073 -0.0683499 0.0584015 -0.0784643 0.0222833 0.0756298 0.0213027 -0.0310566 0.161452 0.0023151 -0.0799038 -0.0570103 0.092273 -0.000427737 0.0843221 -0.150473 0.110077 0.193819 0.0287365 -0.115871 0.0418457 0.0641268 -0.0520782 0.00888252 0.0112196 0.180253 -0.0283801 0.0768006 0.230192 0.026815 -0.136479 0.0307926 0.0464632 0.174412 -0.0650906 0.105701 -0.110055 -0.0222588 0.0834184 -0.0212052 0.0978471 0.0286031 0.106142 -0.0311395 -0.0238474 -0.0601484 0.0160681 -0.0705031 0.0399185 0.0970345 0.0169578 0.0408678 0.153098 -0.0464632 -0.0836577 -0.0122672 -0.152294 0.0352131 0.0654555 0.0018409 0.0391094 0.0760209 -0.0286665 -0.0199495 -0.0193007 -0.0274622 -0.0582433 0.0555547 0.171836 0.0648536 -0.0666 0.0382161 0.0765145 -0.00682741 0.108518 -0.197158 0.00386708 -0.129203 0.013184 0.0588361 -0.023478 0.115553 0.133774 -0.0873116 0.0165484 0.0215111 0.10195 -0.123659 -0.174323 -0.122694 0.082132 -0.0131482 0.0557002 0.0291039 -0.0280105 -0.119047 0.081947 -0.0357194 -0.0755771 
0.102858 -0.047864 -0.0791657 -0.0521585 0.156599 0.110571 0.0163265 -0.0792758 -0.145471 -0.0709433 -0.0780016 0.104812 0.0862118 0.0184436 -0.0515063 -0.000442711 1.39144e-05 0.0780372 -0.0343515 0.147156 0.148706 0.00662269 0.106371 0.125035 -0.0182854 0.0680902 -0.0400387 -0.206558 0.0216852 0.115261 -0.0693035 0.0597225 -0.0957254 0.0353124 0.0497904 -0.000740106 -0.0614388 0.174443 -0.0254967 -0.0909512 -0.0428409 0.0856994 -0.0240377 0.104815 -0.143201 0.0768408 0.162505 0.0264083 -0.110656 0.0588605 0.053975 -0.0785287 0.00644424 0.00898338 0.169343 -0.0426358 0.0641435 0.22722 0.0328055 -0.162882 0.0424563 0.0386702 0.182849 -0.0471365 0.0931132 -0.130134 -0.0313768 0.106812 -0.00788285 0.0791547 0.0228326 0.1009 -0.0148202 -0.0343933 -0.092245 0.0250716 -0.0688517 0.0229151 0.0837665 0.0332488 0.0216603 0.13197 -0.0478061 -0.0929326 -0.0259745 -0.14762 0.0640484 0.0865236 0.0220528 0.0216142 0.0729312 -0.0475105 -0.0349274 -0.0254868 -0.0322462 -0.0372998 0.0576697 0.13916 0.0500597 -0.0568792 0.0462476 0.0554702 -0.0224803 0.11997 -0.190619 -0.0207795 -0.156356 0.031242 0.0271246 -0.0279181 0.124245 0.154719 -0.0975674 0.023273 0.0294507 0.104395 -0.146551 -0.15914 -0.106591 0.0742196 -0.034224 0.0746212 0.0361672 -0.0209165 -0.0947468 0.0513797 -0.0558172 -0.0936753 
0.0839659 -0.0419458 -0.0759947 -0.0429502 0.14755 0.0792613 0.00212673 -0.12441 -0.154507 -0.0544039 -0.0566597 0.109965 0.0898012 0.0695112 -0.0286939 0.0036634 0.000709231 0.0798256 0.015994 0.149844 0.127714 0.00352126 0.121772 0.130431 -0.00495722 0.0955492 -0.0261201 -0.194085 0.0342093 0.138699 -0.0704265 0.0620244 -0.0659873 0.0176042 0.0541513 0.0233949 -0.0397671 0.186814 0.000912458 -0.0831731 -0.0573696 0.0940556 -0.00905374 0.092946 -0.161166 0.0792926 0.187205 0.0220725 -0.0871797 0.0472073 0.0454674 -0.0707305 0.00785448 0.0222316 0.190669 -0.0299949 0.0747048 0.236736 0.0212621 -0.141179 0.0300515 0.0267897 0.192066 -0.0475635 0.100805 -0.0934157 -0.0250354 0.0955038 -0.0045751 0.0873616 0.0227152 0.116105 -0.0248457 -0.0128023 -0.0601007 0.00740975 -0.0695738 0.022811 0.0874698 0.0172533 0.0271542 0.149886 -0.0517268 -0.0924663 -0.0274975 -0.153588 0.0430396 0.0823552 0.0235982 0.0118284 0.0754247 -0.0321802 -0.00501899 -0.0324427 -0.0236422 -0.0676852 0.040163 0.172124 0.0841316 -0.072149 0.0244616 0.0490348 0.00270421 0.103049 -0.187956 0.0048888 -0.138106 0.0160503 0.0571637 -0.0304074 0.106948 0.151563 -0.0831959 0.021528 0.0221728 0.0999386 -0.107008 -0.172974 -0.111336 0.0777394 -0.0120242 0.0672991 0.0253744 -0.0238143 -0.137343 0.0754617 -0.0414171 -0.0561731 
0.083262 -0.0654365 -0.0734859 -0.0496281 0.154134 0.0842954 0.00696146 -0.101861 -0.151128 -0.0625334 -0.0611989 0.117901 0.0896732 0.0622573 -0.0353442 -0.00517842 -0.010745 0.0770204 0.0195786 0.145074 0.148782 -0.0114763 0.125124 0.130038 0.00373366 0.0889175 -0.0242302 -0.202137 0.0367114 0.130248 -0.0643835 0.0390535 -0.0687757 0.0108165 0.0467639 0.0130406 -0.0635382 0.176722 -0.00310086 -0.0887147 -0.0508662 0.0970108 -0.0239257 0.10119 -0.165111 0.0613268 0.173402 0.0126952 -0.0814646 0.0374445 0.0316969 -0.0777303 0.0134582 0.0142451 0.180535 -0.0257187 0.0744943 0.248868 0.00775025 -0.140604 0.0393858 0.025978 0.199687 -0.034144 0.102089 -0.0941161 -0.0326674 0.0975533 0.00199007 0.0828405 0.020966 0.126507 -0.030531 -0.0285928 -0.0700239 0.0159819 -0.0692219 0.0146671 0.0894687 0.0309704 0.00418325 0.136246 -0.0406134 -0.0839424 -0.0268338 -0.159022 0.0607905 0.0970755 0.0267872 -0.00754946 0.0791834 -0.0267204 -0.0078359 -0.0240872 -0.0229553 -0.0765713 0.0361718 0.16779 0.0773531 -0.0656421 0.0273895 0.0373032 -0.00384019 0.0913315 -0.186165 0.00855564 -0.131575 0.0153983 0.0546207 -0.0425662 0.108503 0.146901 -0.0876626 0.0144808 0.0349388 0.113605 -0.114807 -0.157318 -0.10838 0.0863982 -0.0260637 0.062289 0.00463824 -0.0315368 -0.140981 0.0855448 -0.0485146 -0.0495505 
0.088586 -0.0665041 -0.0815323 -0.0538028 0.155822 0.0849489 0.0101405 -0.0969928 -0.147123 -0.0570682 -0.0633525 0.12373 0.0936758 0.0478798 -0.0527437 0.00312114 -0.0261175 0.0744177 0.00314866 0.151505 0.158737 -0.0199137 0.118306 0.121029 -0.00166882 0.0947236 -0.0266019 -0.195276 0.040857 0.134348 -0.0739475 0.0545013 -0.0782875 0.0149206 0.0367631 0.00391704 -0.0728872 0.176274 0.00279447 -0.0953358 -0.0497156 0.081656 -0.018195 0.101612 -0.154818 0.0451565 0.168493 0.0217076 -0.0790133 0.0442395 0.0359614 -0.0720869 0.000678193 0.019969 0.182817 -0.0370831 0.0720424 0.236909 -0.00304977 -0.146929 0.0472925 0.0197179 0.206124 -0.0175924 0.0891203 -0.0947923 -0.0404968 0.101684 0.00521315 0.075253 0.0119535 0.128881 -0.0300517 -0.018133 -0.0745296 0.0123721 -0.0575604 0.0102512 0.0880889 0.0363338 0.0166627 0.133104 -0.0338592 -0.078719 -0.0265795 -0.157421 0.06407 0.113509 0.0458283 -0.00658609 0.0779025 -0.0306533 -0.020749 -0.015153 -0.0326886 -0.0772779 0.0340096 0.163274 0.0762075 -0.0671288 0.0402995 0.0299468 -0.00991191 0.100126 -0.179171 0.00859196 -0.139878 0.0328326 0.0545073 -0.0447566 0.104212 0.154326 -0.0980882 0.024542 0.0408892 0.113484 -0.109332 -0.141789 -0.103441 0.0875415 -0.0288705 0.0668481 0.0218502 -0.0354033 -0.146314 0.0800419 -0.0469847 -0.0516263 
0.0681021 -0.0321954 -0.055554 -0.0386896 0.130352 0.0936825 0.0191234 -0.14878 -0.212101 0.0152723 -0.0399732 0.0764924 0.110867 0.0856468 0.0346728 -0.0193372 0.00981759 0.0890772 0.108064 0.120303 0.0950953 -0.000669293 0.0906232 0.1181 0.000931115 0.131287 -0.0846933 -0.196634 0.0707975 0.139903 -0.0628515 0.066826 -0.0760665 -0.0244221 0.101547 0.0379602 -0.0192949 0.139018 0.0603338 -0.0940916 -0.0374825 0.0680051 -0.00616222 0.0729572 -0.186319 0.0835458 0.197497 0.0460669 -0.0876492 -0.0251672 0.0324835 -0.0579553 0.0353752 0.0188296 0.167387 -0.0116663 0.0914115 0.217529 0.0167095 -0.112289 0.0296809 0.0532801 0.177443 -0.0553273 0.120034 -0.0223955 0.00474439 0.054264 0.00216775 0.0415106 0.00459641 0.132479 -0.0319653 -0.000821445 -0.0347846 -0.00573531 -0.0927119 0.0182057 0.129406 0.0188324 0.0351437 0.142228 -0.0407829 -0.0695861 -0.0031704 -0.153146 0.0450295 0.0609212 0.0202474 -0.00442396 0.0915055 0.0356328 0.0451441 -0.0326517 -0.063048 -0.123689 0.0574986 0.203576 0.0813565 -0.0728127 0.0413548 0.0830111 0.0419539 0.049445 -0.171672 0.0376091 -0.067182 0.0183371 0.0844606 0.0211101 0.0969013 0.0930664 -0.0701996 -0.0426803 0.0106646 0.0982854 -0.0953389 -0.171861 -0.141323 0.0472543 0.00223615 -0.0190362 0.0127078 -0.0409705 -0.178259 0.111824 -0.0497448 -0.00547178 
0.0797242 -0.087174 -0.0860026 -0.0343769 0.163855 0.0816772 0.0561908 -0.125583 -0.141584 -0.00654562 -0.0312063 0.137204 0.107535 0.0684911 -0.0202724 -0.0385467 -0.0258752 0.0990321 0.0609665 0.141373 0.136161 -0.0218641 0.0787234 0.127003 -0.00292864 0.10264 -0.0585568 -0.201125 0.0508478 0.168526 -0.0788749 0.0484124 -0.0734918 -0.0234763 0.0760502 0.0211107 -0.0597025 0.130799 0.0186562 -0.115147 -0.0144692 0.0810126 -0.0343179 0.10544 -0.213953 0.0401298 0.148638 0.0350722 -0.0346168 -0.023176 0.0178314 -0.0667693 0.0133726 0.0104805 0.190191 -0.0119957 0.0472755 0.231489 -0.0285034 -0.0935066 0.0326555 -0.000738511 0.209073 -0.0203631 0.116262 -0.0722801 -0.0199221 0.0753445 0.0110499 0.0364556 0.0322935 0.1484 -0.0222586 -0.0441922 -0.0727353 0.0365252 -0.0800834 0.0159541 0.102639 0.0272231 0.00861519 0.13237 -0.0209581 -0.0479014 -0.0104077 -0.156378 0.0898537 0.1051 0.034704 -0.0199943 0.081138 -1.64956e-05 0.0121319 -0.0237109 -0.0773955 -0.145279 0.0280678 0.139548 0.100373 -0.0697331 0.0689624 0.0553883 0.0342799 0.0301126 -0.170266 0.0288916 -0.0826034 0.021297 0.0614023 0.0167612 0.101297 0.0922657 -0.0900461 -0.023429 0.0243015 0.11861 -0.100683 -0.142612 -0.136062 0.0754165 -0.0191636 0.00133881 -0.0154318 -0.0330675 -0.162702 0.127953 -0.0600686 -0.00474563 
0.0797242 -0.087174 -0.0860026 -0.0343769 0.163855 0.0816772 0.0561908 -0.125583 -0.141584 -0.00654562 -0.0312063 0.137204 0.107535 0.0684911 -0.0202724 -0.0385467 -0.0258752 0.0990321 0.0609665 0.141373 0.136161 -0.0218641 0.0787234 0.127003 -0.00292864 0.10264 -0.0585568 -0.201125 0.0508478 0.168526 -0.0788749 0.0484124 -0.0734918 -0.0234763 0.0760502 0.0211107 -0.0597025 0.130799 0.0186562 -0.115147 -0.0144692 0.0810126 -0.0343179 0.10544 -0.213953 0.0401298 0.148638 0.0350722 -0.0346168 -0.023176 0.0178314 -0.0667693 0.0133726 0.0104805 0.190191 -0.0119957 0.0472755 0.231489 -0.0285034 -0.0935066 0.0326555 -0.000738511 0.209073 -0.0203631 0.116262 -0.0722801 -0.0199221 0.0753445 0.0110499 0.0364556 0.0322935 0.1484 -0.0222586 -0.0441922 -0.0727353 0.0365252 -0.0800834 0.0159541 0.102639 0.0272231 0.00861519 0.13237 -0.0209581 -0.0479014 -0.0104077 -0.156378 0.0898537 0.1051 0.034704 -0.0199943 0.081138 -1.64956e-05 0.0121319 -0.0237109 -0.0773955 -0.145279 0.0280678 0.139548 0.100373 -0.0697331 0.0689624 0.0553883 0.0342799 0.0301126 -0.170266 0.0288916 -0.0826034 0.021297 0.0614023 0.0167612 0.101297 0.0922657 -0.0900461 -0.023429 0.0243015 0.11861 -0.100683 -0.142612 -0.136062 0.0754165 -0.0191636 0.00133881 -0.0154318 -0.0330675 -0.162702 0.127953 -0.0600686 -0.00474563 
0.093746 -0.120507 -0.0925104 -0.0563166 0.190113 0.100132 0.0668791 -0.0874876 -0.124481 -0.0405031 -0.0709016 0.170371 0.0989268 0.0268157 -0.0476229 -0.0425393 -0.0558619 0.0883843 -0.00848721 0.166359 0.127943 -0.00871601 0.0835636 0.0977333 -0.0483257 0.0866443 -0.0570243 -0.197098 -0.0129823 0.137802 -0.104981 0.0622088 -0.0868052 0.0243397 0.0620099 0.0082567 -0.0537046 0.132005 -0.0168057 -0.123335 0.0179607 0.0736684 -0.0164267 0.10118 -0.215721 0.0348275 0.132327 0.042185 -0.0447168 0.0410712 0.0133838 -0.116948 -0.0136956 0.0420726 0.207265 -0.0323019 0.0261362 0.217765 -0.0556165 -0.0948645 0.0480697 0.0163284 0.207027 -0.0165121 0.117909 -0.106703 -0.0505737 0.105271 0.00657219 0.0361086 0.0308255 0.129642 0.00427508 -0.0317864 -0.0960192 0.0724797 -0.0661528 -0.00813197 0.100462 0.00224232 0.015784 0.127715 -0.0249886 -0.037225 -0.0394936 -0.13947 0.113176 0.133396 0.0415071 0.0213813 0.0938302 -0.0497465 -0.0105855 -0.0157596 -0.0862156 -0.094717 0.0243937 0.0946424 0.0859404 -0.0509601 0.0718342 0.0320506 -0.000188273 0.0479785 -0.14795 0.00367551 -0.136703 0.0386971 -0.0128691 0.0195461 0.109123 0.108128 -0.0853476 0.00496638 0.0153316 0.106797 -0.101538 -0.125563 -0.123007 0.081044 -0.00923822 0.0321916 0.0222118 -0.0203239 -0.125219 0.0875115 -0.0708288 -0.0533093 
0.0276169 -0.0266395 -0.0870321 -0.0872516 0.0938091 0.0990892 0.0207394 -0.169894 -0.170953 0.0444272 -0.0357991 0.0678389 0.109188 0.0609342 0.0538548 -0.0354572 -0.0613196 -0.00622691 0.136891 0.112302 0.0201603 -5.00565e-05 0.0122228 -0.00711062 -0.0350189 0.202339 -0.123215 -0.169122 0.0446984 0.109699 -0.062394 0.0517922 -0.0661978 -0.06215 0.137989 0.0689132 0.00867282 0.106424 0.130437 -0.115675 -0.0169052 0.0194996 -0.0097314 0.0224973 -0.146936 0.111351 0.153438 0.0757049 -0.0928956 -0.0631374 -0.0925156 -0.0787506 0.0719676 0.0385095 0.138513 -0.00872297 0.0194011 0.185829 -0.0993211 -0.0729341 0.0212126 0.0750628 0.225644 -0.04289 0.113497 0.0896597 0.0105864 0.0874538 0.0287988 -0.0885474 0.0186165 0.105458 -0.0313474 0.00348768 0.00986781 0.0341036 -0.111262 -0.071989 0.168575 0.0289156 0.0590486 0.105173 -0.0426843 -0.0168368 -0.0260222 -0.123172 0.0513088 0.0794697 0.0673454 0.00956092 0.124269 0.0333714 0.104864 0.0480898 -0.114536 -0.145328 0.066066 0.124316 0.0864093 -0.0629709 0.0461949 0.0368597 -0.00571818 -0.0697 -0.163891 0.10973 -0.00760114 0.0168188 0.0210505 0.100904 0.130699 0.0205006 -0.0625677 -0.065576 0.00200033 0.0852726 -0.139815 -0.0834823 -0.134603 -0.00750145 0.0143297 -0.08931 0.0596657 -0.0295524 -0.163452 0.134847 -0.0535575 -0.00197457 
