{
  "descriptor": [
    -0.08662058413028717,
    0.10788122564554214,
    0.043314553797245026,
    -0.10249907523393631,
    -0.15258333086967468,
    0.008193127810955048,
    -0.09282595664262772,
    -0.1069498360157013,
    0.15320631861686707,
    -0.11879734694957733,
    0.2061760127544403,
    -0.0925949215888977,
    -0.187773659825325,
    -0.09063606709241867,
    -0.08550679683685303,
    0.23177729547023773,
    -0.22986112534999847,
    -0.19571396708488464,
    0.01561747957020998,
    0.03915495052933693,
    0.1312960982322693,
    0.018700985237956047,
    -0.01682467572391033,
    0.04098287597298622,
    -0.12074612081050873,
    -0.38678792119026184,
    -0.09453044086694717,
    -0.03474045172333717,
    -0.015614797361195087,
    -0.11109603196382523,
    -0.014815596863627434,
    0.038177069276571274,
    -0.20019732415676117,
    -0.028498450294137,
    0.01582781970500946,
    0.09800776839256287,
    -0.015787551179528236,
    -0.14104555547237396,
    0.10465605556964874,
    -0.005028951913118362,
    -0.32550814747810364,
    0.034004561603069305,
    0.10110490769147873,
    0.20696808397769928,
    0.17184995114803314,
    0.010255378670990467,
    -0.0010835996363312006,
    -0.1459321677684784,
    0.0989747866988182,
    -0.15557332336902618,
    -0.022305864840745926,
    0.13055914640426636,
    0.04615878313779831,
    0.022195633500814438,
    -0.040583536028862,
    -0.11059980094432831,
    0.01679842732846737,
    0.13731996715068817,
    -0.17814984917640686,
    -0.04204852879047394,
    0.12037383764982224,
    -0.10686354339122772,
    0.00028590852161869407,
    -0.12478234618902206,
    0.16847433149814606,
    0.09653352200984955,
    -0.08791297674179077,
    -0.2538797855377197,
    0.15141789615154266,
    -0.1445813626050949,
    -0.08438247442245483,
    0.08359678089618683,
    -0.10466970503330231,
    -0.18200834095478058,
    -0.2516993284225464,
    -0.05075462535023689,
    0.3587683141231537,
    0.07058477401733398,
    -0.1430812031030655,
    0.04482811689376831,
    -0.02990713156759739,
    0.012829319573938847,
    0.08854728192090988,
    0.16414080560207367,
    0.0555061399936676,
    0.026225728914141655,
    -0.12159698456525803,
    -0.022325972095131874,
    0.266571968793869,
    -0.06100143492221832,
    0.021711083129048347,
    0.20107299089431763,
    -0.005270537920296192,
    0.04550390690565109,
    0.02533540688455105,
    0.028349198400974274,
    -0.10438758879899979,
    0.1171715185046196,
    -0.13822141289710999,
    -0.00030278117628768086,
    -0.07939009368419647,
    -0.012766581028699875,
    -0.03863159939646721,
    0.11023655533790588,
    -0.09766694903373718,
    0.1376386284828186,
    0.01953538879752159,
    0.01802275888621807,
    -0.018475012853741646,
    -0.041140198707580566,
    -0.054188720881938934,
    -0.06964059919118881,
    0.12022986263036728,
    -0.20285308361053467,
    0.15948651731014252,
    0.16002978384494781,
    0.11982210725545883,
    0.13449016213417053,
    0.13778135180473328,
    0.10227217525243759,
    -0.01540753711014986,
    -0.08299878239631653,
    -0.2668924331665039,
    0.01308248657733202,
    0.07439517229795456,
    -0.1024143248796463,
    0.06217937543988228,
    -0.013105489313602448
  ]
}