{
  "descriptor": [
    -0.10081523656845093,
    0.057506296783685684,
    0.127682164311409,
    -0.07511068880558014,
    -0.1384141445159912,
    0.02568088471889496,
    -0.04393608868122101,
    -0.05955017730593681,
    0.14883369207382202,
    -0.12399869412183762,
    0.19582460820674896,
    -0.025547027587890625,
    -0.21999941766262054,
    0.03336410969495773,
    -0.05949702858924866,
    0.09893691539764404,
    -0.12798218429088593,
    -0.17798393964767456,
    -0.004436603747308254,
    -0.08460400998592377,
    0.0477425716817379,
    0.1278390884399414,
    -0.009998372755944729,
    0.056830745190382004,
    -0.14969871938228607,
    -0.3237302899360657,
    -0.0903739258646965,
    -0.1186802014708519,
    -0.008927416987717152,
    -0.1298656463623047,
    -0.03679578751325607,
    0.11913322657346725,
    -0.11946164071559906,
    0.016088567674160004,
    0.042042508721351624,
    0.07124258577823639,
    -0.04501837119460106,
    -0.06827497482299805,
    0.24687132239341736,
    0.09822342544794083,
    -0.194661945104599,
    -0.014351689256727695,
    0.05752941966056824,
    0.28463342785835266,
    0.10179384052753448,
    -0.03404708579182625,
    -0.014588911086320877,
    0.0024372157640755177,
    0.10643450170755386,
    -0.2692417800426483,
    0.048818133771419525,
    0.23425814509391785,
    0.06747128069400787,
    0.10033494234085083,
    0.09718364477157593,
    -0.1022285744547844,
    0.005341728217899799,
    0.08951742202043533,
    -0.12771210074424744,
    0.07917287200689316,
    0.04788961261510849,
    -0.11020079255104065,
    -0.004109951201826334,
    -0.06786062568426132,
    0.15502673387527466,
    0.09590557962656021,
    -0.09585465490818024,
    -0.11015329509973526,
    0.11051974445581436,
    -0.11446192115545273,
    -0.16827452182769775,
    0.07527519017457962,
    -0.15095269680023193,
    -0.12684977054595947,
    -0.2013414055109024,
    0.0711979940533638,
    0.40622055530548096,
    0.11001656204462051,
    -0.14200326800346375,
    0.05865605175495148,
    -0.013066064566373825,
    -0.08762051165103912,
    0.014265499077737331,
    0.09439563006162643,
    -0.10794016718864441,
    0.06010260432958603,
    -0.020829176530241966,
    0.05641791224479675,
    0.19279944896697998,
    0.04174978658556938,
    -0.01838340051472187,
    0.2133403718471527,
    -0.017975445836782455,
    0.09347538650035858,
    0.10439856350421906,
    0.05917761102318764,
    -0.04412142187356949,
    -0.06586305797100067,
    -0.13616707921028137,
    0.015523195266723633,
    -0.006538805551826954,
    -0.11874259263277054,
    -0.05277387052774429,
    0.12381398677825928,
    -0.21889252960681915,
    0.13763906061649323,
    -0.026916347444057465,
    -0.09341137111186981,
    -0.07181525975465775,
    0.046570658683776855,
    -0.10486052185297012,
    0.02386012114584446,
    0.14292468130588531,
    -0.2404632270336151,
    0.14733397960662842,
    0.1612369269132614,
    0.042254745960235596,
    0.1274789273738861,
    0.08355604857206345,
    -0.012616008520126343,
    -0.011966293677687645,
    -0.05835109204053879,
    -0.12747985124588013,
    -0.1342693418264389,
    0.10182134062051773,
    -0.008960777893662453,
    -0.021470120176672935,
    0.0036992505192756653
  ]
}