{
  "descriptor": [
    -0.041241101920604706,
    0.14300227165222168,
    0.14189325273036957,
    -0.05147707834839821,
    -0.09156614542007446,
    0.0693349838256836,
    -0.021033352240920067,
    0.00903345551341772,
    0.15040703117847443,
    -0.05094831809401512,
    0.22691257297992706,
    -0.04068094864487648,
    -0.2320079356431961,
    0.023506956174969673,
    -0.005799399223178625,
    0.10917896032333374,
    -0.15390998125076294,
    -0.07704030722379684,
    -0.1868201494216919,
    -0.09520081430673599,
    -0.009730779565870762,
    0.08796709775924683,
    0.11893864721059799,
    -0.04294727370142937,
    -0.1940440684556961,
    -0.3363509178161621,
    -0.06496799737215042,
    -0.09723220020532608,
    0.13558118045330048,
    -0.047955650836229324,
    0.04012064263224602,
    0.056351203471422195,
    -0.13345961272716522,
    -0.021027861163020134,
    0.06748078018426895,
    0.03425877168774605,
    -0.08122142404317856,
    -0.04120318964123726,
    0.2443341761827469,
    -0.045431315898895264,
    -0.2209354043006897,
    0.0523398220539093,
    0.09434691816568375,
    0.22613190114498138,
    0.24292536079883575,
    0.02958381175994873,
    0.023545080795884132,
    -0.05082445964217186,
    0.03367362543940544,
    -0.26778849959373474,
    0.12873323261737823,
    0.1994386464357376,
    0.0999206081032753,
    0.12849105894565582,
    0.13066048920154572,
    -0.0989651307463646,
    -0.012278340756893158,
    0.21859078109264374,
    -0.08365923166275024,
    0.12897449731826782,
    0.10777842998504639,
    -0.06521954387426376,
    -0.05037403106689453,
    -0.0650392547249794,
    0.09183374792337418,
    0.06459011882543564,
    -0.15650467574596405,
    -0.15283551812171936,
    0.1571478694677353,
    -0.11309432983398438,
    -0.051610399037599564,
    0.13599534332752228,
    -0.13303951919078827,
    -0.15030665695667267,
    -0.2410649061203003,
    0.056190937757492065,
    0.38130852580070496,
    0.12684734165668488,
    -0.17095528542995453,
    -0.03611971437931061,
    0.008194453082978725,
    0.010752526111900806,
    -0.005779880564659834,
    0.0801936537027359,
    -0.1533094048500061,
    -0.13358329236507416,
    -0.0027026727329939604,
    0.050094589591026306,
    0.17252178490161896,
    -0.016660379245877266,
    -0.03516272455453873,
    0.22763581573963165,
    -0.002158795716241002,
    -0.009912463836371899,
    -0.008007962256669998,
    0.08662086725234985,
    -0.06331997364759445,
    -0.029233798384666443,
    -0.15078046917915344,
    0.04132391884922981,
    0.07425006479024887,
    -0.14758363366127014,
    -0.04868720844388008,
    0.10081104189157486,
    -0.2035210132598877,
    0.1845625638961792,
    -0.026390956714749336,
    -0.012945805676281452,
    0.07969852536916733,
    0.05126882717013359,
    -0.07246573269367218,
    0.03493152931332588,
    0.2625134289264679,
    -0.22813911736011505,
    0.22882519662380219,
    0.24490898847579956,
    0.02007199078798294,
    0.08483686298131943,
    0.16061551868915558,
    0.09007487446069717,
    0.07295083999633789,
    0.017374172806739807,
    -0.1713152378797531,
    -0.13188420236110687,
    0.006284411996603012,
    -0.09963253885507584,
    -0.023936202749609947,
    0.04130714759230614
  ]
}