{
  "descriptor": [
    -0.05437394231557846,
    0.06803219020366669,
    0.1443946808576584,
    -0.08590906113386154,
    -0.055202316492795944,
    -0.04305524379014969,
    -0.005077608861029148,
    -0.11692193895578384,
    0.18427123129367828,
    -0.0996985211968422,
    0.17445161938667297,
    -0.045199163258075714,
    -0.28834253549575806,
    -0.018442820757627487,
    0.018428442999720573,
    0.1614988148212433,
    -0.1654602736234665,
    -0.20237132906913757,
    -0.19471687078475952,
    -0.085160031914711,
    0.003846158040687442,
    0.0833883285522461,
    0.014279586263000965,
    0.05407319590449333,
    -0.19553478062152863,
    -0.21440407633781433,
    0.03042941726744175,
    -0.08108534663915634,
    -0.04119177535176277,
    -0.11656732857227325,
    0.15433895587921143,
    0.15457911789417267,
    -0.1494937390089035,
    0.04019353911280632,
    -0.018485434353351593,
    0.05565870553255081,
    -0.08887816965579987,
    -0.16150714457035065,
    0.28151366114616394,
    -0.03678996115922928,
    -0.3097619414329529,
    -0.059603504836559296,
    0.050464123487472534,
    0.2465493381023407,
    0.26928025484085083,
    -0.04679900035262108,
    0.003487424459308386,
    -0.06713638454675674,
    0.13869500160217285,
    -0.4195348620414734,
    -0.010479266755282879,
    0.18578822910785675,
    0.021765880286693573,
    0.09462760388851166,
    0.1337166279554367,
    -0.2093239277601242,
    0.03911937028169632,
    0.05694813281297684,
    -0.1830136775970459,
    0.033797234296798706,
    0.053178440779447556,
    -0.15173697471618652,
    0.031597308814525604,
    -0.11458855867385864,
    0.20572781562805176,
    0.051399968564510345,
    -0.15238897502422333,
    -0.10339458286762238,
    0.17828544974327087,
    -0.17885324358940125,
    -0.14305731654167175,
    0.18779955804347992,
    -0.10332175344228745,
    -0.18423013389110565,
    -0.340666264295578,
    -0.050439365208148956,
    0.3582541346549988,
    0.1263810098171234,
    -0.18354684114456177,
    0.05291791632771492,
    -0.04060563072562218,
    -0.014751682989299297,
    0.0035183660220354795,
    0.16150929033756256,
    -0.0009216127800755203,
    -0.04661405086517334,
    -0.06360457837581635,
    -0.00555105647072196,
    0.2531758248806,
    -0.03865377977490425,
    -0.06335216015577316,
    0.30688104033470154,
    0.037158817052841187,
    -0.08830767869949341,
    -0.028198380023241043,
    0.029628749936819077,
    -0.048159126192331314,
    0.02007158100605011,
    -0.11660510301589966,
    0.036200422793626785,
    0.06667239964008331,
    0.02845665253698826,
    0.03698717802762985,
    0.1268664300441742,
    -0.13223159313201904,
    0.22563108801841736,
    -0.015906453132629395,
    0.021442554891109467,
    0.011684085242450237,
    -0.023928094655275345,
    -0.0868241935968399,
    -0.010373176075518131,
    0.1940086930990219,
    -0.27054357528686523,
    0.16184762120246887,
    0.13622206449508667,
    0.033334460109472275,
    0.08975166827440262,
    0.05164240673184395,
    0.10932596027851105,
    -0.001485542394220829,
    0.01890060305595398,
    -0.1765809804201126,
    -0.08690064400434494,
    0.056217700242996216,
    -0.013910353183746338,
    0.03087226115167141,
    0.10661240667104721
  ]
}