{
  "descriptor": [
    -0.08874184638261795,
    0.05588287487626076,
    0.1253804713487625,
    -0.09302885830402374,
    -0.17370294034481049,
    0.010783372446894646,
    -0.039853040128946304,
    -0.05995761603116989,
    0.16908659040927887,
    -0.16538603603839874,
    0.19684380292892456,
    -0.04804973676800728,
    -0.22535963356494904,
    0.08702675998210907,
    -0.05564648285508156,
    0.12618021667003632,
    -0.14725911617279053,
    -0.19170863926410675,
    -0.031629517674446106,
    -0.0920819342136383,
    0.02804999239742756,
    0.12029213458299637,
    -0.04246477037668228,
    0.06461116671562195,
    -0.157948300242424,
    -0.33876606822013855,
    -0.0754665657877922,
    -0.1033700481057167,
    0.005058257840573788,
    -0.11981089413166046,
    -0.04455849528312683,
    0.10774480551481247,
    -0.11770278215408325,
    0.01951821893453598,
    0.040774255990982056,
    0.0492875874042511,
    -0.039887409657239914,
    -0.12246362864971161,
    0.25553613901138306,
    0.09993809461593628,
    -0.24538835883140564,
    -0.014632917940616608,
    0.07397446781396866,
    0.26258334517478943,
    0.10957048833370209,
    -0.05658546835184097,
    0.00681128166615963,
    -0.02662535011768341,
    0.13343240320682526,
    -0.28147339820861816,
    0.03326364606618881,
    0.21000705659389496,
    0.05146317183971405,
    0.09377477318048477,
    0.08387593924999237,
    -0.11401066184043884,
    -0.008899818174540997,
    0.10433214902877808,
    -0.12441730499267578,
    0.06560488045215607,
    0.07939019054174423,
    -0.10558296740055084,
    -0.014061723835766315,
    -0.07584720104932785,
    0.1688157021999359,
    0.10061760991811752,
    -0.09478624165058136,
    -0.10570123046636581,
    0.13432419300079346,
    -0.12561221420764923,
    -0.15716737508773804,
    0.07135411351919174,
    -0.12927567958831787,
    -0.12965941429138184,
    -0.18840934336185455,
    0.06056641414761543,
    0.4202312231063843,
    0.11641540378332138,
    -0.12421884387731552,
    0.058531396090984344,
    -0.029280489310622215,
    -0.07001058757305145,
    0.032612428069114685,
    0.10272606462240219,
    -0.09671060740947723,
    0.04768018797039986,
    -0.015415478497743607,
    0.06371565908193588,
    0.2386787086725235,
    0.03585391864180565,
    0.0023286654613912106,
    0.23266565799713135,
    -0.004727993160486221,
    0.06636408716440201,
    0.09699370712041855,
    0.07713119685649872,
    -0.07524775713682175,
    -0.07554015517234802,
    -0.12270202487707138,
    0.006925677880644798,
    0.02725870907306671,
    -0.1020568460226059,
    -0.04211687669157982,
    0.13101090490818024,
    -0.24186472594738007,
    0.13474313914775848,
    -0.04002249613404274,
    -0.08670206367969513,
    -0.030723003670573235,
    0.04923725873231888,
    -0.07085549831390381,
    -0.0010273164371028543,
    0.13939905166625977,
    -0.22305089235305786,
    0.11140841245651245,
    0.14971855282783508,
    0.040383923798799515,
    0.13730791211128235,
    0.0822555422782898,
    -0.016560032963752747,
    -0.007414727006107569,
    -0.07419417053461075,
    -0.14270463585853577,
    -0.12902463972568512,
    0.10061231255531311,
    0.0023682371247559786,
    -0.01523273903876543,
    0.0040041483007371426
  ]
}