{
  "descriptor": [
    -0.07578268647193909,
    0.0710170641541481,
    0.06733346730470657,
    -0.04004744812846184,
    -0.08791448920965195,
    -0.006721270736306906,
    -0.04004517197608948,
    -0.039537400007247925,
    0.11483105272054672,
    -0.06525305658578873,
    0.20056968927383423,
    -0.0591183565557003,
    -0.21886396408081055,
    0.000260013883234933,
    -0.054108671844005585,
    0.11901962757110596,
    -0.12744909524917603,
    -0.12254440784454346,
    -0.05858670175075531,
    -0.0821167528629303,
    0.042178768664598465,
    0.06366919726133347,
    0.003224968444555998,
    0.035464849323034286,
    -0.12376459687948227,
    -0.3225777745246887,
    -0.07028462737798691,
    -0.09463094919919968,
    0.02057998813688755,
    -0.1487177610397339,
    -0.015462741255760193,
    0.12806040048599243,
    -0.13410258293151855,
    0.0065747154876589775,
    0.036101896315813065,
    0.07188054174184799,
    -0.02154185064136982,
    -0.06494263559579849,
    0.23445579409599304,
    0.07358404248952866,
    -0.16064251959323883,
    0.038857027888298035,
    0.04405423253774643,
    0.29628080129623413,
    0.1602388471364975,
    -0.008188079111278057,
    -0.015667833387851715,
    -0.02057616040110588,
    0.09489087015390396,
    -0.2713334262371063,
    0.019273055717349052,
    0.21145027875900269,
    0.06005299091339111,
    0.09928426146507263,
    0.07068625092506409,
    -0.11494600772857666,
    0.025398824363946915,
    0.07378841936588287,
    -0.16481703519821167,
    0.06107500568032265,
    0.03195760026574135,
    -0.10415687412023544,
    -0.02002757601439953,
    -0.08308391273021698,
    0.16619855165481567,
    0.10641638189554214,
    -0.09157489240169525,
    -0.11791932582855225,
    0.1272541731595993,
    -0.12247315794229507,
    -0.08274862170219421,
    0.06373979896306992,
    -0.14041319489479065,
    -0.15071967244148254,
    -0.20282647013664246,
    0.08307716250419617,
    0.35716748237609863,
    0.14003804326057434,
    -0.16233256459236145,
    0.06673546880483627,
    -0.026992496103048325,
    -0.06612975895404816,
    0.030544234439730644,
    0.07318941503763199,
    -0.08129479736089706,
    -0.0030945846810936928,
    -0.04046686366200447,
    0.053808584809303284,
    0.17920036613941193,
    -0.00018875290697906166,
    -0.01784684881567955,
    0.20262163877487183,
    -0.031576257199048996,
    0.056273605674505234,
    0.0558178685605526,
    0.027881529182195663,
    -0.07907549291849136,
    -0.026884546503424644,
    -0.12049537152051926,
    -0.0017173326341435313,
    0.01860029809176922,
    -0.13218849897384644,
    -0.01247397530823946,
    0.11692503839731216,
    -0.1874878853559494,
    0.12996721267700195,
    -0.034121494740247726,
    -0.05702224746346474,
    -0.027639035135507584,
    0.04315211996436119,
    -0.06869684904813766,
    0.016008837148547173,
    0.14621314406394958,
    -0.24089796841144562,
    0.20861488580703735,
    0.17698651552200317,
    0.03150263428688049,
    0.11175959557294846,
    0.07211674004793167,
    0.05154600739479065,
    -0.00501842750236392,
    -0.014279570430517197,
    -0.12700100243091583,
    -0.09585756808519363,
    0.051630862057209015,
    0.006468126084655523,
    -0.027292408049106598,
    0.0043051899410784245
  ]
}