0.107584 -0.00292799 -0.167795 0.0553774 0.0968726 0.117906 0.0157229 -0.0144303 0.00351615 -0.0714038 0.0963164 0.152236 0.062666 -0.197731 -0.198096 0.0541128 -0.0192906 0.0814149 -0.194614 0.191563 0.165306 -0.093973 0.0885548 0.147275 -0.0352923 -0.0171368 0.020944 -0.217789 0.00876428 0.0549822 -0.0369075 0.0962067 -0.027173 0.101752 -0.109895 -0.0499344 -0.0894254 0.121292 -0.0744503 -0.0187853 0.0343654 -0.0489885 -0.074192 0.123441 -0.110904 -0.0933071 0.126601 -0.0139385 -0.107181 0.0875904 0.0694686 -0.0293469 -0.0971733 -0.00664961 0.0545243 -0.0203 0.0230709 0.0830048 0.0076475 -0.091276 -0.0510185 -0.0579239 0.216033 -0.0591385 0.0173457 -0.177074 -0.0395638 0.034166 -0.0375624 0.0784637 -0.0411283 0.031162 -0.0356108 0.0284718 -0.0190651 -0.0292229 -0.0147389 0.116096 -0.0926181 0.0752986 -0.0935722 0.0671599 -0.0141651 -0.0720465 -0.079525 0.0983244 0.0850238 0.0265614 -0.0194274 -0.037291 0.0409844 -0.153457 -0.14337 -0.00614154 0.0130656 -0.0377678 -0.0293784 0.019137 -0.00451611 -0.0569334 0.0135597 -0.0378547 -0.0328941 0.205406 -0.0220727 -0.0164369 -0.0912064 0.161088 -0.00988502 -0.100216 -0.0207722 0.178163 -0.0378257 0.0401635 0.0489043 0.0250162 -0.145159 -0.107431 0.0607075 0.135721 -0.030619 0.0993238 -0.0106645 0.0599112 -0.0213112 0.0235829 -0.0403017 -0.0506267 
0.109151 0.00212725 -0.17016 0.0604481 0.0986255 0.113909 0.0160918 -0.0139879 0.0025446 -0.0585172 0.105322 0.147816 0.065981 -0.19339 -0.193633 0.0595963 -0.00667655 0.0885647 -0.193751 0.19083 0.16603 -0.102372 0.0908893 0.147511 -0.0298741 -0.0223161 0.0195072 -0.214558 0.0152491 0.0558875 -0.0340602 0.10289 -0.0239493 0.101198 -0.114226 -0.0505747 -0.0906341 0.120901 -0.069142 -0.0215336 0.0320607 -0.0507244 -0.0763821 0.119095 -0.110705 -0.0954902 0.121037 -0.0104313 -0.105834 0.0777388 0.0731686 -0.0207738 -0.10176 -0.0122697 0.0451692 -0.0181269 0.0248369 0.0767135 0.0116417 -0.0857193 -0.0540891 -0.063926 0.210211 -0.0623281 0.0156455 -0.171586 -0.0432277 0.0380307 -0.0391225 0.0794054 -0.0421244 0.0332557 -0.0395173 0.0242638 -0.020569 -0.0328015 -0.00906952 0.12385 -0.0961433 0.0724718 -0.100991 0.0641372 -0.0143631 -0.0723333 -0.0768001 0.101584 0.0829455 0.0236927 -0.0168429 -0.0408933 0.036165 -0.150058 -0.14379 -0.00442625 0.0161327 -0.042801 -0.0318344 0.0187566 -0.00775976 -0.0596662 0.0161087 -0.0386972 -0.030363 0.209153 -0.0153171 -0.0150776 -0.0861947 0.160955 0.00246368 -0.104091 -0.030789 0.177744 -0.0360682 0.0427713 0.0548164 0.0199105 -0.146419 -0.107977 0.0643047 0.13796 -0.0331327 0.0983529 -0.0168223 0.0669259 -0.0202545 0.0226373 -0.0404208 -0.0486303 
0.104365 0.00772925 -0.168066 0.069034 0.0944212 0.102975 0.0128701 -0.0297532 0.0184391 -0.080267 0.0958178 0.152847 0.0533313 -0.194878 -0.209645 0.0584046 -0.0206604 0.0766789 -0.191619 0.192704 0.170502 -0.10017 0.0910525 0.138756 -0.0267115 -0.0176961 0.0221293 -0.214963 0.00836441 0.0679281 -0.0398425 0.101986 -0.0148449 0.097917 -0.105469 -0.0567125 -0.0808913 0.13954 -0.0702146 -0.0281125 0.0259604 -0.0468123 -0.0666227 0.112233 -0.104153 -0.0873337 0.129277 -0.0243122 -0.100613 0.0835765 0.0680101 -0.0102376 -0.0844351 -0.00172258 0.0672392 -0.024629 0.0312663 0.0678751 -0.00088498 -0.0984667 -0.0499456 -0.0725559 0.215665 -0.0574788 0.0194221 -0.171983 -0.0412967 0.0361659 -0.0355465 0.0786091 -0.0380178 0.0270107 -0.0415853 0.0284434 -0.0135326 -0.0253598 -0.011521 0.111153 -0.100011 0.0816002 -0.0980932 0.0743775 -0.0135402 -0.0688812 -0.0707074 0.0961597 0.0730411 0.0327914 -0.0151235 -0.0383372 0.0341291 -0.15562 -0.14114 -0.00199903 0.0128384 -0.0455978 -0.0273005 0.0214559 0.00707035 -0.063315 0.0158951 -0.0376011 -0.0297972 0.20748 -0.0228919 -0.0186729 -0.0796994 0.165338 0.00112869 -0.101809 -0.027446 0.175604 -0.0462582 0.0428349 0.0558256 0.0260055 -0.148761 -0.107782 0.0647982 0.134946 -0.0322451 0.117314 -0.00920018 0.0558468 -0.0106195 0.0293653 -0.0202014 -0.0494945 
0.107461 0.00352495 -0.161091 0.0612538 0.092805 0.113269 0.0136156 -0.0159807 0.019065 -0.0774825 0.104515 0.14607 0.0583818 -0.200471 -0.200434 0.0540322 -0.0241197 0.0789805 -0.20385 0.188748 0.168507 -0.0956218 0.0922395 0.138037 -0.0321206 -0.0217558 0.0207276 -0.213174 0.00870147 0.0496018 -0.0319245 0.0953583 -0.020551 0.104403 -0.108594 -0.0544128 -0.0844974 0.134868 -0.070923 -0.0206262 0.035726 -0.0498218 -0.0808998 0.114592 -0.109549 -0.100232 0.114879 -0.0159906 -0.100531 0.0864985 0.0619085 -0.0136776 -0.0948871 -0.00225478 0.0524438 -0.0242447 0.0285799 0.0676384 -0.00176209 -0.0958112 -0.055953 -0.0691603 0.214344 -0.0556261 0.013179 -0.169695 -0.0371168 0.0408325 -0.032624 0.0819401 -0.0386801 0.0270487 -0.0356402 0.0306165 -0.0136442 -0.0342971 -0.0182435 0.110417 -0.0989788 0.0832255 -0.0980343 0.0669051 -0.00915843 -0.0705295 -0.0742943 0.101751 0.0832598 0.032549 -0.0173258 -0.0380573 0.0433369 -0.157765 -0.141161 -0.00416902 0.00973215 -0.0481302 -0.0336087 0.0152749 -0.00345248 -0.0594283 0.0168793 -0.0390807 -0.0319004 0.20618 -0.0100163 -0.0184093 -0.0797257 0.164158 0.00282176 -0.103937 -0.0266966 0.180563 -0.0429998 0.0476213 0.0582967 0.0238101 -0.149415 -0.10478 0.0685675 0.134491 -0.0292052 0.108873 -0.0134973 0.0645585 -0.00907915 0.0203703 -0.0250222 -0.0440667 
0.0994584 0.0037763 -0.161932 0.057114 0.0952076 0.114188 0.0213014 -0.0187699 0.0134985 -0.0745031 0.0935386 0.148982 0.0634215 -0.201528 -0.199244 0.0487873 -0.0306466 0.0759308 -0.198919 0.194752 0.167752 -0.104936 0.0858488 0.142182 -0.0332292 -0.0174517 0.0118103 -0.216395 0.0136725 0.0542884 -0.0292277 0.0989202 -0.0266341 0.103998 -0.102662 -0.0527575 -0.0810478 0.133871 -0.0702055 -0.0298146 0.041811 -0.0574441 -0.0701488 0.118901 -0.111334 -0.099194 0.124705 -0.0103921 -0.103286 0.0840846 0.0552744 -0.0254249 -0.093545 -0.00352949 0.0643366 -0.0209914 0.0202854 0.0778863 -0.00316668 -0.100781 -0.0535395 -0.063 0.219863 -0.0576542 0.0210851 -0.165096 -0.0368046 0.0298526 -0.0392777 0.0728727 -0.0445766 0.0305182 -0.0386494 0.0366105 -0.0116869 -0.0330704 -0.0143538 0.11624 -0.0861108 0.0781088 -0.0981588 0.0662506 -0.00938197 -0.0663772 -0.0750759 0.0944886 0.0850548 0.0392705 -0.0103822 -0.0360689 0.0482549 -0.158235 -0.135465 -0.0076033 0.00480199 -0.0491238 -0.0305437 0.0218041 -0.0013106 -0.0593054 0.0151879 -0.0395759 -0.0349975 0.20603 -0.0170366 -0.0116264 -0.0828487 0.169364 -5.7512e-05 -0.097693 -0.0262527 0.177778 -0.0490948 0.0443414 0.0542321 0.0249161 -0.14392 -0.105342 0.0649876 0.137904 -0.0276464 0.105329 -0.0115354 0.0621251 -0.0239303 0.0240954 -0.0349022 -0.0471132 
0.0935807 0.00706238 -0.16618 0.049504 0.102113 0.113001 0.032294 -0.0303807 0.00727398 -0.0783348 0.0737676 0.146665 0.0682647 -0.197837 -0.198884 0.0404166 -0.0393334 0.0710993 -0.197224 0.203935 0.164323 -0.113217 0.0864724 0.129592 -0.0392253 -0.0135927 -0.00901139 -0.219832 0.0172376 0.059006 -0.0245027 0.109814 -0.0382173 0.100108 -0.0895953 -0.0505775 -0.0733945 0.147201 -0.0644814 -0.0437685 0.043244 -0.0583933 -0.0614152 0.119791 -0.116055 -0.0888705 0.133796 -0.000617101 -0.102815 0.0865451 0.0388457 -0.0323932 -0.0887776 -0.00236203 0.0735587 -0.0284249 0.0191201 0.0870546 -0.00640245 -0.10923 -0.0484699 -0.051572 0.227068 -0.0609121 0.0306071 -0.162101 -0.0331711 0.0257136 -0.0422947 0.0637133 -0.0434923 0.0356447 -0.0361131 0.0518182 -0.0185219 -0.0349961 -0.0138892 0.109714 -0.071619 0.07216 -0.0933949 0.0688887 -0.0183456 -0.0617109 -0.0704031 0.0809124 0.0795278 0.0497866 0.000637161 -0.0368919 0.0612669 -0.155755 -0.122825 -0.0184244 0.00398949 -0.0551561 -0.023019 0.0350783 -0.00115797 -0.0570166 0.0119874 -0.0374834 -0.0380876 0.209158 -0.0267241 -0.00752289 -0.0846557 0.179583 0.00781675 -0.0806699 -0.0226138 0.176823 -0.062012 0.0494518 0.0455718 0.0255685 -0.137019 -0.107703 0.0606954 0.135357 -0.0299024 0.109833 -0.00435172 0.0621331 -0.0393569 0.0157935 -0.0466057 -0.0539451 
0.0939462 0.00662617 -0.1807 0.0568521 0.114549 0.10577 0.0197839 -0.043649 -0.0050628 -0.0671051 0.0805327 0.162461 0.0626063 -0.18256 -0.207271 0.046988 -0.0226826 0.0902125 -0.177414 0.206028 0.161568 -0.108727 0.0864923 0.142678 -0.0241344 -0.0109636 0.00988371 -0.2111 0.02269 0.0780726 -0.0377125 0.106694 -0.0356406 0.0840676 -0.0973242 -0.0466979 -0.0889988 0.121009 -0.0625314 -0.0370084 0.0335165 -0.0421023 -0.0527307 0.131313 -0.122061 -0.0849097 0.149191 -0.00665689 -0.0976406 0.080533 0.0594672 -0.0260812 -0.0952469 -0.0125514 0.0718334 -0.0225122 0.0165461 0.098199 0.00669129 -0.0964327 -0.0460442 -0.0548188 0.232234 -0.0539856 0.0246344 -0.171802 -0.0408209 0.0240237 -0.0411991 0.0744074 -0.0344296 0.0498801 -0.0309964 0.0394756 -0.0238563 -0.0274078 -0.0129685 0.11854 -0.0832959 0.0601661 -0.0902196 0.0871338 -0.0187202 -0.0606613 -0.0709692 0.0822115 0.0734391 0.0438609 -0.00307028 -0.0445737 0.0424851 -0.14059 -0.133278 -0.0164565 0.0188929 -0.0592464 -0.0278765 0.0406812 0.00233892 -0.0676606 0.00301327 -0.0373239 -0.0222827 0.205443 -0.0422232 0.000214924 -0.0894132 0.171252 0.00589449 -0.0810758 -0.0144545 0.172128 -0.0502051 0.0507662 0.0345285 0.0199685 -0.134922 -0.10976 0.0569302 0.132401 -0.0347232 0.106161 -0.0103534 0.0489197 -0.0510022 0.0286696 -0.051126 -0.0503784 
0.0967057 0.0121846 -0.178624 0.0507264 0.114058 0.104529 0.0260115 -0.034249 0.00045737 -0.070199 0.0797607 0.155104 0.0622656 -0.187391 -0.202188 0.0481478 -0.0254687 0.0782902 -0.194359 0.201613 0.153931 -0.105392 0.089288 0.126557 -0.0289115 -0.0139722 0.0052349 -0.203542 0.0221315 0.062454 -0.033631 0.113318 -0.038688 0.0903407 -0.106071 -0.0521503 -0.086353 0.132155 -0.0640676 -0.0279333 0.0414849 -0.0422486 -0.0573834 0.125998 -0.120918 -0.0842141 0.136426 -0.00487505 -0.0958174 0.0844581 0.0535362 -0.0238222 -0.104266 -0.0102228 0.0610403 -0.0294051 0.0141029 0.0939729 0.00440113 -0.0935111 -0.0508489 -0.055651 0.225178 -0.0531612 0.0196248 -0.168533 -0.037978 0.0319395 -0.0379393 0.0719942 -0.0319488 0.0493002 -0.0234189 0.0518586 -0.0203287 -0.030947 -0.0164919 0.110533 -0.0886175 0.061117 -0.0872399 0.0821072 -0.0171003 -0.0599156 -0.0704298 0.0847277 0.0769568 0.0437593 -0.00456555 -0.0460133 0.046482 -0.145539 -0.136524 -0.0218288 0.0205322 -0.057868 -0.0233905 0.0321496 -0.00309453 -0.0639583 -0.00461341 -0.0428615 -0.022858 0.213492 -0.0423706 -0.00593326 -0.0938953 0.181023 0.0113077 -0.0854412 -0.0104166 0.179998 -0.0543525 0.0586536 0.036245 0.0123784 -0.139103 -0.105919 0.0629766 0.130464 -0.032637 0.115942 -0.0079296 0.0607739 -0.0416177 0.0121195 -0.0554391 -0.0534751 
0.0934035 0.0117105 -0.174247 0.0478472 0.11364 0.113863 0.0301601 -0.0374356 0.000154102 -0.0782067 0.0761156 0.158159 0.0623021 -0.191234 -0.204166 0.0381525 -0.0364504 0.0790785 -0.19006 0.198768 0.161072 -0.101476 0.0767766 0.139324 -0.0294906 -0.0155935 0.000237617 -0.209519 0.0233608 0.0722631 -0.0311718 0.102678 -0.046076 0.0897629 -0.0955553 -0.0479598 -0.0857248 0.117045 -0.0662466 -0.0283809 0.048814 -0.0454522 -0.0521263 0.134058 -0.118463 -0.0819762 0.146242 -0.00453776 -0.101201 0.0809295 0.0490444 -0.0300002 -0.0985413 -0.0115321 0.0701612 -0.0199588 0.00616069 0.105839 0.00113771 -0.0967524 -0.0477389 -0.0456478 0.232395 -0.0535643 0.0219049 -0.171749 -0.032501 0.0189042 -0.040762 0.0704159 -0.0337257 0.0480615 -0.0259586 0.0473696 -0.0194484 -0.0255986 -0.0203621 0.113391 -0.0805124 0.0627355 -0.0850169 0.086812 -0.0162494 -0.0558792 -0.0735305 0.0869342 0.0808716 0.0405358 -0.0111449 -0.0399782 0.0531724 -0.149482 -0.132822 -0.023384 0.0124481 -0.0577432 -0.0256681 0.0325732 0.00237377 -0.0601578 -0.00209268 -0.0370597 -0.0233857 0.207563 -0.0495081 -0.000325161 -0.0952725 0.182602 -0.0036563 -0.0780889 -0.003014 0.168959 -0.0605195 0.049315 0.0295646 0.0222378 -0.137557 -0.106737 0.0579061 0.131681 -0.0288422 0.107078 -0.0120861 0.0550364 -0.0514854 0.0217529 -0.0603623 -0.0538558 
0.0899872 0.00541682 -0.167136 0.0476446 0.110664 0.111838 0.0330757 -0.0320394 0.000195628 -0.0709967 0.0683967 0.154626 0.0615794 -0.192419 -0.194052 0.0458753 -0.0392144 0.0756952 -0.192457 0.200095 0.158549 -0.114347 0.090392 0.134186 -0.035976 -0.0130418 -0.00599884 -0.220574 0.0151882 0.0588317 -0.0300878 0.112317 -0.0375152 0.0968738 -0.0958855 -0.0466713 -0.0793899 0.137677 -0.071216 -0.0335255 0.0480896 -0.0508225 -0.0564 0.116549 -0.119066 -0.0775166 0.142649 -0.00757898 -0.107366 0.0829237 0.0459985 -0.0427431 -0.0933968 -0.006186 0.0766845 -0.0185357 0.0200744 0.0992642 -0.00126042 -0.098223 -0.0471458 -0.0451218 0.222679 -0.0624709 0.0388115 -0.160063 -0.040752 0.0289047 -0.0449418 0.0744321 -0.0400781 0.0462104 -0.0340472 0.0502011 -0.0143067 -0.0243702 -0.0149711 0.113951 -0.0757321 0.0526069 -0.0965171 0.079523 -0.022616 -0.0609296 -0.0803652 0.0850854 0.0816127 0.0470869 -0.00926346 -0.0357477 0.0548126 -0.151477 -0.126291 -0.0250967 0.0107701 -0.046086 -0.0236424 0.0366031 0.00536863 -0.051634 0.003849 -0.047076 -0.033726 0.207204 -0.0349582 -0.00554132 -0.0969127 0.174163 -0.002744 -0.0858017 -0.0189059 0.179481 -0.0508385 0.0407973 0.0434044 0.0254562 -0.139224 -0.109014 0.0583724 0.138635 -0.0239334 0.109991 -0.00607037 0.0601218 -0.0450261 0.0243837 -0.0570738 -0.057074 
0.0968103 0.0114068 -0.179092 0.0498098 0.11821 0.115032 0.0244305 -0.036348 0.000637344 -0.0709882 0.0805846 0.152111 0.0592458 -0.184594 -0.197108 0.0461028 -0.0337718 0.0794741 -0.193163 0.194596 0.156367 -0.107904 0.0924321 0.139933 -0.0198687 -0.0261509 0.00537188 -0.204907 0.022729 0.0605223 -0.0259138 0.100706 -0.0482563 0.0861662 -0.106839 -0.0424333 -0.0971051 0.11103 -0.0691875 -0.0213163 0.0475541 -0.0401844 -0.0619501 0.130184 -0.121625 -0.0812437 0.137154 0.00152034 -0.0948472 0.0819958 0.0508979 -0.0242988 -0.102907 -0.0185625 0.0578117 -0.0216398 0.0145739 0.10657 0.0113954 -0.0905562 -0.0521267 -0.0401793 0.227963 -0.052352 0.0145438 -0.16543 -0.0370135 0.0344894 -0.0358194 0.0844944 -0.0305971 0.0615837 -0.0233087 0.0460179 -0.0158556 -0.0268616 -0.0222872 0.114864 -0.0894649 0.062204 -0.0857636 0.0840115 -0.0176045 -0.0604458 -0.0783345 0.0955607 0.0782313 0.0391912 -0.0181044 -0.0472217 0.0527819 -0.140812 -0.135224 -0.0282279 0.0199916 -0.0604989 -0.0307873 0.034721 0.00111341 -0.0631579 -0.00220841 -0.046618 -0.0175868 0.204565 -0.0452008 -2.48684e-05 -0.100179 0.180001 0.00514997 -0.0830177 -0.00459112 0.180186 -0.0462387 0.0511467 0.0339753 0.0221206 -0.14159 -0.0989428 0.0630381 0.136528 -0.0293862 0.105253 -0.0172423 0.0603148 -0.0575936 0.0213057 -0.0648195 -0.0453819 
0.0950635 0.00891017 -0.177951 0.0401511 0.113953 0.122032 0.0235357 -0.0356983 -0.00742069 -0.0716682 0.0749478 0.158245 0.058273 -0.192616 -0.196527 0.043192 -0.0429115 0.0787505 -0.187469 0.192513 0.153492 -0.0925246 0.0889493 0.136546 -0.0332254 -0.0131203 0.00979678 -0.216048 0.0156463 0.0656012 -0.0361847 0.0942139 -0.0483625 0.0882716 -0.0950342 -0.0443696 -0.0902225 0.111918 -0.069048 -0.0154913 0.0433499 -0.0434153 -0.059621 0.138241 -0.125196 -0.0735025 0.148241 -0.00238884 -0.104696 0.0901757 0.0578459 -0.0357465 -0.103103 -0.010014 0.0656402 -0.0210022 0.0156344 0.110302 0.00577461 -0.0899299 -0.0466105 -0.0424151 0.233951 -0.0542896 0.0275853 -0.182585 -0.0360499 0.0298715 -0.0360507 0.0831597 -0.0320378 0.0557613 -0.0228616 0.0439839 -0.0200167 -0.0248569 -0.0286455 0.112716 -0.0827863 0.0606968 -0.077859 0.0859458 -0.020131 -0.0579535 -0.0844019 0.0873818 0.0813377 0.0353318 -0.0176837 -0.0373878 0.0504817 -0.146187 -0.136643 -0.0273598 0.0142435 -0.0519532 -0.0252934 0.0342857 0.00441541 -0.0573795 -0.00237675 -0.0381826 -0.0245208 0.200728 -0.0464571 -0.0070551 -0.104085 0.176951 -0.0125161 -0.0763263 0.00337022 0.175092 -0.0443076 0.0453683 0.0257531 0.0270902 -0.1397 -0.104283 0.0533108 0.131043 -0.0238442 0.100255 -0.00649639 0.0544158 -0.0506601 0.021702 -0.0636941 -0.0518359 
0.102397 0.011399 -0.17404 0.0561928 0.117268 0.103319 0.0258857 -0.0380353 0.00397137 -0.0641709 0.091153 0.156931 0.0600364 -0.181637 -0.200221 0.0554858 -0.0235732 0.0851336 -0.200354 0.196094 0.156553 -0.105628 0.0912377 0.131145 -0.0241417 -0.0174951 0.00462139 -0.198014 0.0238358 0.0621044 -0.0357276 0.115968 -0.0414055 0.0901006 -0.111961 -0.0515999 -0.094855 0.126012 -0.0571987 -0.0193594 0.0412194 -0.0373719 -0.0647606 0.117229 -0.118826 -0.0891214 0.127582 -0.00589447 -0.0906472 0.0789619 0.0602526 -0.0151918 -0.111529 -0.0118642 0.0534284 -0.0270592 0.0186063 0.0949644 0.00440327 -0.081288 -0.0511584 -0.0569173 0.221927 -0.0496476 0.0139304 -0.164182 -0.0407554 0.0408124 -0.0363609 0.083613 -0.0278146 0.0570741 -0.0213532 0.0515089 -0.0195395 -0.0311844 -0.0159512 0.109898 -0.0973147 0.058358 -0.0865643 0.0853591 -0.0135099 -0.061125 -0.0747272 0.0909704 0.0805808 0.0400352 -0.012665 -0.0503014 0.0436775 -0.143183 -0.137781 -0.0180197 0.0205688 -0.0607455 -0.0304415 0.0268296 0.000105881 -0.0614316 -0.00198248 -0.0472665 -0.0210757 0.215174 -0.032303 -0.00486547 -0.0922733 0.178919 0.0162161 -0.0917934 -0.0150755 0.182652 -0.0477055 0.0614192 0.0419445 0.0131999 -0.14282 -0.0979842 0.0634131 0.131287 -0.0317947 0.114988 -0.014193 0.0616962 -0.0409743 0.0181778 -0.0551795 -0.0471754 
0.0992083 0.011188 -0.188117 0.0538776 0.118084 0.113227 0.0193313 -0.0397329 -0.00905785 -0.0636674 0.0857463 0.159298 0.0591586 -0.176022 -0.199839 0.0512959 -0.0196695 0.0854542 -0.180628 0.195178 0.151976 -0.10752 0.0973552 0.137084 -0.0191737 -0.0210373 0.0132173 -0.203347 0.0191195 0.0664926 -0.0354988 0.105949 -0.0400543 0.0852409 -0.114511 -0.0432961 -0.0934426 0.110094 -0.0624664 -0.0155933 0.0392622 -0.0356558 -0.0564618 0.123336 -0.126504 -0.0838999 0.143746 -0.00875025 -0.0942936 0.0844165 0.0638131 -0.0230661 -0.106968 -0.0110344 0.0566345 -0.0201761 0.0249025 0.104631 0.0146803 -0.0814157 -0.0519935 -0.0435702 0.226978 -0.0626029 0.0176675 -0.167359 -0.0398711 0.0347036 -0.0372367 0.0893908 -0.03068 0.0634295 -0.0258651 0.0486951 -0.015554 -0.0251825 -0.0147409 0.114623 -0.0966759 0.0515047 -0.0922577 0.0872547 -0.0149817 -0.0592172 -0.0784883 0.0983975 0.0743203 0.033241 -0.0164117 -0.0522523 0.0422102 -0.141534 -0.134729 -0.0258016 0.0301701 -0.06016 -0.0297713 0.0418478 -0.000232241 -0.0601163 -0.00886331 -0.0447658 -0.0140646 0.212657 -0.0424084 0.00143301 -0.100042 0.174652 -0.00168793 -0.0878012 -0.0117013 0.176587 -0.0340702 0.0528238 0.0312775 0.0159349 -0.133236 -0.102747 0.0643571 0.135589 -0.0292677 0.102331 -0.0135479 0.0536432 -0.0549389 0.0236432 -0.0633992 -0.0417832 
0.0975312 0.0143953 -0.187741 0.0525726 0.115709 0.112073 0.0151288 -0.0427559 -0.0109796 -0.0480687 0.0902852 0.153437 0.0620456 -0.173409 -0.198792 0.0617997 -0.0224346 0.0907811 -0.178315 0.189825 0.156401 -0.115456 0.104032 0.136411 -0.0181022 -0.017567 0.0144333 -0.206412 0.0259912 0.0671908 -0.03526 0.106541 -0.0414453 0.0801004 -0.112419 -0.0433418 -0.101291 0.113913 -0.0535873 -0.014829 0.0274986 -0.0397637 -0.0646227 0.121727 -0.12065 -0.0846982 0.140231 -0.00370661 -0.097517 0.0776297 0.0668367 -0.0156091 -0.109139 -0.0155229 0.0491552 -0.0185821 0.0347844 0.103442 0.0158345 -0.0799903 -0.0479777 -0.0479775 0.230069 -0.0592 0.0208648 -0.165888 -0.0470372 0.0436089 -0.0354267 0.095696 -0.0341379 0.068755 -0.0321261 0.0442928 -0.019389 -0.0309848 -0.0128803 0.119083 -0.0967124 0.0525121 -0.0929751 0.081609 -0.018431 -0.0601423 -0.0849858 0.09457 0.0716379 0.0327218 -0.0109536 -0.0556092 0.0375258 -0.134505 -0.133239 -0.0210933 0.0324983 -0.0603137 -0.0329354 0.0472279 0.00280142 -0.0592369 0.000380266 -0.0476656 -0.019784 0.210435 -0.0303561 0.000412301 -0.0965644 0.170925 0.0103469 -0.0917348 -0.0209167 0.182083 -0.0283795 0.05186 0.0411142 0.0219121 -0.135409 -0.0974336 0.0646282 0.136822 -0.0307313 0.0971643 -0.0139822 0.05341 -0.059225 0.0288956 -0.06379 -0.0372434 
0.104538 0.00733443 -0.189291 0.0580039 0.116654 0.113464 0.0129697 -0.0424073 -0.0118414 -0.0553305 0.0896743 0.159216 0.0559561 -0.175429 -0.198476 0.0635718 -0.0119047 0.0910587 -0.177947 0.192073 0.151995 -0.106437 0.108958 0.132024 -0.0231325 -0.0165542 0.0168296 -0.211435 0.0123089 0.0638025 -0.0401138 0.11095 -0.0342679 0.0851295 -0.113463 -0.0437384 -0.0958091 0.118811 -0.058245 -0.0138464 0.0249855 -0.0323266 -0.0674815 0.113419 -0.123796 -0.0800403 0.138483 -0.0125159 -0.0970065 0.0857142 0.0751161 -0.0204463 -0.105991 -0.0111126 0.0502281 -0.0219963 0.040948 0.0977489 0.0160435 -0.0732848 -0.0488012 -0.0490649 0.223213 -0.0698484 0.0287008 -0.174267 -0.048007 0.0474554 -0.0379521 0.100671 -0.0306271 0.0630759 -0.0303758 0.0426984 -0.0242498 -0.0265039 -0.0112825 0.113814 -0.102644 0.0494343 -0.0959505 0.0822576 -0.020448 -0.0641254 -0.084312 0.0934854 0.0712942 0.0281528 -0.0181239 -0.0525233 0.034012 -0.137587 -0.135672 -0.019125 0.0367287 -0.0514451 -0.0274428 0.0408476 -0.00136391 -0.054068 -0.00161706 -0.0441687 -0.0234732 0.211332 -0.0274997 -0.0074193 -0.0954172 0.162274 0.0014605 -0.0908444 -0.0216491 0.181173 -0.0196894 0.051228 0.0410644 0.018512 -0.137344 -0.101519 0.0618502 0.135579 -0.0312436 0.102088 -0.0088407 0.0525672 -0.0416442 0.025977 -0.0564651 -0.0439772 
0.107663 0.0120122 -0.188654 0.0624276 0.120586 0.104462 0.0154736 -0.0484056 -0.00272859 -0.0489009 0.0998664 0.163699 0.0569614 -0.168696 -0.204556 0.0633485 -0.00055043 0.101021 -0.186974 0.190993 0.148357 -0.101979 0.100885 0.138439 -0.0208757 -0.0187049 0.0202379 -0.19587 0.0199009 0.0698283 -0.0420469 0.117471 -0.0351486 0.0807713 -0.119155 -0.0481822 -0.10296 0.116069 -0.0558652 -0.00951889 0.0219032 -0.0256757 -0.074345 0.113585 -0.121394 -0.0840725 0.127659 -0.00799569 -0.0899097 0.0777522 0.0814379 -0.0047799 -0.110235 -0.0206245 0.0401443 -0.0224562 0.0321499 0.0982621 0.0164401 -0.0662774 -0.0525559 -0.0558524 0.222128 -0.0616905 0.0145145 -0.174049 -0.0457875 0.0512408 -0.0412153 0.100396 -0.0222546 0.0617278 -0.0239806 0.0412959 -0.0299016 -0.0265615 -0.0113802 0.11146 -0.109697 0.0480588 -0.0918745 0.0893372 -0.0191517 -0.0656257 -0.0776963 0.0908635 0.0713849 0.0243223 -0.0180562 -0.0556521 0.0256651 -0.133879 -0.136429 -0.0129329 0.0420395 -0.0568981 -0.031644 0.0287404 -0.00138387 -0.0612023 0.00163861 -0.0428256 -0.0189607 0.215212 -0.0299751 -0.00722022 -0.0923508 0.158711 0.0140835 -0.092285 -0.0159045 0.182465 -0.0221261 0.0622273 0.0392117 0.0126565 -0.144998 -0.0967711 0.0635537 0.131647 -0.0357066 0.104273 -0.0183437 0.0536846 -0.0393222 0.0268601 -0.0584975 -0.0471299 
0.101892 0.012907 -0.185713 0.0516867 0.121037 0.112221 0.0152978 -0.037478 -0.00517206 -0.0487416 0.0946297 0.153768 0.0614692 -0.167394 -0.195701 0.0588547 -0.00499082 0.0972135 -0.180723 0.188263 0.15817 -0.111198 0.102144 0.13508 -0.0176214 -0.0180574 0.0187409 -0.202013 0.0276872 0.0630043 -0.0290643 0.110335 -0.0318986 0.0851193 -0.111243 -0.043957 -0.0930133 0.121847 -0.0531455 -0.0235911 0.030572 -0.0343832 -0.0681894 0.119292 -0.125223 -0.0870558 0.131236 -0.00385056 -0.0970704 0.0694536 0.0650416 -0.0119276 -0.108943 -0.0178402 0.0477208 -0.0158045 0.0313293 0.100619 0.0116845 -0.0821551 -0.0545745 -0.0574152 0.226525 -0.0663234 0.0237245 -0.16257 -0.0489485 0.0505945 -0.0375258 0.101474 -0.0302702 0.0602332 -0.0356639 0.0346486 -0.0228867 -0.0325216 -0.0103757 0.124325 -0.0984489 0.0440212 -0.104179 0.0877265 -0.0144289 -0.0626479 -0.0771194 0.0865804 0.0764116 0.0379824 -0.00745187 -0.051168 0.0388857 -0.139147 -0.135294 -0.0183821 0.0394312 -0.0614107 -0.0318979 0.0421098 -0.00585579 -0.0597715 0.00180238 -0.0448502 -0.0222818 0.211913 -0.0289991 -0.00112657 -0.09333 0.159146 0.0171508 -0.098392 -0.0232942 0.180857 -0.0323671 0.0600378 0.0512733 0.0135856 -0.140629 -0.108905 0.0679787 0.13762 -0.0279071 0.101993 -0.016746 0.0586743 -0.0464124 0.0235057 -0.0559455 -0.041232 
0.0992219 0.0105591 -0.172109 0.0609106 0.119184 0.0976208 0.0203923 -0.0442703 0.0132688 -0.0554842 0.0970881 0.15255 0.0619716 -0.168983 -0.198903 0.0594579 -0.0153294 0.0953841 -0.204084 0.196178 0.159017 -0.117783 0.099828 0.13753 -0.0201886 -0.0224919 0.00314908 -0.196065 0.0239971 0.0595425 -0.0266376 0.119404 -0.0358092 0.087177 -0.114446 -0.0439945 -0.0994532 0.134754 -0.0592324 -0.0243696 0.0344345 -0.0314683 -0.0765276 0.108203 -0.116509 -0.0935651 0.118197 0.000180053 -0.0843522 0.0712967 0.0571536 -0.00998211 -0.108899 -0.0198635 0.0492398 -0.0218813 0.0242022 0.0933006 0.00809386 -0.0821788 -0.0544704 -0.0581293 0.218076 -0.0517971 0.0139735 -0.156438 -0.0437265 0.0535857 -0.0373069 0.0945017 -0.0242489 0.0598955 -0.0246593 0.0451737 -0.022556 -0.0334856 -0.0142384 0.114563 -0.10034 0.0505225 -0.096361 0.0872151 -0.0192505 -0.0662505 -0.0765206 0.0905193 0.0774628 0.0424835 -0.00933143 -0.0549283 0.0412159 -0.13888 -0.126603 -0.0196761 0.0282969 -0.0632791 -0.0383805 0.02787 0.000295247 -0.0619774 0.00589602 -0.0521101 -0.0223082 0.211251 -0.0225021 -0.00270843 -0.0902193 0.163463 0.0309573 -0.0947314 -0.0262065 0.188495 -0.0408394 0.064595 0.0510792 0.0161044 -0.145981 -0.0981545 0.0649832 0.13384 -0.0333325 0.116703 -0.0227916 0.0661472 -0.045851 0.0234499 -0.0568754 -0.0434185 
0.101223 0.0180672 -0.174617 0.0565368 0.107976 0.104427 0.0195478 -0.0387631 0.00539937 -0.0585265 0.097856 0.150058 0.0598921 -0.183078 -0.198042 0.0610002 -0.0198533 0.0833984 -0.198105 0.194547 0.152206 -0.107456 0.0976354 0.118697 -0.0285689 -0.00923087 0.0103221 -0.198496 0.0245437 0.0539258 -0.0310089 0.123865 -0.0315592 0.0948236 -0.109851 -0.049532 -0.0825286 0.142348 -0.0482939 -0.023277 0.0355588 -0.0465922 -0.0703686 0.109445 -0.118198 -0.0907575 0.124267 -0.00529304 -0.0984446 0.0773544 0.0566481 -0.00547797 -0.110737 -0.00555984 0.0497624 -0.0274972 0.0275013 0.0818899 -0.001176 -0.083819 -0.0577212 -0.0659996 0.225104 -0.0596429 0.0215198 -0.156635 -0.0413671 0.0468123 -0.0375864 0.0900975 -0.0340157 0.047963 -0.0298879 0.0557996 -0.0154642 -0.0426216 -0.0116604 0.112738 -0.100976 0.0558972 -0.0951024 0.0797897 -0.0138824 -0.0649854 -0.0752783 0.0878853 0.0766311 0.0406146 -0.00507583 -0.0470656 0.0464192 -0.147196 -0.134305 -0.0136502 0.0262445 -0.0602034 -0.0277873 0.031472 -0.00217184 -0.0608454 -0.000273343 -0.0464625 -0.0300759 0.218001 -0.0165609 -0.00510195 -0.0827018 0.174964 0.0242286 -0.0974097 -0.0282698 0.187633 -0.0451118 0.0651476 0.0544546 0.00527175 -0.141739 -0.105565 0.0740958 0.131002 -0.0243455 0.114516 -0.00555507 0.0663325 -0.0286393 0.0128035 -0.0416287 -0.0446229 
0.0999484 0.00808413 -0.173959 0.0658301 0.117915 0.0975797 0.0216928 -0.0390974 0.0155932 -0.0551481 0.101606 0.163672 0.0540847 -0.17916 -0.197335 0.0545056 -0.0115552 0.0958199 -0.197587 0.196426 0.149615 -0.105624 0.0915057 0.137109 -0.0215514 -0.0156521 0.0128757 -0.19671 0.0202537 0.05854 -0.0310194 0.123734 -0.0270583 0.09101 -0.116367 -0.0466701 -0.0900034 0.126734 -0.0606827 -0.0207542 0.0466364 -0.0346074 -0.0738166 0.11312 -0.125554 -0.0969585 0.120717 -0.00819726 -0.0821808 0.070378 0.0636709 -0.00870662 -0.111294 -0.0159802 0.0540259 -0.0193004 0.0182202 0.0845748 0.0037591 -0.0753234 -0.0610567 -0.0698557 0.216421 -0.0531587 0.0139764 -0.162114 -0.0389746 0.0436758 -0.0359589 0.0943445 -0.0256397 0.0544786 -0.0228131 0.0478125 -0.018732 -0.033787 -0.0171467 0.119312 -0.107147 0.0485427 -0.0997684 0.0951229 -0.0122518 -0.0638068 -0.0687906 0.0904486 0.0838233 0.0416728 -0.0129922 -0.0522105 0.0372748 -0.139545 -0.135382 -0.0195891 0.0270294 -0.0649285 -0.0346172 0.0186703 0.000170572 -0.0662993 -0.00153414 -0.0508602 -0.016577 0.210067 -0.0238033 -0.00553333 -0.0865629 0.163422 0.0208589 -0.0929672 -0.023611 0.184206 -0.0416002 0.0597864 0.0483798 0.00323761 -0.143306 -0.111311 0.0695592 0.131547 -0.0225664 0.118903 -0.0200525 0.0662477 -0.0343263 0.0197198 -0.046737 -0.0412208 
0.0932287 0.0240014 -0.171144 0.0572715 0.107335 0.0976194 0.0194084 -0.0409805 0.0161374 -0.0617652 0.096678 0.151694 0.059436 -0.187548 -0.203282 0.0615861 -0.0297775 0.083302 -0.202348 0.19624 0.157767 -0.107958 0.0897821 0.121863 -0.0260599 -0.0124202 0.0112245 -0.196392 0.0265813 0.0652604 -0.0312734 0.121103 -0.0257059 0.0938145 -0.106065 -0.0510976 -0.080447 0.138117 -0.0536988 -0.02651 0.0380393 -0.0517355 -0.0600885 0.115065 -0.113409 -0.0897403 0.129538 -0.0058219 -0.0980922 0.0742604 0.0550027 -0.00672654 -0.107745 -0.00745763 0.0579795 -0.0235817 0.0168741 0.0750434 -0.00451247 -0.0885442 -0.0583547 -0.0732924 0.223686 -0.0509237 0.0189352 -0.159026 -0.0436235 0.0400366 -0.0390996 0.0832897 -0.0338364 0.0418337 -0.0315614 0.0460857 -0.0116359 -0.0353154 -0.0129657 0.116813 -0.101206 0.0593211 -0.0900605 0.0822468 -0.0136499 -0.0563854 -0.0749186 0.0925216 0.074954 0.043012 -0.00280219 -0.0402936 0.0414759 -0.150673 -0.139363 -0.0122263 0.0174199 -0.058951 -0.0342196 0.02897 0.00363356 -0.0656448 0.00365112 -0.049305 -0.02828 0.213181 -0.0195866 -0.00430181 -0.0833969 0.179978 0.0225524 -0.0958473 -0.0290022 0.181382 -0.055711 0.062961 0.050412 0.00822308 -0.144018 -0.102723 0.0721439 0.132371 -0.0226332 0.119868 -0.00908321 0.0661174 -0.0292352 0.016928 -0.0378736 -0.0458051 
0.0966629 0.0216558 -0.170397 0.0555093 0.0915854 0.107458 0.017247 -0.0391867 0.0124461 -0.0718246 0.0949581 0.143637 0.0637402 -0.190068 -0.207323 0.0610687 -0.0305899 0.0780802 -0.196785 0.196345 0.162978 -0.106371 0.0949305 0.118335 -0.0386294 -0.00796695 0.00978735 -0.207245 0.0226623 0.0629409 -0.0347767 0.120411 -0.0203311 0.101424 -0.0977239 -0.0519224 -0.0651244 0.153418 -0.0497704 -0.0332966 0.0278008 -0.0590471 -0.0593096 0.104074 -0.111107 -0.0944536 0.132501 -0.00939868 -0.107856 0.0854191 0.0485588 -0.00951595 -0.0936733 0.0102712 0.0645527 -0.0265772 0.03595 0.0656284 -0.0106358 -0.1012 -0.0581971 -0.0666472 0.229279 -0.0656055 0.024481 -0.153054 -0.0389424 0.0350422 -0.0412064 0.0780083 -0.0457884 0.0267222 -0.0418007 0.0536473 -0.00825764 -0.0409737 -0.00668579 0.109825 -0.0935115 0.0626801 -0.0910906 0.0739264 -0.0156671 -0.0642392 -0.0734303 0.0958212 0.0677147 0.0416119 0.000928501 -0.0332142 0.0540352 -0.16065 -0.131294 -0.00665066 0.0159454 -0.053123 -0.0311925 0.042023 0.00338071 -0.058285 0.0138534 -0.0418676 -0.0386324 0.217052 -0.00880506 -0.00559918 -0.0743864 0.175273 0.0143439 -0.0956841 -0.038294 0.181473 -0.050086 0.057293 0.0545968 0.0147314 -0.136283 -0.107144 0.0735304 0.131749 -0.0222801 0.111753 0.00471307 0.0601312 -0.0252897 0.017944 -0.0275168 -0.0462472 
0.097212 0.0161007 -0.167513 0.0565454 0.096851 0.102946 0.0188902 -0.0449921 0.00578492 -0.0808865 0.0809384 0.151287 0.0589212 -0.196319 -0.21207 0.0535229 -0.0358534 0.0745553 -0.191746 0.199837 0.161656 -0.0980091 0.0873816 0.116433 -0.0375597 0.00393408 0.0054745 -0.212653 0.018296 0.0683971 -0.0362257 0.123749 -0.0318312 0.0964269 -0.0899797 -0.0584692 -0.0683377 0.15301 -0.0444384 -0.0352775 0.0316984 -0.0538228 -0.0573651 0.11571 -0.110288 -0.0871556 0.140582 -0.0123947 -0.102727 0.0839815 0.0539894 -0.0117135 -0.0886763 0.00754904 0.0713613 -0.0351232 0.0331418 0.0721555 -0.00549541 -0.105742 -0.04688 -0.0682915 0.226881 -0.0542072 0.0247649 -0.169496 -0.0322986 0.0274702 -0.0340347 0.0703646 -0.0430626 0.0312213 -0.0322962 0.058275 -0.0189232 -0.043104 -0.0152747 0.105991 -0.087885 0.0757062 -0.0830458 0.0815416 -0.0146228 -0.0624257 -0.0652703 0.0762615 0.0720934 0.046658 -0.000403193 -0.0411613 0.050181 -0.149217 -0.131445 -0.00959994 0.00901395 -0.0529506 -0.01955 0.0398385 0.00376809 -0.0628305 0.00548975 -0.0343385 -0.0361181 0.221508 -0.0206352 -0.0161621 -0.0767942 0.182381 0.0148979 -0.0837926 -0.0240959 0.178924 -0.0659349 0.0579544 0.0441227 0.0139508 -0.13959 -0.114103 0.0633237 0.121819 -0.0254391 0.123424 0.00710449 0.0506277 -0.0257607 0.0105554 -0.0313064 -0.0528203 
0.0917554 0.0117203 -0.1618 0.0576184 0.094829 0.0978758 0.0241187 -0.0439196 0.0139582 -0.0946761 0.066486 0.149528 0.0580596 -0.202457 -0.210214 0.0413341 -0.0484394 0.0686949 -0.194033 0.210082 0.164863 -0.102096 0.0838437 0.121737 -0.040318 -0.00326418 -0.00659804 -0.219955 0.0140449 0.0731795 -0.0328858 0.120407 -0.0300598 0.0983974 -0.079627 -0.0570929 -0.0627068 0.156484 -0.0592373 -0.0481651 0.0359863 -0.0579402 -0.0510107 0.12133 -0.109353 -0.0837296 0.146642 -0.00926519 -0.0995605 0.0939662 0.0400551 -0.0259944 -0.0764401 0.00773218 0.0865841 -0.0365317 0.0233983 0.0692544 -0.00779741 -0.11888 -0.043395 -0.062202 0.223884 -0.0494065 0.0244731 -0.169939 -0.0270327 0.0118833 -0.0373378 0.0573164 -0.0455371 0.0240221 -0.0316271 0.0606489 -0.0204059 -0.0428965 -0.0164667 0.101146 -0.0741912 0.0824069 -0.0787619 0.0821658 -0.0244804 -0.0642086 -0.0571004 0.0734013 0.0663499 0.052637 0.00415774 -0.0329829 0.0606279 -0.148865 -0.127873 -0.0183314 -0.000681123 -0.0507096 -0.0207183 0.0412154 0.00712957 -0.0651938 0.00815171 -0.0359069 -0.0342516 0.21134 -0.0313063 -0.0146389 -0.0768298 0.18443 0.013487 -0.0714387 -0.0187957 0.17671 -0.0779234 0.0490326 0.0359825 0.020492 -0.131347 -0.117917 0.0588998 0.123268 -0.0269754 0.129826 0.0073533 0.0542537 -0.0320081 0.00737235 -0.0275351 -0.0587864 
0.0954779 0.0179909 -0.160632 0.0540082 0.0975359 0.101942 0.0278316 -0.0374226 0.0134025 -0.0960197 0.0681267 0.14457 0.0619527 -0.193897 -0.204595 0.0424484 -0.0341024 0.0651514 -0.201066 0.206192 0.164317 -0.100106 0.0811948 0.119618 -0.0382242 -0.00783713 -0.00824327 -0.210159 0.0191096 0.0686423 -0.0260876 0.12597 -0.029621 0.103818 -0.0867437 -0.0571374 -0.0570055 0.162296 -0.0580328 -0.0467827 0.0399909 -0.0529059 -0.046733 0.114566 -0.107096 -0.0847735 0.141645 -0.010383 -0.103689 0.0884994 0.0394762 -0.0238464 -0.0793793 0.00736824 0.0821321 -0.0336664 0.0180781 0.0745308 -0.00624924 -0.121785 -0.0523154 -0.0605206 0.219849 -0.0610981 0.0220974 -0.158044 -0.0260486 0.0184874 -0.0432377 0.0569654 -0.0414174 0.0221471 -0.0334076 0.0601512 -0.0154549 -0.0400897 -0.0116177 0.100148 -0.0764159 0.0763907 -0.083511 0.0818677 -0.0189323 -0.0658958 -0.0547281 0.0739762 0.0687052 0.0511566 0.0034978 -0.0311455 0.0610402 -0.158342 -0.128389 -0.0168428 0.00640145 -0.0478928 -0.0172577 0.040368 -0.00117237 -0.0608552 0.00310373 -0.035042 -0.0355737 0.222529 -0.0395044 -0.0112814 -0.0824249 0.182274 0.0158819 -0.0834378 -0.0192346 0.177904 -0.0830155 0.0576965 0.0425357 0.0140142 -0.137096 -0.119313 0.0620821 0.126148 -0.0254758 0.13086 0.00746016 0.0593799 -0.0257232 0.0023 -0.0295133 -0.0630687 
0.0923457 0.0136783 -0.158986 0.0580179 0.103455 0.0989073 0.0251284 -0.0397429 0.022631 -0.094536 0.0663299 0.150264 0.0569179 -0.20943 -0.210061 0.0426384 -0.0482802 0.0744448 -0.205974 0.203933 0.168129 -0.0970104 0.0792941 0.122449 -0.0348273 -0.0134411 -0.0117033 -0.217909 0.0151189 0.0735151 -0.0212709 0.121353 -0.0358379 0.0953818 -0.0801004 -0.0599339 -0.0716195 0.141711 -0.0586395 -0.0435472 0.0422256 -0.053725 -0.0542413 0.130607 -0.106727 -0.0881469 0.138304 -0.00538625 -0.0918116 0.0867654 0.0445408 -0.0229572 -0.0804517 -0.00594973 0.0727362 -0.0360709 0.0156139 0.0690429 -0.00311805 -0.11404 -0.0470078 -0.0652382 0.215897 -0.0428558 0.015726 -0.182516 -0.0273843 0.0140799 -0.0358885 0.0569552 -0.0367535 0.0298823 -0.0268475 0.0481267 -0.0314181 -0.0396277 -0.0243877 0.102924 -0.0815698 0.091826 -0.0746574 0.0826829 -0.0203116 -0.0543308 -0.0547814 0.0755732 0.0714271 0.0497797 -0.00274139 -0.0376858 0.0521007 -0.14424 -0.137468 -0.0186185 -0.00165787 -0.0510935 -0.0251465 0.0329832 -0.00411879 -0.0650004 0.00724611 -0.0379631 -0.0313121 0.211841 -0.0318195 -0.0201766 -0.078897 0.187063 0.0203527 -0.066653 -0.017252 0.170288 -0.0870625 0.053047 0.0339867 0.0201788 -0.139053 -0.110662 0.057063 0.123844 -0.0265586 0.133686 -0.00215723 0.05723 -0.0292713 -0.000359848 -0.0327842 -0.0576401 
0.0947948 0.0193221 -0.162257 0.0535603 0.0993951 0.102922 0.0258886 -0.0354083 0.0170407 -0.0972718 0.0706832 0.149055 0.0624007 -0.204819 -0.208957 0.0403942 -0.0366726 0.065628 -0.209323 0.207918 0.160368 -0.0920852 0.0751167 0.121002 -0.0403299 -0.0138854 -0.00792651 -0.20659 0.0164906 0.069802 -0.0237914 0.12038 -0.0348438 0.101151 -0.0900429 -0.0577542 -0.0651324 0.144074 -0.0622192 -0.0356692 0.0436794 -0.0539616 -0.0497291 0.126134 -0.106309 -0.0878476 0.1385 -0.00578326 -0.09854 0.0931991 0.0462872 -0.0245945 -0.0870667 -0.000914212 0.070847 -0.0371396 0.0059282 0.072885 -0.00270201 -0.113 -0.0540633 -0.0588486 0.216464 -0.0535394 0.0131601 -0.177164 -0.0220468 0.0124555 -0.0437548 0.050141 -0.0351708 0.0229438 -0.0240492 0.055392 -0.0223225 -0.0369231 -0.0180795 0.100925 -0.0811906 0.0877556 -0.0731199 0.0771512 -0.0165235 -0.0564006 -0.0558602 0.0808758 0.0715674 0.0439161 -0.00367246 -0.0339317 0.0516938 -0.156177 -0.134826 -0.0140943 0.00195588 -0.0488075 -0.0203487 0.0284887 -0.0101582 -0.0630986 6.17168e-05 -0.0331628 -0.0340341 0.220874 -0.0409556 -0.0138024 -0.0836666 0.189542 0.0114505 -0.0734158 -0.0135569 0.171524 -0.0847763 0.0621417 0.0272146 0.0124476 -0.141496 -0.108323 0.0577051 0.124747 -0.0302511 0.128202 0.000129151 0.0599838 -0.0240745 -0.00290463 -0.0383076 -0.0643724 
0.0920397 0.0353362 -0.161106 0.0377351 0.114299 0.11644 0.017226 -0.0409327 0.00138619 -0.0879267 0.075534 0.151432 0.0658448 -0.186641 -0.198202 0.0370381 -0.0252421 0.0697536 -0.200804 0.199876 0.161323 -0.0751092 0.0627163 0.133636 -0.0248644 -0.00760622 0.000859486 -0.188978 0.0321185 0.079539 -0.0137695 0.104461 -0.0478889 0.0942938 -0.0888903 -0.04474 -0.0723297 0.122125 -0.0523348 -0.0230522 0.0467063 -0.0412875 -0.0402306 0.143027 -0.108853 -0.0836501 0.152561 0.00165376 -0.103574 0.0804841 0.0548308 -0.0193238 -0.104289 -0.0125719 0.0710961 -0.0272724 -0.0182026 0.107201 0.00273812 -0.116194 -0.0623558 -0.0560257 0.227812 -0.0568863 0.0101468 -0.17768 -0.0173374 0.0194539 -0.0465552 0.0611827 -0.0202153 0.0420241 -0.0194192 0.0433899 -0.0191053 -0.0343414 -0.0273205 0.112565 -0.0758507 0.0814306 -0.063636 0.095494 -0.00216872 -0.0506145 -0.0622161 0.0689121 0.0798988 0.0432417 -0.000313309 -0.0318538 0.0461276 -0.157159 -0.137062 -0.00925691 0.00936375 -0.0578109 -0.0207682 0.0301178 -0.0184856 -0.0699545 -0.0153714 -0.0229571 -0.0301571 0.220334 -0.0712267 0.00444851 -0.101661 0.181608 0.012565 -0.0769864 0.00904898 0.167667 -0.0936537 0.0786565 0.0229142 0.00856381 -0.149277 -0.113396 0.0490435 0.124171 -0.02384 0.118768 -0.00344189 0.056051 -0.0386212 0.00385082 -0.0484125 -0.0636395 
0.0996725 0.0395627 -0.180169 0.0307599 0.116739 0.125434 0.0090904 -0.0398704 -0.0307276 -0.0625679 0.086002 0.143456 0.0746778 -0.164899 -0.191051 0.0542902 -0.00108875 0.0805184 -0.182424 0.187918 0.158108 -0.0787545 0.0741412 0.137205 -0.019461 -0.0100338 0.0124035 -0.188094 0.0413079 0.0793061 -0.0242239 0.102323 -0.0526175 0.0833167 -0.103566 -0.0356634 -0.0899685 0.103326 -0.0489915 -0.00665587 0.0280935 -0.034178 -0.0422263 0.14572 -0.109205 -0.0654547 0.158631 0.00347255 -0.121012 0.0698119 0.0711405 -0.0111716 -0.115774 -0.019841 0.0478068 -0.0212853 -0.00166573 0.122958 0.0232903 -0.0953404 -0.059538 -0.0400752 0.229641 -0.0672138 0.0114796 -0.178613 -0.0295688 0.0368522 -0.0441669 0.0769877 -0.0183687 0.054581 -0.0266482 0.0313106 -0.0184251 -0.0286578 -0.0239723 0.123708 -0.0851833 0.0664684 -0.0679243 0.0882933 -0.0101621 -0.0572211 -0.0827791 0.0842813 0.0739458 0.0182405 -0.0142748 -0.0391946 0.0349789 -0.146934 -0.142397 -0.0109081 0.028803 -0.0512929 -0.0193181 0.0440614 -0.0191061 -0.0678133 -0.0159836 -0.0197803 -0.0239907 0.224186 -0.0744485 0.00818213 -0.113551 0.180014 0.00891001 -0.0928599 0.005529 0.167465 -0.0661931 0.0689504 0.0255822 0.0127121 -0.152525 -0.113645 0.0526583 0.131062 -0.0289589 0.0929925 -0.00754255 0.0553183 -0.0522834 0.0146105 -0.0661694 -0.0582312 
0.0975762 0.0307532 -0.169548 0.0428058 0.111096 0.121436 0.0186391 -0.0431584 -0.00630485 -0.0862738 0.0784629 0.150215 0.0695617 -0.191295 -0.202433 0.0424048 -0.0302239 0.0772528 -0.198285 0.198603 0.164536 -0.0796126 0.0709075 0.136504 -0.0277554 -0.0174154 -2.96679e-05 -0.197537 0.029179 0.0852425 -0.0234201 0.102555 -0.0509726 0.0917448 -0.0877217 -0.0474772 -0.0798959 0.108974 -0.0517206 -0.021833 0.0388263 -0.0468963 -0.0412793 0.143752 -0.112477 -0.0847853 0.153073 0.00258511 -0.106737 0.0873908 0.061186 -0.0217468 -0.101037 -0.010872 0.061256 -0.0285233 -0.00335728 0.103061 0.00844618 -0.106793 -0.0572435 -0.046395 0.229505 -0.0582508 0.00817749 -0.182226 -0.0232604 0.01398 -0.0495542 0.0604398 -0.0271861 0.0424016 -0.0221766 0.0409391 -0.023862 -0.031973 -0.0235282 0.106987 -0.0785995 0.0866279 -0.0602484 0.082574 -0.00833806 -0.0508439 -0.0682247 0.0846568 0.0724657 0.0299345 -0.00977521 -0.0322541 0.0467056 -0.154598 -0.140646 -0.0106429 0.00638445 -0.055829 -0.0277544 0.0388229 -0.0149339 -0.0663355 -0.00442474 -0.021979 -0.0272263 0.219801 -0.0584633 0.00113503 -0.0961607 0.18923 0.00569696 -0.0722304 0.00261647 0.162681 -0.0787927 0.0688938 0.0169246 0.0178747 -0.143069 -0.100399 0.0508335 0.12817 -0.0281444 0.104057 -0.0062018 0.051943 -0.0438607 0.00861429 -0.0528652 -0.0584626 
0.101927 0.0321665 -0.166234 0.0449003 0.108487 0.115113 0.0148279 -0.0442056 0.010959 -0.10406 0.0805424 0.144561 0.0645726 -0.183305 -0.20734 0.0418124 -0.0282957 0.0595613 -0.209088 0.196679 0.165245 -0.0755257 0.0701555 0.122002 -0.0228638 -0.016138 0.00416812 -0.188602 0.0243264 0.0797911 -0.0151719 0.107678 -0.046394 0.091933 -0.0942004 -0.0485288 -0.0766169 0.12989 -0.0513739 -0.0221772 0.0395916 -0.0392859 -0.0491511 0.135586 -0.102699 -0.0794771 0.139666 -0.00230939 -0.0991518 0.0820145 0.0517583 -0.00402158 -0.0927845 -0.007778 0.0632177 -0.0377432 -0.00656775 0.0962075 0.00355917 -0.116413 -0.0627053 -0.0555484 0.226249 -0.0544513 -0.000979995 -0.174501 -0.014788 0.0320548 -0.0388899 0.0597829 -0.0168887 0.0364879 -0.0194686 0.038221 -0.0178771 -0.0313272 -0.02791 0.095096 -0.0878614 0.101575 -0.0598075 0.0840778 -0.00443649 -0.05668 -0.0627328 0.0798367 0.0736628 0.0360706 -0.0113609 -0.0369298 0.0459772 -0.161134 -0.139179 -0.00475712 0.00528001 -0.0594527 -0.0202867 0.0261969 -0.0124179 -0.0715184 -0.00724032 -0.0230523 -0.0283066 0.223554 -0.0667776 -0.00283573 -0.097628 0.190696 0.0152589 -0.0815793 0.00700318 0.168057 -0.09479 0.0790122 0.0265187 0.01636 -0.158997 -0.101073 0.05553 0.123572 -0.0310202 0.121521 -0.00321395 0.0558162 -0.0251659 0.00169035 -0.0403029 -0.0593489 
0.0984331 0.0155508 -0.151552 0.0474125 0.111314 0.125888 0.0199481 -0.0263916 0.00706847 -0.100142 0.0733937 0.150749 0.0603832 -0.196383 -0.187982 0.0350416 -0.0249665 0.0733388 -0.194563 0.197823 0.176456 -0.0704587 0.058285 0.158206 -0.0182746 -0.0182443 0.00360172 -0.211339 0.023998 0.0809611 -0.00736514 0.0899214 -0.0424453 0.102297 -0.0745805 -0.0415142 -0.0680507 0.111566 -0.0634456 -0.0380662 0.0483916 -0.0410318 -0.0395779 0.148834 -0.105773 -0.0918913 0.154468 -0.00548236 -0.106199 0.081756 0.0526315 -0.0416108 -0.0824412 -0.0143956 0.0830961 -0.0188609 -0.0202704 0.108206 0.00205333 -0.128157 -0.0622718 -0.0542943 0.22488 -0.0665963 0.0133212 -0.173537 -0.0176282 0.00724367 -0.0495102 0.0560863 -0.0296472 0.0357767 -0.0317883 0.0214766 -0.0234923 -0.0339685 -0.0258362 0.116079 -0.0675587 0.0936762 -0.0671127 0.0936452 -0.00805841 -0.0671821 -0.0570089 0.0701087 0.0788592 0.0409416 -0.00823656 -0.0218859 0.0568411 -0.157371 -0.146839 -0.00595761 0.00227219 -0.0407967 -0.0247534 0.0264963 -0.0175665 -0.0673023 -0.00491638 -0.0286295 -0.0318194 0.203523 -0.0744319 0.00278351 -0.0972481 0.161908 -0.0013064 -0.0785097 0.00647144 0.165241 -0.0883776 0.0565064 0.0353895 0.0201427 -0.148188 -0.119862 0.0415794 0.128454 -0.0205268 0.114245 -0.00226845 0.0563454 -0.0344189 0.0125074 -0.033535 -0.0681916 
0.0963846 0.0165735 -0.142412 0.0377989 0.0958982 0.136224 0.0199366 -0.0193012 -0.00857502 -0.0954944 0.0826099 0.154571 0.0721026 -0.198542 -0.192493 0.0214646 -0.0329934 0.0710635 -0.194117 0.200659 0.174485 -0.0690693 0.0512719 0.162208 -0.0316634 -0.0106397 0.00246287 -0.205214 0.0268518 0.0773414 -0.0162169 0.075798 -0.0478643 0.105462 -0.0814837 -0.0429625 -0.0752461 0.109988 -0.063011 -0.0261889 0.0449531 -0.0528354 -0.0472902 0.148486 -0.109569 -0.105479 0.154076 -0.00604291 -0.11697 0.091706 0.0539094 -0.040023 -0.0941094 -0.00496695 0.0786948 -0.0166558 -0.0242612 0.114615 -0.00477655 -0.123566 -0.0622471 -0.0461641 0.234658 -0.0665376 0.0133602 -0.17473 -0.00972461 -0.00338999 -0.0595465 0.053899 -0.0321702 0.0301526 -0.0294497 0.0371396 -0.0170418 -0.0366485 -0.0242923 0.10808 -0.0569457 0.0964413 -0.0693794 0.076374 0.00187097 -0.0631273 -0.0636198 0.0727365 0.0876156 0.0355278 -0.00115364 -0.0202274 0.0586671 -0.167422 -0.132983 0.00382358 -0.00438761 -0.0486893 -0.026764 0.0257238 -0.0196879 -0.0604956 -0.00345128 -0.0121278 -0.0407609 0.205549 -0.0644736 0.0124367 -0.0917363 0.166095 -0.00955243 -0.0831452 0.0069427 0.162386 -0.0846367 0.0583032 0.0287128 0.0251804 -0.137245 -0.111818 0.0459598 0.132894 -0.025894 0.0897387 -0.00659592 0.0495936 -0.0370605 0.0215736 -0.0345369 -0.0614586 
0.102208 0.0320855 -0.162248 0.0314469 0.112335 0.138472 0.0254552 -0.0344871 -0.0236297 -0.073078 0.0884679 0.152537 0.0829692 -0.1702 -0.18662 0.0284221 -0.0153146 0.0785346 -0.186763 0.193363 0.170973 -0.0733389 0.0553009 0.161473 -0.0219804 -0.0188605 -0.00201745 -0.192562 0.0455509 0.095649 -0.0215433 0.0849686 -0.0575161 0.0885332 -0.0889485 -0.0356435 -0.0911066 0.098517 -0.0555151 -0.0157409 0.0343142 -0.0391473 -0.0495027 0.146622 -0.116378 -0.0852723 0.153749 0.00647512 -0.116197 0.075374 0.0640577 -0.0146116 -0.104955 -0.0207603 0.0652129 -0.0130507 -0.0231919 0.137661 0.0041705 -0.104873 -0.0681956 -0.0391808 0.241087 -0.0720567 0.00989549 -0.172869 -0.0173671 0.0153979 -0.0650803 0.0652782 -0.0169157 0.0500913 -0.0306275 0.0285696 -0.0200248 -0.0235605 -0.0237507 0.108721 -0.0622604 0.0876465 -0.0649895 0.0779425 -0.000220828 -0.056751 -0.0716489 0.0742477 0.0836529 0.0209709 -0.00672307 -0.0267605 0.046849 -0.160394 -0.132594 0.00320393 0.00641809 -0.0641218 -0.0257435 0.0311142 -0.0137144 -0.0654259 -0.000771302 -0.00440706 -0.0303432 0.211415 -0.0859708 0.0222223 -0.103438 0.170084 0.00745614 -0.084101 0.0156207 0.158893 -0.0804111 0.0626598 0.0264896 0.0329228 -0.144032 -0.102514 0.0466152 0.142603 -0.0304624 0.0729669 -0.0172391 0.051846 -0.0537998 0.0330779 -0.0524138 -0.0581792 
0.0949636 0.0241587 -0.147655 0.0321004 0.102234 0.12581 0.0128625 -0.027063 -0.0182088 -0.086216 0.0874359 0.151014 0.0815013 -0.173212 -0.195125 0.0251537 -0.0167381 0.0726564 -0.193233 0.200942 0.173013 -0.0772387 0.0603608 0.155179 -0.0267456 -0.00683221 0.00483998 -0.189276 0.0390815 0.0766234 -0.0169458 0.0833741 -0.0471705 0.0948034 -0.0956883 -0.0409595 -0.088959 0.121734 -0.0596084 -0.0194035 0.0367127 -0.0414909 -0.0561185 0.145255 -0.110999 -0.0934508 0.149034 -0.0013098 -0.116226 0.0783393 0.0541464 -0.0170605 -0.102407 -0.0138519 0.0641716 -0.0194382 -0.0185225 0.12404 0.00437987 -0.118736 -0.0641185 -0.0442443 0.233037 -0.0578238 0.00746595 -0.170994 -0.0120358 0.0163101 -0.0549379 0.0607897 -0.0221452 0.0346836 -0.0258196 0.0354162 -0.0146984 -0.0344647 -0.027445 0.10741 -0.0618705 0.0935468 -0.0766479 0.07539 0.00319476 -0.0617536 -0.0682095 0.0686507 0.0889795 0.0337026 -0.00196712 -0.0341902 0.049796 -0.160421 -0.124232 0.00439896 0.00522881 -0.0629876 -0.0248719 0.0327761 -0.0194662 -0.0692708 -0.00681183 -0.00743519 -0.0353432 0.218013 -0.0711618 0.0150291 -0.0980715 0.172648 0.0134431 -0.09669 0.00776587 0.16714 -0.0896489 0.0708355 0.0296456 0.0245087 -0.147623 -0.113325 0.0523386 0.137026 -0.0360285 0.0894907 -0.0208574 0.0500083 -0.0447132 0.0237904 -0.0459441 -0.0568827 
0.0990432 0.0272167 -0.168552 0.0277414 0.122918 0.136159 0.015271 -0.0416935 -0.0267264 -0.0634395 0.0837475 0.152833 0.0822733 -0.153499 -0.182572 0.0310564 -0.00383515 0.0903329 -0.168929 0.192473 0.176451 -0.0740739 0.0568079 0.178082 -0.011559 -0.0144861 0.00861507 -0.194497 0.0514285 0.104408 -0.018489 0.0786968 -0.0560578 0.0791437 -0.0798572 -0.0247604 -0.0936712 0.0883985 -0.0549995 -0.0261742 0.0275906 -0.0294311 -0.0462073 0.156682 -0.116753 -0.0784744 0.161607 0.0150379 -0.111606 0.0633262 0.0659831 -0.0171525 -0.0979285 -0.0316217 0.0752046 -0.00478065 -0.0233946 0.148819 0.0128306 -0.112912 -0.062497 -0.0390614 0.245376 -0.0691874 0.0114717 -0.174002 -0.0237515 0.0216173 -0.0586502 0.074779 -0.0169288 0.0583879 -0.0367213 0.00766242 -0.0259724 -0.0220824 -0.0242415 0.126277 -0.0565392 0.0769918 -0.0649924 0.0950763 -0.00484235 -0.0601653 -0.0692954 0.0612805 0.0808558 0.0291951 -0.000773326 -0.0255431 0.0452087 -0.146722 -0.132508 0.00121821 0.0133632 -0.0639184 -0.0283153 0.0409271 -0.0108033 -0.0745765 0.00547416 -0.00577899 -0.0264676 0.19915 -0.097453 0.0258835 -0.110455 0.149237 0.0108308 -0.0799501 0.020669 0.160182 -0.0768502 0.0604035 0.0273932 0.0359799 -0.146617 -0.11548 0.0356681 0.140305 -0.0288813 0.0712501 -0.0181229 0.0454845 -0.0734142 0.0423652 -0.0575917 -0.0582879 
0.103246 0.021342 -0.172906 0.0312309 0.118605 0.131424 0.0183015 -0.0312427 -0.0247528 -0.0664801 0.0815584 0.155833 0.0741667 -0.172544 -0.185716 0.0319138 -0.0069835 0.0881385 -0.175458 0.191873 0.165796 -0.0653749 0.059365 0.1672 -0.0225537 -0.0120901 0.0139993 -0.203849 0.0353666 0.0932625 -0.0315995 0.0831474 -0.050416 0.0852779 -0.0857164 -0.0370624 -0.0883422 0.0900161 -0.0661827 -0.0183941 0.0348506 -0.0322477 -0.0480754 0.160667 -0.121761 -0.0722562 0.160405 0.0042354 -0.113054 0.0718573 0.0751411 -0.0269846 -0.101025 -0.0239428 0.0715679 -0.0110035 -0.0143923 0.130142 0.0194589 -0.106979 -0.0564293 -0.0456252 0.232984 -0.0622903 0.0121635 -0.190404 -0.0226204 0.0208134 -0.0463863 0.0695021 -0.0197982 0.0501817 -0.0273092 0.0124721 -0.0266983 -0.0200816 -0.0319802 0.126721 -0.0676014 0.0752928 -0.0646355 0.0956203 -0.00922623 -0.0611238 -0.068442 0.0712695 0.0857425 0.0233641 -0.0108269 -0.0265924 0.03905 -0.146513 -0.143187 -0.00982241 0.0090675 -0.0531047 -0.0218051 0.0311097 -0.0101048 -0.0734394 0.00012931 -0.008438 -0.0186215 0.201895 -0.0910776 0.00454456 -0.112837 0.159253 -0.00553056 -0.0772504 0.0246541 0.16108 -0.0704516 0.0499953 0.0194 0.0277764 -0.150716 -0.122673 0.0346259 0.129115 -0.0262151 0.0838961 -0.0114461 0.0508403 -0.0547025 0.0283832 -0.0587685 -0.0624578 
