{
  "descriptor": [
    -0.08042589575052261,
    0.15314258635044098,
    0.09038317948579788,
    -0.07127594202756882,
    -0.14002279937267303,
    0.11563245952129364,
    -0.0923008844256401,
    -0.0583161786198616,
    0.14458239078521729,
    -0.10336620360612869,
    0.1884278506040573,
    0.03637104481458664,
    -0.24603377282619476,
    -0.04407426714897156,
    0.000005254509233054705,
    0.0763663798570633,
    -0.09528136253356934,
    -0.1369941085577011,
    -0.09602512419223785,
    -0.12404268980026245,
    -0.05676000192761421,
    0.09003578871488571,
    0.017208343371748924,
    -0.08360400795936584,
    -0.0768452063202858,
    -0.2796630859375,
    -0.04756423830986023,
    -0.05146999657154083,
    0.13275504112243652,
    -0.11999448388814926,
    0.07231764495372772,
    0.03883887082338333,
    -0.15108272433280945,
    -0.03461088985204697,
    0.004386946093291044,
    0.07735573500394821,
    -0.09865202009677887,
    -0.054835423827171326,
    0.2583540976047516,
    -0.08112169802188873,
    -0.10614978522062302,
    0.01849893294274807,
    0.03410756215453148,
    0.2631896138191223,
    0.16207005083560944,
    -0.032136693596839905,
    0.036096103489398956,
    -0.016439495608210564,
    0.11098749935626984,
    -0.31477418541908264,
    0.1391785889863968,
    0.19123823940753937,
    0.13064874708652496,
    0.12889911234378815,
    0.0481024831533432,
    -0.11605734378099442,
    0.0020522689446806908,
    0.2421334981918335,
    -0.15371794998645782,
    0.154959037899971,
    0.11664006859064102,
    -0.07780978828668594,
    -0.09799592196941376,
    -0.05284520238637924,
    0.19982771575450897,
    0.10144145041704178,
    -0.13577581942081451,
    -0.20227909088134766,
    0.11676613241434097,
    -0.1236741840839386,
    -0.05083665996789932,
    0.13832341134548187,
    -0.11257514357566833,
    -0.13318267464637756,
    -0.2043573409318924,
    0.15616697072982788,
    0.36043399572372437,
    0.1309000551700592,
    -0.13624203205108643,
    -0.004685231950134039,
    -0.02514241263270378,
    -0.022265547886490822,
    -0.008277029730379581,
    0.0381549708545208,
    -0.08315527439117432,
    -0.15863065421581268,
    0.008476517163217068,
    0.017096934840083122,
    0.20357933640480042,
    0.017934110015630722,
    -0.06318196654319763,
    0.21843041479587555,
    0.07186634838581085,
    0.007413920480757952,
    -0.012495486065745354,
    0.08003639429807663,
    0.025709059089422226,
    -0.05761419236660004,
    -0.06185504049062729,
    0.08029837161302567,
    0.017471034079790115,
    -0.1740577071905136,
    -0.02731700800359249,
    0.10461266338825226,
    -0.16880133748054504,
    0.2622413635253906,
    -0.04075032100081444,
    0.05566215515136719,
    0.08765346556901932,
    -0.0019038250902667642,
    -0.0435023307800293,
    -0.017970753833651543,
    0.25155991315841675,
    -0.3064996898174286,
    0.22166065871715546,
    0.18856462836265564,
    0.0379854254424572,
    0.15018506348133087,
    0.07463807612657547,
    0.13985000550746918,
    0.08343121409416199,
    0.00786789134144783,
    -0.15118107199668884,
    -0.14413145184516907,
    -0.005210105329751968,
    -0.06994831562042236,
    -0.06570828706026077,
    0.09126734733581543
  ]
}