{
  "descriptor": [
    -0.13753409683704376,
    0.06255123019218445,
    0.06253039836883545,
    -0.017652887850999832,
    -0.06666626036167145,
    -0.009812097065150738,
    0.022828152403235435,
    -0.05447007343173027,
    0.07487106323242188,
    -0.04213089123368263,
    0.18717922270298004,
    -0.012828236445784569,
    -0.22957029938697815,
    -0.08562356233596802,
    -0.02293865568935871,
    0.1015998050570488,
    -0.08556588739156723,
    -0.11666371673345566,
    -0.15815238654613495,
    -0.12265412509441376,
    0.019346851855516434,
    0.06493533402681351,
    -0.05919399857521057,
    0.022444207221269608,
    -0.11092466115951538,
    -0.27885839343070984,
    -0.021453706547617912,
    -0.07366851717233658,
    0.05171511694788933,
    -0.08391973376274109,
    0.0462852418422699,
    0.062389012426137924,
    -0.09422077983617783,
    -0.012162222526967525,
    0.004255225881934166,
    0.09207771718502045,
    -0.14604808390140533,
    -0.09553465992212296,
    0.21804963052272797,
    0.02697453834116459,
    -0.11917609721422195,
    -0.01619427651166916,
    0.06410424411296844,
    0.33157777786254883,
    0.18197019398212433,
    0.027716416865587234,
    0.06584934890270233,
    -0.02980612777173519,
    0.12538030743598938,
    -0.2583935260772705,
    0.01578206568956375,
    0.16860131919384003,
    0.07219164818525314,
    0.12041744589805603,
    0.11560028791427612,
    -0.2058301866054535,
    0.0787421241402626,
    0.08688788115978241,
    -0.2134190797805786,
    0.12565220892429352,
    0.014113002456724644,
    -0.1382330060005188,
    -0.055901724845170975,
    -0.04140147566795349,
    0.17386981844902039,
    0.06692784279584885,
    -0.11305544525384903,
    -0.15668748319149017,
    0.09929974377155304,
    -0.21025677025318146,
    -0.053326305001974106,
    0.12334513664245605,
    -0.08568649739027023,
    -0.18684253096580505,
    -0.24839165806770325,
    0.07420600205659866,
    0.3877493143081665,
    0.184199720621109,
    -0.1671869307756424,
    0.018952995538711548,
    0.011293132789433002,
    -0.05576879531145096,
    0.17714715003967285,
    0.1047585979104042,
    -0.0829465389251709,
    -0.0637049451470375,
    -0.14666908979415894,
    -0.042236220091581345,
    0.16138412058353424,
    0.028350545093417168,
    -0.07219095528125763,
    0.196022629737854,
    0.049004361033439636,
    -0.05633263289928436,
    0.03821044787764549,
    0.0284563060849905,
    -0.15171365439891815,
    0.026018217206001282,
    -0.02850288525223732,
    -0.0458066426217556,
    0.10134638845920563,
    -0.15014974772930145,
    0.042011700570583344,
    0.019838344305753708,
    -0.0913143903017044,
    0.22275310754776,
    -0.03075716458261013,
    0.08230556547641754,
    -0.016012808308005333,
    -0.07305193692445755,
    -0.13606704771518707,
    0.04019114747643471,
    0.17195546627044678,
    -0.23420214653015137,
    0.16709749400615692,
    0.15346185863018036,
    0.01961088739335537,
    0.15602758526802063,
    0.14706739783287048,
    0.08724459260702133,
    -0.0287614855915308,
    0.023737682029604912,
    -0.12672138214111328,
    -0.06584637612104416,
    -0.01139078475534916,
    -0.016078144311904907,
    0.08251558989286423,
    0.025298837572336197
  ]
}