{
  "descriptor": [
    -0.1335143744945526,
    0.11987856775522232,
    0.11200430244207382,
    -0.08876767009496689,
    -0.08001658320426941,
    0.024825485423207283,
    0.04235043749213219,
    -0.1838265359401703,
    0.19318602979183197,
    -0.037682969123125076,
    0.16943864524364471,
    -0.06741967797279358,
    -0.31090247631073,
    0.1219448521733284,
    -0.1386917233467102,
    0.16598743200302124,
    -0.19793088734149933,
    -0.1911591738462448,
    -0.07259302586317062,
    -0.028871234506368637,
    -0.01176183670759201,
    0.06443451344966888,
    -0.07094733417034149,
    0.06123441830277443,
    -0.09815480560064316,
    -0.28798916935920715,
    -0.03486635908484459,
    -0.005190152674913406,
    0.09459256380796432,
    -0.04080040380358696,
    0.037302784621715546,
    0.15514829754829407,
    -0.14218096435070038,
    0.06796163320541382,
    0.039771173149347305,
    0.0948110967874527,
    -0.09144952148199081,
    -0.1431821584701538,
    0.18806304037570953,
    0.062492527067661285,
    -0.20313896238803864,
    -0.034454427659511566,
    0.020454833284020424,
    0.3167061507701874,
    0.19260434806346893,
    -0.03201129660010338,
    0.0017418540082871914,
    -0.1696230173110962,
    0.1277628391981125,
    -0.32464540004730225,
    -0.05816791579127312,
    0.21093349158763885,
    -0.003923589829355478,
    0.1315307915210724,
    0.06396275758743286,
    -0.20382395386695862,
    0.007118765264749527,
    0.07302889227867126,
    -0.15622878074645996,
    0.05934574827551842,
    0.051988594233989716,
    -0.09994003921747208,
    0.023636942729353905,
    -0.1877991259098053,
    0.13287335634231567,
    0.06492872536182404,
    -0.13531339168548584,
    -0.06910821795463562,
    0.23686155676841736,
    -0.11987578123807907,
    -0.08182936906814575,
    0.04696914181113243,
    -0.09062018245458603,
    -0.15427625179290771,
    -0.2270248830318451,
    -0.004837372340261936,
    0.4132503569126129,
    0.14111164212226868,
    -0.11385050415992737,
    0.021184654906392097,
    -0.013131340965628624,
    -0.02975635416805744,
    0.0211690254509449,
    0.11727215349674225,
    -0.10957213491201401,
    -0.055224668234586716,
    -0.05795488879084587,
    0.019897140562534332,
    0.23131531476974487,
    0.005007537547498941,
    0.02460438944399357,
    0.23895512521266937,
    -0.0354851596057415,
    -0.004683321807533503,
    -0.004284663591533899,
    0.1273186355829239,
    -0.13405834138393402,
    0.03335094824433327,
    -0.13872508704662323,
    -0.04997061938047409,
    0.015910476446151733,
    -0.0481065958738327,
    0.0749468207359314,
    0.19420500099658966,
    -0.15670040249824524,
    0.2165246456861496,
    0.027082066982984543,
    0.02998645044863224,
    0.05636856332421303,
    -0.020035699009895325,
    -0.00846244115382433,
    0.022744959220290184,
    0.176814004778862,
    -0.22002486884593964,
    0.19167576730251312,
    0.1462891548871994,
    0.028839487582445145,
    0.07448508590459824,
    0.010284644551575184,
    0.05394325032830238,
    -0.04118743911385536,
    -0.023369386792182922,
    -0.1459215134382248,
    -0.07924357056617737,
    0.03183448314666748,
    -0.043683744966983795,
    -0.07787206023931503,
    0.03072458878159523
  ]
}