{
  "descriptor": [
    -0.07521593570709229,
    0.018268616870045662,
    0.11263587325811386,
    -0.05186345800757408,
    -0.1503123641014099,
    0.03796537220478058,
    -0.09750563651323318,
    0.01566881500184536,
    0.1552589386701584,
    -0.14938874542713165,
    0.14501705765724182,
    -0.017503418028354645,
    -0.24756895005702972,
    0.10865810513496399,
    -0.023261766880750656,
    0.17527256906032562,
    -0.1488294154405594,
    -0.15799188613891602,
    -0.03318129852414131,
    -0.039396222680807114,
    -0.00876599084585905,
    0.11953084170818329,
    0.015641041100025177,
    0.0790921002626419,
    -0.15704581141471863,
    -0.4012165069580078,
    -0.09167107194662094,
    -0.05901817977428436,
    0.026565618813037872,
    -0.09336747229099274,
    -0.08518049865961075,
    0.08841896057128906,
    -0.10843642801046371,
    0.031810302287340164,
    0.11455247551202774,
    0.10923457890748978,
    -0.08220263570547104,
    -0.17077545821666718,
    0.2181275337934494,
    0.11257711797952652,
    -0.2736940085887909,
    -0.008381478488445282,
    0.061621956527233124,
    0.2627447545528412,
    0.180201917886734,
    0.01248213555663824,
    0.05312292277812958,
    -0.06703377515077591,
    0.13412973284721375,
    -0.29344719648361206,
    0.030762262642383575,
    0.20979838073253632,
    0.013904531486332417,
    0.06548537313938141,
    0.09001553058624268,
    -0.13755957782268524,
    0.004087287001311779,
    0.13382168114185333,
    -0.10996938496828079,
    0.03645584359765053,
    0.05215563252568245,
    -0.06087128445506096,
    0.03447367623448372,
    -0.06588311493396759,
    0.17964693903923035,
    0.07514876127243042,
    -0.12578806281089783,
    -0.11998888105154037,
    0.2198200672864914,
    -0.1531933695077896,
    -0.0851261094212532,
    0.06661741435527802,
    -0.14168092608451843,
    -0.20297931134700775,
    -0.1886323243379593,
    0.025190455839037895,
    0.37512755393981934,
    0.16246354579925537,
    -0.10338380187749863,
    0.08991917967796326,
    0.02414529398083687,
    -0.029166927561163902,
    0.011307941749691963,
    0.2078169584274292,
    -0.07831966876983643,
    0.028944795951247215,
    -0.022109074518084526,
    0.03956776484847069,
    0.2655651867389679,
    0.02694266475737095,
    0.027443010360002518,
    0.2232331931591034,
    0.019037501886487007,
    0.04391821473836899,
    0.11377985775470734,
    0.07077185809612274,
    -0.12077321112155914,
    -0.09420211613178253,
    -0.1985260397195816,
    -0.04576428234577179,
    -0.0068827103823423386,
    -0.04544444382190704,
    -0.01842469535768032,
    0.1680229902267456,
    -0.18936781585216522,
    0.15222278237342834,
    -0.06330551207065582,
    -0.10131678730249405,
    -0.008768875151872635,
    0.04032222181558609,
    -0.07066691666841507,
    -0.03063472919166088,
    0.12363054603338242,
    -0.2044450044631958,
    0.08862705528736115,
    0.17313599586486816,
    0.08896010369062424,
    0.1361127495765686,
    0.10906888544559479,
    0.034492477774620056,
    0.02284638211131096,
    -0.05860358476638794,
    -0.17805598676204681,
    -0.11166176944971085,
    0.05530671775341034,
    -0.02224763296544552,
    -0.01678101159632206,
    -0.016577323898673058
  ]
}