{
  "descriptor": [
    -0.0929628312587738,
    0.09824731945991516,
    0.07626843452453613,
    -0.025989089161157608,
    -0.07579953968524933,
    -0.02797308750450611,
    -0.052795205265283585,
    -0.07536040991544724,
    0.1069449707865715,
    -0.059697236865758896,
    0.20005275309085846,
    -0.034309521317481995,
    -0.21376515924930573,
    -0.0508933961391449,
    -0.03700889274477959,
    0.11397600173950195,
    -0.12341637909412384,
    -0.09805402904748917,
    -0.09560444205999374,
    -0.11745888739824295,
    0.04770013317465782,
    0.08149860799312592,
    0.0161129143089056,
    -0.0190555639564991,
    -0.13160400092601776,
    -0.2893540561199188,
    -0.08231555670499802,
    -0.09241566807031631,
    0.05203206464648247,
    -0.14678016304969788,
    0.020652905106544495,
    0.0897626280784607,
    -0.17906543612480164,
    -0.02264804020524025,
    -0.00006239789217943326,
    0.0674898624420166,
    -0.027859853580594063,
    -0.0738230049610138,
    0.2023109495639801,
    0.02467530034482479,
    -0.14389728009700775,
    0.033043552190065384,
    0.05660466104745865,
    0.2515125274658203,
    0.20253051817417145,
    -0.01740455999970436,
    -0.006811876315623522,
    -0.0386434905230999,
    0.07345771789550781,
    -0.271142840385437,
    0.010820399038493633,
    0.19690479338169098,
    0.071332648396492,
    0.11031226068735123,
    0.066489078104496,
    -0.1171678975224495,
    0.03079967573285103,
    0.08102016150951385,
    -0.16123907268047333,
    0.053321316838264465,
    0.05720030143857002,
    -0.10468470305204391,
    -0.0403033122420311,
    -0.05185439810156822,
    0.16512832045555115,
    0.09180206805467606,
    -0.0802503302693367,
    -0.12473048269748688,
    0.149476557970047,
    -0.13562370836734772,
    -0.05616264417767525,
    0.0851321667432785,
    -0.1285136193037033,
    -0.15187706053256989,
    -0.24051114916801453,
    0.09732402861118317,
    0.3767056167125702,
    0.15021152794361115,
    -0.14859431982040405,
    0.06321729719638824,
    -0.07599560916423798,
    -0.041920844465494156,
    0.011336631141602993,
    0.04037318006157875,
    -0.0759330689907074,
    -0.04333755373954773,
    -0.05530755594372749,
    0.07288116216659546,
    0.18183109164237976,
    -0.018441520631313324,
    -0.006267470307648182,
    0.2122524529695511,
    -0.008825472556054592,
    0.032634396106004715,
    0.02202729508280754,
    0.026155278086662292,
    -0.08557047694921494,
    -0.03091404214501381,
    -0.07595466077327728,
    -0.0039016297087073326,
    0.054759908467531204,
    -0.13908177614212036,
    0.015198183245956898,
    0.14854413270950317,
    -0.15875524282455444,
    0.15356145799160004,
    -0.031439073383808136,
    -0.040138792246580124,
    0.005912165157496929,
    0.024882210418581963,
    -0.03828202188014984,
    0.0006423011072911322,
    0.15778306126594543,
    -0.21184810996055603,
    0.22369982302188873,
    0.17967763543128967,
    -0.01160918828099966,
    0.12028878927230835,
    0.06974632292985916,
    0.12411803752183914,
    -0.02685808390378952,
    0.00014346165698952973,
    -0.1319442242383957,
    -0.09303364157676697,
    0.015700342133641243,
    -0.005372005049139261,
    -0.02384057082235813,
    0.02818049117922783
  ]
}