0.121208 -0.0115076 -0.122518 0.00358181 0.0872075 0.152132 0.0686442 0.0307247 -0.0121191 -0.151929 0.0450947 0.113291 0.0927204 -0.207381 -0.146712 -0.0294647 -0.0831458 0.00838128 -0.242036 0.205759 0.146141 -0.0650314 0.0706455 0.0526027 -0.082444 -0.0799229 -0.0722241 -0.193803 -0.0328059 0.0312972 -0.0116328 0.060383 -0.0680472 0.123742 -0.0786512 -0.0310544 -0.0864446 0.0950566 -0.107423 -0.0170555 0.0524011 -0.0799453 -0.080914 0.140339 -0.138602 -0.0537934 0.0744827 0.0241447 -0.105886 0.15676 -0.001493 -0.0626672 -0.107566 0.0142158 0.0231769 -0.0671086 -0.0541738 0.0770464 -0.0289719 -0.0664661 -0.0484683 0.00819906 0.185076 -0.0601507 0.0216874 -0.220596 0.00537568 0.0118627 -0.0607018 0.0317877 0.00920586 0.00558079 -0.000404575 0.0323559 -0.0572817 -0.00126685 -0.025719 0.0270498 -0.0432831 0.142867 -0.0507877 -0.0381357 -0.0266494 -0.0229001 -0.0812521 0.0983442 0.0913601 0.00630361 -0.0348816 0.0112814 0.0980118 -0.193014 -0.134093 -0.0065204 -0.0666811 -0.0463325 -0.0240095 -0.0163618 -0.0395461 -0.0201272 0.0135924 0.0187069 -0.0667499 0.17013 -0.0340323 -0.00432966 -0.0999486 0.227924 -0.0270306 -0.0390107 0.0154279 0.117438 -0.106902 0.0525072 -0.00819825 0.0585958 -0.103337 -0.0402791 0.0490329 0.160163 -0.0634014 0.0655156 -0.0160513 0.10975 0.0362902 -0.0472759 -0.0260397 -0.0686707 
0.130891 -0.0175984 -0.121576 -0.0176591 0.106307 0.158041 0.0764224 0.0497739 -0.0236599 -0.155061 0.0191222 0.108748 0.0900701 -0.199555 -0.136242 -0.0238708 -0.0702486 -0.00195616 -0.250836 0.201095 0.129104 -0.037091 0.0607802 0.0288522 -0.0988961 -0.0783431 -0.081032 -0.17639 -0.0349589 0.0128621 -0.0143901 0.0577179 -0.0927493 0.110404 -0.0734665 -0.0285579 -0.0934104 0.0878627 -0.114364 -0.0107417 0.0504641 -0.0527845 -0.0845308 0.143233 -0.130454 -0.0276921 0.0594485 0.0356096 -0.107204 0.159755 -0.00180583 -0.0744856 -0.116447 0.00236043 0.0124166 -0.0823383 -0.0710354 0.0928015 -0.0221396 -0.0588182 -0.043145 0.0254275 0.176067 -0.0588798 0.0252321 -0.236704 0.00303272 0.0316079 -0.0575449 0.0148442 0.0334396 0.0123123 0.0249218 0.0174324 -0.0800796 0.0186731 -0.0287494 0.0190828 -0.0361492 0.133011 -0.0226236 -0.0408692 -0.0326156 -0.0162167 -0.0797592 0.0756245 0.0945369 0.0128136 -0.0372938 0.0180284 0.0913926 -0.180849 -0.148793 0.00159088 -0.0618261 -0.0251921 0.00276133 -0.0380579 -0.0649902 -0.0107871 0.00866028 0.0228146 -0.0831823 0.160981 -0.0658383 -0.00874937 -0.115188 0.213768 -0.0308195 -0.0243626 0.0476373 0.114884 -0.103433 0.0679486 -0.0171797 0.0547274 -0.122846 -0.0236337 0.0223489 0.140657 -0.0831981 0.0664459 0.00132019 0.107669 0.0526379 -0.0608456 -0.0470875 -0.0977471 
0.146865 -0.0131415 -0.159289 -0.028787 0.120102 0.168246 0.0663831 0.0336242 -0.0430704 -0.119792 0.0196938 0.104522 0.101654 -0.187185 -0.142768 -0.00910898 -0.0551221 0.0116543 -0.230458 0.196263 0.130494 -0.0360258 0.081363 0.00408493 -0.0950625 -0.061544 -0.0650193 -0.180673 -0.0371493 0.0295823 -0.032026 0.0645067 -0.095397 0.100893 -0.0619643 -0.0359298 -0.0928651 0.094223 -0.0828802 -0.0279536 0.016911 -0.0495259 -0.083036 0.151306 -0.147124 -0.0221505 0.0607932 0.0534945 -0.106087 0.16276 0.023776 -0.0533247 -0.119935 0.00646552 0.00961358 -0.100612 -0.0413259 0.0835254 -0.0117894 -0.0721331 -0.0315618 0.00771585 0.195462 -0.059412 0.0262377 -0.252498 -0.013046 0.0727644 -0.0388426 0.030913 0.037224 0.0313165 0.0167631 -0.0020947 -0.10702 0.0152206 -0.0276146 0.0205894 -0.0381941 0.133886 -0.0114662 -0.0336672 -0.0257315 -0.0106184 -0.0789786 0.0502881 0.0870938 0.0208539 -0.00181595 0.0155199 0.0756961 -0.169858 -0.158814 0.0117891 -0.0604419 -0.0414485 0.00971978 -0.0140522 -0.0686966 -0.0297187 0.0300594 0.0416149 -0.0757681 0.159236 -0.0650181 -0.0218625 -0.119 0.206097 -0.0163732 -0.012076 0.0543147 0.120402 -0.094572 0.0846727 -0.00920482 0.0555186 -0.125057 -0.0262501 0.0122052 0.129081 -0.0831627 0.0623352 0.0298411 0.0960945 0.0498867 -0.0697923 -0.0368445 -0.0870312 
0.152659 -0.0294234 -0.162502 -0.00520286 0.138205 0.157084 0.0856796 0.0216411 -0.0314326 -0.128775 0.0204703 0.101517 0.0813019 -0.189359 -0.127936 -0.0102537 -0.0848843 0.00343123 -0.207336 0.18344 0.161989 -0.0831872 0.0853708 0.0250418 -0.0343262 -0.0734986 -0.0800444 -0.211543 -0.0242532 0.0418795 -0.00793487 0.0756054 -0.108766 0.104536 -0.0564187 -0.039215 -0.110227 0.0847481 -0.0545596 -0.059588 0.0436205 -0.0613901 -0.0752925 0.142402 -0.139036 -0.0257129 0.0649877 0.0499773 -0.0932403 0.133291 -0.0109486 -0.0400477 -0.0925107 -0.0122451 0.02839 -0.0925578 -0.0310308 0.109078 -0.0302232 -0.076002 -0.0251509 0.00340338 0.212405 -0.0478085 0.0155933 -0.197299 -0.0216157 0.0716785 -0.0253375 0.0382973 0.0150857 0.0692356 -0.0191927 0.0081812 -0.0912884 -0.00361239 -0.0233035 0.014307 -0.0368655 0.159597 -0.0448852 -0.0212835 -0.0257233 -0.0311686 -0.0795027 0.0560478 0.0870746 0.0334513 -0.00546545 -0.00989922 0.117097 -0.14889 -0.155872 -0.00620542 -0.0608556 -0.0601847 -0.000178231 -0.00276738 -0.032817 -0.0445101 0.0255148 0.00304242 -0.0517344 0.154607 -0.0695107 -0.00822651 -0.113568 0.232744 0.00833393 -0.029486 0.0481329 0.130002 -0.114816 0.0484157 0.038778 0.0797092 -0.116188 -0.0321771 0.0473713 0.15496 -0.0591511 0.0781717 0.0109383 0.107669 0.00599411 -0.0551682 -0.0231387 -0.0671899 
0.139708 -0.0193856 -0.156548 0.00219413 0.120059 0.137782 0.0614755 0.00615164 -0.0160655 -0.145884 0.0122265 0.0893363 0.0754274 -0.19955 -0.152898 0.00334258 -0.103898 -0.00228407 -0.210745 0.196183 0.176619 -0.0951918 0.0894809 0.00672104 -0.0362303 -0.0705492 -0.0826068 -0.215177 -0.0319493 0.0513124 -0.00942886 0.0715848 -0.0964817 0.0946003 -0.0403905 -0.0393221 -0.106203 0.101939 -0.0491506 -0.074816 0.0169826 -0.0717437 -0.0665151 0.140214 -0.109842 -0.017032 0.0721878 0.0477028 -0.0975166 0.137973 -0.0186915 -0.0305577 -0.0737027 -0.00357252 0.0344028 -0.104389 -0.0204364 0.0765812 -0.0317698 -0.0974721 -0.00918869 -0.00180116 0.209415 -0.0319808 0.0167519 -0.206952 -0.0235903 0.068702 -0.0200524 0.0269322 0.0124387 0.0494985 -0.0214597 -0.00523669 -0.0943316 -0.0074624 -0.021731 0.0107218 -0.0360293 0.182858 -0.0344503 -0.0282597 -0.0385021 -0.0255697 -0.0805374 0.0633513 0.0634815 0.0424458 0.0069977 -0.00755213 0.10617 -0.14928 -0.152792 0.00533203 -0.0721896 -0.0543813 -0.00177566 0.00901347 -0.0311841 -0.0515999 0.0390022 0.00408227 -0.0655634 0.148284 -0.0494578 -0.0104013 -0.0977286 0.241805 0.0153913 -0.0215063 0.0310527 0.12192 -0.128742 0.0529933 0.033308 0.0884037 -0.125083 -0.0205416 0.0422841 0.143006 -0.0745259 0.0926122 0.0222606 0.0949948 0.0192891 -0.0552182 -0.00569577 -0.0708467 
0.127734 -0.0201755 -0.15553 -0.0106957 0.135631 0.135319 0.0581603 0.00075976 -0.0282455 -0.140624 -0.00338686 0.0842491 0.0816507 -0.186233 -0.142687 0.00571163 -0.107576 0.00482494 -0.206551 0.194521 0.179397 -0.0972482 0.0983044 -0.00563684 -0.032847 -0.0651943 -0.0922645 -0.217656 -0.0283806 0.0490138 -0.00502868 0.0788322 -0.100641 0.0906876 -0.0318896 -0.0348178 -0.101054 0.107988 -0.0424679 -0.0817166 0.0284369 -0.0622524 -0.0528616 0.144641 -0.123199 -0.0119943 0.0843408 0.0520513 -0.0964619 0.128086 -0.0263392 -0.0472202 -0.0766184 0.000143716 0.041029 -0.104322 -0.0127534 0.0835137 -0.027339 -0.110854 -0.00460997 0.00501468 0.205637 -0.02622 0.0283379 -0.197691 -0.0292485 0.0775038 -0.00728113 0.027216 0.0140369 0.0617601 -0.0140759 -0.00638228 -0.0946322 -0.00563626 -0.0327638 0.0145968 -0.0277744 0.164107 -0.0318139 -0.0130149 -0.0402044 -0.0201312 -0.0852362 0.0574879 0.068005 0.0594745 0.00993244 -0.012196 0.112431 -0.143285 -0.146808 -0.0118485 -0.0756321 -0.0577349 -0.00427564 0.0319887 -0.0360136 -0.0495233 0.0323735 -0.00222794 -0.0563171 0.15139 -0.0550687 -0.00997943 -0.110895 0.246854 0.0205736 -0.0187712 0.0289874 0.123006 -0.138729 0.0590619 0.0289805 0.0831219 -0.124364 -0.0312507 0.0348577 0.136767 -0.0670922 0.100459 0.0248525 0.0929379 0.0010537 -0.0628248 -0.0243284 -0.0668241 
0.130263 -0.0240184 -0.142234 -0.00589082 0.141169 0.139404 0.0835474 -7.4531e-05 -0.0348014 -0.140053 -0.00121286 0.093724 0.0896066 -0.175786 -0.123873 -0.00562156 -0.105068 0.00288842 -0.21294 0.188543 0.174177 -0.0916561 0.0790189 0.00781715 -0.0298273 -0.0671736 -0.111754 -0.211539 -0.0283831 0.0580572 -0.000441525 0.096208 -0.117118 0.100824 -0.036499 -0.0315012 -0.104639 0.0983264 -0.0409252 -0.0700465 0.0500613 -0.0578789 -0.0493281 0.138837 -0.127103 -0.0180684 0.0816897 0.0476329 -0.091634 0.11723 -0.0202134 -0.0599973 -0.0841237 -0.00391676 0.0457087 -0.0934184 -0.0377265 0.108647 -0.0295927 -0.0937418 -0.0129334 0.0104155 0.19563 -0.037254 0.0277028 -0.183058 -0.0179259 0.0670591 -0.0227071 0.0197018 0.0198109 0.0732032 -0.00807556 0.00527619 -0.0929161 -0.00082643 -0.0307592 -0.000950308 -0.0242573 0.163092 -0.0283865 -0.014075 -0.0332786 -0.0248671 -0.0902857 0.0505415 0.0849961 0.0450788 -0.00505027 -0.0136582 0.114924 -0.150068 -0.138495 -0.0168763 -0.0863031 -0.0533429 -0.00374159 0.0158087 -0.0304191 -0.0384476 0.0202616 0.00072719 -0.0518145 0.16343 -0.0704537 -0.00430919 -0.122354 0.250728 0.013554 -0.0201312 0.0344392 0.118923 -0.154021 0.0554862 0.0264665 0.0812667 -0.117554 -0.0302077 0.0309857 0.14375 -0.0561233 0.0956342 0.014376 0.10204 -0.00334259 -0.0605339 -0.0366582 -0.0706496 
0.126465 -0.0139394 -0.163856 0.00401203 0.126991 0.13509 0.0469623 -0.0135933 -0.0282684 -0.136234 0.00923271 0.109597 0.0693799 -0.180645 -0.155217 -0.00197552 -0.102099 0.00333247 -0.192997 0.197684 0.165739 -0.0997119 0.100489 0.00641956 -0.0207103 -0.0481207 -0.0636234 -0.209625 -0.0392116 0.0576304 -0.0131107 0.0754861 -0.0869899 0.0913057 -0.0456459 -0.0353017 -0.111358 0.114992 -0.0483724 -0.0741451 0.0203188 -0.0639441 -0.0590777 0.15138 -0.131598 -0.0151774 0.0940005 0.0351977 -0.0967876 0.136211 -0.0018636 -0.0209557 -0.0785971 -0.00216352 0.0571633 -0.0984961 -0.0193607 0.0914478 -0.0253406 -0.109934 -0.0176736 -0.0144847 0.222051 -0.0290395 0.0298658 -0.201505 -0.0288912 0.0799638 -0.0226842 0.0546648 0.0207044 0.063858 -0.0171499 0.000541569 -0.0855912 -0.00437552 -0.0333716 0.0093864 -0.039047 0.171635 -0.0493804 -0.00943841 -0.0240335 -0.0257309 -0.088261 0.0358181 0.0705046 0.0563172 0.0197979 -0.0123249 0.0876664 -0.149363 -0.143357 -0.00348478 -0.0654154 -0.0687257 0.00480173 0.0244872 -0.0241713 -0.067705 0.0216992 0.0131536 -0.0532149 0.154171 -0.0661501 -0.0050423 -0.111824 0.237248 0.0187403 -0.0334553 0.0381799 0.135006 -0.133356 0.0653125 0.0368639 0.0735597 -0.120791 -0.0435821 0.0540496 0.14873 -0.0569908 0.0972222 0.0225294 0.0776684 0.0158518 -0.0483088 0.00825526 -0.0570489 
0.108765 0.0394217 -0.143567 -0.00261603 0.111334 0.167887 0.0730938 0.0244139 -0.057743 -0.0616245 0.037631 0.113347 0.0735083 -0.226071 -0.0947198 -0.0417884 -0.0796242 0.0146275 -0.151168 0.168242 0.130405 -0.0532189 0.0495766 0.0318644 -0.00905034 -0.021228 -0.0451642 -0.208022 0.00329199 0.0560297 -0.000556965 0.0547677 -0.0740072 0.109016 -0.0325441 -0.0629316 -0.0607705 0.0878397 -0.0318367 -0.0488853 0.0790779 -0.101609 -0.0446978 0.19642 -0.187836 -0.0453155 0.118089 0.0179466 -0.106691 0.105588 0.0538749 -0.009632 -0.118797 -0.00201223 0.0568304 -0.0608619 -0.051329 0.0745409 -0.0149386 -0.118073 -0.0556228 -0.0814279 0.204213 -0.0533705 0.0392939 -0.214161 0.00844966 0.0147517 -0.0293663 0.0449175 0.00536228 0.0690789 -0.0208248 0.0171026 -0.0538896 -0.0286851 -0.0678607 0.0645398 -0.0205417 0.173725 -0.0720549 0.00999514 0.0416456 0.0106017 -0.0334184 -0.00198573 0.115958 0.0448396 0.0377065 -0.0070594 0.0533669 -0.151827 -0.153418 -0.0231067 -0.0918867 -0.11886 0.026247 0.0183394 -0.0413205 -0.0848821 -0.0135794 0.0595521 -0.010826 0.171549 -0.0890679 -0.0155472 -0.0901456 0.240442 0.0164873 -0.0287164 0.0527525 0.118102 -0.162086 0.0565315 0.0281109 0.0151389 -0.107414 -0.109564 0.0484497 0.141039 0.00158214 0.0729713 0.0105042 0.0910079 0.0336449 -0.0622671 0.0307263 -0.0253632 
0.125888 -0.0146326 -0.146405 0.00655748 0.121593 0.161366 0.0758714 0.0170775 -0.0134852 -0.115487 0.0390101 0.139553 0.0634852 -0.201515 -0.128498 -0.0539496 -0.0919654 0.00183723 -0.182698 0.177234 0.140904 -0.0565672 0.0509346 0.0545847 -0.0189181 -0.0347219 -0.0405746 -0.198783 -0.0284259 0.0504699 -0.00231198 0.0503914 -0.0832299 0.106462 -0.0489834 -0.0471257 -0.0946354 0.0882678 -0.0655293 -0.0535963 0.0777327 -0.0670523 -0.0767402 0.18399 -0.171052 -0.0559395 0.0826079 0.0256495 -0.0769005 0.121615 0.0199638 -0.0120068 -0.0987496 -0.00889383 0.0728234 -0.0673547 -0.0714224 0.108795 -0.0355364 -0.104536 -0.0543438 -0.0546019 0.225189 -0.036464 0.0159196 -0.208033 0.00618243 0.0422602 -0.027473 0.0596867 0.0227689 0.0637205 -0.00879189 0.0142921 -0.0679119 -0.00996672 -0.0584253 0.0281571 -0.0307059 0.174038 -0.065121 0.0113448 0.0240655 -0.0208588 -0.0484803 0.00362119 0.122396 0.0530889 0.018289 -0.00607167 0.080921 -0.160599 -0.144349 -0.0140045 -0.0760799 -0.104573 0.0118459 -0.0222609 -0.0223834 -0.079341 0.00402358 0.0388025 -0.0265504 0.143665 -0.0934765 -0.0075917 -0.104598 0.215469 0.000450242 -0.0307094 0.0700447 0.129553 -0.146585 0.0565003 0.0372979 0.0467226 -0.110142 -0.0825663 0.0594638 0.149131 -0.0164278 0.0794646 0.000429158 0.0879133 0.0251724 -0.0437763 0.0281151 -0.0334632 
0.131225 0.00137256 -0.103267 0.00798699 0.0862411 0.157687 0.0936368 0.0592296 0.00138299 -0.154999 0.039617 0.116559 0.0730081 -0.216603 -0.121043 -0.0353352 -0.0588152 -0.0114512 -0.253845 0.195319 0.120759 -0.0385119 0.0543236 0.0345104 -0.0939793 -0.0838852 -0.0817931 -0.179752 -0.040095 0.0101103 -0.0134147 0.0803401 -0.052803 0.146991 -0.0840792 -0.0453361 -0.0498507 0.112867 -0.120958 -0.0114746 0.0717659 -0.0712473 -0.0678001 0.111718 -0.137395 -0.0467082 0.0625181 0.000776179 -0.115111 0.165904 0.00704146 -0.0680884 -0.115755 0.0224652 0.0296528 -0.0608933 -0.0758499 0.0682119 -0.0390228 -0.0563483 -0.0669787 -0.00476655 0.157565 -0.0972926 0.0358806 -0.200247 0.0108648 0.00267355 -0.0856528 0.0315523 0.0172144 -0.00924203 0.00655762 0.0509586 -0.0478571 0.00374877 -0.0116478 0.0173369 -0.0437093 0.113942 -0.0611061 -0.0310921 -0.020595 -0.0258172 -0.0548094 0.0809132 0.0949485 0.00127744 -0.0334355 0.0391303 0.0942279 -0.214427 -0.146962 -0.00735334 -0.0521361 -0.0236162 0.00428503 -0.0467882 -0.0563539 0.000557138 -0.00685373 0.0175508 -0.0730702 0.173885 -0.0544338 -0.00883081 -0.0970393 0.205631 -0.0398635 -0.0510951 0.024444 0.120885 -0.104536 0.0530486 0.0105006 0.0254675 -0.102183 -0.0528468 0.0566808 0.155278 -0.0443188 0.0844665 0.0050911 0.129121 0.0969371 -0.0692151 0.00460161 -0.095319 
