0.0527642 0.0235122 -0.101627 -0.0902018 0.0475211 0.121531 0.035034 -0.0461785 -0.0669069 -0.0778564 -0.105362 0.082955 0.0520754 -0.118208 -0.0637918 -0.0451643 -0.146463 -0.0547005 -0.111403 0.125401 0.0239418 0.0218773 0.0572355 0.0140731 -0.0938142 0.116866 -0.0207011 -0.202171 -0.0619279 0.0196503 -0.0484368 0.06264 -0.100107 0.0781003 0.0192483 -0.0130389 -0.0142859 0.20477 -0.0759693 -0.0129279 0.0402793 -0.0455727 -0.0172479 0.151216 -0.12075 0.0820185 0.165364 0.0357923 -0.122587 0.1292 0.040705 -0.0934299 -0.0394426 0.0508919 0.176695 -0.0526747 -0.0203357 0.165068 0.0407389 -0.184098 -0.00677517 0.00541731 0.187537 -0.0221967 0.0867762 -0.152412 0.0149374 0.0713998 0.00212464 0.0443442 -0.00935295 0.0454401 0.0380715 0.0790549 -0.0134006 -0.00732218 -0.11406 -0.00262594 0.0488607 0.0684682 0.0523758 0.0666655 -0.0410392 -0.0578527 -0.0775003 -0.123665 0.0984976 0.0632734 0.0529688 0.0407643 0.0454096 -0.123747 -0.0336041 -0.0970971 -0.0819585 0.00810087 0.107479 0.0511566 0.0578509 -0.0462169 -0.027639 0.0614208 -0.0329728 0.127222 -0.181516 -0.0671443 -0.205466 0.133929 -0.0886426 -0.000790787 0.160418 0.18836 -0.124898 0.00931379 -0.020674 0.0406357 -0.110291 -0.151335 -0.0241658 0.0397521 0.0484058 0.0863603 0.115581 0.0232284 -0.00576306 -0.057664 -0.0431195 -0.0878618 
0.0539136 0.0275269 -0.107782 -0.0790626 0.0386994 0.102919 0.0220026 -0.0660574 -0.0732146 -0.0645151 -0.114447 0.0799942 0.0565996 -0.100348 -0.0629611 -0.0224432 -0.127832 -0.0546485 -0.0914536 0.133549 0.0185991 0.0146837 0.0770193 0.0213663 -0.0923069 0.131392 -0.0202306 -0.209055 -0.0606526 0.0359442 -0.0551398 0.0834932 -0.0863594 0.068705 0.0237843 -0.0169633 -0.00268111 0.234731 -0.057194 -0.0164665 0.000161337 -0.0331726 -0.00800928 0.129992 -0.104294 0.083672 0.178018 0.0305479 -0.110028 0.142818 0.059014 -0.0923708 -0.024807 0.0602339 0.183097 -0.0611018 0.0127218 0.157453 0.0549619 -0.191464 -0.00140726 -0.00075634 0.177208 -0.0346061 0.0841471 -0.152228 0.0132548 0.0734842 -0.0028968 0.0338304 -0.0202211 0.049206 0.0261299 0.0924301 -0.0173342 -0.0190776 -0.10015 -0.00814257 0.0579953 0.0724065 0.0633641 0.0682182 -0.0563195 -0.0689355 -0.0634957 -0.139203 0.0696865 0.0585759 0.0689306 0.0291271 0.0284959 -0.106862 -0.0207651 -0.0945417 -0.0636831 0.0177729 0.113527 0.0760772 0.0641176 -0.0473101 -0.0287266 0.0563083 -0.0351543 0.142014 -0.183253 -0.0792687 -0.204923 0.113799 -0.0675651 0.00290129 0.144984 0.199987 -0.110908 0.00905006 -0.0230857 0.047023 -0.0960023 -0.15756 -0.0362857 0.0363866 0.0429635 0.0989322 0.131015 0.00964812 -0.0229662 -0.0597775 -0.0419906 -0.0908801 
0.0361131 0.066642 -0.0745293 -0.0852387 0.100647 0.101304 0.00385531 -0.0545458 -0.181522 -0.0213182 -0.108573 0.0419719 0.0637082 -0.0199327 0.0376195 -0.0162172 -0.0102618 -0.0104 0.0145561 0.150813 0.0323267 -0.00882434 0.108412 -0.00918885 -0.0370763 0.138017 -0.0955236 -0.19904 0.040513 0.019292 -0.0191069 0.115371 -0.0526343 0.037381 0.0402518 0.0385574 0.0194493 0.248494 0.00491932 -0.0452428 0.0207827 0.0264103 0.0110711 0.0610444 -0.159305 0.151083 0.213437 0.00822124 -0.156409 0.0537528 0.000157876 -0.0230336 -0.0314676 0.0400371 0.139944 -0.0361384 0.067259 0.164096 0.019913 -0.152357 -0.0238053 0.0377699 0.161001 -0.109256 0.147803 -0.0842422 -0.00260389 0.0761762 -0.0142005 0.0728493 0.0107927 0.0891613 -0.0242674 0.0966529 0.0183964 -0.0102947 -0.103639 0.0433513 0.0947493 -0.00765456 -0.0430602 0.123435 -0.0342324 -0.0323422 -0.0163937 -0.133942 0.0558433 0.0894491 0.0597363 0.00718697 0.0675957 -0.0537062 0.0142226 -0.0782957 -0.000441278 -0.0725717 0.137536 0.178767 0.0108404 -0.0602313 -0.0758819 0.0709837 -0.0115691 0.151794 -0.204439 0.0164178 -0.135755 0.0949947 0.0584857 -0.0300477 0.0904277 0.147192 -0.135315 0.0156639 0.0290877 0.00010108 -0.0939049 -0.254753 -0.022585 0.0764905 0.0489947 0.081445 0.0854568 0.0268516 -0.0580483 -0.0206576 -0.0107827 -0.055021 
0.045434 0.00626271 -0.108993 -0.063497 0.105763 0.0776234 -0.00543057 -0.10512 -0.104492 -0.0582575 -0.101997 0.0822675 0.061545 -0.0504411 -0.0360607 -0.0184874 -0.0766315 -0.000306997 -0.000723103 0.181419 0.0664737 -0.0344746 0.130611 0.0135129 -0.0460478 0.137516 -0.066932 -0.246335 -0.0183121 0.0518873 -0.0230979 0.0759471 -0.0499003 0.0288362 0.0767192 0.0245245 -0.0046266 0.255671 -0.00145474 -0.0832934 -0.0130628 0.0258055 -0.0215856 0.103041 -0.157214 0.111904 0.194448 0.0269366 -0.0947188 0.091792 -0.0129271 -0.0559282 -0.000241561 0.0432113 0.176953 -0.0627366 0.0775529 0.160698 0.00663268 -0.163931 0.01199 0.00981868 0.201857 -0.0590816 0.145785 -0.152733 -0.016778 0.0919644 0.019131 0.0616272 0.00615419 0.0889289 -0.0226812 0.0572949 -0.0388963 -0.0123164 -0.11358 0.0319281 0.0865263 0.0502195 -0.0282411 0.109069 -0.053249 -0.0282105 -0.034263 -0.155038 0.0575524 0.115177 0.0716533 -0.018112 0.0666502 -0.0488164 0.0223713 -0.0759679 -0.0326067 -0.0810199 0.0956636 0.162703 0.04331 -0.0776391 -0.0223539 0.0531131 -0.0317044 0.109246 -0.152817 -0.0205399 -0.124235 0.0873002 0.0391267 0.0230861 0.0854128 0.150277 -0.116359 0.015624 0.0135835 0.0629485 -0.0993283 -0.211263 -0.0529691 0.074982 0.0195804 0.110545 0.0716138 0.00877056 -0.0885413 -0.0144892 -0.0192766 -0.0379356 
0.0383598 0.0564003 -0.103374 -0.0694291 0.0699177 0.110448 -0.0496381 -0.0933244 -0.144951 -0.0599519 -0.108375 0.0450469 0.0498245 -0.0511215 -0.0281058 0.00499975 -0.0528589 -0.0036212 0.0417153 0.142488 0.0755981 -0.0289729 0.143819 -0.00154649 -0.0269108 0.142651 -0.0494655 -0.243687 0.000396641 0.0403354 -0.0147125 0.0765131 -0.0331638 0.0325624 0.0695358 0.0242623 0.0129187 0.239641 0.0302981 -0.0662037 -0.0384723 0.00719561 0.015428 0.0808943 -0.123911 0.122955 0.231517 0.000476909 -0.152119 0.0933677 0.0129605 -0.0311282 0.0155319 0.0580457 0.148443 -0.0445316 0.130508 0.14116 0.0302074 -0.18982 0.00949831 0.033947 0.195187 -0.0971909 0.147546 -0.125584 -0.0191694 0.074036 0.00371127 0.101251 -0.0281691 0.0649438 -0.0624491 0.06293 -0.00361983 -0.0380361 -0.10097 0.0325656 0.07857 0.0443092 -0.049394 0.107832 -0.0402279 -0.0330987 -0.0365448 -0.131848 0.0220892 0.0832323 0.0666259 -0.00278164 0.0600321 -0.0525103 0.010471 -0.0667481 0.00648423 -0.0528573 0.109862 0.226685 0.0242651 -0.0605517 -0.042608 0.068699 -0.0366004 0.140326 -0.147153 -0.014074 -0.116424 0.0834937 0.0265412 -0.0187616 0.0678463 0.13943 -0.102499 -0.00147714 0.0304216 0.0445617 -0.0854251 -0.232097 -0.0154573 0.0819197 0.0493788 0.0819846 0.0974832 -0.0233971 -0.0711617 -0.0171266 0.0161837 -0.0282173 
0.0678604 0.0702042 -0.0866754 -0.00999283 0.0899699 0.0825999 -0.0039521 -0.15451 -0.138028 -0.0926059 -0.116974 0.0346944 0.0684538 -0.0171782 0.00339491 0.0187373 -0.0414168 -0.0455865 -0.00406517 0.165963 0.0705339 -0.0382378 0.086067 -0.0259024 0.000204908 0.0943883 -0.157623 -0.218967 -0.0375327 0.123191 -0.0267731 0.173662 -0.0476532 0.0519659 0.0836411 0.0442374 0.0426982 0.201703 0.0555964 -0.114204 -0.0360173 -0.0119543 0.0888412 0.00670894 -0.0690286 0.194875 0.234478 0.0103855 -0.139986 0.0784452 0.0204532 -0.0403871 0.0576072 0.063539 0.197451 -0.0728026 0.0619762 0.0950817 0.0220664 -0.163391 0.0155972 0.0556218 0.116909 -0.110376 0.110975 -0.0534291 -0.0127338 0.084965 -0.0328254 0.00775082 0.000558089 0.0530186 -0.0525293 0.0297521 0.00826097 0.0261069 -0.061577 -0.0396036 0.0836981 0.108783 0.0323197 0.0817775 -0.0797823 -0.0366811 -0.0300841 -0.0861986 -0.0154368 0.0317488 0.0265993 0.0515377 0.0514815 -0.0704629 0.0114943 -0.0342151 -0.0909689 -0.00977589 0.108741 0.17451 0.0595554 -0.0656246 -0.010189 0.0659343 -0.0209594 0.141373 -0.191365 0.0130896 -0.133736 0.155818 0.0202292 0.027262 0.0660136 0.0976987 -0.165855 -0.0321474 0.00949634 0.063512 -0.115831 -0.161685 -0.0522814 0.0942693 0.0396695 0.0994041 0.131176 0.0167645 -0.0329621 -0.0122815 0.0503234 -0.0796535 
0.0666059 0.0363138 -0.11059 -0.052799 0.114639 0.143788 0.0155409 -0.0995659 -0.132701 -0.0824364 -0.119374 0.0510919 0.0534055 -0.079494 -0.0258658 -0.00142013 -0.0891397 0.0107313 -0.0299872 0.129483 0.0973103 -0.0251661 0.106853 0.0175501 -0.0199649 0.0835979 -0.11194 -0.25099 -0.00943687 0.0683166 -0.00695431 0.109502 -0.0982309 0.0488431 0.0798719 0.0182841 -0.0250683 0.169413 0.00549551 -0.0887395 0.00208898 -0.000605127 0.0278459 0.11125 -0.11824 0.119494 0.215439 0.0376306 -0.147953 0.0881921 0.0119266 -0.075049 0.0186864 0.0208755 0.152847 -0.0516813 0.0659423 0.170613 0.0386025 -0.186724 0.00919717 0.0689094 0.19291 -0.0793391 0.117225 -0.109335 -0.0172802 0.0697394 -0.0117435 0.0697727 -0.0124719 0.0872789 -0.0314421 0.0487257 -0.0468222 -0.0177551 -0.104494 -0.000860953 0.0700519 0.0618178 0.0148746 0.105933 -0.067627 -0.0609063 -0.0552599 -0.108714 0.039346 0.0575745 0.0340868 0.0258382 0.0995375 -0.0603882 -0.0332848 -0.0891751 -0.0416547 -0.0129745 0.0946394 0.178374 0.027073 -0.0432216 -0.00849465 0.0544679 -0.0162533 0.12605 -0.184804 -0.0162664 -0.153785 0.128495 0.00657838 0.0177334 0.108489 0.142024 -0.138045 -0.0253416 0.0274226 0.0661959 -0.1059 -0.179452 -0.0150419 0.0856456 0.0469506 0.0775081 0.103129 0.00748765 -0.0802736 -0.0285202 -0.0109156 -0.0688407 
0.0129873 0.0730739 -0.0885362 -0.0686902 0.0874496 0.142852 -0.0536503 -0.126606 -0.163886 -0.0414275 -0.0962873 -0.000741038 0.0648368 -0.0291579 0.0212954 -0.0213449 -0.0591849 0.01626 0.0662383 0.109278 0.0533948 -0.0262072 0.142553 -0.0455411 -0.0101951 0.129723 -0.114145 -0.226131 0.0425083 0.0144836 0.0376522 0.0902333 -0.0479341 -0.0168274 0.122198 0.0597294 0.00706959 0.187767 0.0674441 -0.0922422 0.0065463 0.00810699 -0.00315575 0.0759749 -0.168462 0.142655 0.217394 0.0506518 -0.155319 0.0227448 -0.0566674 -0.0119591 0.0525312 0.0282767 0.0838215 -0.040959 0.136718 0.129619 0.0199956 -0.186174 -0.022514 0.0963201 0.198525 -0.085477 0.14127 -0.0411455 0.0121834 0.0737322 0.0177236 0.0844552 -0.012509 0.0688508 -0.0462341 0.0472799 0.0139766 -0.0434716 -0.161306 0.00590326 0.0919149 0.0429982 -0.0319845 0.117608 -0.0400861 -0.0224962 -0.0176973 -0.104859 0.0178989 0.0781054 0.0247951 -0.0101976 0.122527 0.00230509 0.0427458 -0.0768257 -0.0220652 -0.119902 0.0956196 0.26988 -0.00526902 -0.073944 -0.0221944 0.0746057 -0.000146401 0.0812076 -0.140892 0.0348303 -0.0532513 0.109352 0.0836846 0.0316203 0.0713413 0.0910972 -0.110257 -0.027723 0.0211691 0.0297353 -0.122206 -0.213816 -0.00300499 0.0631643 0.0622687 0.0143256 0.0643186 -0.0184014 -0.102603 -0.00351445 0.00347085 0.0211402 
0.030514 0.0995786 -0.126678 -0.060535 0.0661874 0.0939891 -0.039304 -0.113166 -0.147378 -0.0467699 -0.100347 0.0283477 0.0648403 -0.0485929 -0.0284662 0.0027023 -0.0537035 -0.0357155 0.00249251 0.158569 0.0229591 -0.0423756 0.119985 -0.0448363 -0.0253326 0.141937 -0.0705406 -0.194597 0.00237186 0.0274994 -0.00598794 0.1235 -0.0549608 0.0227987 0.0412042 0.0319892 0.0255348 0.242171 0.0507793 -0.049276 -0.00270421 -0.0191522 0.0417447 0.0781343 -0.12919 0.128395 0.2391 0.0232252 -0.131139 0.0898364 0.0159547 -0.0152287 -0.023602 0.0692364 0.135469 -0.0752072 0.0863504 0.116568 0.0485946 -0.194327 -0.0165971 0.027321 0.176401 -0.0856073 0.101696 -0.0942086 0.0165112 0.075284 0.010553 0.0512114 -0.0113372 0.0775743 -0.0217846 0.109118 0.0315071 -0.0459755 -0.104439 0.0287252 0.0638179 0.0593443 -0.00815113 0.101916 -0.035321 -0.0285664 -0.0287997 -0.0975955 0.0132294 0.0789385 0.0789705 -0.0220146 0.043461 -0.0669505 0.0211779 -0.0889979 -0.0224565 -0.0786969 0.124122 0.20622 0.010599 -0.0846546 -0.0839128 0.0668711 -0.00275341 0.178995 -0.164203 0.00530671 -0.135776 0.16118 0.0408645 -0.00142866 0.0670554 0.145788 -0.136944 0.0373947 -0.0139313 -0.00629291 -0.0929913 -0.21298 -0.00169386 0.0583806 0.0500032 0.0945371 0.118087 0.005035 -0.0683162 -0.0632731 -0.011538 -0.0257457 
