-0.014335 -0.00699167 -0.0069704 -0.0073794 0.0864837 0.234337 -0.00930516 -0.0444308 -0.0574399 -0.0883587 -0.0183415 0.104328 0.0147625 -0.139587 0.00788212 -0.0213346 -0.134943 0.029242 -0.0245696 0.0563418 0.138626 -0.067846 0.0157955 0.176233 0.0793795 0.0325185 -0.0333733 -0.227313 0.0109264 0.0230969 0.136972 0.0222914 -0.0749304 0.0833551 0.0416328 0.0759862 -0.0632558 -0.0404078 0.0051476 -0.0659962 0.132086 -0.102629 0.0436499 0.126572 -0.0740074 -0.0986707 0.194772 -0.00262465 -0.15608 -0.00360081 -0.0352318 -0.169152 0.053607 -0.0524713 0.119322 0.109661 -0.101336 0.229063 -0.0451679 -0.150949 -0.0834655 0.0649944 0.227689 -0.13383 0.125918 0.042611 -0.00630147 -0.0659372 -0.114013 0.105285 -0.0927356 0.0874635 -0.100407 -0.0184776 0.037896 -0.0391837 -0.0387067 0.0410369 0.0383648 0.0766474 -0.0731649 0.0879853 0.0054368 -0.0605869 -0.092843 -0.0282357 0.0908146 0.0479812 -0.0282296 0.0587455 0.14427 -0.0927569 -0.0542771 0.011381 -0.0226175 0.0397197 -0.034981 0.103357 0.0139825 0.001112 -0.0327167 -0.0625789 -0.0859731 0.0295638 -0.0702225 0.112721 -0.0795587 0.0309483 -0.0860052 -0.0598265 0.0076847 0.118963 -0.0692358 -0.0706501 0.104242 0.034672 -0.0976794 -0.100841 0.065166 0.15988 0.130066 -0.0430282 -0.0054033 -0.0105769 -0.108626 0.10585 0.00603292 -0.0121077 
-0.0168361 -0.000926906 0.0306115 0.00192701 0.0599251 0.224335 -0.0286072 -0.0760605 -0.0661387 -0.122772 -0.0600947 0.1007 -0.0319186 -0.189665 0.00224272 -0.0375559 -0.214736 -0.03081 0.0172394 0.0493408 0.131248 -0.0325866 0.0384858 0.123012 0.0744909 0.0601087 -0.0308749 -0.257829 -0.0104413 0.0247947 0.105557 -0.0305019 -0.0659258 0.0689081 0.0978963 0.0387 -0.0411557 -0.0167094 0.0177927 -0.0803089 0.115522 -0.125001 0.0443996 0.11999 -0.0900228 -0.0356813 0.213793 -0.0156262 -0.154096 0.0401454 -0.022411 -0.127963 0.0958674 -0.0142818 0.164737 0.0566949 -0.032184 0.168229 -0.0662048 -0.1633 -0.0385622 0.060611 0.212479 -0.0849108 0.150152 -0.00208355 0.00190734 -0.07524 -0.0754674 0.112175 -0.110529 0.0833193 -0.102632 0.0069412 0.054305 -0.0375226 -0.0777188 0.0132516 0.070527 0.158999 -0.0376414 0.0648592 0.023837 -0.0287068 -0.0632111 -0.078386 0.0733878 0.0751501 -0.0348362 0.0747084 0.143823 -0.0582792 -0.0417156 0.0158154 -0.0965996 0.00366838 0.00394917 0.124529 0.0546217 -0.0296379 0.00109234 -0.0245203 -0.0785801 -0.0147279 -0.0603009 0.0647093 -0.0420442 0.0713218 -0.0781339 -0.00913453 0.0515841 0.107722 -0.0803952 -0.0998386 0.09287 0.0686933 -0.0946459 -0.0788382 0.033456 0.150458 0.134336 -0.0200813 0.0195616 -0.0580865 -0.0832581 0.106111 0.0698861 0.0118054 
-0.0276262 0.0102478 -0.00687671 -0.0256611 0.0483085 0.208716 -0.0506918 -0.0785532 -0.110793 -0.0691438 -0.0375189 0.0640248 -0.0296218 -0.157953 0.0296976 -0.0415437 -0.1925 -0.0384845 0.116257 0.0375508 0.0905604 -0.0281854 0.0466433 0.0961659 0.0808867 0.115124 0.00098376 -0.250119 0.0446827 0.000955806 0.100959 -0.0734393 -0.0670685 0.00634314 0.110008 0.0561692 -0.0527014 -0.02155 0.0590826 -0.0730122 0.0909684 -0.104566 0.0135293 0.142559 -0.114865 -0.00900245 0.215986 0.00979613 -0.148005 0.00119816 -0.0661949 -0.0866273 0.105356 -0.0316505 0.127526 0.0546938 -0.00219048 0.182626 -0.0568296 -0.15303 -0.0430805 0.0630709 0.254918 -0.0593166 0.136616 0.0263873 0.0176186 -0.0743933 -0.0212115 0.0894138 -0.115588 0.102766 -0.101124 0.0171493 0.0712208 -0.0707462 -0.104887 0.0318575 0.0855199 0.152587 -0.037565 0.0700435 0.0191526 -0.0281792 -0.0421273 -0.0969278 0.0591719 0.0791689 -0.00686892 0.0281166 0.164142 0.0177598 -0.0277672 0.0153305 -0.0622972 -0.056927 0.0242944 0.162022 0.0500185 -0.0650438 -0.0199855 -0.0144676 -0.0448563 -0.0641949 -0.0878482 0.0946113 0.00413955 0.050345 -0.0262638 0.0118097 0.0940183 0.0971908 -0.050271 -0.117077 0.090291 0.0643438 -0.0852448 -0.10472 0.0334156 0.10779 0.119117 -0.0664193 0.0171772 -0.0669639 -0.143204 0.119371 0.0567329 0.0544393 
0.00169917 0.00956906 -0.0250461 -0.0245991 0.0771624 0.216767 -0.00354861 -0.0345494 -0.0611745 -0.11243 -0.0277882 0.0997297 -0.000772734 -0.206034 -0.0365265 -0.0095614 -0.195317 -0.00729796 -0.0301829 0.0742574 0.157806 -0.049158 0.0433813 0.115751 0.0456694 0.0513102 -0.00777284 -0.257896 0.0275344 0.0330534 0.0738665 -0.011812 -0.0521678 0.0865579 0.0669284 0.0120151 -0.0278235 0.0185813 0.00548076 -0.0795206 0.11631 -0.126095 0.0508259 0.15695 -0.106128 -0.0513219 0.220153 -0.00863564 -0.175283 0.0408116 -0.0433752 -0.13278 0.040012 -0.00247021 0.143552 0.0529988 -0.0324754 0.166018 -0.0756872 -0.173324 -0.0492643 0.0256125 0.252266 -0.0760053 0.132304 -0.021034 -0.0206916 -0.0676463 -0.0593992 0.0887149 -0.116836 0.0612386 -0.0999229 0.00530134 0.056264 -0.0460826 -0.061802 0.0559364 0.0450281 0.116077 -0.0461127 0.0728138 0.011079 -0.0320459 -0.0748878 -0.0228973 0.0763162 0.0786167 -0.0122476 0.0697909 0.16109 -0.098755 -0.101572 -0.00109105 -0.064857 -0.000853431 -0.0155254 0.13353 0.0411918 -0.0293402 -0.00533582 -0.0486772 -0.0642552 0.0351753 -0.0632774 0.064428 -0.0623911 0.116249 -0.0695492 -0.0534142 0.0369651 0.124972 -0.0885454 -0.0720496 0.0963744 0.0581183 -0.0978184 -0.101019 0.058552 0.150925 0.115785 -0.00127529 0.028381 -0.016197 -0.0919269 0.0768792 0.0416105 -0.00652298 
-0.00720588 -0.030281 -0.0483769 -0.050644 0.0675072 0.205582 -0.0336999 0.00649159 -0.100327 -0.0706178 -0.0360545 0.0850004 0.0270617 -0.164661 -0.00661232 -0.0336263 -0.15619 -0.00190121 0.00129045 0.100213 0.114833 -0.0858152 0.0545718 0.140699 0.045464 0.0759528 0.0142939 -0.25816 0.00390554 -0.0290416 0.104678 -0.0295242 -0.0748033 0.0694549 0.0230975 0.0560324 -0.0706144 0.0143641 -0.018594 -0.0625571 0.110488 -0.109347 0.0116585 0.196333 -0.106262 -0.0724769 0.211227 0.0179454 -0.163711 0.0375041 -0.0495815 -0.178974 0.0228436 -0.0397721 0.113906 0.0620686 -0.0738297 0.212858 -0.00559886 -0.192027 -0.0510137 0.0460879 0.246554 -0.067675 0.109283 -0.0155879 -0.00407786 -0.0408339 -0.0376428 0.0744458 -0.110118 0.0858793 -0.0746842 -0.00301683 0.0329684 -0.0775909 -0.0698545 0.0800978 0.0635514 0.105397 -0.0805138 0.0578112 -0.0171448 -0.0710628 -0.0893212 -0.0441342 0.0988643 0.0804049 0.0288147 0.0152016 0.143711 -0.0645696 -0.0595781 -0.0250273 -0.0285973 0.00876338 -0.00214374 0.127516 -0.000540718 -0.0428788 -0.0569703 -0.0472632 -0.0608365 0.0253137 -0.0890109 0.0810099 -0.101468 0.0739968 -0.0700249 -0.0643483 0.0460126 0.15965 -0.0700542 -0.0646781 0.0792316 0.0317143 -0.0919267 -0.14739 0.0596697 0.126601 0.0944563 -0.0214191 0.00935956 0.00235693 -0.128326 0.0473981 -0.0143713 -0.00238146 
0.0133425 -0.00434227 -0.0165809 -0.0985243 0.068147 0.139707 -0.0184623 0.0994195 -0.0419337 -0.0702809 0.0170701 0.0427878 0.0576315 -0.172084 -0.0695958 0.047939 -0.11124 -0.0446202 -0.158259 0.0918948 0.186095 -0.0859985 0.00779416 0.0280944 0.014441 0.0933688 0.00950365 -0.174135 0.0456377 -0.0809483 0.0866398 -0.010722 -0.0855365 0.104529 -0.0499069 -0.0141844 -0.0880612 0.138285 0.0114424 -0.0337616 0.0939304 -0.0833012 -0.011076 0.175456 -0.0069364 -0.101635 0.106612 0.000602575 -0.177609 -0.0166286 -0.0512961 -0.120346 -0.105949 -0.0191465 0.0474188 -0.000721077 -0.110848 0.160664 -0.0462345 -0.190209 -0.0231788 -0.0612429 0.197333 0.003291 0.0757972 -0.0436713 -0.0433809 0.079118 0.0338643 0.0197948 -0.0451227 0.0576347 -0.0319981 -0.0278614 0.00761525 -0.0857784 -0.0558283 0.110591 0.0122175 0.113271 -0.0825283 0.0234715 0.0492896 -0.0492315 -0.13465 -0.0378519 0.16982 0.130682 0.0718081 -0.0376779 0.0809713 -0.129048 -0.119054 0.0210158 -0.0257232 0.019356 0.0174097 0.0239603 -0.0813977 -0.0227808 -0.0738134 -0.0669609 -0.112552 0.123121 -0.049107 0.030092 -0.122502 0.149509 0.00158951 -0.178593 0.00440766 0.162854 -0.170831 0.067952 0.158417 0.00244651 -0.187631 -0.0991749 0.0416706 0.0826022 0.0135498 0.0963375 0.0278313 0.0669215 -0.0134438 -0.029936 -0.0280723 -0.0541429 
0.0164466 -0.00948683 -0.0119343 -0.100354 0.082445 0.151379 -0.0249277 0.0903842 -0.0732854 -0.0538762 0.0140531 0.0421701 0.0685807 -0.121014 -0.0427275 0.0367504 -0.0564402 -0.0201349 -0.139949 0.100513 0.160779 -0.0783949 0.0285928 0.0419364 0.00195386 0.109527 0.00225173 -0.166447 0.0582122 -0.0983985 0.0951074 0.0285449 -0.0856951 0.109063 -0.0614109 0.0166973 -0.0759214 0.169629 -0.00226654 -0.0322409 0.100425 -0.0511108 -0.0287963 0.15087 -0.0410766 -0.0948425 0.115284 0.00662986 -0.178423 -0.028775 -0.0417953 -0.118681 -0.112637 -0.0200445 0.0482346 0.00957328 -0.0928562 0.183924 -0.0232151 -0.187996 -0.0413407 -0.0390785 0.191298 -0.0374932 0.0991135 -0.0259927 -0.0296587 0.0909635 0.0216003 0.0598109 -0.0403333 0.0658322 -0.0219884 0.000695888 0.00766372 -0.0972641 -0.0549276 0.126481 0.0138887 0.0512014 -0.101558 0.0484589 0.0416744 -0.0758168 -0.124017 -0.0662329 0.177005 0.133839 0.0604803 -0.0391352 0.0935915 -0.122917 -0.0857874 0.0022265 0.0127696 0.0119658 0.0330504 0.0471248 -0.0905445 -0.00914939 -0.0918794 -0.0495698 -0.112977 0.141649 -0.0585485 0.0395469 -0.131338 0.1069 0.020243 -0.185421 -0.00493624 0.182776 -0.152889 0.0793942 0.161586 -0.0234755 -0.178979 -0.149484 0.0384701 0.0840378 0.0232004 0.0928302 0.0262516 0.0696078 -0.0246533 -0.0298664 -0.0449019 -0.0534259 
0.025997 -0.0158627 -0.0313309 -0.0953775 0.077501 0.189179 -0.009945 0.0916953 -0.040455 -0.0906247 0.00155591 0.0393342 0.0593962 -0.173041 -0.0643162 0.0099208 -0.118034 -0.015144 -0.157992 0.0912529 0.177798 -0.0699757 0.0435815 0.0424041 -0.014271 0.0622374 -0.00154102 -0.203438 0.0300285 -0.0915402 0.0944436 -0.00403605 -0.0831732 0.112495 -0.0236234 0.00153866 -0.0637448 0.136961 -0.0296025 -0.0531979 0.117343 -0.0779318 -0.0391075 0.182143 -0.0765491 -0.0952402 0.112176 0.0235999 -0.175702 0.0141943 -0.0574242 -0.127396 -0.0807586 -0.00461846 0.0588622 0.00556252 -0.0682512 0.157893 -0.0355903 -0.212689 -0.0396279 -0.0215987 0.213646 -0.02999 0.0944757 -0.0537783 -0.0273035 0.0721311 0.0242972 0.071599 -0.0517963 0.0444717 -0.0286611 -0.0167299 0.00364793 -0.0850047 -0.0779999 0.10765 0.018982 0.0791655 -0.0886972 0.0371523 0.0330449 -0.0638527 -0.117659 -0.0282434 0.168777 0.131071 0.0429834 -0.00309124 0.133077 -0.14546 -0.10469 -0.0196985 -0.0269338 1.05657e-05 0.0105662 0.0589613 -0.0786802 -0.0103433 -0.0336241 -0.0393204 -0.095817 0.109416 -0.037047 0.0214555 -0.122526 0.126193 -0.0172483 -0.145943 0.0164852 0.17361 -0.141812 0.050037 0.141247 0.00595433 -0.171457 -0.132822 0.0549279 0.0956689 0.0413068 0.068612 0.0297525 0.0655969 -0.0170435 -0.0319696 -0.0223729 -0.0403755 
0.0339345 -0.0272495 -0.0310706 -0.116709 0.0440779 0.187763 0.0164267 0.121086 -0.0752332 -0.112326 -0.00837278 0.0796232 0.0505403 -0.182602 -0.097506 -0.0381127 -0.145605 -0.0686902 -0.151551 0.0845345 0.132014 -0.0451236 -0.00325617 0.0260769 -0.0374474 0.0856708 0.0299426 -0.16095 0.00526495 -0.100138 0.0347628 -0.0480429 -0.113509 0.111078 -0.0731084 -0.0336843 -0.101706 0.102596 -0.0456718 0.00843396 0.124945 -0.0870627 -0.0397037 0.18316 -0.0697182 -0.0842274 0.101001 -0.0129783 -0.182372 0.0487312 -0.0419099 -0.124472 -0.0985145 0.01124 0.0499026 -0.00379822 -0.100862 0.191248 -0.0497705 -0.170266 -0.0200059 0.0034977 0.227452 0.000244519 0.0609466 -0.071976 -0.0104042 0.0501613 0.020929 0.0330372 -0.0411013 0.0383984 0.00529071 0.0239195 0.0214662 -0.048402 -0.0714416 0.0528171 0.0174976 0.0993702 -0.0806745 -2.64209e-05 0.0634074 -0.0484745 -0.137613 -0.0297471 0.191521 0.105583 0.0391879 -0.0155705 0.102738 -0.16016 -0.0953774 0.00602379 -0.0432793 0.00579412 0.0450029 -0.00165168 -0.0581395 -0.00462798 -0.0698997 -0.0141777 -0.0974607 0.12573 -0.0796385 0.02195 -0.139548 0.165774 -0.0978076 -0.156001 0.0885392 0.156541 -0.131305 0.0459964 0.094836 0.0153572 -0.160167 -0.081151 0.0584023 0.0852247 0.00434115 0.0363344 0.0223193 0.0297872 0.00315634 -0.0212634 -0.0493795 -0.0580764 
0.0394417 -0.0510871 -0.0466629 -0.105577 0.0499452 0.18489 0.0358804 0.0772825 -0.117327 -0.0982726 -0.0316922 0.0583933 0.054536 -0.1331 -0.0390326 -0.0902556 -0.163587 -0.0903686 -0.0288902 0.091324 0.1178 -0.0680162 0.0238525 0.0107929 -0.00905119 0.106472 -0.0215979 -0.203553 0.0410197 -0.0778162 0.0521297 -0.0583407 -0.137034 0.0482937 -0.00756633 -0.00528359 -0.113918 0.13215 0.00426164 -0.0402672 0.106126 -0.0617442 -0.0917014 0.171239 -0.131712 -0.0478927 0.103268 0.00458281 -0.137269 0.0289062 -0.106155 -0.0703791 -0.0274587 0.00666717 0.0676394 -0.0194349 -0.0500201 0.238575 -0.0708013 -0.173331 -0.0208191 0.0268338 0.28158 -0.00958661 0.0779198 -0.0248096 0.025708 0.0353208 0.0465074 0.0278194 -0.0428308 0.0970105 -0.0239535 0.0640659 0.00955041 -0.0745842 -0.0938043 -0.00257134 0.0787428 0.146676 -0.0947057 -0.0122809 0.0490757 -0.0666944 -0.0740788 -0.107987 0.169294 0.127644 0.0666806 -0.0628716 0.171533 -0.0817587 -0.0270055 -0.0116036 -0.0509061 -0.0975085 0.0780341 0.0630452 -0.0142236 -0.0288422 -0.061805 0.0178939 -0.0694804 0.0659816 -0.121829 0.0674467 -0.0721054 0.14958 -0.0129161 -0.0922504 0.116853 0.14099 -0.149015 -0.00104196 0.11023 0.0599835 -0.10388 -0.107619 0.0620242 0.0909887 -0.00140595 -0.0103192 0.0118778 0.0132456 -0.0696177 0.0097914 -0.0142979 0.00600883 
0.0247689 -0.0191037 -0.0331589 -0.105153 0.0536519 0.178544 0.00868847 0.0991087 -0.0817945 -0.0937182 -0.0128246 0.0460085 0.0581616 -0.181183 -0.0723439 -0.00894817 -0.183008 -0.0660894 -0.130693 0.0883409 0.162041 -0.0913342 0.040629 0.00742284 -0.00534501 0.0761678 -0.00869503 -0.196933 0.0376187 -0.0897662 0.0599365 -0.0250218 -0.117014 0.089178 -0.0509217 -0.0238255 -0.110495 0.124175 -0.00623365 -0.0197902 0.115433 -0.10198 -0.041889 0.17147 -0.0810028 -0.0857245 0.113429 0.0020141 -0.169884 0.0293801 -0.0692857 -0.106775 -0.0788254 0.0089422 0.0467859 -0.0138551 -0.0463446 0.174233 -0.0458946 -0.189044 -0.0207305 0.00277663 0.233957 0.0133543 0.0663386 -0.0346907 -0.0193401 0.0540863 0.0447933 0.0361034 -0.0613311 0.078652 -0.0193434 0.0290023 0.0294499 -0.0776637 -0.0840371 0.0478443 0.027614 0.131306 -0.0763447 -0.0079643 0.0515204 -0.0460377 -0.126944 -0.0144259 0.168206 0.12887 0.0510369 -0.0437387 0.132229 -0.123561 -0.0919547 -0.00893725 -0.0613651 -0.0292638 0.0277449 0.0639518 -0.0383587 -0.0164247 -0.0543361 -0.0409216 -0.0791564 0.116292 -0.0560253 0.035512 -0.118272 0.197469 -0.0244852 -0.148829 0.0480091 0.169653 -0.147957 0.0231256 0.120937 0.0381197 -0.147775 -0.0765906 0.0685456 0.0984771 0.0133179 0.0407614 0.0234561 0.0360669 -0.0489323 -0.0164116 -0.0367646 -0.0135154 
0.0196322 -0.00813688 -0.0297029 -0.086873 0.0791067 0.159513 -0.00483368 0.0848919 -0.0495167 -0.0754864 0.00643398 0.0678455 0.0596112 -0.159297 -0.0739046 0.0293362 -0.104685 -0.0125533 -0.157977 0.096401 0.17488 -0.0881842 0.045626 0.0507823 -0.0047031 0.0767316 0.00483891 -0.193769 0.0358489 -0.0720928 0.071444 0.0216537 -0.0662862 0.110184 -0.0530567 -0.0129928 -0.076396 0.158834 -0.0246361 -0.0347644 0.106465 -0.0707679 -0.0210507 0.165775 -0.0680111 -0.0942438 0.127429 -0.0121324 -0.183895 0.00748839 -0.0355587 -0.126273 -0.09574 -0.00685512 0.0637461 0.0153741 -0.0674905 0.169977 -0.0369433 -0.192056 -0.041114 -0.0404017 0.206065 -0.0293622 0.0975278 -0.04888 -0.0459423 0.0733238 0.00440706 0.0684641 -0.0485728 0.0522974 -0.0334628 -0.00415589 0.0140825 -0.0717823 -0.0646048 0.101694 0.00426855 0.0627654 -0.107406 0.0433057 0.036352 -0.0594123 -0.131296 -0.0293614 0.165923 0.120321 0.0466969 -0.0181722 0.0936603 -0.149914 -0.109418 -0.0132385 -0.00630226 0.0117446 0.0116643 0.0595265 -0.0650613 -0.00780293 -0.0637232 -0.0574677 -0.0915227 0.142071 -0.0516977 0.0224668 -0.134193 0.136257 -0.00959154 -0.18085 0.00213388 0.180321 -0.139876 0.0502341 0.148573 0.00281186 -0.1694 -0.132538 0.0639324 0.111569 0.0373181 0.0852385 0.0202716 0.0596066 -0.0172092 -0.0207543 -0.0261585 -0.0463392 
-0.00602375 -0.00693377 0.0161028 0.0190298 0.0781941 0.230935 0.0171481 -0.0515367 -0.0543982 -0.0947476 -0.0183167 0.0754836 0.00144143 -0.196858 0.00663756 -0.0119351 -0.193446 0.0311403 -0.0393165 0.0557656 0.164466 -0.0676984 0.0313958 0.123079 0.0659911 0.0266299 -0.0889813 -0.275497 0.0169148 0.0158537 0.119402 0.0317493 -0.0905292 0.079828 0.0993439 0.0463186 -0.0497572 -0.00884063 0.0125982 -0.102692 0.142521 -0.120456 0.0249192 0.124898 -0.0975056 -0.0732059 0.191692 0.00540282 -0.160863 -0.00405602 -0.0514988 -0.147998 0.0597616 -0.0301967 0.126329 0.064323 -0.0414287 0.158415 -0.053108 -0.16418 -0.0575727 0.0548287 0.21289 -0.0993923 0.146474 0.0284802 0.00194821 -0.0699853 -0.0656863 0.101504 -0.0973582 0.0929909 -0.0816181 -0.00167254 0.0256155 -0.0615572 -0.0838905 0.0435291 0.0475106 0.11124 -0.0481253 0.0806782 -0.00460361 -0.0589491 -0.082185 -0.0169849 0.0890724 0.0667722 -0.0438265 0.0574333 0.180192 -0.0657022 -0.0692427 -0.0219588 -0.0907206 -2.18409e-05 -0.019853 0.12284 0.0277434 -0.00894115 0.0143231 -0.0531136 -0.0616206 0.00199618 -0.0270313 0.0758659 -0.0280311 0.0931459 -0.0445185 -0.0150683 -0.00832594 0.112298 -0.0924128 -0.109397 0.123013 0.0494533 -0.108598 -0.094804 0.0510142 0.134421 0.120133 -0.0202603 0.016943 0.00136052 -0.090465 0.0915965 0.040612 0.00920373 
0.0131293 -0.0172137 -0.00329186 0.0109715 0.0858262 0.244355 0.0607507 -0.024385 -0.0578501 -0.101359 -0.044429 0.0716418 0.0208791 -0.170637 0.0540906 -0.0434327 -0.159355 0.023557 -0.0554433 0.0144634 0.125682 -0.0290611 0.00837605 0.152121 0.0677847 -0.0189506 -0.0969163 -0.26993 -0.0186887 0.022243 0.126045 0.0604156 -0.113542 0.0926952 0.0643598 0.0349173 -0.0371061 -0.0627458 -0.0228373 -0.0565336 0.191988 -0.106843 0.0358431 0.139553 -0.116866 -0.0550182 0.174637 -0.00346621 -0.139202 -0.0147682 -0.0191123 -0.197503 0.0695769 -0.0404208 0.103857 0.0827354 -0.0670123 0.187706 0.00935709 -0.140515 -0.0721541 0.0859625 0.144679 -0.122354 0.103761 0.0255537 0.0339456 -0.0723643 -0.0652666 0.063654 -0.0815451 0.0975249 -0.0625712 -0.0169899 0.0312214 -0.0168401 -0.107165 0.019155 0.0293555 0.108791 -0.0264921 0.0794659 -0.0015135 -0.0630587 -0.0784023 0.0226753 0.117481 -0.00140818 -0.108563 0.0415391 0.156945 -0.0795499 -0.0760817 -0.069789 -0.110016 0.0380351 -0.0193148 0.0860437 0.0292335 0.00824468 -0.00814904 -0.051004 -0.00873526 0.0460223 -0.0925596 0.0379305 -0.0954097 0.111864 -0.115046 -0.0057995 0.0343939 0.0924612 -0.0966928 -0.14137 0.0654644 0.0455568 -0.116513 -0.105591 0.0373137 0.128739 0.144034 -0.0282236 -0.00814763 0.0283673 -0.0884513 0.0514859 -0.0334529 -0.00526056 
0.0355615 -0.0188441 -0.0395189 -0.029043 0.0998945 0.222161 0.0495242 0.00347459 -0.00659313 -0.133823 -0.035082 0.0691867 0.0314231 -0.192308 -0.0206217 0.0146926 -0.173525 0.00720117 -0.140124 0.0277293 0.191457 -0.0207578 0.00912847 0.1147 0.034824 -0.00865771 -0.0667825 -0.265329 -0.0130854 0.0270735 0.10094 0.056581 -0.107529 0.113557 0.0463121 0.00853343 -0.038499 0.00117314 -0.0164558 -0.048233 0.15677 -0.0817108 0.0379857 0.16132 -0.0627513 -0.0629432 0.161029 0.00484837 -0.142234 0.000667095 -0.0249067 -0.184269 0.0172905 -0.0151812 0.110587 0.0498123 -0.0546285 0.172117 -0.0133359 -0.174426 -0.0475766 0.0334805 0.170827 -0.0716044 0.0727951 -0.0418986 0.0014308 0.00115157 -0.00803955 0.0608738 -0.0643941 0.0722549 -0.0586053 -0.0482531 0.0078943 -0.0228465 -0.103327 0.0460055 -0.00335945 0.111741 -0.00127127 0.0947333 0.00307006 -0.0549624 -0.114583 0.0402744 0.132191 0.0314079 -0.0771731 0.0374886 0.144588 -0.128871 -0.130157 -0.0624876 -0.0970074 0.0596586 -0.0267411 0.0723687 0.0104079 0.00834433 0.00452075 -0.0721689 -0.0321649 0.0874481 -0.0851375 -0.00137966 -0.142562 0.139967 -0.113866 -0.0455297 0.0318699 0.107946 -0.142229 -0.0799209 0.0889699 0.0711531 -0.15224 -0.102299 0.0241574 0.112836 0.123065 0.0464907 0.0362394 0.0449465 -0.0733904 0.00565098 -0.042959 -0.0294999 
0.0489279 -0.0301421 -0.020493 -0.0125257 0.102235 0.217495 0.0647616 0.0201514 -0.000777522 -0.126008 -0.0250086 0.0535845 0.0409883 -0.188042 0.0197384 -0.0117015 -0.165117 0.014182 -0.155194 0.0579019 0.177861 -0.0331925 0.0363955 0.147061 0.0344484 -0.0351071 -0.100403 -0.271052 -0.000508074 0.00834331 0.122078 0.0602442 -0.107318 0.120662 0.0360732 0.0223884 -0.0472305 0.0320702 -0.046958 -0.0483022 0.165755 -0.0783494 -0.0110242 0.151112 -0.099678 -0.0802315 0.141004 0.0209259 -0.112025 0.0306039 -0.0401604 -0.163635 0.012444 -0.0251191 0.106372 0.0390872 -0.0491038 0.173389 -0.00562356 -0.176252 -0.0782927 0.0416461 0.159269 -0.083453 0.0533606 -0.0265637 0.021376 -0.0162329 -0.0320941 0.0655416 -0.0615974 0.0867829 -0.051266 -0.00409189 0.0092324 -0.0504715 -0.110181 0.0386358 0.0204365 0.125017 -0.0119905 0.0837846 -0.00564846 -0.0770027 -0.074945 0.0329443 0.124475 0.0400375 -0.0662431 0.0313968 0.169518 -0.11663 -0.111414 -0.0810279 -0.094875 0.0230991 -0.0328938 0.0708275 0.00433604 0.000947697 0.00428216 -0.0705194 -0.0190635 0.0827922 -0.0920916 0.0164058 -0.129465 0.125439 -0.0446983 -0.0369975 0.0273857 0.14048 -0.141535 -0.082322 0.0955371 0.0706418 -0.120495 -0.120067 0.0341504 0.139602 0.119865 0.0407667 0.0143824 0.0763262 -0.0883903 0.000502273 -0.0216062 -0.0116554 
0.0695988 -0.000855266 -0.0174094 -0.0084082 0.0919287 0.247732 0.0758272 0.00249009 0.0384882 -0.147785 -0.00210576 0.0861662 0.0091175 -0.201623 0.00152745 -0.0789115 -0.204749 0.0221382 -0.16514 0.0523507 0.140066 0.00587832 0.0562476 0.123822 0.0122589 -0.0788224 -0.070631 -0.237768 -0.0375843 0.0197217 0.0945034 -0.00345339 -0.0850415 0.131726 0.0538985 0.0020418 -0.0235937 0.0367935 -0.0660526 -0.029254 0.151029 -0.078233 -0.0366309 0.136783 -0.173553 -0.099023 0.112486 0.00961784 -0.0928095 0.128246 -0.0274947 -0.108776 -0.0114865 0.0188492 0.110917 0.02656 -0.0453807 0.16075 -0.0667658 -0.147926 -0.100997 0.0199257 0.203304 -0.11683 0.063012 -0.0662464 0.0348468 -0.0296588 -0.0803928 0.137627 -0.0205345 0.0790082 -0.0391408 0.0403325 0.00492509 -0.0420202 -0.110091 -0.0201801 0.0185541 0.111458 -0.0293183 0.0755892 0.0233564 -0.0467246 -0.0527484 0.0234877 0.105558 0.0345886 -0.0457812 0.0763843 0.172534 -0.182571 -0.093527 -0.0781052 -0.0837142 -0.0471838 -0.0479026 0.0438928 0.0164171 0.00705225 0.0118532 -0.0259381 -0.0244075 0.0613407 -0.0663363 0.0213543 -0.096175 0.110348 -0.0674235 -0.00843873 0.0576412 0.124524 -0.0962515 -0.0371905 0.0781482 0.0745011 -0.0649607 -0.0814311 0.0680288 0.163242 0.141046 0.0171194 0.0118527 0.0666128 -0.0180222 -0.00647958 0.0544887 0.014893 
0.064256 -0.0452275 -0.0300955 -0.0528343 0.0748762 0.170312 0.0640811 0.0629703 0.0436572 -0.164925 -0.025075 0.0687926 0.0461381 -0.20558 -0.0528775 -0.0693958 -0.228114 -0.0317778 -0.195711 0.109708 0.168718 -0.0339202 0.0716844 0.075638 -0.0488721 -0.0430634 -0.0561725 -0.246102 -0.0398344 -0.00780796 0.0457646 -0.0314023 -0.0675143 0.122787 0.0257603 -0.0268631 -0.0411979 0.127864 -0.104765 -0.047381 0.113935 -0.0771962 -0.0711575 0.164717 -0.146694 -0.0677749 0.0859094 0.0258617 -0.0823645 0.135128 -0.0750186 -0.11973 -0.0251924 0.0358854 0.121046 -0.0213622 -0.0338649 0.117178 -0.0715438 -0.181424 -0.0457771 -0.00892088 0.19498 -0.012505 0.0456062 -0.124933 0.0218038 0.0163579 -0.000494065 0.0573774 -0.0280758 0.0322374 -0.0190004 0.0130232 -0.00500915 -0.0287359 -0.113685 -0.00437925 0.0416582 0.151928 -0.0293714 0.0222997 -0.00199812 -0.0391953 -0.059179 0.0145764 0.123462 0.0915332 -0.000260336 0.0456867 0.166117 -0.170663 -0.0957228 -0.0739778 -0.112958 -0.053919 -0.0316581 0.0301747 0.0170405 -0.0159771 0.032612 -0.0271674 -0.0351016 0.0610806 -0.058231 -0.0205535 -0.116246 0.156303 -0.0374341 -0.0352686 0.0648841 0.142509 -0.140038 -0.0199193 0.066885 0.117657 -0.091166 -0.0839962 0.0359676 0.136341 0.0559588 0.0700762 0.0100389 0.0845299 -0.0192346 -0.0380591 0.0244049 -0.00888629 
0.0414471 -0.0336184 -0.0532048 -0.0473221 0.0545814 0.098895 0.0353035 -0.0126018 -0.00120861 -0.187635 -0.0866845 0.0476095 0.0416904 -0.177042 -0.0909448 0.000159299 -0.25518 -0.086506 -0.177496 0.147892 0.149489 -0.0647434 0.0913966 0.00343501 -0.0603545 0.00959126 -0.0765732 -0.250561 -0.0543797 0.0243472 -0.00919085 0.034945 -0.0755846 0.101786 0.0327153 -0.0206882 -0.0431697 0.180174 -0.0803459 -0.0621701 0.0410922 -0.084843 -0.00554763 0.12732 -0.0617681 0.0300601 0.140652 0.0210654 -0.112611 0.142299 -0.0815961 -0.155143 0.014813 0.0546273 0.145756 -0.0596656 -0.0122233 0.102821 -0.0464557 -0.171336 0.0114739 0.0284788 0.182245 0.017125 0.0756505 -0.10235 -0.0123685 0.0168719 0.00303075 -0.00864209 -0.0615168 0.0190625 -0.00406377 0.0443901 0.0028073 -0.0228084 -0.0713711 -0.0524444 0.0404887 0.157816 0.0453982 -0.0153776 -0.0849764 -0.0607825 -0.105273 0.00370721 0.0536471 0.0751989 -0.000479697 0.0420009 0.151973 -0.133795 -0.0824746 -0.0647364 -0.113261 0.0358108 0.00412028 0.0684255 0.0734975 -0.00219422 0.01536 -0.0501427 -0.0628132 0.0769207 -0.0755211 -0.0295591 -0.135996 0.208702 -0.0462506 -0.0260501 0.0618176 0.158703 -0.147965 -0.0298757 0.0346843 0.133113 -0.0964646 -0.034185 0.0146563 0.103758 0.00768166 0.106802 0.0746462 0.0551175 -0.0343796 -0.0339725 -0.008103 -0.074334 
0.0758839 -0.0118389 -0.0661168 -0.0544072 0.0445454 0.0913021 0.0230545 0.00596961 -0.065271 -0.17463 -0.0847366 0.0363965 0.0604983 -0.176586 -0.102363 0.0411975 -0.193945 -0.0948852 -0.192838 0.174758 0.122873 -0.0323826 0.110906 -0.0271321 -0.0920279 0.0243526 -0.0760095 -0.214516 -0.0432018 0.0107713 -0.0425404 0.0567523 -0.0940781 0.103162 -0.0204468 -0.0426867 -0.059176 0.202382 -0.0696395 -0.0112488 -0.0201819 -0.0613491 -0.00153914 0.117136 -0.0434076 0.0283663 0.141502 0.0115286 -0.127562 0.194767 -0.0123734 -0.148012 -0.0370965 0.0681782 0.09999 -0.103847 0.00986003 0.094149 0.00536078 -0.152244 0.0115368 0.0362484 0.160992 0.00529211 0.0553954 -0.148079 -0.00826696 0.0154339 -0.010524 -0.0282296 -0.0425944 0.0232189 0.030314 0.0907435 -0.0232436 -0.0408096 -0.0448254 -0.0602403 0.0233375 0.157058 0.0899861 -0.043391 -0.0855479 -0.0640548 -0.0980655 0.00085611 0.0314158 0.0483619 0.014893 0.023714 0.11033 -0.126121 -0.11053 -0.0403811 -0.0767896 0.0704568 0.0410485 0.0726954 0.0185038 0.0160634 -0.0204134 -0.0213554 -0.0748631 0.138229 -0.0965137 -0.0460328 -0.151612 0.209251 -0.02202 -0.0438713 0.0650651 0.185333 -0.130455 0.0179452 0.00131686 0.10476 -0.0831561 -0.0136226 -0.00951337 0.0754958 -0.0432038 0.118596 0.114814 0.0426146 -0.00273018 -0.071595 -0.0225292 -0.104126 
0.0616458 -0.00434174 -0.0660259 -0.0520809 0.0189506 0.0583377 0.00795259 0.00452041 -0.0481747 -0.172448 -0.0989152 0.0309097 0.0484695 -0.180149 -0.106499 0.0447628 -0.191468 -0.118698 -0.189483 0.182357 0.0896964 -0.0309617 0.101095 -0.0427728 -0.103554 0.0451735 -0.0551945 -0.205245 -0.0644507 -0.000923377 -0.0490226 0.064204 -0.0689795 0.105117 -0.0184266 -0.0457026 -0.0339615 0.217356 -0.0806185 -0.0137504 -0.0262292 -0.0745953 0.0128897 0.110681 -0.0177044 0.0512738 0.143356 0.00627521 -0.122555 0.205599 -0.0140308 -0.156839 -0.0233265 0.0733052 0.107963 -0.106641 -0.00245015 0.0630092 0.0183086 -0.153867 0.0177245 0.0207502 0.132049 0.0134775 0.0537957 -0.148133 -0.00955006 0.00339419 -0.0119865 -0.0565116 -0.0598066 -0.00905993 0.0379426 0.091807 -0.0118626 -0.0429762 -0.0370963 -0.0588389 0.0239761 0.157805 0.0977053 -0.0546198 -0.105613 -0.0646123 -0.0880473 -0.00876393 0.0129099 0.0389976 0.0278311 0.0342452 0.0858553 -0.119722 -0.103979 -0.0457416 -0.0748039 0.0991859 0.0530817 0.0595724 0.0289047 0.00665669 -0.0338862 -0.0259611 -0.0746204 0.12912 -0.0952343 -0.0634084 -0.150439 0.206055 -0.0411383 -0.0324271 0.0648709 0.184621 -0.128171 0.0139289 -0.0182333 0.0851361 -0.0770008 -0.0218119 -0.0114127 0.0534256 -0.0404399 0.137663 0.132634 0.0484832 0.0212957 -0.0938386 -0.0168402 -0.119048 
0.0680633 -0.00352674 -0.0785771 -0.0531987 0.0664979 0.0883983 0.0078968 -0.02583 -0.098686 -0.166547 -0.108627 0.0252411 0.0558146 -0.146542 -0.0887537 0.0309719 -0.178242 -0.0776421 -0.148011 0.179496 0.11716 -0.0501157 0.120587 -0.0459669 -0.0553452 0.0397491 -0.0836702 -0.220154 -0.0504167 0.0147057 -0.0340007 0.0665779 -0.0964662 0.0912004 0.0138722 -0.0292203 -0.0473542 0.202718 -0.0438109 -0.0592592 -0.0114794 -0.0533459 0.0335337 0.125886 -0.06199 0.0586047 0.174093 0.0214644 -0.134208 0.173702 -0.0237509 -0.149935 -0.0125795 0.0634123 0.119511 -0.110281 0.0198536 0.0952697 0.0242226 -0.187617 0.0276349 0.0483431 0.159483 0.00166665 0.0731467 -0.121326 -0.0193016 0.0288735 0.00227739 -0.021323 -0.0419389 0.0403196 0.0319814 0.0723525 -0.0328884 -0.044533 -0.0585956 -0.0563857 0.0423259 0.145828 0.0751972 -0.0128496 -0.0922035 -0.0675187 -0.0922724 -0.0297889 0.0183292 0.068735 0.0338883 0.021361 0.118143 -0.0982289 -0.092039 -0.0645115 -0.0801494 0.0500371 0.0568435 0.117818 0.0149448 -0.0140227 -0.0272036 -0.00786592 -0.0498789 0.12666 -0.115142 -0.0348509 -0.150182 0.21413 -0.0111407 -0.0218764 0.0784733 0.176841 -0.145002 0.0200279 -0.00238218 0.0839554 -0.0907016 -0.0485366 -0.0123462 0.0579658 -0.0329436 0.125453 0.123066 0.032769 -0.0215531 -0.0841125 -0.0148137 -0.101512 
0.0543196 -0.0316712 -0.0619485 -0.0375761 0.0695423 0.124725 -0.002102 -0.0222277 -0.0928031 -0.14736 -0.0992011 0.0482325 0.0377904 -0.168501 -0.077005 0.0243414 -0.186018 -0.0265564 -0.107738 0.148019 0.152703 -0.0518614 0.106708 0.0448522 -0.0333039 0.050681 -0.0593803 -0.281857 -0.0390752 0.0213265 -0.0193544 0.0561819 -0.0926256 0.0940633 0.0363454 -0.0247727 -0.0499137 0.157098 -0.0501367 -0.0748056 0.0231352 -0.0670728 0.0200831 0.142446 -0.0683815 0.0332709 0.204131 0.00744435 -0.157021 0.124201 -0.0131028 -0.173159 0.0283729 0.0392088 0.137021 -0.0537 0.0391829 0.112864 0.0286177 -0.21316 0.0358314 0.0530089 0.173036 -0.00697467 0.0863301 -0.107943 -0.0193843 0.00905193 0.0157349 0.016837 -0.0851196 0.0418357 -0.00867336 0.0346474 -0.0242352 -0.0561651 -0.0816126 -0.00496169 0.0493667 0.133094 0.0387574 0.0419261 -0.0903615 -0.0954065 -0.0836828 -0.0258384 0.0458171 0.0681967 0.00598918 0.0296631 0.135976 -0.0753315 -0.098805 -0.0692535 -0.0851563 0.0598514 0.0367871 0.137161 0.0414038 -0.0215854 0.00604957 -0.0303072 -0.0416634 0.10058 -0.100221 -0.0410479 -0.141719 0.169855 -0.0500182 -0.0276822 0.0700813 0.180749 -0.124282 -0.0526473 0.032445 0.0915995 -0.116386 -0.107726 -0.00924629 0.0650683 0.00993408 0.105112 0.0992758 0.0153166 -0.0629618 -0.0324638 -0.0184211 -0.084794 
0.0659466 -0.0738839 -0.0625698 -0.08596 0.0769908 0.148643 0.0286502 0.0582821 -0.0146838 -0.165597 -0.0425266 0.0518918 0.0626457 -0.138176 -0.0552593 -0.0631486 -0.181886 -0.0573147 -0.184348 0.14337 0.105764 -0.0358578 0.0899711 0.0193618 -0.073867 0.0228406 -0.0401984 -0.20178 -0.0663659 -0.0839438 0.0349534 -0.0102966 -0.0919273 0.114518 -0.0252087 0.0174122 -0.0468094 0.165157 -0.107247 -0.0301725 0.121105 -0.0390843 -0.0755035 0.160574 -0.153826 -0.0363739 0.0927288 0.0451924 -0.0839122 0.142187 -0.102899 -0.149687 -0.0609339 0.0594005 0.11049 -0.0549394 -0.0355559 0.145437 -0.0223367 -0.186273 -0.0348271 0.0388517 0.197415 0.00222434 0.0386809 -0.0935764 0.0335381 0.0782933 0.0568608 0.0506476 -0.00749905 0.0486278 0.0450814 0.0608887 0.00589047 -0.0470704 -0.119251 0.0025983 0.0324421 0.083525 -0.018632 0.0383679 -0.0206852 -0.0806246 -0.0987619 0.0067511 0.133522 0.116911 0.0127632 0.00636179 0.189008 -0.149883 -0.0571216 -0.104863 -0.0758894 -0.0382994 0.00515477 0.0374521 -0.00837501 -0.0269501 -0.0302319 -0.0299981 -0.0250098 0.0778703 -0.08577 -0.00172179 -0.16579 0.158061 -0.0580686 -0.0450302 0.0939326 0.181317 -0.119827 0.0242286 0.0369095 0.0569875 -0.093445 -0.118022 0.0342864 0.074926 0.0303739 0.0862876 0.0512686 0.0912409 -0.0457367 -0.0766541 -0.0392207 -0.0201882 
0.054814 -0.0700736 -0.0669339 -0.0761818 0.082101 0.145478 0.00743297 0.0233265 -0.0418529 -0.153806 -0.0750523 0.0447005 0.0391237 -0.123487 -0.0357099 -0.0699176 -0.169017 -0.056175 -0.116385 0.139148 0.0803729 -0.0243894 0.106653 0.00857359 -0.0586342 0.0665105 -0.0404824 -0.226907 -0.0675162 -0.0889519 0.0432684 -0.00289188 -0.089303 0.0879036 0.0148834 0.028449 -0.0268681 0.180998 -0.0834369 -0.0558167 0.115935 -0.0197954 -0.0669885 0.165664 -0.169279 -0.00188562 0.125399 0.0428216 -0.0746321 0.128216 -0.101369 -0.14125 -0.0202578 0.0590827 0.131443 -0.0604868 0.000205134 0.149532 0.00198595 -0.211947 -0.0270945 0.0473333 0.198184 -0.00820884 0.0657919 -0.0827948 0.0409895 0.0719082 0.079059 0.063102 -0.0168047 0.0644699 0.0452559 0.0732161 -0.000844197 -0.065502 -0.141069 0.00823756 0.054367 0.0765434 -0.0171047 0.0718987 -0.0271068 -0.0885723 -0.0668883 -0.0509103 0.120938 0.137293 0.0234243 -0.00676572 0.193147 -0.100372 -0.0328914 -0.123001 -0.0663407 -0.0502838 0.04036 0.0854201 -0.00263918 -0.0404188 -0.040789 -0.00974771 -0.00449253 0.0598422 -0.109055 -0.00664544 -0.150808 0.127771 -0.0389403 -0.0138015 0.11448 0.185964 -0.119413 0.00929811 0.0368923 0.0406012 -0.0869487 -0.166588 0.0226307 0.0467284 0.0454908 0.0907869 0.0733976 0.0593286 -0.0618573 -0.0753044 -0.0226658 -0.0092647 
0.0494223 -0.0301912 -0.0415947 -0.0686521 0.0492633 0.145171 -0.0050006 0.0427154 -0.0751308 -0.145459 -0.0904833 0.0253518 0.0296909 -0.16085 -0.0420898 -0.0444523 -0.153289 -0.0756561 -0.116377 0.146579 0.0756668 -0.0325659 0.100816 -0.00608503 -0.0643735 0.0858366 -0.0432111 -0.225337 -0.0528603 -0.10785 0.0362002 0.022686 -0.0858817 0.11721 -0.000511011 -0.000388441 0.00389403 0.20821 -0.0712395 -0.0567599 0.103426 -0.061848 -0.0262665 0.140513 -0.128998 -0.00109078 0.150886 0.0194494 -0.113365 0.140171 -0.0552606 -0.135212 -0.0268128 0.0758456 0.131896 -0.068357 0.0188782 0.101648 0.0253602 -0.238383 -0.0128619 0.0365267 0.158467 -0.029153 0.0812972 -0.0797853 0.0359635 0.0345038 0.0575167 0.0530459 -0.0564127 0.0349049 0.031761 0.109659 0.0188907 -0.0909216 -0.106346 0.0342477 0.0636604 0.0884692 -0.0203912 0.0495571 -0.0132167 -0.0845058 -0.0431462 -0.064022 0.105297 0.14484 0.0416898 0.0123213 0.165747 -0.10465 -0.0395142 -0.103036 -0.0711751 -0.01508 0.0785544 0.102197 -0.0224611 -0.032159 -0.0521222 0.00985157 -0.0319078 0.113072 -0.0859801 -0.0248026 -0.137339 0.146712 -0.0354091 -0.0413403 0.0820968 0.205354 -0.128644 0.0176963 0.0429104 0.00479898 -0.0870044 -0.176036 0.0225308 0.0410897 0.0391488 0.117218 0.104563 0.0453487 -0.0170043 -0.0937209 0.00509144 -0.0409438 
0.0440298 -0.00224479 -0.043832 -0.0621497 0.0187015 0.186004 -0.0204257 0.0474518 -0.120001 -0.114411 -0.0605471 0.0461617 0.0279603 -0.182905 -0.0517949 -0.054505 -0.16712 -0.0524415 -0.0556073 0.131422 0.0883771 -0.0405781 0.0979722 0.0631376 -0.0412754 0.0763596 0.0121236 -0.228783 -0.0306563 -0.0748195 0.00097985 -0.056751 -0.0693286 0.107086 0.000718472 -0.015767 -0.0186509 0.141865 -0.0733564 -0.0465502 0.0732916 -0.09917 -0.00277066 0.172715 -0.145801 -0.0283528 0.202028 -0.00336957 -0.172305 0.164054 -0.009 -0.129215 -0.0238015 0.0738668 0.145459 -0.031232 0.0195578 0.123384 0.0287944 -0.244906 -0.020846 0.0440261 0.208633 -0.0475978 0.0849416 -0.071352 0.0152276 -0.0242106 0.00711669 0.0861907 -0.0899191 0.0359549 -0.00843736 0.097111 0.0488357 -0.0878545 -0.0875129 0.0522435 0.0791369 0.104111 -0.0400462 0.0302863 0.0101621 -0.0795428 -0.0496411 -0.0467238 0.0833723 0.108621 0.0583775 0.0428756 0.151765 -0.110315 -0.0599473 -0.0709782 -0.0608263 -0.0276988 0.0623104 0.145585 -0.00523332 -0.0468851 -0.0397962 0.0347213 -0.0226794 0.0851408 -0.0928681 0.0127814 -0.114093 0.13566 -0.0665278 -0.071299 0.0944664 0.196166 -0.0695739 -0.0205225 0.0474757 0.0234848 -0.0556956 -0.158681 0.0460966 0.0821088 0.0502461 0.0319795 0.0869715 -0.00258879 -0.0410707 -0.0228047 0.0479655 -0.0150094 
0.027744 -0.0195643 -0.0121929 -0.077363 -0.00542342 0.204625 -0.0399296 0.0548986 -0.110746 -0.105034 -0.034446 0.0261426 0.0396768 -0.166947 -0.0133231 -0.0487447 -0.202807 -0.0750473 -0.0408601 0.1208 0.099958 -0.0499646 0.0694741 0.0975818 -0.0245857 0.0759488 0.00500768 -0.21957 -0.0103348 -0.0922028 0.0416274 -0.0932847 -0.0874083 0.0948605 -0.00355237 0.0449506 -0.0475559 0.089363 -0.0618634 -0.02528 0.0817518 -0.112771 -0.018189 0.166207 -0.106074 -0.0564478 0.19376 0.0230435 -0.167812 0.136389 -0.0594929 -0.147906 -0.0188851 0.0583738 0.140447 -0.00812449 -0.0268713 0.150842 0.0119249 -0.238796 -0.0365203 0.0750916 0.221862 -0.0311667 0.0529321 -0.0116061 0.0427091 -0.023585 0.0169882 0.0690727 -0.0955122 0.0596201 -0.0198356 0.0835597 0.0858121 -0.0984777 -0.0954551 0.050667 0.098441 0.128416 -0.0161008 0.0214535 -0.000685802 -0.0936657 -0.0742574 -0.00756409 0.0905816 0.104552 0.0542077 0.0434204 0.18387 -0.0908091 -0.041538 -0.0397756 -0.0817455 -0.0265609 0.0219191 0.128303 0.00790151 -0.04964 -0.0376301 -0.006019 -0.0387586 0.0221422 -0.0929971 0.0714851 -0.114934 0.108673 -0.0705416 -0.0750739 0.0881891 0.19397 -0.0674174 -0.0523671 0.061797 0.0495503 -0.0588167 -0.127978 0.038067 0.084244 0.0607871 -0.0146596 0.0761814 0.0155764 -0.100838 0.0155404 0.0359089 0.0172801 
0.0358019 -0.0250101 -0.0444104 -0.0624189 0.00878086 0.178102 -0.0475445 -0.00455289 -0.0900353 -0.164621 -0.0606597 0.0516264 0.0261825 -0.123854 -0.0524719 -0.0571715 -0.198246 -0.112984 -0.0238896 0.140845 0.0971633 -0.075439 0.0830788 0.0686491 -0.00199812 0.0740674 0.0218234 -0.205315 -0.0602482 -0.0383624 0.0288628 -0.083504 -0.0548658 0.0957566 0.00787836 0.0418797 -0.0415241 0.109739 -0.0575763 -0.0700296 0.0410565 -0.112443 0.0223606 0.142717 -0.0819509 -0.00870917 0.194687 0.0101316 -0.159653 0.162613 -0.0750587 -0.143161 0.0374538 0.0638935 0.181001 -0.0189284 -0.0493809 0.167346 -0.0269899 -0.227641 -0.0190944 0.0765578 0.24269 -0.050554 0.0758609 0.000273041 0.00604467 -0.00238041 -0.0243084 0.0634677 -0.0933557 0.0303073 -0.0488422 0.05607 0.0739258 -0.0542155 -0.0428369 -0.0188978 0.0953967 0.153317 -0.0294299 -0.0102314 -0.0243196 -0.0916083 -0.0875416 -0.0476741 0.0490206 0.0961241 0.0654965 0.0728826 0.167032 -0.119092 -0.0242861 -0.0122997 -0.0675584 -0.0031166 0.0285986 0.12174 0.0476285 -0.0557155 -0.0326315 0.000597684 -0.0674678 0.0159214 -0.109396 0.0770643 -0.119935 0.113415 -0.0979894 -0.0751135 0.10138 0.17735 -0.074586 -0.0323327 0.0588206 0.0746385 -0.0565816 -0.0890642 0.0543655 0.122111 0.0474374 0.00059589 0.0828464 0.00261398 -0.0699433 0.0216447 0.0729129 -0.0148267 
0.0297971 0.00207122 -0.0804638 -0.0549368 0.086276 0.207819 0.0137516 -0.113407 -0.100961 -0.0607453 -0.039503 0.0741181 0.0355221 -0.0419774 0.0195781 -0.0756439 -0.164072 -0.0701928 0.0633737 0.0889795 0.0441705 -0.0779838 0.0984688 0.0523317 0.0523763 0.0639616 -0.0243688 -0.172913 0.0118653 0.0269206 0.0819671 -0.0323039 -0.084745 0.00957499 0.0509923 0.0756329 -0.0773539 0.0673207 0.038299 -0.0786205 0.0428213 -0.0777786 -0.0263326 0.0991979 -0.163848 0.00929819 0.134696 0.0734543 -0.0950006 0.0752551 -0.0896401 -0.0240861 0.0645507 -0.019612 0.13989 0.00163062 -0.0341721 0.260724 -0.0902811 -0.120872 -0.0795337 0.0893961 0.305133 -0.105452 0.109948 0.0705002 -0.00713818 0.0360131 -0.080029 0.107462 -0.0499993 0.145087 -0.0894157 0.0734065 0.0482671 -0.0289225 -0.047259 -0.0700037 0.105006 0.132052 -0.0340669 0.000177402 0.0068984 -0.0498772 -0.0642913 -0.133802 0.0390141 0.0948945 0.060984 0.0390706 0.178767 -0.0431661 0.0300724 0.0243043 -0.0284243 -0.11129 0.031346 0.132413 0.074112 -0.0678809 0.00355986 0.00963643 -0.0601685 -0.0332456 -0.134915 0.135412 -0.0574485 0.0601805 0.034225 -0.0046253 0.123096 0.145311 -0.0389175 -0.0185129 0.0885972 0.0908794 -0.0475856 -0.0264757 0.0626436 0.177946 0.0833382 -0.0923581 0.0263283 -0.0104711 -0.149012 0.0989162 0.0499094 0.03774 
0.0430612 0.0147584 -0.0164416 -0.0333542 0.0730187 0.184282 0.0270804 -0.126658 -0.110052 -0.134468 -0.0933038 0.0773041 -0.00309829 0.0206207 0.0597817 -0.116101 -0.137394 -0.094286 0.059617 0.0855339 -0.0107438 -0.0170629 0.0569786 0.0425907 0.0473029 0.0488295 -0.0763669 -0.116101 -0.0453182 0.0284253 0.0546893 0.0442803 -0.0721174 0.0558648 0.0409131 0.0861283 -0.019996 0.0490321 0.0225543 -0.0739555 0.0812798 -0.0685739 0.0500742 0.00137385 -0.139186 0.0775869 0.149884 0.0182947 -0.117638 0.114727 -0.0901086 -0.0449502 0.116147 0.0456806 0.180734 0.00646063 -0.050933 0.230942 -0.0815307 -0.112381 -0.0704519 0.158148 0.211969 -0.149047 0.0737915 0.144446 0.0340752 0.000234885 -0.116341 0.0936401 -0.0378667 0.0894436 -0.075837 0.135941 0.0880017 0.00656323 -0.0188126 -0.161385 0.105733 0.0837399 -0.0115424 0.0503077 -0.0148089 -0.071866 -0.0192358 -0.111624 0.010087 0.0411796 0.0154205 0.111306 0.196443 -0.0713043 0.0517773 0.0109974 -0.038042 -0.0410375 0.0529047 0.126558 0.0989862 -0.0493207 -0.0400878 0.0149815 -0.0418989 0.00604743 -0.188388 0.144935 -0.0865195 0.0602262 -0.0496603 0.00162898 0.144969 0.114726 -0.0700148 -0.047381 0.0432047 0.0356109 -0.00388728 -0.0745324 0.0782763 0.160194 0.128329 -0.0568982 0.0708984 -0.00916281 -0.103221 0.0629125 0.0978762 -0.00207251 
-0.0011194 0.0251686 -0.0152879 -0.0395459 0.100064 0.173639 0.0382261 -0.156211 -0.122283 -0.0039732 -0.0873741 0.0845317 0.0248052 -0.00870291 0.0881985 -0.101624 -0.140497 -0.0687588 0.0997252 0.0543378 -0.0169489 -0.0336163 0.0962028 0.0352869 0.0627972 0.0550151 -0.0740922 -0.1274 0.0371565 0.0630897 0.0662458 0.027112 -0.0706867 -0.00915281 0.0800125 0.0480212 -0.0620336 0.0472765 0.0463146 -0.086703 0.0485268 -0.0820705 -0.0222771 0.0356399 -0.188798 0.0690604 0.0989071 0.0874283 -0.0637133 0.0424363 -0.0347939 0.0361802 0.112159 -0.0553681 0.140138 0.00183755 -0.0152662 0.227751 -0.102775 -0.0550653 -0.0759219 0.0995982 0.216815 -0.0868737 0.134456 0.0870466 -0.0144527 0.021057 -0.136118 0.0949674 -0.0487085 0.153828 -0.0934452 0.09424 0.0434017 0.010986 -0.0382946 -0.130007 0.137252 0.141282 -0.000310954 -0.0223884 0.0248343 -0.00453113 0.00340964 -0.222473 0.0291237 0.0910973 0.0356711 0.0627595 0.134004 0.0184881 0.0776201 0.0617901 -0.0693187 -0.120575 0.0548208 0.120289 0.10082 -0.0786693 0.0548469 0.0502533 -0.0557888 -0.0448734 -0.145352 0.100737 -0.0271913 0.0397157 0.10197 0.0465522 0.146439 0.118749 -0.0571681 -0.030849 0.0578534 0.0788339 -0.0406746 0.015121 0.0304752 0.201729 0.0968832 -0.110425 -0.0192915 -0.051189 -0.136846 0.130377 0.0554992 0.0261067 
0.024287 0.00905458 -0.00540145 -0.042796 0.0750615 0.201051 0.034855 -0.127597 -0.102294 -0.132614 -0.0965066 0.0756839 -0.00383519 -0.00638932 0.0704104 -0.129866 -0.196746 -0.0854272 0.044346 0.0611994 0.00357864 -0.00879493 0.0546573 0.034228 0.0492819 0.0433196 -0.0930141 -0.148728 -0.0574903 0.0270627 0.0655425 0.0138006 -0.0980994 0.0360735 0.0625049 0.0858462 -0.0528418 0.0274841 0.0101328 -0.0470458 0.102048 -0.0683036 0.0225107 0.0405761 -0.155184 0.0726907 0.145414 0.0175168 -0.107908 0.0966043 -0.0863116 -0.0659786 0.104533 0.0305721 0.169295 0.0152014 -0.0493615 0.244481 -0.0737924 -0.107953 -0.0662931 0.155639 0.21341 -0.115146 0.0914764 0.103044 0.0426455 0.00517185 -0.0906419 0.103807 -0.0148277 0.118209 -0.0484948 0.111599 0.0757071 0.0195501 -0.0780582 -0.164465 0.0937268 0.109243 -0.00217544 0.0439266 -0.00644304 -0.0455084 -0.0556287 -0.10269 0.0499639 0.037715 -0.0104896 0.0849944 0.181985 -0.0650462 0.0551168 -0.0178632 -0.0779994 -0.055417 0.0415877 0.117403 0.098854 -0.0360814 -0.0316459 0.0225176 -0.0299071 -0.0172727 -0.180297 0.123205 -0.0945942 0.0818705 -0.0619988 0.02202 0.156246 0.0976667 -0.0848513 -0.0714678 0.0321683 0.0706542 -0.0260753 -0.0550505 0.0581401 0.152395 0.135306 -0.0690783 0.0435234 -0.0116213 -0.103058 0.0686843 0.06809 0.027647 
0.00881167 0.0107439 -0.0772327 -0.0708627 0.06865 0.183538 0.0716755 -0.0789343 -0.133493 -0.0478987 -0.0585784 0.0711307 0.0480171 0.0130507 0.052895 -0.155025 -0.170327 -0.0917747 0.0728607 0.0605777 -0.0123904 -0.0780225 0.0429452 0.0338245 0.054176 0.0392057 -0.0525629 -0.131391 0.00153916 0.0342055 0.0588065 -0.03005 -0.108359 -0.0107373 0.0179412 0.0640372 -0.104099 0.024147 -0.00041639 -0.0381295 0.0877706 -0.0802089 -0.0223541 0.112387 -0.187793 0.0427157 0.115963 0.0547595 -0.0888224 0.0425015 -0.0993915 -0.0380342 0.0653471 -0.0268012 0.120596 0.0282956 -0.0900116 0.292653 -0.0520837 -0.0987961 -0.0810771 0.119539 0.260357 -0.0785759 0.0738352 0.0997936 0.0341882 0.0129799 -0.0797513 0.0511864 -0.0208087 0.149376 -0.0455575 0.0877095 0.0672529 0.0166766 -0.0672592 -0.119129 0.102617 0.121796 -0.0471167 -0.027363 -0.00261258 -0.0361149 -0.0611793 -0.115711 0.0696169 0.0391379 0.0482258 0.010595 0.152244 -0.0494441 0.0626232 -0.0272796 -0.0622156 -0.118666 0.0425899 0.0926317 0.0895671 -0.0605099 -0.0383157 0.0437307 -0.00557095 -0.0222345 -0.213368 0.145867 -0.0922505 0.111675 -0.0167315 -0.00241591 0.173439 0.108218 -0.0776407 -0.0558674 0.0183919 0.0801052 -0.0275265 -0.025979 0.0822637 0.157296 0.0780707 -0.127324 -0.0224038 0.0039437 -0.147144 0.0816086 -0.00732804 0.0404613 
0.00318505 0.0122691 -0.0645856 -0.0493791 0.0627158 0.193733 0.0348551 -0.0660787 -0.156306 -0.0210831 -0.0432487 0.0498369 0.0165203 -0.0345699 0.0761212 -0.114927 -0.159203 -0.0552198 0.121204 0.0642251 -0.0136002 -0.0683868 0.0709462 0.062451 0.0713687 0.0561332 -0.0383287 -0.168562 0.0483395 -0.00571646 0.0818846 -0.0465804 -0.108169 -0.0280787 0.0312636 0.0742985 -0.112752 0.0125015 0.0134562 -0.0311817 0.0808409 -0.073457 -0.0461517 0.124118 -0.19033 0.0211677 0.14638 0.0462671 -0.100261 0.0380067 -0.0904022 -0.034434 0.0675159 -0.0495902 0.0909949 0.0337695 -0.043335 0.275457 -0.028566 -0.100218 -0.0902689 0.116367 0.27149 -0.0850132 0.0869867 0.0917599 0.0396866 -0.0360377 -0.0660495 0.0778348 -0.0523231 0.170841 -0.0518865 0.114016 0.0672858 -0.0454959 -0.0786237 -0.0604338 0.0948761 0.109585 -0.0460447 0.00227224 -0.0133891 -0.0574644 -0.0321284 -0.11197 0.0458022 0.0480449 0.0345785 -0.0118046 0.170503 0.0118327 0.0304519 -0.0301123 -0.0189503 -0.115055 0.0507764 0.13234 0.0691529 -0.0643657 -0.0587575 0.0176352 -0.00133846 -0.045689 -0.19108 0.148822 -0.0419969 0.0730289 0.0295246 0.00310482 0.154642 0.132086 -0.0318514 -0.0848734 0.042739 0.0577074 -0.0182146 -0.0609109 0.084184 0.140528 0.0767531 -0.126819 -0.0161739 -0.00992752 -0.173702 0.0908368 0.00896411 0.0547805 
-0.00952906 0.00400626 -0.0475743 0.0268801 0.0441828 0.201831 0.0222599 -0.153844 -0.095321 -0.0567618 -0.0534166 0.0325606 -0.0282037 0.0247437 0.0774154 -0.119021 -0.130272 -0.0278407 0.147638 0.0132714 -0.0433403 -0.0668344 0.0133085 0.0410826 0.0872491 0.0290827 -0.106537 -0.130058 -0.0275376 0.0154711 0.0989264 0.0141188 -0.102478 -0.0642372 0.0832222 0.124288 -0.0911992 -0.0733963 0.016801 -0.087152 0.0977037 -0.0427309 -0.00861698 0.0333689 -0.124095 0.0407676 0.11248 0.0347798 -0.0833775 -0.0105513 -0.11723 -0.0486557 0.17641 -0.0509876 0.0988471 0.05884 -0.0633315 0.227389 -0.0224307 -0.0876807 -0.0805187 0.196163 0.217185 -0.127099 0.0864105 0.209332 0.0570826 -0.0473137 -0.0900704 0.0663029 -0.0215435 0.127408 -0.0317595 0.0696874 0.0590077 -0.000328753 -0.0704905 -0.151782 0.0712855 0.0511431 -0.0106654 0.052586 -0.0506143 -0.0857902 -0.0250202 -0.06571 -0.00651476 -0.00310619 -0.0218001 0.0414815 0.177888 0.0265059 0.076958 -0.0208307 -0.0242828 -0.0589912 0.0426765 0.102926 0.0838281 -0.0279019 -0.00282203 0.00445807 0.0113195 -0.134229 -0.177204 0.183773 0.0101556 -0.00316497 -0.0510583 0.0875367 0.147293 0.0500041 0.0191777 -0.152835 0.0332953 0.0309675 -0.0406091 -0.0167944 0.082825 0.0726675 0.098266 -0.167477 0.021041 -0.0450352 -0.12733 0.141832 0.0436988 0.0448527 
0.0317371 -0.0129713 -0.0737622 -0.0443412 0.0571005 0.206366 0.0478492 -0.0504061 -0.107526 -0.0792967 -0.040737 0.0432916 0.0350713 -0.0616508 0.0105963 -0.147234 -0.160099 -0.0422454 0.0590896 0.0949513 0.0375776 -0.0990993 0.0692821 0.0659625 0.0233839 0.0423799 -0.06603 -0.202704 0.0126545 -0.0223388 0.0872113 -0.0457273 -0.117826 0.000426337 0.0526878 0.0615887 -0.0951301 0.0731022 -0.0159584 -0.0778817 0.0876165 -0.0685903 -0.0841564 0.131159 -0.179931 0.000500534 0.123094 0.0634617 -0.0967578 0.0565881 -0.132196 -0.0400775 0.0774212 -0.0205757 0.0956562 0.00591721 -0.0268779 0.241537 -0.0294001 -0.162799 -0.0600899 0.12727 0.283915 -0.0870817 0.0764858 0.0508354 0.0636374 -0.0189844 -0.0325625 0.0832143 -0.0534607 0.109899 -0.0428605 0.0951997 0.0258678 -0.0635419 -0.0938172 -0.0520199 0.106376 0.116904 -0.0886911 0.0206763 -0.0280882 -0.0860025 -0.0233814 -0.1052 0.0630343 0.0699263 0.0454086 -0.00868068 0.215713 -0.0298713 0.0600071 -0.0587976 -0.0351205 -0.144941 0.051439 0.132286 0.0527116 -0.0625462 -0.0101727 0.0396295 -0.0157963 -0.0194205 -0.142553 0.119211 -0.0269887 0.0881395 0.00618083 0.0162746 0.137486 0.13175 -0.0619608 -0.0705621 0.0474585 0.0707988 -0.0482703 -0.103041 0.0834191 0.121188 0.0461208 -0.0936121 -0.0130904 0.0103909 -0.151601 0.059949 0.0097452 0.0456994 
0.0460935 -0.0130245 -0.0813476 -0.0724121 0.0625034 0.154766 0.0326081 -0.0306875 -0.0739423 -0.127215 -0.0479161 0.0284516 0.062895 -0.0600755 -0.0495384 -0.1062 -0.175201 -0.0941931 -0.0511177 0.146206 0.0805059 -0.117129 0.0977163 3.91702e-05 -0.0142433 0.0539857 -0.06798 -0.193182 -0.0108457 -0.0403842 0.0523307 -0.0333774 -0.105341 0.0442416 0.0156766 0.0433846 -0.0823692 0.197618 -0.039141 -0.0862356 0.0553558 -0.0532113 -0.0827292 0.123838 -0.142536 0.0331944 0.110941 0.0613329 -0.102477 0.0948554 -0.151158 -0.0390945 0.0192215 0.028627 0.118588 -0.0512453 -0.0216744 0.202638 -0.0331662 -0.196447 -0.034627 0.0838106 0.271558 -0.0368399 0.0699051 0.00303983 0.0347111 0.0705961 0.0167141 0.0651606 -0.0242352 0.0811824 -0.0126615 0.0903686 0.0237861 -0.0542981 -0.0906087 -0.0466017 0.0939827 0.13264 -0.0720505 -0.00332982 -0.0318912 -0.0850929 -0.0649932 -0.0989573 0.0806384 0.119159 0.0745374 -0.0140275 0.207466 -0.0887556 0.0455221 -0.067574 -0.0551815 -0.129422 0.0572005 0.115879 0.0491474 -0.0652884 -0.0195279 0.0354888 -0.0358535 0.0373966 -0.133458 0.078861 -0.0832796 0.150873 0.0316532 -0.0348403 0.123802 0.167537 -0.124586 0.00794444 0.0651214 0.085738 -0.0804462 -0.0986732 0.0635997 0.111959 -0.00233814 0.00789979 0.021905 0.047073 -0.10618 0.00449258 0.0122064 0.0132065 
