{
  "descriptor": [
    -0.08771602064371109,
    0.06439769268035889,
    0.05398890748620033,
    -0.019916638731956482,
    -0.08300291746854782,
    0.009596653282642365,
    -0.06162945553660393,
    -0.10342153161764145,
    0.12934546172618866,
    -0.08928855508565903,
    0.1766267865896225,
    -0.05597274750471115,
    -0.2636392414569855,
    0.032137878239154816,
    -0.042943499982357025,
    0.08557251840829849,
    -0.11218597739934921,
    -0.1408083140850067,
    -0.094337098300457,
    0.02220386266708374,
    0.03337609022855759,
    0.03203639015555382,
    0.02501748502254486,
    0.06831187009811401,
    -0.09766396880149841,
    -0.38570019602775574,
    -0.10038583725690842,
    -0.08898495882749557,
    0.05892152339220047,
    -0.09479327499866486,
    -0.06576792150735855,
    0.049745477735996246,
    -0.15171518921852112,
    -0.014959604479372501,
    0.05947551876306534,
    0.0659400001168251,
    -0.0829504206776619,
    -0.09625470638275146,
    0.2277219593524933,
    0.0711156353354454,
    -0.26037535071372986,
    0.01789388246834278,
    0.01408909261226654,
    0.2952847480773926,
    0.18219122290611267,
    0.038902752101421356,
    -0.0017725005745887756,
    -0.06152641028165817,
    0.08294061571359634,
    -0.3446720838546753,
    0.07136359810829163,
    0.21963079273700714,
    0.07603277266025543,
    0.08304253220558167,
    0.13522182404994965,
    -0.1571618765592575,
    0.04025765135884285,
    0.10721220076084137,
    -0.1709466576576233,
    0.04206717014312744,
    0.07018264383077621,
    -0.005755230784416199,
    -0.014014316722750664,
    -0.08613704144954681,
    0.19983215630054474,
    0.13744251430034637,
    -0.12181631475687027,
    -0.08237729966640472,
    0.14841940999031067,
    -0.15671797096729279,
    -0.021406276151537895,
    0.11216646432876587,
    -0.11131813377141953,
    -0.24086306989192963,
    -0.16038471460342407,
    0.07205989956855774,
    0.42926377058029175,
    0.24434629082679749,
    -0.16945147514343262,
    0.04442210868000984,
    -0.0572049543261528,
    -0.006705667823553085,
    0.06525915861129761,
    0.04742474853992462,
    -0.11693740636110306,
    0.05593482032418251,
    -0.027470987290143967,
    0.015983298420906067,
    0.16465918719768524,
    0.036968719214200974,
    0.006387375295162201,
    0.269012451171875,
    0.00125189870595932,
    0.0019036456942558289,
    0.10589127242565155,
    0.01694473624229431,
    -0.06540612876415253,
    -0.0826328694820404,
    -0.1898012012243271,
    -0.06345432996749878,
    0.05017789080739021,
    -0.08499544858932495,
    0.02131906896829605,
    0.11808858811855316,
    -0.23531313240528107,
    0.15940769016742706,
    -0.02868424728512764,
    -0.062074195593595505,
    0.05086358264088631,
    0.011841870844364166,
    -0.06921878457069397,
    0.009675316512584686,
    0.1444552093744278,
    -0.3147708773612976,
    0.1576889306306839,
    0.15298794209957123,
    0.06145366653800011,
    0.11447972804307938,
    0.06700080633163452,
    0.021277356892824173,
    -0.0012620100751519203,
    -0.051138073205947876,
    -0.15446026623249054,
    -0.10560453683137894,
    0.09564735740423203,
    -0.015810716897249222,
    -0.017016135156154633,
    -0.04299570247530937
  ]
}