0.016005 0.0680997 -0.122059 -0.0179671 0.138616 0.185756 0.0357781 -0.125777 -0.187272 0.0378013 -0.016749 0.0959278 0.119377 -0.0170858 0.0127797 -0.012491 -0.0233524 0.0829929 0.0229657 0.11442 0.106714 -0.0899859 0.0545784 0.102314 0.0453396 0.0254189 -0.137555 -0.217065 0.0652898 0.150979 0.0223004 0.116991 -0.0781459 -0.00338166 0.0378837 0.0685848 -0.0892842 0.0369776 0.0192087 -0.0679284 0.042962 -0.0328396 0.0268299 0.0923032 -0.170955 0.0630258 0.224077 0.0195441 -0.174108 -0.059614 0.0265325 -0.064983 0.0150865 -0.0610909 0.0975145 0.0639684 -0.0226764 0.233536 0.013643 -0.0836484 -0.0716476 0.0903385 0.202922 -0.152776 0.158811 -0.00027917 -0.0282872 0.0221371 -0.124238 0.0420857 0.0165486 0.142975 -0.0704041 -0.0355848 0.00974071 0.0765839 -0.0706983 0.00698465 0.0567102 0.0358494 -0.0614266 0.0549732 -0.0293735 -0.0109828 -0.102431 -0.0219352 0.0637559 -0.0123131 -0.0145273 0.00376351 0.0437802 -0.0601761 -0.00919229 -0.00633824 -0.0487334 -0.0695002 0.022959 0.161786 0.0245199 -0.0314553 0.0108969 0.0468634 -0.000683797 0.0967083 -0.184752 0.116866 -0.0974521 0.115829 0.0146814 -0.0167641 0.0386678 0.0703489 -0.0913626 -0.0555538 0.0194673 0.0667457 -0.149775 -0.0995758 -0.000545983 0.165672 0.0355254 -0.0889824 -0.0287497 -0.00411782 -0.120677 0.137548 -0.0723106 -0.0262333 
0.0391182 0.0358724 -0.128858 -0.0307491 0.147361 0.186034 0.0422992 -0.113661 -0.185621 0.00350841 -0.0320217 0.12113 0.120569 -0.0297884 -0.0229259 -0.0198797 -0.0425256 0.0775737 -0.00806037 0.144651 0.11372 -0.0869794 0.0809262 0.110304 0.0115588 0.0196795 -0.114476 -0.220162 0.0356809 0.141334 -0.00901398 0.0919464 -0.0820995 0.0187 0.0248566 0.0478604 -0.0922494 0.0618825 -0.00241191 -0.0657251 0.0322301 -0.0271683 0.0231395 0.0983703 -0.187711 0.0492031 0.216935 0.0217245 -0.160105 0.00596974 0.0343151 -0.0889399 -0.00265619 -0.0301614 0.120912 0.0326273 -0.00483532 0.23797 0.00229215 -0.093144 -0.0513868 0.0941275 0.218681 -0.138561 0.147579 -0.0415297 -0.045517 0.0364086 -0.123277 0.0465013 0.0153768 0.136501 -0.0586807 -0.0161221 -0.00320995 0.0814409 -0.0565604 -0.00339703 0.0682104 0.0395769 -0.0533204 0.0426833 -0.0246785 -0.0135377 -0.109747 -0.0303566 0.0702802 0.013561 -0.00228082 0.0113952 0.0486165 -0.0856816 -0.0111723 -0.00916916 -0.0536429 -0.0667176 0.0185428 0.161391 0.0254501 -0.0280736 0.0202042 0.0490917 -0.0159235 0.120032 -0.167156 0.092962 -0.12363 0.123455 -0.0116636 -0.0224666 0.0505034 0.0947458 -0.0738341 -0.0271295 0.00470644 0.0901693 -0.133968 -0.0814287 -0.0140241 0.177068 0.0176277 -0.0726014 -0.0158045 -0.0111464 -0.12439 0.12153 -0.0804239 -0.0397373 
0.0234754 0.0625204 -0.110716 -0.0133953 0.145938 0.189279 0.0386236 -0.137375 -0.194809 0.0178548 -0.0295724 0.10495 0.109607 -0.0258398 0.00137269 -0.00763856 -0.0253394 0.0857069 0.0131529 0.118721 0.104542 -0.0673062 0.0479535 0.0945471 0.0279968 0.0392445 -0.146877 -0.218945 0.05554 0.146713 0.0128568 0.132809 -0.092049 0.00272031 0.0455564 0.0676119 -0.0844427 0.0399981 0.0216707 -0.0628811 0.04908 -0.0181721 0.0296496 0.0826917 -0.166666 0.0752249 0.2312 0.0141769 -0.179382 -0.0527245 0.0322468 -0.0739823 0.0118157 -0.0515853 0.105793 0.0511959 -0.0160203 0.233179 0.0099127 -0.0784552 -0.0613765 0.102949 0.200061 -0.152342 0.165121 -0.015985 -0.0231691 0.0213769 -0.119578 0.0467311 0.0247954 0.138054 -0.0533672 -0.0196517 -0.00119289 0.0779624 -0.0769032 0.00220331 0.0529559 0.02505 -0.0428979 0.0746931 -0.0298064 -0.016351 -0.105766 -0.0294809 0.0691091 -0.0104282 -0.0342565 0.0112905 0.0508081 -0.0578454 -0.0107935 -0.0045084 -0.0526196 -0.055605 0.0358994 0.15812 0.0224985 -0.0222888 0.00630838 0.0521822 -0.0087745 0.10658 -0.18432 0.106377 -0.097994 0.115916 0.00182733 -0.00363635 0.0452076 0.0690428 -0.0924779 -0.050806 0.0133503 0.0622194 -0.158152 -0.104351 -0.0150544 0.149716 0.0342266 -0.0726613 -0.0113267 -0.0131324 -0.111382 0.133934 -0.0757823 -0.0427669 
0.0123806 0.0643075 -0.11286 -0.0120665 0.149333 0.200536 0.0422435 -0.150085 -0.175901 0.0182455 -0.0275897 0.0969081 0.100748 -0.0214262 0.0118904 -0.0280325 -0.0271451 0.0858857 0.0273924 0.102945 0.0868102 -0.0522412 0.0230595 0.10125 0.0303341 0.0390889 -0.155612 -0.208435 0.0631186 0.145374 0.033952 0.128481 -0.10043 -0.011984 0.0653813 0.0889925 -0.0778999 0.00550125 0.0185077 -0.0640707 0.0732078 -0.014658 0.019826 0.0851066 -0.170023 0.0791727 0.221533 0.0354486 -0.159078 -0.0732077 0.00821734 -0.0648686 0.0313202 -0.0680892 0.101013 0.0659466 -0.0284099 0.235652 0.00800374 -0.0732804 -0.0753593 0.118777 0.204926 -0.151829 0.157609 -0.000683752 -3.64417e-05 0.00440443 -0.111987 0.0465553 0.0278029 0.136551 -0.0464925 -0.0200581 0.00391257 0.0804217 -0.0951784 0.00473139 0.0521657 0.0139467 -0.0298976 0.0959356 -0.0287156 -0.0098424 -0.0900874 -0.0261328 0.0696565 -0.0110997 -0.045996 0.0143823 0.0724218 -0.0397969 0.00128327 -0.0151887 -0.0534503 -0.0694796 0.0341207 0.146972 0.0271944 -0.0251158 0.016791 0.0582232 0.00561814 0.0721063 -0.193573 0.116911 -0.0817262 0.0948031 -0.00581271 0.0333394 0.0633559 0.0486728 -0.0915441 -0.0665938 -0.00182062 0.0603571 -0.151866 -0.11052 -0.0171284 0.135595 0.0471832 -0.092192 -0.0161102 -0.0155655 -0.129932 0.143658 -0.0834667 -0.0289815 
0.0374845 0.0415429 -0.127797 -0.00719636 0.154005 0.193173 0.0483288 -0.133103 -0.168847 -0.00163865 -0.0309118 0.106479 0.110514 -0.0324461 -0.0142262 -0.011438 -0.0363383 0.0848486 -0.010888 0.126441 0.115013 -0.070206 0.0371748 0.124005 0.0292772 0.0139057 -0.143725 -0.220406 0.0355871 0.155462 0.00604292 0.122871 -0.107814 0.00965841 0.03976 0.0676151 -0.0883183 0.0101617 -6.9723e-05 -0.0715414 0.0589911 -0.0218243 0.0354998 0.0929207 -0.15767 0.0637274 0.221061 0.0328773 -0.156965 -0.0344954 0.0311553 -0.096318 0.0208671 -0.0525514 0.12263 0.0476105 -0.0298728 0.233608 0.0259369 -0.0920381 -0.0515976 0.113739 0.197343 -0.140161 0.129872 -0.0187897 -0.0236437 0.0229965 -0.107061 0.0316446 0.019249 0.140634 -0.0445943 -0.0342111 -0.00734281 0.0877937 -0.0711497 0.00576602 0.0515919 0.0333072 -0.0180638 0.0802074 -0.0381931 -0.0251916 -0.105119 -0.00230893 0.0686311 -0.00720533 -0.0360919 0.0179333 0.0620807 -0.0662463 -0.0219064 -0.0164496 -0.0708576 -0.0447233 0.0189244 0.138461 0.033691 -0.0314721 0.031453 0.0403698 0.00535867 0.0956509 -0.192648 0.0992579 -0.12153 0.116942 -0.0333898 0.015666 0.0656665 0.0727544 -0.0874764 -0.0600981 -0.00514136 0.0771814 -0.158043 -0.0871139 -0.0316565 0.143265 0.028735 -0.0650693 -0.00577764 -0.00392833 -0.13365 0.131076 -0.09382 -0.0497403 
0.0689599 0.00722944 -0.159058 -0.0365376 0.158157 0.156163 0.0377066 -0.0933879 -0.189709 0.00380483 -0.056596 0.137265 0.127012 -0.0616252 -0.0638116 -0.0041965 -0.0203531 0.0797315 -0.0487688 0.178179 0.0938085 -0.0643799 0.0800549 0.116074 -0.0238324 0.0348191 -0.0807497 -0.214259 -0.00223215 0.129364 -0.0551343 0.10957 -0.103723 0.0346471 -0.000458621 0.00875309 -0.090149 0.0667636 -0.026191 -0.0605169 0.0241993 -0.0199096 0.0286396 0.124994 -0.175108 0.0531958 0.208666 0.0464494 -0.137631 0.0560851 0.0944635 -0.117744 -0.029477 -0.0255996 0.128525 -0.0149578 0.00412807 0.207553 0.058013 -0.110022 -0.0109625 0.0775369 0.184496 -0.0895175 0.102601 -0.122425 -0.0540802 0.0561614 -0.0883641 0.0085224 0.0067049 0.121395 -0.0164629 -0.0188915 -0.0457443 0.081331 -0.0516039 0.0238788 0.0635443 0.0540696 -0.0047949 0.0462205 -0.0304155 -0.0164673 -0.0959011 -0.0411174 0.0787457 0.0272897 0.00962167 0.000838732 0.00798911 -0.0744229 -0.0390662 -0.0195558 -0.0722554 -0.0322652 0.0399031 0.132368 0.0101791 -0.0571791 0.0322486 0.0556023 -0.00705533 0.16407 -0.167191 0.0228645 -0.174224 0.141796 -0.0444137 0.00236658 0.0819334 0.120764 -0.0688373 0.00386046 -0.047178 0.0735438 -0.148953 -0.0850655 -0.0613507 0.13552 -0.0150091 -0.0182652 0.015536 -0.0162711 -0.117984 0.0661737 -0.130071 -0.0830035 
0.0344219 0.0610831 -0.158826 -0.0277688 0.147637 0.200359 0.0551998 -0.149419 -0.155277 0.00212721 -0.0375505 0.113162 0.120496 -0.0178385 -0.0322275 -0.0290386 -0.048632 0.082653 -0.0156763 0.120072 0.0933789 -0.0670672 0.0392621 0.0906734 0.00424972 0.0107274 -0.137721 -0.200045 0.022869 0.170711 -0.0103237 0.131529 -0.0998406 0.005155 0.0427309 0.0646879 -0.0798945 0.00825433 -0.0010946 -0.0671682 0.0497852 -0.0326723 0.0434848 0.100329 -0.175573 0.074175 0.212674 0.0471764 -0.151888 -0.0117094 0.0297322 -0.0793779 0.0119746 -0.0354072 0.118038 0.040898 -0.0272738 0.226831 0.0152753 -0.0835606 -0.0574589 0.117688 0.215657 -0.141434 0.125955 -0.0314633 -0.0263862 0.0308325 -0.115933 0.0405643 0.0276514 0.124771 -0.042169 -0.0261569 -0.0105468 0.0998142 -0.0664904 -0.0211645 0.0445746 0.0198351 -0.0120552 0.0664844 -0.0384562 -0.00124268 -0.110331 -0.00221987 0.0612424 -0.0232846 -0.0220008 0.0328367 0.0547511 -0.0909357 -0.0135274 -0.0273672 -0.0688288 -0.0588221 0.0179701 0.146715 0.0379238 -0.028793 0.0432841 0.0600128 0.00802546 0.101464 -0.188739 0.0952831 -0.132281 0.133534 -0.054977 0.0288661 0.0686056 0.0562049 -0.0861763 -0.045973 -0.0272975 0.0781749 -0.130156 -0.0717015 -0.00881525 0.152397 0.0394486 -0.0864272 0.0067497 -0.0076556 -0.129532 0.113823 -0.0945136 -0.0388044 
0.0218981 0.0837495 -0.159533 -0.0404549 0.109792 0.208004 0.0655882 -0.139986 -0.160558 0.0278337 -0.0257883 0.102559 0.12559 -0.0250162 -0.0481047 -0.0613166 -0.0515546 0.0764466 0.00108716 0.116963 0.0654536 -0.0731389 0.0017751 0.101541 -0.0227347 0.031884 -0.125362 -0.181848 0.0470931 0.162077 -0.0240985 0.114542 -0.106546 0.00216238 0.0475534 0.0597788 -0.060055 0.00891586 -0.00606875 -0.072127 0.0548748 -0.0637748 0.0380235 0.109782 -0.17058 0.0621876 0.213464 0.0645865 -0.170552 -0.0135654 0.0124631 -0.0671047 0.00999939 -0.0305914 0.121949 0.0607568 -0.0508529 0.225426 0.0100706 -0.0992105 -0.0556375 0.120679 0.241847 -0.144836 0.119378 -0.00816112 -0.00450726 -0.00788282 -0.127092 0.0247448 -0.00189183 0.0934353 -0.0387262 0.00256035 0.00650742 0.0774233 -0.05201 0.00132219 0.0713681 -0.00321839 -0.0175151 0.0634538 -0.0432502 -0.0083771 -0.092825 -0.0168514 0.0544696 -0.0227299 0.0145187 0.0530261 0.07278 -0.0964729 0.0125214 -0.0275669 -0.0653752 -0.0713169 0.0341588 0.136737 0.0491102 -0.0298488 0.0527316 0.0893 0.00226162 0.0883588 -0.186765 0.108621 -0.110047 0.120536 -0.0725621 0.036364 0.088476 0.0606833 -0.0709277 -0.0502871 -0.0413932 0.0611335 -0.107684 -0.0867414 0.00393641 0.128545 0.0346613 -0.124754 0.00967518 -0.0130569 -0.140526 0.124777 -0.0987198 -0.0472408 
0.0599218 0.0385613 -0.120545 -0.0586608 0.163712 0.16939 0.0645483 -0.0529981 -0.219516 0.00971125 -0.0809972 0.0992624 0.114976 -0.0645073 -0.0370731 0.00786925 -0.00173883 0.0462846 -0.0449757 0.174111 0.0863885 -0.0429017 0.0536113 0.029648 -0.0390125 0.0823836 -0.137926 -0.18701 0.0685427 0.0689698 -0.0351066 0.169754 -0.138587 0.0503254 -0.000286936 0.0114855 -0.0554524 0.124474 0.0106447 -0.0679435 0.0697938 -0.0116312 0.039495 0.0796539 -0.169572 0.0607693 0.204061 0.0422978 -0.151532 0.0114772 0.0527431 -0.0701746 -0.0663661 -0.00679589 0.111731 -0.0344372 0.0150968 0.196854 0.0330895 -0.117788 -0.0244547 0.0827373 0.176169 -0.112789 0.133013 -0.0757922 -0.0282741 0.0415903 -0.0639174 0.0171327 0.00232615 0.131656 -0.00320673 0.0647101 -0.0291495 0.0430428 -0.0507958 0.0449501 0.0721783 0.00753783 -0.00486085 0.0714533 0.00740538 -0.0109873 -0.0513741 -0.0762333 0.101026 0.0793814 0.0232912 -0.0110245 0.063149 -0.060262 -0.0360983 -0.023117 -0.0548767 -0.0578534 0.105274 0.153886 -0.0172214 -0.0366114 -0.00975755 0.0663852 -0.0167289 0.200405 -0.177041 0.0407438 -0.142789 0.164785 0.0103015 -0.0143297 0.0581972 0.124581 -0.122868 0.0262762 0.000631672 0.0159715 -0.135851 -0.125179 -0.0484778 0.10827 -0.00804329 0.0127961 0.0581301 -0.00701671 -0.102235 0.0378668 -0.118408 -0.0865216 
0.0648076 0.0188967 -0.125187 -0.0486881 0.171535 0.166461 0.0776703 -0.0607212 -0.204247 0.012111 -0.0808981 0.126023 0.114251 -0.0738429 -0.0499752 -0.00679636 0.00400399 0.0766416 -0.044817 0.173472 0.0926118 -0.046426 0.059724 0.0780307 -0.0422427 0.0555344 -0.129124 -0.200518 0.0590822 0.097615 -0.0358158 0.146187 -0.125205 0.0421276 0.0181661 -0.0068306 -0.0655589 0.107959 -0.00792545 -0.0782804 0.0521188 -0.00223472 0.031613 0.0997979 -0.180098 0.0465253 0.19589 0.0446975 -0.136343 0.0256905 0.0676485 -0.0823877 -0.0465736 -0.0246129 0.118277 -0.0243222 0.0161566 0.211914 0.0285664 -0.109338 -0.0224661 0.0811492 0.182149 -0.11545 0.134023 -0.104981 -0.0436163 0.0263391 -0.0976635 0.0192036 0.00305391 0.125034 -0.0137085 0.0431034 -0.0544954 0.0583511 -0.0422492 0.0393806 0.0834844 0.0113693 -0.0175351 0.0639108 -0.0019919 -0.00752228 -0.0430615 -0.0920904 0.0940589 0.0677536 0.0220242 -0.00430097 0.0479366 -0.059778 -0.0336024 -0.0233176 -0.0436486 -0.053892 0.0863514 0.150478 -0.0158449 -0.0311362 0.0176419 0.0721722 -0.0171429 0.191907 -0.172409 0.0264853 -0.137547 0.138196 0.0127458 -0.0050131 0.0626125 0.119896 -0.100902 0.0188977 -0.0100041 0.0452977 -0.125516 -0.111315 -0.0554065 0.132362 -0.014091 -0.00524152 0.0279256 -0.0209335 -0.116791 0.0526338 -0.122181 -0.0954658 
0.0860693 0.0416612 -0.137996 -0.0360995 0.17178 0.151243 0.090407 -0.0470024 -0.177118 -0.00825617 -0.0591499 0.112141 0.103434 -0.0828707 -0.06182 -0.00370662 0.0312362 0.0553775 -0.0857812 0.184705 0.0862109 -0.0238271 0.0498155 0.0644855 -0.0534726 0.0452474 -0.11444 -0.178788 0.0748612 0.0850861 -0.0415758 0.164456 -0.12251 0.0681031 -0.00130352 -0.00987383 -0.0404088 0.138612 -0.0327091 -0.076435 0.0588364 0.00118121 0.0200162 0.104207 -0.176801 0.0617005 0.182101 0.0506141 -0.136552 0.0355091 0.0659661 -0.0426852 -0.0798136 -0.0235429 0.118738 -0.0384259 -0.00945496 0.196117 0.0365031 -0.106214 -0.0368441 0.0477268 0.185128 -0.121709 0.120722 -0.123021 -0.0294701 0.0256536 -0.0877669 0.0353026 0.00319923 0.101838 0.00324505 0.0621603 -0.0557397 0.0323645 -0.0263411 0.0710416 0.0532821 0.00124397 -0.00862556 0.0719954 -0.00837677 -0.0312531 -0.0224351 -0.094355 0.0876506 0.0637147 0.0140249 0.0155393 0.0654884 -0.0843584 -0.0680862 -0.0372001 -0.0262356 -0.0553623 0.103974 0.112802 -0.0127286 -0.0401076 -0.00219453 0.0830361 -0.0146122 0.210889 -0.190278 0.0134522 -0.13998 0.153383 0.0313548 -0.0130089 0.0759673 0.140307 -0.121843 0.0471346 0.00318888 0.00992112 -0.119024 -0.140519 -0.0377448 0.121398 -0.0206969 0.0414444 0.0473295 0.0217675 -0.0735421 0.0178344 -0.100461 -0.120089 
0.0482878 0.0488262 -0.122518 -0.0129117 0.156968 0.218662 0.0579904 -0.139398 -0.173653 -0.0185026 -0.043234 0.123775 0.0864993 -0.0567771 -0.0208673 -0.0128452 -0.0447521 0.081081 -0.0135991 0.10542 0.0990818 -0.0427706 0.0299864 0.0875778 0.0127202 0.0337155 -0.143101 -0.214556 0.0171577 0.141615 -0.00198541 0.144381 -0.116617 0.0292665 0.0488492 0.0574427 -0.0739771 0.000391928 0.0247775 -0.06348 0.0811657 -0.028385 0.0558618 0.0770328 -0.161659 0.0701179 0.21964 0.0172144 -0.174039 -0.0182605 0.038995 -0.0942721 0.0126944 -0.0306376 0.122396 0.0428268 -0.0201775 0.233394 -0.00548871 -0.0698478 -0.0507421 0.121903 0.209488 -0.160284 0.153791 -0.0250498 -0.0326869 0.01835 -0.122046 0.0612778 0.0184796 0.129262 -0.0473219 -0.00430358 -0.0126823 0.0895291 -0.0622838 -0.0180313 0.0376243 0.0119528 -0.0211178 0.086092 -0.0169651 -0.0113669 -0.117814 -0.0139715 0.0787512 -0.0143356 -0.0490528 0.0404276 0.0733503 -0.0885245 -0.0298939 -0.00646293 -0.0602716 -0.0248245 0.0363075 0.135757 0.0259699 -0.00759367 0.0179378 0.0508754 -0.0171498 0.11683 -0.167276 0.0903292 -0.113818 0.124876 -0.0677899 0.0137904 0.0635884 0.0603603 -0.0809737 -0.0459579 0.00668306 0.0562504 -0.140586 -0.0850426 -0.00582143 0.146598 0.0594009 -0.0688669 0.0250712 -0.0211345 -0.0968558 0.117443 -0.0714834 -0.0584826 
-0.0354676 0.127048 -0.133253 0.00250032 0.0924422 0.167862 0.0137177 -0.209237 -0.139831 0.0686214 0.0109727 0.0718754 0.0918074 0.0702891 0.0297429 -0.00428672 0.00376216 0.0756057 0.105985 0.0301685 0.0435049 -0.0402743 -0.00966776 0.0489634 0.0486999 0.0569791 -0.141947 -0.148791 0.0869407 0.200308 0.0408195 0.150126 -0.0338739 -0.0795067 0.0693875 0.129497 -0.0663864 -0.0274714 0.04824 -0.0326079 0.00664902 -0.00453314 0.0329081 0.0584064 -0.123277 0.118073 0.211163 0.00888384 -0.15208 -0.150378 0.017638 0.0137656 0.0545103 -0.0807077 0.0801583 0.124673 -0.0418583 0.22352 -0.00263271 0.000385981 -0.103652 0.0927729 0.195535 -0.171127 0.180728 0.0399336 0.00282408 -0.00972852 -0.131342 0.0672205 0.0580696 0.110364 -0.0707663 -0.0521523 0.0241361 0.100469 -0.0669362 -0.0224719 -0.00151049 -0.0334588 -0.0156332 0.0866596 -0.0500587 0.0165021 -0.0934579 -0.0165658 0.0179105 -0.088374 -0.057568 0.0225947 0.01332 -0.0334247 0.0116372 0.0123578 0.00618899 -0.0553517 0.028613 0.134754 0.0596975 0.0103386 0.00935981 0.0761872 0.00913856 0.0112116 -0.205009 0.164718 -0.0366171 0.0327352 0.00891894 0.0302349 0.0307783 -0.026612 -0.0666879 -0.101675 0.00908882 0.0482612 -0.0999619 -0.0909474 0.0220876 0.125249 0.0704708 -0.151947 -0.0136478 -0.0355753 -0.0950768 0.193654 -0.0349335 0.0122186 
0.0585002 0.0322246 -0.137547 -0.00789022 0.176907 0.215777 0.0578541 -0.135454 -0.174491 -0.0178694 -0.0433685 0.12016 0.0932501 -0.0227789 -0.0186749 -0.0168926 -0.0111384 0.0920774 -0.00639833 0.102483 0.101125 -0.0461581 0.0301804 0.111715 0.0279384 0.0180403 -0.137933 -0.199672 0.02324 0.144767 0.00725964 0.148127 -0.123475 0.025514 0.0314109 0.0693012 -0.0814414 -0.0219768 0.0130303 -0.0693084 0.0860854 -0.00332578 0.0571553 0.0782897 -0.161295 0.0567555 0.209139 0.0313335 -0.145086 -0.027297 0.0362387 -0.0979479 0.020008 -0.0476457 0.115845 0.0480418 -0.0204387 0.246186 0.0243625 -0.0752299 -0.0538022 0.136225 0.198145 -0.158671 0.125608 -0.0107939 -0.0264952 0.0205282 -0.112263 0.0588245 0.0195441 0.139915 -0.0398327 -0.0163658 -0.0262513 0.0937017 -0.0535528 -0.0118203 0.0323869 -0.00410803 -0.0159939 0.103765 -0.0211186 -0.0217645 -0.101621 -0.0103243 0.0772303 -0.0131771 -0.052621 0.0265521 0.0806288 -0.0678414 -0.0290271 -0.0198878 -0.0418195 -0.0243619 0.0289829 0.139224 0.0221895 -0.0146121 0.02207 0.044387 0.0086526 0.113403 -0.190783 0.0931247 -0.129231 0.102756 -0.0661036 0.0204372 0.0718165 0.0629767 -0.0737412 -0.0449925 -0.00235711 0.0552952 -0.130434 -0.091135 -0.0145082 0.139131 0.0494771 -0.0675414 0.0144507 -0.0182279 -0.131356 0.114388 -0.0936159 -0.0559461 
0.039785 0.0755501 -0.146458 -0.0137588 0.162873 0.194355 0.0710181 -0.136061 -0.17118 0.0040647 -0.0527516 0.106754 0.0961365 -0.0260424 -0.0160853 -0.0265164 0.0197532 0.0790801 0.000304913 0.111395 0.0760317 -0.0251341 0.0274419 0.0723299 -0.0121542 0.0338462 -0.152596 -0.192868 0.0622338 0.151734 0.00410401 0.185828 -0.0943792 0.0194769 0.0552869 0.0585299 -0.0361145 0.0448571 -0.00344973 -0.0754553 0.0726747 -0.00197688 0.0422303 0.0775128 -0.180319 0.10603 0.21715 0.0398714 -0.15704 -0.0388104 0.0353523 -0.0363821 0.00861579 -0.0443949 0.120071 0.0439596 -0.0078718 0.215011 0.0152192 -0.0717281 -0.0720738 0.109027 0.19614 -0.18031 0.161398 -0.0467462 -0.012007 0.00525056 -0.122233 0.0709176 0.0205027 0.102695 -0.0436148 0.014166 -0.024992 0.0825452 -0.0550457 0.0142729 0.0338015 -0.0269459 -0.0284729 0.107042 -0.0297614 -0.0115324 -0.0555034 -0.052854 0.0617146 -0.0152777 -0.044014 0.0402692 0.0756629 -0.0709794 -0.0266088 -0.0373392 -0.0186819 -0.0515686 0.0754348 0.151509 0.0219735 -0.0170357 0.0232533 0.0880828 0.00888055 0.133771 -0.207699 0.0744389 -0.105498 0.106901 -0.014408 0.0319838 0.0629025 0.057208 -0.10569 -0.0411394 -0.00293796 0.0316744 -0.114982 -0.147012 -0.00312776 0.146679 0.0500379 -0.052118 0.0253594 -0.00409935 -0.100079 0.0961005 -0.0705076 -0.0676464 
0.0445431 0.0800738 -0.139396 -0.0568932 0.141827 0.173593 0.0743599 -0.0878448 -0.202716 0.0228069 -0.0598252 0.103071 0.109264 -0.0567443 -0.0494111 -0.0350188 0.0202844 0.0582392 -0.0173899 0.138282 0.0617483 -0.0267136 0.0345083 0.0364903 -0.0548579 0.0853357 -0.121781 -0.179762 0.101327 0.100352 -0.0231835 0.171507 -0.112078 0.0336098 0.0358404 0.0124936 -0.0322235 0.123663 0.00960033 -0.0720269 0.0610951 -0.0188022 0.014964 0.0982766 -0.188373 0.0911229 0.202974 0.0501351 -0.169137 -0.0192618 0.0345496 -0.00829547 -0.0445844 -0.0267587 0.0959713 -0.00114109 0.00552954 0.207422 0.0078717 -0.0951046 -0.0520043 0.0737006 0.211045 -0.13914 0.158016 -0.0859141 -0.01122 0.0105937 -0.0976138 0.0508291 -0.00501549 0.0848314 -0.0241935 0.0656512 -0.0324896 0.0309457 -0.0519045 0.0495683 0.0644353 -0.01765 -0.0384502 0.0749853 -0.00519701 -0.0131135 -0.0341249 -0.114207 0.0842898 0.034473 0.0102234 0.0131657 0.0745174 -0.0679565 -0.0196645 -0.0324426 -0.0157395 -0.0846631 0.117796 0.155518 -0.000829145 -0.0302248 -0.000271216 0.112892 -0.0164997 0.190468 -0.181471 0.0408297 -0.0990874 0.146934 0.0268707 0.000398468 0.0694079 0.0981346 -0.126089 0.0168198 0.00270926 0.0076425 -0.115279 -0.165427 0.00133808 0.125009 0.00970439 -0.0300664 0.0314899 -0.0103966 -0.0889503 0.0480908 -0.0946951 -0.086085 
0.0832866 0.0175542 -0.137848 -0.0298521 0.18538 0.141604 0.0615109 -0.0731217 -0.135018 -0.0476484 -0.0694609 0.125144 0.0760568 -0.0777635 -0.0809152 -0.00171903 0.00400279 0.0374441 -0.0851766 0.2073 0.0928513 -0.0258884 0.0686012 0.0366757 -0.0430126 0.0621956 -0.106394 -0.184269 0.0303624 0.0749268 -0.0317506 0.136474 -0.107083 0.0651224 0.017042 0.0123992 -0.0292574 0.165655 -0.0298911 -0.0961858 0.0532809 0.0308366 0.0263744 0.0947767 -0.172104 0.058828 0.184178 0.0468791 -0.0975002 0.0675928 0.0406152 -0.0528519 -0.0772864 0.00554259 0.160062 -0.0618333 -0.00261792 0.17998 0.0111565 -0.126839 -0.0187554 0.0324978 0.200309 -0.110616 0.13641 -0.148386 -0.032634 0.0573046 -0.0505493 0.0630304 0.0312378 0.115613 0.0131576 0.0587918 -0.0622 0.0340875 -0.0390437 0.0760311 0.0456455 -0.00251351 -0.00904881 0.105372 -0.00627082 -0.0196289 -0.0271201 -0.10637 0.0849503 0.114701 0.0312116 0.00952199 0.0715376 -0.0907087 -0.0573373 -0.0417222 -0.0251294 -0.0712764 0.0980077 0.107332 -0.00943307 -0.0440461 -0.0148299 0.0699017 -0.0319768 0.178306 -0.173389 0.0118018 -0.139549 0.135726 0.0191849 0.0102972 0.067783 0.139159 -0.121375 0.0755337 0.00799442 0.0155104 -0.115846 -0.145319 -0.0581106 0.107918 -0.0234131 0.0949065 0.0713938 0.0170245 -0.0680065 0.00837213 -0.0732315 -0.100952 
0.101541 0.0677351 -0.150667 -0.000993957 0.158025 0.136657 0.0761577 -0.0523465 -0.12309 0.0143385 0.0128962 0.139089 0.120138 -0.115908 -0.0840247 -0.0105682 0.0641444 0.0776779 -0.114858 0.228751 0.0933531 -0.0299887 0.0479741 0.0995914 -0.0594794 0.0169762 -0.0991303 -0.171776 0.0614426 0.115698 -0.0451223 0.143019 -0.0658248 0.091856 -0.0240432 -0.0185946 -0.0144826 0.146212 -0.0374652 -0.060524 0.0372824 -0.0125913 0.00595696 0.103645 -0.190356 -0.0049802 0.172713 0.0436388 -0.102811 0.0824505 0.109967 -0.0136074 -0.129365 -0.00293179 0.118594 -0.0443457 -0.0248554 0.126388 0.0301242 -0.091754 -0.0625976 -0.0305963 0.182639 -0.139093 0.090746 -0.191073 -0.00961701 0.011267 -0.107858 0.038603 0.0250002 0.0824827 -0.00972577 0.0607442 -0.0521404 0.0153659 -0.0152378 0.112574 0.0242769 0.0316034 -0.04326 0.0787631 0.0150922 0.00804708 0.00891471 -0.0607539 0.0867466 0.0468936 0.0482033 0.0126791 0.00854194 -0.123596 -0.0734812 -0.0206194 -0.0319288 -0.110881 0.0656024 0.077535 -0.0416449 -0.0631813 -0.00357881 0.100627 -0.0145598 0.224326 -0.152283 0.0131432 -0.109165 0.146584 0.0496932 -0.00150894 0.0304654 0.126218 -0.117914 0.0849708 -0.017401 -0.00756009 -0.0934924 -0.154838 -0.0449506 0.137655 -0.0253709 0.0643191 0.0317831 0.0505202 -0.0394331 0.00209442 -0.054823 -0.0833912 
0.122059 0.0211776 -0.129459 0.00912532 0.203891 0.134231 0.129591 -0.073178 -0.136909 -0.0175638 -0.0266468 0.143877 0.12192 -0.0279854 -0.0417241 -0.0309575 0.0796529 0.0832199 -0.104168 0.193473 0.0943755 -0.027614 0.0585883 0.112824 -0.0300602 -0.0193701 -0.135214 -0.157332 0.0510615 0.142028 -0.0343697 0.172178 -0.0972401 0.0788371 -0.0135486 -0.012985 -0.0325612 0.12772 -0.0381855 -0.0815843 0.0526124 0.0439714 0.0182547 0.0761268 -0.207921 0.020146 0.141127 0.0432968 -0.0629815 0.0514439 0.0934719 -0.0384314 -0.0821907 -0.0209766 0.130279 -0.035286 -0.0299126 0.202847 0.0254957 -0.0619999 -0.0591188 0.0272693 0.15419 -0.152659 0.0895517 -0.127074 -0.0199019 0.0286311 -0.133027 0.0385997 0.0463494 0.119637 -0.00110022 0.0436911 -0.0793301 0.0570189 0.00298124 0.0350452 0.0432571 0.0179878 -0.0262022 0.0729937 -0.00050052 -0.0185381 0.0125314 -0.0933078 0.0851083 0.0378915 -0.000817762 0.0112492 0.0436611 -0.10634 -0.0480622 -0.0313188 -0.0314622 -0.0960205 0.0635349 0.0818129 -0.0120332 -0.0341165 0.00709364 0.094153 0.00889303 0.217327 -0.196882 0.018218 -0.129556 0.125055 0.0587808 -0.0015879 0.0549453 0.118052 -0.120797 0.0698789 -0.00824384 0.0266315 -0.0835086 -0.116532 -0.0585951 0.16386 -0.0243464 0.0498076 -0.00671144 0.0426901 -0.0667566 0.0239322 -0.0794765 -0.0993224 
0.0663037 0.0664882 -0.141969 -0.0331553 0.201658 0.140979 0.0781678 -0.0953692 -0.141708 -0.0107116 -0.0410489 0.122059 0.112043 -0.0220452 -0.0481824 -0.0236017 0.034156 0.0913557 -0.0843745 0.168245 0.109448 -0.0303346 0.0534788 0.0826752 -0.00571618 -0.0044961 -0.113249 -0.154447 0.0638491 0.153396 -0.0249091 0.137467 -0.0760451 0.0490786 0.0192566 0.0151259 -0.0374108 0.0991187 -0.0342669 -0.0848976 0.0558699 0.0204352 0.0601307 0.114206 -0.200095 0.0696718 0.195271 0.0501865 -0.113146 0.0147996 0.0619822 -0.0406917 -0.0676957 -0.0303841 0.139125 -0.000305122 -0.0365971 0.203899 0.0222342 -0.105055 -0.0610272 0.0402475 0.179926 -0.121881 0.113243 -0.107159 -0.0432122 0.0459285 -0.105861 0.059246 0.0556282 0.114036 -0.0107079 -0.0119925 -0.0375965 0.0817533 -0.0466895 0.0529338 0.0382095 -0.0130308 -0.0252918 0.10921 -0.00490562 0.00625867 -0.0357302 -0.0630748 0.0767788 0.050771 0.00857471 0.0336554 0.0402891 -0.111109 -0.0593857 -0.0505093 -0.0335671 -0.0904902 0.0421954 0.130884 -0.00255023 -0.0539692 0.00941856 0.0814747 0.0250959 0.178066 -0.214878 0.0480914 -0.154591 0.140023 0.028444 -0.0121619 0.0755027 0.0951841 -0.140611 0.0563728 -0.0131991 0.0305385 -0.122833 -0.130375 -0.0383285 0.152649 0.00752202 0.0295438 0.000284481 0.0250605 -0.0895099 0.0462575 -0.0809761 -0.0823964 
0.0951441 0.0143353 -0.11545 -0.0320655 0.211112 0.193532 0.0966717 -0.0828923 -0.167765 -0.021903 -0.0546278 0.12472 0.111339 -0.0301276 -0.0174991 -0.0127255 0.0115291 0.113549 -0.0753048 0.124295 0.129706 -0.0141935 0.0417074 0.128278 -0.000128989 -0.0325144 -0.132341 -0.178533 0.0258075 0.15704 -0.0384971 0.119711 -0.12011 0.0618655 0.0301175 0.0164431 -0.0603763 0.00263678 -0.0154057 -0.0770294 0.0687385 0.023285 0.0754155 0.0850671 -0.17906 0.0435426 0.178789 0.0446441 -0.124919 0.0212463 0.0747517 -0.122206 -0.0263271 -0.0235922 0.130976 0.016614 -0.0183938 0.233704 0.0184179 -0.0808974 -0.0325041 0.109213 0.162077 -0.139054 0.102586 -0.0664787 -0.058034 0.0404856 -0.121052 0.0372548 0.0386488 0.134407 -0.0225297 -0.039478 -0.057164 0.114822 -0.0314036 0.00133028 0.0575544 -0.0137145 0.0102083 0.093822 -0.00689011 -0.00516022 -0.0753791 -0.017997 0.085397 0.0143244 -0.0347778 0.0588148 0.0693977 -0.103008 -0.0623407 -0.0183265 -0.0631944 -0.0234016 0.00960762 0.119662 0.00318481 -0.0111357 0.0466583 0.05404 0.00901802 0.146815 -0.193033 0.0490214 -0.162755 0.10365 -0.0524406 0.00393429 0.0849055 0.0750537 -0.0823296 0.00516254 -0.0110617 0.0767399 -0.126231 -0.0633218 -0.0706909 0.144368 0.0235693 -0.0260492 0.00664171 0.000304101 -0.115403 0.0821804 -0.10993 -0.0974137 
0.0828516 0.0252632 -0.117192 -0.0279637 0.207426 0.204349 0.0860361 -0.103252 -0.159092 -0.0191039 -0.0418127 0.117145 0.108515 -0.0202878 -0.0184536 -0.0193341 0.0070016 0.119975 -0.0510797 0.120333 0.133572 -0.0106227 0.0294034 0.136239 0.00868454 -0.0297322 -0.140323 -0.178599 0.0465015 0.166918 -0.0200626 0.108425 -0.119181 0.0357995 0.049967 0.0363098 -0.0691763 -0.0113745 -0.00755088 -0.0769831 0.065082 0.0295538 0.0577837 0.0840482 -0.178822 0.0463689 0.183831 0.0529572 -0.120907 -0.00459463 0.0548558 -0.0945813 -0.00672158 -0.0366596 0.127475 0.0289662 -0.0198343 0.238219 0.00919494 -0.0829425 -0.0472598 0.118585 0.180404 -0.142598 0.101994 -0.0541276 -0.0394525 0.0300598 -0.118576 0.0403822 0.0497249 0.137447 -0.0284749 -0.0461833 -0.0478069 0.113219 -0.0490743 0.00391855 0.0599455 -0.00766036 0.0135683 0.109206 -0.00549373 -0.00294959 -0.0633039 -0.0156656 0.0788554 0.0124379 -0.0398588 0.0525931 0.0779893 -0.0860637 -0.0496233 -0.00955211 -0.0616808 -0.0516908 0.00837191 0.126563 0.00735895 -0.0185487 0.058899 0.0615586 0.0130618 0.118675 -0.202923 0.0739387 -0.134976 0.0851626 -0.0369792 0.0240077 0.0889678 0.0570598 -0.0863504 -0.0103815 -0.0123014 0.0868603 -0.135926 -0.0670996 -0.0709039 0.139871 0.022744 -0.0490786 -0.00364523 -0.0125336 -0.132219 0.112323 -0.104163 -0.0769977 
0.0950658 0.0289049 -0.127715 -0.0479052 0.197949 0.186709 0.084624 -0.0640087 -0.160483 -0.0343475 -0.0521049 0.116392 0.115282 -0.0531636 -0.0331764 -0.0254484 0.00236101 0.091487 -0.090813 0.154163 0.125715 -0.014215 0.0456685 0.115153 -0.0194704 -0.028322 -0.120729 -0.177732 0.0313726 0.137694 -0.0375672 0.102343 -0.112647 0.0657028 0.0226456 0.0127214 -0.0547492 0.0360257 -0.0368777 -0.0719089 0.0671735 0.0099403 0.0605579 0.111927 -0.18802 0.0492695 0.188467 0.0557815 -0.13482 0.0505424 0.061764 -0.10255 -0.0491869 -0.0176073 0.132686 -0.00153129 -0.029302 0.218184 0.0235781 -0.108089 -0.0377706 0.0935071 0.178257 -0.124378 0.0904099 -0.0992219 -0.0415216 0.0381321 -0.106505 0.0327488 0.0394636 0.115413 -0.0123852 -0.0210211 -0.0485044 0.0939988 -0.0444433 0.0209632 0.061263 0.00708028 0.00605523 0.0902684 -0.010589 -0.00785569 -0.0591842 -0.0219406 0.0845169 0.0274445 -0.00854602 0.0573293 0.0710529 -0.117801 -0.0700924 -0.0348325 -0.0613473 -0.0482549 0.0246324 0.118453 -0.0112848 -0.0342076 0.0336924 0.0671913 0.0105588 0.156339 -0.207593 0.0467724 -0.168768 0.129514 -0.0395725 0.00183473 0.101658 0.089484 -0.106579 0.0228932 -0.0242397 0.0643245 -0.124967 -0.0906526 -0.0568907 0.142641 0.0121015 -0.00694736 0.0167505 0.0180017 -0.103896 0.04953 -0.0995705 -0.0958629 
0.0763381 0.026247 -0.134443 -0.0564594 0.199645 0.202004 0.0696701 -0.0813233 -0.175151 -0.00803331 -0.055196 0.127656 0.116514 -0.0281915 -0.0235052 -0.0256544 0.00291087 0.102017 -0.0507733 0.138129 0.116269 -0.0186022 0.0582225 0.107511 -0.0134574 -0.0101971 -0.115047 -0.182981 0.0300258 0.144326 -0.0297203 0.10084 -0.0972215 0.0463498 0.0315736 0.0295476 -0.0616771 0.0254662 -0.0153049 -0.0699547 0.0596958 0.015463 0.0560955 0.100753 -0.201417 0.046312 0.193612 0.0493339 -0.133394 0.033066 0.0580655 -0.102966 -0.0314665 -0.0186594 0.127075 0.0183594 -0.0108036 0.233104 0.0068778 -0.0932336 -0.0485722 0.104848 0.191403 -0.143818 0.117749 -0.079342 -0.0513995 0.0476341 -0.116506 0.0480745 0.0431073 0.128512 -0.0299362 -0.0322077 -0.0431347 0.109017 -0.0464017 0.0046918 0.0651729 -0.013569 -0.0104904 0.0896211 -0.00353409 0.00796623 -0.0746224 -0.0326817 0.0862055 0.0274798 -0.00526061 0.0499114 0.0601929 -0.106549 -0.0490249 -0.0180012 -0.0467597 -0.0534483 0.0180419 0.14084 -0.0105812 -0.0215491 0.0393535 0.062933 0.00131932 0.137198 -0.195015 0.0645775 -0.159169 0.0969946 -0.046893 0.00243793 0.0849774 0.0773292 -0.0806167 0.0141251 -0.0182856 0.071608 -0.120292 -0.0860387 -0.0497919 0.152639 0.0273201 -0.0464345 0.0114923 -0.00758712 -0.117411 0.0803812 -0.100898 -0.0757823 
0.0669384 0.0573971 -0.152129 -0.050454 0.185329 0.203019 0.0526878 -0.109607 -0.178827 0.0350382 -0.0330867 0.129575 0.120902 -0.0258794 -0.0244124 -0.0216974 0.0208019 0.117802 -0.0229376 0.126972 0.0982552 -0.0139706 0.0438169 0.116612 -0.00936337 0.00841661 -0.100331 -0.175136 0.0508398 0.167249 -0.0312976 0.107535 -0.0906341 0.0245764 0.0389932 0.0381115 -0.0632121 0.00786669 0.00174611 -0.0609214 0.038489 0.00329625 0.0488666 0.114317 -0.199427 0.0562326 0.205493 0.0577405 -0.142645 0.0118259 0.0870083 -0.0661908 -0.0393451 -0.036812 0.115091 0.0304398 -0.0182671 0.22869 0.0181745 -0.0772723 -0.0582735 0.0837054 0.20445 -0.150013 0.122996 -0.0970755 -0.0490213 0.0380684 -0.127451 0.0621457 0.0422271 0.126115 -0.0402506 -0.039683 -0.0447547 0.0999343 -0.0481312 0.0291156 0.0566729 -0.0143823 -0.009402 0.0923947 -0.00335358 0.0172183 -0.0714913 -0.0445708 0.0749296 0.00147386 0.000411232 0.0497241 0.0289696 -0.09273 -0.0476967 -0.0115404 -0.034057 -0.0673545 0.0281522 0.141707 -0.00674014 -0.0354662 0.0443146 0.0860099 0.00553993 0.129303 -0.193705 0.0704541 -0.143662 0.0882657 -0.0301585 0.0143163 0.0826212 0.06309 -0.0695501 0.0103936 -0.0247185 0.0574298 -0.116711 -0.101175 -0.0456845 0.152364 0.0338653 -0.0719719 0.00851394 -0.0154871 -0.116694 0.0937522 -0.0927546 -0.0619366 
0.0521227 0.0526952 -0.163101 -0.0238609 0.156328 0.216923 0.0635745 -0.120258 -0.178173 0.0227672 -0.0281383 0.118573 0.119372 -0.0147027 -0.0392949 -0.033491 -0.00143474 0.108165 0.00331355 0.100771 0.102625 -0.0674028 0.0199374 0.125759 0.018359 -0.0082671 -0.116865 -0.180639 0.0407601 0.174086 -0.0155267 0.104676 -0.111336 0.00327712 0.0295487 0.045715 -0.0926178 -0.0390762 0.00847518 -0.0712142 0.0505904 -0.0176119 0.0556317 0.105112 -0.174056 0.0325196 0.198705 0.0448147 -0.146861 -0.0210508 0.0579338 -0.0818838 0.00862362 -0.0486719 0.100632 0.0556792 -0.0278896 0.245149 0.0264541 -0.077713 -0.0540412 0.125303 0.214187 -0.158913 0.111474 -0.0272071 -0.0370572 0.00623086 -0.136948 0.0317236 0.0221708 0.129051 -0.0481196 -0.0443959 -0.0311909 0.105273 -0.0337969 -0.00509637 0.0510775 0.00468959 -0.0265395 0.0599146 -0.0114972 0.00137627 -0.0939208 -0.00709064 0.0647809 -0.0284886 -0.0114934 0.0282952 0.0429988 -0.0844822 -0.0240516 -0.0107027 -0.0431774 -0.055905 0.0178295 0.141034 0.00967534 -0.0177632 0.0520298 0.0732542 0.0127416 0.109239 -0.188043 0.0996807 -0.122235 0.100399 -0.0668196 0.0177372 0.0778075 0.0441928 -0.0564077 -0.0333018 -0.0261476 0.07157 -0.11551 -0.0575314 -0.016144 0.1475 0.0216173 -0.12014 -0.0102996 -0.0338252 -0.13777 0.130055 -0.109085 -0.0485131 
0.0345771 0.0639993 -0.142222 -0.0141964 0.15751 0.219553 0.0573878 -0.132885 -0.180261 0.0310326 -0.0349701 0.112517 0.107462 -0.0124371 -0.0157577 -0.0284737 -0.00127487 0.113741 0.0172789 0.085196 0.0941155 -0.0750914 0.0321 0.117396 0.0330145 -0.000201351 -0.135353 -0.187732 0.0459012 0.155616 0.0163471 0.125999 -0.108265 -7.20998e-05 0.0349767 0.0590783 -0.0903772 -0.0336249 0.0194886 -0.0633298 0.0674292 -0.0170913 0.0539816 0.090497 -0.176531 0.0314545 0.204853 0.034759 -0.146643 -0.0439162 0.0498117 -0.0850677 0.0135387 -0.0586598 0.0878097 0.0705836 -0.0164929 0.248961 0.026472 -0.0682903 -0.0671118 0.131244 0.203333 -0.176792 0.139273 -0.00789403 -0.029885 -0.00539809 -0.145287 0.0538333 0.0176087 0.142446 -0.0524793 -0.0265326 -0.0231285 0.0931128 -0.0445006 -0.00554284 0.0430966 -0.0104177 -0.0461775 0.0711898 -0.0124784 0.00339074 -0.0977925 -0.0133259 0.0667389 -0.0318219 -0.0269632 0.0158239 0.0458992 -0.0696578 -0.00844931 -0.021997 -0.0272973 -0.0516749 0.0203565 0.156945 0.0063483 -0.00285357 0.0297158 0.0604784 0.00916298 0.110289 -0.173222 0.105206 -0.106194 0.0922107 -0.0466718 0.0147147 0.0520604 0.0447152 -0.0558374 -0.0427259 -0.0127897 0.0555094 -0.111344 -0.0726378 -0.00173688 0.152304 0.0418366 -0.116362 -0.0200115 -0.0316673 -0.137752 0.131063 -0.10639 -0.036097 
0.0669044 0.0375745 -0.156124 -0.0432739 0.190308 0.188998 0.0556506 -0.0858445 -0.191755 0.0110944 -0.0552349 0.124294 0.125556 -0.039684 -0.038889 -0.00691542 0.025255 0.0954124 -0.0387966 0.148847 0.113228 -0.0575051 0.0628832 0.105099 -0.00246998 0.00345239 -0.112019 -0.189924 0.0395733 0.136441 -0.019043 0.120604 -0.0972966 0.0360837 0.0123537 0.0266595 -0.0698183 0.0304708 -0.00848601 -0.0757049 0.0507074 -0.000133547 0.0625128 0.110821 -0.186091 0.0462696 0.209467 0.0498516 -0.139798 0.0166253 0.071398 -0.0989313 -0.0367075 -0.0379097 0.109757 0.013079 -0.0096803 0.221434 0.0362819 -0.0973275 -0.046637 0.0950696 0.184496 -0.142673 0.12074 -0.086548 -0.0558839 0.0393527 -0.115972 0.0334299 0.0228044 0.128613 -0.0357233 -0.0279975 -0.044055 0.0951452 -0.0374139 0.0337538 0.0560866 0.00405009 -0.0305005 0.0683242 -0.0098632 0.00534754 -0.0786481 -0.0315534 0.0779935 0.020858 0.00197403 0.0196764 0.0340825 -0.0877552 -0.0499246 -0.0209008 -0.0354497 -0.0477071 0.0353895 0.15209 -0.0250929 -0.0323959 0.0247863 0.0618851 0.00229594 0.162595 -0.186172 0.0607619 -0.157503 0.122994 -0.0270819 -0.00560264 0.0604432 0.0850231 -0.0826003 0.0145615 -0.0202144 0.0532277 -0.129902 -0.0952146 -0.0384923 0.154853 0.00807062 -0.0385443 0.00578742 -0.00744106 -0.123156 0.0709931 -0.117386 -0.0780961 
0.104712 0.0159871 -0.109531 -0.0524773 0.217977 0.188165 0.102562 -0.0407594 -0.160368 -0.0548161 -0.0697966 0.123609 0.107058 -0.0488428 -0.0377685 -0.0189711 0.0174026 0.0847253 -0.103899 0.146797 0.133449 0.00696754 0.0399765 0.0992553 -0.0268966 -0.0393391 -0.124266 -0.161491 0.0246772 0.134136 -0.0439157 0.0942859 -0.117684 0.0756381 0.0274998 -0.00224893 -0.0415949 0.036594 -0.0395051 -0.0768242 0.0697015 0.0374541 0.079445 0.0953909 -0.180697 0.0434101 0.167282 0.0421303 -0.120726 0.0567467 0.0673143 -0.120229 -0.0549522 -0.00802144 0.137312 -0.0101753 -0.0311581 0.221474 0.00787875 -0.0957616 -0.0267811 0.0956977 0.158808 -0.133341 0.10335 -0.11214 -0.0552168 0.0411956 -0.112385 0.0229581 0.0501118 0.116341 -0.000953446 -0.0332893 -0.065677 0.117015 -0.0236564 0.0161045 0.0616728 -0.00511369 0.0158689 0.081975 0.00557786 0.0101996 -0.0517832 -0.0380004 0.0893135 0.0438744 -0.0157528 0.0658153 0.0659786 -0.125576 -0.0811423 -0.0193936 -0.0566925 -0.0293908 0.0316463 0.104943 -0.0288224 -0.00616765 0.0323747 0.0705283 -0.0052829 0.161575 -0.206836 0.0320241 -0.169041 0.115204 -0.0514353 -0.00213889 0.0994817 0.0752444 -0.10346 0.0424657 -0.0202909 0.0685417 -0.123104 -0.0621578 -0.0834173 0.139133 -0.00501874 0.00909756 0.021547 0.00635269 -0.079036 0.0466291 -0.107727 -0.118142 
0.07935 0.0497458 -0.132748 -0.0483936 0.223672 0.146571 0.094597 -0.0748954 -0.149844 0.000773314 -0.0431075 0.11829 0.110392 -0.00319627 -0.0285486 -0.0322852 0.0503611 0.104091 -0.0801226 0.156577 0.101975 0.00485666 0.0415369 0.0905682 -0.0160443 -0.0138949 -0.110112 -0.136878 0.0669978 0.148814 -0.036825 0.113735 -0.0894977 0.0448496 0.0310317 0.0211644 -0.036326 0.0709397 -0.0462996 -0.0836374 0.0580205 0.0560443 0.0537879 0.119146 -0.210646 0.0725856 0.174759 0.0658234 -0.0996914 0.0167854 0.059884 -0.0499345 -0.0802675 -0.0360519 0.138712 0.000565731 -0.0490761 0.221528 0.0180288 -0.0859743 -0.0543439 0.0522496 0.174254 -0.1193 0.109665 -0.112944 -0.0447417 0.0566792 -0.0998249 0.0586744 0.0752954 0.126997 0.0105185 -0.0280471 -0.0625259 0.0969392 -0.0445059 0.060438 0.0527072 -0.048773 -0.000650906 0.119925 -0.00868753 0.00559854 -0.0307508 -0.075308 0.082979 0.0572861 0.00774576 0.0502199 0.054332 -0.0996844 -0.0676235 -0.0493789 -0.0259098 -0.0863061 0.0421046 0.107854 -0.0116776 -0.0453837 0.0184638 0.0867779 0.0294793 0.144482 -0.230967 0.0475026 -0.159947 0.101281 0.021538 0.00428582 0.10212 0.0873619 -0.120013 0.0606846 -0.0145907 0.0352625 -0.113846 -0.123789 -0.0675175 0.133986 0.00106333 0.0171815 0.00443749 0.0299846 -0.0945426 0.0478002 -0.0942744 -0.095951 
0.0770402 0.0513634 -0.147397 -0.0419352 0.193974 0.136773 0.100265 -0.0759736 -0.152338 -0.00293762 -0.0386315 0.124776 0.124355 -0.0124522 -0.0438999 -0.0369697 0.0392966 0.0880681 -0.0886316 0.172001 0.0920998 -0.0199015 0.0612001 0.0816017 -0.0383987 -0.00748529 -0.111209 -0.153461 0.0640393 0.141498 -0.0429061 0.138316 -0.0837502 0.0512917 0.00758064 0.0092876 -0.0371393 0.11094 -0.0529168 -0.0690899 0.0526717 0.0302584 0.0320313 0.118022 -0.223436 0.0635923 0.177309 0.0565909 -0.106577 0.0324187 0.0600696 -0.0427763 -0.0868282 -0.0235219 0.13026 -0.00905054 -0.0312129 0.213267 0.0265066 -0.0834208 -0.0596867 0.0477491 0.180302 -0.124595 0.109149 -0.119932 -0.0309364 0.045133 -0.103143 0.0558141 0.0540151 0.114083 0.00684896 0.0128115 -0.0529443 0.0723103 -0.0402995 0.0509431 0.0451241 -0.0293807 -0.0202387 0.0940025 -0.0187445 -0.00887047 -0.0330566 -0.0701622 0.0831322 0.0429242 0.00609815 0.0285222 0.0524698 -0.108802 -0.053449 -0.0645449 -0.0275249 -0.0974573 0.0483216 0.118676 -0.00114128 -0.044926 0.00682935 0.0871474 0.0278665 0.178342 -0.212389 0.0364443 -0.157501 0.13526 0.0279047 -0.00685761 0.0811559 0.106996 -0.121647 0.0556783 -0.0256208 0.0305212 -0.0966696 -0.135526 -0.0407477 0.147814 -0.0054127 0.0200081 -0.00368279 0.0404081 -0.0943455 0.0306806 -0.100133 -0.0867379 
0.07632 0.0446979 -0.117981 -0.0617092 0.166836 0.157748 0.0720493 -0.0439963 -0.191678 -0.0216945 -0.0666681 0.109632 0.102781 -0.0734437 -0.0581277 -0.0240345 0.0187647 0.0534952 -0.0790416 0.172696 0.0884955 -0.00317651 0.0462746 0.0500247 -0.0567441 0.0605842 -0.0966004 -0.167243 0.0664583 0.0786492 -0.046255 0.134798 -0.1163 0.0733656 0.00791079 -0.00824313 -0.0323198 0.132421 -0.0301913 -0.06733 0.067023 0.00147094 0.0344063 0.117521 -0.186212 0.0645477 0.193013 0.0472329 -0.146005 0.0409588 0.0649177 -0.0551135 -0.0847504 -0.00317767 0.124211 -0.0360667 -0.00753842 0.193677 0.0316292 -0.123332 -0.0275968 0.0559902 0.178445 -0.101634 0.121806 -0.134003 -0.0217567 0.0260025 -0.0714774 0.0427109 0.00929967 0.0900872 0.01236 0.050266 -0.0464877 0.0340397 -0.0486703 0.0663444 0.058643 -0.00113773 -0.00668886 0.0856142 0.00802234 -0.0155783 -0.0306981 -0.100264 0.102612 0.0736069 0.0177883 0.0231585 0.0679497 -0.0923514 -0.0594057 -0.0441246 -0.0417705 -0.0610516 0.0991957 0.126441 -0.0210104 -0.0419742 -0.0110045 0.100195 -0.0117646 0.21004 -0.186557 0.00974645 -0.152155 0.155808 0.00608506 -0.0184019 0.092003 0.128247 -0.136261 0.0589627 -0.0142307 0.00961552 -0.117652 -0.154387 -0.0452759 0.109313 -0.0107241 0.0375306 0.0438 0.00516344 -0.0697917 0.00721878 -0.100114 -0.109071 
0.0782388 0.0418657 -0.117168 -0.0609266 0.190073 0.185363 0.0744759 -0.0573763 -0.197414 -0.0264887 -0.0749433 0.102324 0.114407 -0.0338652 -0.0314596 -0.0230682 0.0132653 0.0721675 -0.0663484 0.150025 0.117549 -0.0274122 0.0710395 0.0638341 -0.0278133 0.00607788 -0.12473 -0.177387 0.0476905 0.108689 -0.0315511 0.123413 -0.103208 0.0638871 0.021535 0.0136619 -0.0447605 0.0981418 -0.0285087 -0.0823535 0.0614466 0.010815 0.0554103 0.0885005 -0.194002 0.0695577 0.194494 0.042913 -0.153414 0.0359345 0.0484467 -0.0783586 -0.0457878 -0.00610783 0.124021 -0.00745822 0.00766451 0.214851 0.0190242 -0.116565 -0.0392886 0.0983059 0.17361 -0.139666 0.139353 -0.086525 -0.0449688 0.0454369 -0.106141 0.0570827 0.0245597 0.109054 -0.0173116 0.00387345 -0.0393237 0.085255 -0.0395014 0.0220243 0.0662915 -0.0127456 -0.0237575 0.0710065 -0.0033251 -0.0042483 -0.0599806 -0.0635596 0.0845149 0.0540327 0.000390942 0.044371 0.0741642 -0.107171 -0.0441911 -0.038083 -0.0415084 -0.0529782 0.0618513 0.157346 -0.0155111 -0.0156949 0.0194987 0.0862931 -0.00653765 0.181531 -0.189645 0.0433183 -0.157884 0.134556 -0.0110068 -0.0264039 0.0715234 0.103487 -0.113371 0.0328639 0.000866163 0.0519973 -0.120577 -0.110868 -0.037803 0.149364 0.00514137 -0.00781157 0.0247026 0.000326924 -0.084133 0.046048 -0.0934828 -0.0950016 
0.0992853 0.0550115 -0.133698 -0.045619 0.183618 0.173853 0.0954461 -0.0432602 -0.157589 -0.0382858 -0.0521099 0.113967 0.0986817 -0.0816372 -0.0565798 -0.0101576 0.039795 0.0598217 -0.11828 0.157809 0.0953127 0.0175176 0.024496 0.0581586 -0.0487822 0.0155794 -0.102819 -0.156898 0.040261 0.107493 -0.0491698 0.145432 -0.112034 0.0915921 0.00789362 -0.0106463 -0.0102543 0.0898668 -0.0346882 -0.065492 0.0784511 0.00832027 0.0723503 0.110097 -0.172597 0.0563639 0.18555 0.0404643 -0.145073 0.0490829 0.0848339 -0.0786456 -0.0889287 -0.000483166 0.132863 -0.0267537 -0.0418209 0.189181 0.0282037 -0.110389 -0.0386049 0.0490388 0.167522 -0.137216 0.107503 -0.127754 -0.0350969 0.0347983 -0.0924112 0.0325986 0.0254791 0.0856556 0.014839 0.0155364 -0.0509212 0.0645143 -0.0277073 0.0588335 0.0326608 -0.0142664 0.0117221 0.0976046 0.00491222 -0.0134979 -0.0411314 -0.059642 0.0923804 0.0415606 -0.00190627 0.0583188 0.0563317 -0.134203 -0.0957594 -0.036462 -0.0409331 -0.0272614 0.0816231 0.0901014 -0.0310621 -0.0259069 -0.00499514 0.088028 -0.0071634 0.207806 -0.204377 0.00935843 -0.168139 0.150321 -0.0369712 -0.0117727 0.0981484 0.106565 -0.124772 0.060538 -0.0126737 0.00195581 -0.129763 -0.12466 -0.0541624 0.110545 0.00333755 0.0455236 0.0615547 0.0284428 -0.0382187 -0.000537647 -0.0909363 -0.131227 
0.0379436 0.0414871 -0.0981866 -0.0207925 0.175925 0.220115 0.0452355 -0.140904 -0.152619 -0.0428155 -0.0623646 0.10217 0.0949773 -0.00687968 0.0146212 -0.051877 -0.0259763 0.0801296 -0.0136616 0.11705 0.0912708 -0.031366 0.0442827 0.114524 0.0227919 -0.00589971 -0.160945 -0.188921 0.0163967 0.133932 0.0396237 0.125193 -0.100017 0.0282299 0.0633674 0.093697 -0.0549192 0.00133568 -0.0113746 -0.0774298 0.0951701 -0.000257394 0.0474267 0.0578479 -0.173395 0.0713408 0.205553 0.0490855 -0.129541 -0.00880115 0.00207589 -0.100968 0.0493131 -0.0383678 0.124434 0.0517775 -0.0296242 0.232537 0.00886131 -0.0978994 -0.0734191 0.160223 0.177504 -0.171854 0.13286 -0.00025837 -0.00025949 0.00999466 -0.134813 0.0573413 0.0295537 0.118478 -0.040144 -0.0174434 -0.00442913 0.104163 -0.0741483 -0.0348336 0.0642102 0.00906956 -0.0158323 0.104579 -0.0259981 -0.00907875 -0.0725655 -0.0218178 0.0661857 0.00102337 -0.0562669 0.0488331 0.101708 -0.0744361 0.0165161 -0.0238917 -0.0574372 -0.0511806 0.0184757 0.151855 0.0215234 -0.0177752 0.0302814 0.0548084 -0.000656368 0.0907616 -0.191284 0.104094 -0.117159 0.0803045 -0.0513912 0.0425502 0.0720392 0.0554361 -0.0907479 -0.0393552 -0.0263602 0.0664583 -0.132538 -0.0940589 -0.0290694 0.15474 0.0601217 -0.0693723 -0.00483511 -0.0119766 -0.128964 0.115155 -0.0784909 -0.0502218 
