0.107403 0.0693579 -0.112391 -0.0610482 0.11729 0.214016 0.0504613 -0.0940549 -0.182582 -0.0654647 -0.0448737 0.0422769 0.101379 0.0151546 -0.038959 -0.0825619 -0.026723 -0.0288701 -0.0402844 0.133607 0.0192421 -0.00367121 0.0798094 -0.0487645 -0.0449374 0.0733063 -0.0954137 -0.0888631 0.0556418 0.0190682 -0.0254826 0.133417 -0.148536 0.0663173 -0.000480796 0.0345615 -0.00777543 0.168933 0.0413384 -0.0671403 0.0624997 -0.0259132 -0.0398282 0.0247669 -0.209408 0.0764006 0.121201 0.0860647 -0.118862 0.0639336 -0.0200725 0.0822982 -0.0347937 0.0655318 0.0913142 -0.0765177 0.0399123 0.185376 -0.0151433 -0.129673 -0.0565066 0.11325 0.23806 -0.1401 0.0816527 0.00564003 0.048162 0.090789 -0.0502928 0.113822 0.00215347 0.0895772 0.0113513 0.147171 0.0129333 -0.0216059 -0.0347637 -0.0434019 0.067322 0.0265819 0.00601169 0.0475184 0.0434329 -0.0514304 -0.00919102 -0.120262 0.0677272 0.0904441 0.0263653 0.0363869 0.180585 -0.103088 0.0364646 -0.00593133 -0.0472746 -0.153293 0.119823 0.134717 0.031444 -0.0529158 0.00223506 0.144219 -0.0382088 0.185412 -0.146481 0.0704367 -0.0902569 0.159092 0.0355936 -0.00593157 0.115897 0.144303 -0.10684 0.104492 0.0234689 -0.00471918 -0.0787702 -0.103574 0.0303121 0.0967277 0.0142233 -0.0318543 0.083911 -0.00798451 -0.0414249 0.00413417 -0.0192399 -0.035301 
0.107181 0.0623386 -0.118732 -0.0623333 0.121608 0.208628 0.0505236 -0.0844743 -0.182745 -0.0673759 -0.0463009 0.0444009 0.107304 0.00574994 -0.0434226 -0.0815983 -0.0232248 -0.0275433 -0.0493405 0.147793 0.0238354 -0.0133857 0.0907351 -0.0480762 -0.0502353 0.0653414 -0.0960512 -0.0966492 0.0495307 0.0135878 -0.0266484 0.127237 -0.139362 0.0737118 -0.00492372 0.0317437 -0.00438079 0.176823 0.0272012 -0.0740391 0.0658765 -0.0274187 -0.0359776 0.0330704 -0.217778 0.0698315 0.124361 0.0876972 -0.118033 0.0757842 -0.023695 0.0648737 -0.0433817 0.0670276 0.0933798 -0.0794292 0.0382755 0.17687 -0.00968015 -0.133188 -0.0567478 0.109076 0.233574 -0.140063 0.0872269 -0.00713305 0.0404621 0.0899062 -0.0492851 0.104545 0.000283104 0.0860779 0.0136101 0.143995 0.00944999 -0.0189239 -0.0336082 -0.0315951 0.0682143 0.0236099 -0.00394932 0.0400972 0.0388079 -0.0483545 -0.014334 -0.111517 0.0701003 0.0963886 0.030844 0.0337461 0.180017 -0.108765 0.0318065 -0.0174656 -0.0473123 -0.152166 0.115244 0.138034 0.0222766 -0.0539041 0.000846035 0.140393 -0.0339603 0.187257 -0.1418 0.0649345 -0.0963575 0.166339 0.033461 -0.00589644 0.108351 0.148341 -0.105297 0.107811 0.016811 -0.00599028 -0.0769965 -0.10822 0.0270033 0.101486 0.0063266 -0.0230778 0.0796853 0.00204694 -0.0424201 -0.00460571 -0.0265539 -0.0385249 
0.0928068 0.0557904 -0.11667 -0.0665988 0.0814334 0.22275 0.0219353 -0.120886 -0.189014 -0.0303028 -0.0411435 0.0404337 0.0988188 0.0510362 -0.00322555 -0.0847789 -0.0429696 0.00398337 0.0333842 0.110237 0.0139022 -0.000229552 0.0911563 0.0244245 -0.0318098 0.0819736 -0.0643468 -0.132018 0.0346599 0.0599729 -0.0350137 0.0864844 -0.128007 0.0268974 0.0375903 0.0661261 -0.0332053 0.144447 0.0245106 -0.0596667 0.00505375 -0.0193737 -0.0600874 0.0473803 -0.193696 0.0980023 0.14653 0.0864108 -0.139832 0.0638051 0.000712161 0.0604954 0.0192844 0.0434691 0.120996 -0.0349126 0.0480539 0.218719 0.00896386 -0.149846 -0.0460749 0.127676 0.259935 -0.148076 0.0826836 0.0129856 0.0499934 0.0871586 -0.0617826 0.137938 0.00143389 0.0954996 -0.0269272 0.0991966 0.00890168 -0.019725 -0.0615989 -0.0533356 0.10036 0.0369138 0.0107546 0.0647606 -0.0051862 -0.0884167 -0.0290157 -0.137135 0.0393006 0.0392037 0.0382604 0.0506748 0.152813 -0.0715562 0.0618504 -0.0115922 -0.0369071 -0.135657 0.112277 0.162269 0.072312 -0.0713267 0.034518 0.143739 -0.0271965 0.109416 -0.179647 0.0783641 -0.0982643 0.0764664 0.0115181 0.00893135 0.140621 0.140622 -0.0631495 0.0242325 0.0229906 0.0432061 -0.0735652 -0.13434 0.018623 0.099062 0.039987 -0.0891197 0.0770523 -0.0221049 -0.0893385 0.0583927 0.00456333 -0.0147097 
0.0912131 0.060031 -0.114512 -0.0661668 0.103588 0.226553 0.0155068 -0.123843 -0.189672 -0.0358298 -0.0467303 0.0555545 0.0967299 0.0505262 -0.0178271 -0.0743598 -0.0122787 0.0257307 0.0237464 0.120043 0.0240256 0.0228069 0.0812307 0.0475388 -0.0466635 0.0780992 -0.0581494 -0.119229 0.0400955 0.0726181 -0.0447377 0.0839648 -0.120468 0.0353444 0.0449172 0.0710363 -0.0153719 0.124515 0.00884089 -0.0630567 0.00940577 0.000688375 -0.0328721 0.0506329 -0.193595 0.101517 0.164797 0.0882145 -0.14199 0.0651996 0.0165949 0.0428979 0.00868763 0.0428662 0.135088 -0.021969 0.0436494 0.2166 0.0173813 -0.150492 -0.0419652 0.135519 0.251341 -0.158735 0.0903562 -0.011858 0.0411263 0.0775035 -0.0707741 0.146603 0.00554306 0.085094 -0.0195215 0.0799047 -0.00158367 -0.000980927 -0.0538269 -0.0186258 0.0974818 -0.00443198 0.0220279 0.0967734 -0.00267116 -0.0751194 -0.0217955 -0.132905 0.0398405 0.0465308 0.0262571 0.0730292 0.147695 -0.0796829 0.0481069 -0.00607932 -0.0249725 -0.120939 0.108559 0.166862 0.0583344 -0.0659913 0.0420165 0.154122 -0.0284105 0.117625 -0.185713 0.0750922 -0.105724 0.0531953 -0.0106951 0.0169126 0.138142 0.12811 -0.0541678 0.0396643 0.00717489 0.0362176 -0.0795802 -0.147656 -0.0117381 0.0929973 0.0357287 -0.0757865 0.0790401 -0.0330803 -0.0965161 0.0688706 -0.00966804 -0.0349846 
0.0875587 0.0579327 -0.108351 -0.0760291 0.0862537 0.219966 0.0217153 -0.110907 -0.190757 -0.0377681 -0.0486029 0.0426184 0.0982544 0.0497843 -0.0107891 -0.0943512 -0.0348618 -0.00473726 0.0208925 0.11624 0.00311451 0.00893501 0.0959552 0.0108389 -0.049244 0.0812183 -0.0630612 -0.110522 0.0399694 0.0374469 -0.0348046 0.0790228 -0.127952 0.0362865 0.0292956 0.0646046 -0.0238239 0.156791 0.0150511 -0.0518915 0.0152854 -0.00964284 -0.0614218 0.042117 -0.205407 0.0996879 0.13801 0.088726 -0.133084 0.0762669 -0.00942415 0.0660732 -0.00182507 0.0518508 0.112499 -0.0454737 0.0510376 0.212746 0.00561211 -0.145776 -0.0472532 0.133089 0.253261 -0.144472 0.0824498 -0.00166216 0.0541772 0.09111 -0.0584108 0.144634 0.00673458 0.0913414 -0.0118734 0.118709 0.0112048 -0.0198654 -0.060635 -0.0432888 0.102466 0.0182376 0.00561721 0.0646648 0.00612766 -0.0776935 -0.021454 -0.143666 0.0453207 0.0566859 0.0396353 0.0505741 0.158884 -0.0763186 0.0676305 -0.0134929 -0.0300294 -0.146325 0.116897 0.16018 0.0570949 -0.0677711 0.0223984 0.152183 -0.0324033 0.124614 -0.17362 0.0749105 -0.098289 0.0814864 0.0154813 0.00938013 0.140859 0.143617 -0.0621949 0.052852 0.0131424 0.0310343 -0.0663718 -0.137369 0.016026 0.0964176 0.0306441 -0.0766591 0.0752627 -0.0230146 -0.0851192 0.0429727 -0.00558568 -0.0197809 
0.0916369 0.0498571 -0.125295 -0.0621389 0.0986126 0.222068 0.0200052 -0.105806 -0.188543 -0.0381932 -0.0399843 0.0511851 0.0897617 0.044124 -0.0112798 -0.0829899 -0.00197242 0.0264289 0.0369085 0.128873 0.0171884 0.0147761 0.104084 0.0556419 -0.050288 0.0594754 -0.0451771 -0.12415 0.0469883 0.0562958 -0.0332805 0.0723673 -0.105652 0.0385353 0.037959 0.0684573 -0.00992215 0.129377 -0.0108681 -0.0643259 0.00940068 -0.00247873 -0.0463942 0.0603826 -0.21616 0.0941127 0.160108 0.0941564 -0.133937 0.0838075 0.00165138 0.0484299 0.00533963 0.0360478 0.127714 -0.0249653 0.0548108 0.211016 0.0201071 -0.143402 -0.0551153 0.131085 0.258129 -0.166893 0.0905375 -0.0182471 0.0411203 0.0616194 -0.0717911 0.159652 -0.00725263 0.0833316 -0.0292306 0.098481 0.000742088 -0.020727 -0.0451068 -0.00226419 0.0947303 -0.00869285 -0.000984939 0.0822371 -0.0123197 -0.0860103 -0.00824887 -0.126949 0.0276078 0.0445227 0.0274005 0.069754 0.166013 -0.0741277 0.0390564 -0.0265628 0.000997528 -0.132063 0.103215 0.175401 0.0514976 -0.0730514 0.0341138 0.14825 -0.0187954 0.109976 -0.178393 0.0752947 -0.0900748 0.0510014 0.00898883 0.0132044 0.128845 0.13968 -0.0369556 0.0334089 0.00941878 0.0299506 -0.043477 -0.164251 0.0152812 0.11101 0.0355528 -0.0785281 0.0700534 -0.0163395 -0.107771 0.0553579 0.00086295 -0.025179 
0.103702 0.000488283 -0.111259 -0.0608226 0.0937438 0.187249 0.0631536 -0.0641015 -0.165549 -0.0842627 -0.0894013 0.0904645 0.0921359 -0.0178779 -0.0210556 -0.0965391 -0.0396085 0.00739946 -0.0320787 0.158977 0.0176599 0.0151494 0.0953892 0.0842753 -0.0880903 0.0425641 -0.0543912 -0.167388 -0.0354782 0.0602398 -0.0725946 0.0671061 -0.105015 0.0803726 0.0246481 0.013667 0.0065172 0.149469 -0.068755 -0.0601708 0.0409654 -0.0134837 -0.006915 0.0874997 -0.211766 0.0759825 0.161773 0.0576983 -0.12207 0.150136 0.0321587 -0.0715743 0.00565568 0.0686272 0.174854 -0.0424126 0.0250518 0.198522 0.0421723 -0.165663 -0.0240582 0.11676 0.199458 -0.139003 0.0794813 -0.075607 0.0311385 0.0360245 -0.0804172 0.0731175 -0.0143772 0.0554504 0.00553055 0.0941993 -0.0144195 0.0174798 -0.0498357 -0.0288162 0.108324 0.0293319 0.0159654 0.0641223 -0.0323866 -0.0830976 -0.0175572 -0.113561 0.0556269 0.0376868 0.0250924 0.074928 0.125677 -0.118064 0.0221306 -0.0673588 -0.0588138 -0.0632576 0.100657 0.129453 0.0521334 -0.0513416 0.0256491 0.122179 -0.00908263 0.146802 -0.187945 0.000817255 -0.15793 0.0912105 -0.0770165 0.0199858 0.150056 0.156226 -0.0565956 0.0135755 -0.042913 0.0490445 -0.0572848 -0.155462 -0.0277515 0.0988146 0.026484 -0.0197741 0.0706353 -0.000206895 -0.0773678 0.00326562 -0.0391266 -0.0796413 
0.100963 0.00884658 -0.108361 -0.0697645 0.0965467 0.187899 0.060761 -0.0604727 -0.17012 -0.0781752 -0.0873058 0.0875078 0.0882922 -0.0110884 -0.0132183 -0.0926946 -0.0304136 0.00132926 -0.0275659 0.15775 0.0114376 0.0301337 0.0859922 0.075027 -0.0883593 0.0598617 -0.0481558 -0.160042 -0.0235284 0.0531199 -0.0736188 0.0746076 -0.10254 0.0811412 0.0234538 0.0224405 0.0189124 0.152783 -0.0616458 -0.0557576 0.0511053 -0.0116769 -0.00336875 0.0826254 -0.208759 0.0915957 0.167404 0.0554462 -0.128756 0.13448 0.0305322 -0.059683 -0.00413634 0.0731464 0.179114 -0.0381482 0.0232737 0.198367 0.0387834 -0.161673 -0.0265299 0.109382 0.198506 -0.14115 0.0844351 -0.0722182 0.0313857 0.0425073 -0.0694023 0.0816928 -0.01246 0.0530726 0.00306966 0.0947454 -0.00182848 0.0158414 -0.0514439 -0.00941723 0.104381 0.0124808 0.0158045 0.077209 -0.0253379 -0.0765365 -0.0133765 -0.116013 0.0625292 0.0435617 0.0219776 0.0776028 0.125143 -0.118852 0.020154 -0.0658996 -0.0553917 -0.0645436 0.111173 0.12787 0.0562619 -0.0535854 0.015496 0.127085 -0.00794921 0.149792 -0.193957 0.00572969 -0.16121 0.0882846 -0.0779287 0.0106937 0.148358 0.152908 -0.0636797 0.0164966 -0.0360157 0.0349218 -0.0595849 -0.174593 -0.0286227 0.0938056 0.0379252 -0.0168884 0.0791566 -0.000204502 -0.0732188 0.00388019 -0.0361529 -0.076955 
0.0974722 0.021397 -0.121684 -0.0643872 0.102059 0.169392 0.05877 -0.0682471 -0.180628 -0.0685474 -0.0870246 0.0843368 0.0861293 0.0386135 -0.00171028 -0.0862105 0.0103662 -0.0092317 0.00475463 0.152403 -0.00180966 0.0341909 0.0875636 0.0705997 -0.07677 0.0603361 -0.0380172 -0.13165 -0.0048605 0.0699542 -0.0795291 0.091912 -0.0794581 0.071219 0.0147836 0.0350843 0.0318417 0.156245 -0.0602127 -0.0569013 0.0340399 0.0117764 0.0117193 0.0621369 -0.207038 0.120469 0.174066 0.0494421 -0.126221 0.117019 0.0305816 -0.0294481 0.0025295 0.0670924 0.188154 -0.0266125 0.0249382 0.205629 0.0379717 -0.147132 -0.037536 0.108656 0.192891 -0.162372 0.0869366 -0.0465291 0.0315991 0.0490978 -0.0783009 0.0944928 -0.00475328 0.0565131 -0.0116712 0.096809 0.010888 0.0299215 -0.0309378 -0.0086505 0.100212 -0.0141424 0.0115819 0.0843754 -0.0299988 -0.0821714 -0.000183003 -0.125083 0.0420724 0.0331279 0.023681 0.0831185 0.118864 -0.111506 0.0224278 -0.0595939 -0.0221564 -0.0672436 0.12504 0.137521 0.0647768 -0.0596007 0.00485652 0.130491 0.0051762 0.147712 -0.226433 0.0228904 -0.160894 0.0678806 -0.0590745 -0.00224333 0.146055 0.143809 -0.0606865 0.0171936 -0.026714 0.0263677 -0.0412252 -0.189225 -0.0166743 0.104121 0.040736 -0.0179944 0.0845546 -1.57147e-05 -0.0788637 0.0145817 -0.0235546 -0.077658 
0.0935783 0.068729 -0.12371 -0.0663375 0.0856325 0.223937 0.0204331 -0.111891 -0.192076 -0.0385397 -0.0358272 0.0488899 0.0939753 0.027588 -0.0219007 -0.0842669 -0.0207333 0.0145327 0.024336 0.128344 0.0155951 0.00748674 0.092082 0.0286835 -0.0502426 0.0745413 -0.0504112 -0.122743 0.04182 0.0553042 -0.043705 0.0797911 -0.109332 0.047 0.0366107 0.0560929 -0.00632923 0.144579 0.0115024 -0.0653868 0.0139228 -0.0263423 -0.0395501 0.054046 -0.209497 0.09678 0.161399 0.0846944 -0.154321 0.0831029 0.00234521 0.0590492 -0.0013196 0.0536869 0.123759 -0.0363504 0.0506538 0.196353 0.00311919 -0.148992 -0.0495584 0.121347 0.263101 -0.161232 0.0904547 -0.0124131 0.0416918 0.0698862 -0.0731837 0.144755 -0.00695196 0.0716124 -0.0291102 0.104242 0.0130914 -0.0201731 -0.0485715 -0.0184833 0.0934185 0.0106533 -0.00569912 0.0741073 -0.000597659 -0.075789 -0.0213192 -0.123936 0.0338011 0.0451788 0.0390968 0.0707247 0.157968 -0.091591 0.0431239 -0.0154797 -0.0229376 -0.136872 0.111866 0.167615 0.0526561 -0.0749178 0.0302127 0.154001 -0.0292362 0.127609 -0.167458 0.0762519 -0.0897406 0.0850648 -0.000853013 0.00472984 0.13146 0.135443 -0.0533513 0.044339 0.0118592 0.0235571 -0.0649675 -0.152476 0.0211164 0.105766 0.0360648 -0.0796004 0.0799917 -0.0196887 -0.0780664 0.0485486 0.010473 -0.0291294 
0.0800042 0.0721015 -0.114786 -0.0698668 0.102393 0.226925 0.0293003 -0.113545 -0.187282 -0.0363337 -0.0361138 0.0452404 0.0872179 0.0479453 -0.00470421 -0.0805407 -0.0159409 0.0195369 0.0302929 0.113986 0.0141885 0.0216453 0.0803424 0.0285251 -0.0445084 0.0729505 -0.0648434 -0.112618 0.068308 0.0553359 -0.0286189 0.0916048 -0.11519 0.0313944 0.0425547 0.0754079 -0.00810341 0.127379 0.0159577 -0.0584906 0.0271838 -0.00483896 -0.0443206 0.0446248 -0.206097 0.106443 0.159696 0.086928 -0.151842 0.0508778 -0.0212265 0.0622945 0.00161696 0.0356503 0.114258 -0.0164968 0.0393474 0.22143 -0.0103417 -0.126931 -0.0602738 0.13639 0.266344 -0.165896 0.0964499 0.0128948 0.0464687 0.065787 -0.0705932 0.152337 0.00212303 0.0841462 -0.0267296 0.106489 0.014551 -0.0172799 -0.0508796 -0.0155299 0.0881917 -0.0237554 0.00367826 0.0972212 -0.00730503 -0.0749428 -0.0148954 -0.120631 0.0358999 0.0448818 0.0185447 0.0706841 0.180301 -0.0791024 0.038263 -0.00924275 -0.00114705 -0.133793 0.104406 0.165613 0.0541901 -0.0597561 0.0197506 0.13612 -0.028444 0.110929 -0.183155 0.0988486 -0.0817696 0.0628934 0.011741 0.00574164 0.131055 0.126292 -0.0546721 0.0359581 0.0219184 0.0217208 -0.0630771 -0.15572 0.022198 0.101805 0.0443007 -0.0841526 0.0737088 -0.0138725 -0.0970712 0.0656159 -0.00156202 -0.0298067 
0.112417 0.051672 -0.115555 -0.0582673 0.115964 0.221944 0.0372908 -0.0870223 -0.183533 -0.0570504 -0.0375355 0.058581 0.0857534 0.0189725 -0.0240136 -0.0579308 0.0151469 0.019826 -0.00649909 0.135471 0.0421276 0.0184829 0.0896188 0.0579449 -0.0489866 0.0616963 -0.047829 -0.122283 0.0551591 0.048922 -0.0399135 0.0919878 -0.11459 0.0690264 0.0253689 0.0477179 0.00445683 0.149058 0.000562619 -0.0745234 0.023239 0.00059085 -0.0245126 0.0487016 -0.196326 0.0825165 0.161233 0.0779219 -0.153859 0.0830039 0.0088454 0.0322309 -0.015748 0.0456809 0.133869 -0.0326923 0.040758 0.21691 -0.00140587 -0.145233 -0.0522617 0.113896 0.253559 -0.178781 0.0972958 -0.0110679 0.0235264 0.0687482 -0.0823567 0.145293 -0.0108355 0.076298 -0.0290533 0.0991157 -0.000395295 -0.0189015 -0.0200388 0.0109214 0.0861698 -0.0190269 -0.000880765 0.0920699 0.00126184 -0.0905386 -0.0133756 -0.123084 0.0410912 0.0607607 0.0230563 0.0795718 0.173864 -0.103738 0.00660074 -0.00852438 0.00702632 -0.10258 0.109415 0.153584 0.0359969 -0.0554411 0.020636 0.12921 -0.0396078 0.149992 -0.175095 0.0697395 -0.101679 0.0635404 0.00229719 -0.0226507 0.12255 0.155235 -0.0492481 0.0603516 0.0371466 0.0186271 -0.0713455 -0.157334 0.00559271 0.11148 0.0272232 -0.0439831 0.0873684 -0.00483153 -0.0761156 0.046708 -0.00100596 -0.0637267 
0.0871138 0.0913274 -0.108232 -0.0676427 0.0952673 0.216611 0.0357988 -0.0963197 -0.19512 -0.02013 -0.0315539 0.0312611 0.102831 0.0661687 -0.0232343 -0.0687901 0.000355292 -0.000485158 0.0069376 0.109225 0.0205164 -0.0138414 0.0868521 -0.00691137 -0.0366753 0.0725558 -0.0733075 -0.0781545 0.0892384 0.0428451 -0.036694 0.113413 -0.127806 0.0372776 0.00301167 0.0531054 -0.0232413 0.17305 0.0366855 -0.0575882 0.00952705 -0.0113803 -0.0513237 0.0102332 -0.189075 0.0870176 0.131983 0.0747288 -0.148696 0.0419064 -0.012092 0.10645 -0.0232046 0.0466549 0.0916685 -0.0359879 0.0545276 0.212027 -0.011742 -0.13167 -0.0582139 0.119093 0.257181 -0.165836 0.0892424 0.0402962 0.0404589 0.0949812 -0.0771559 0.148396 0.00483435 0.0941813 -0.0225005 0.1286 0.0210808 -0.0221133 -0.0197775 -0.0312828 0.084828 -0.0157096 -0.017742 0.060675 0.0210536 -0.0723277 -0.0143532 -0.133779 0.0394545 0.0653654 0.0514732 0.0458559 0.158664 -0.0898645 0.0514512 0.0121313 0.00488835 -0.149628 0.119688 0.160552 0.0447496 -0.0501008 0.0155636 0.142965 -0.0479096 0.159029 -0.168323 0.10149 -0.0805812 0.0852439 0.0500079 -0.0341412 0.109065 0.144512 -0.0670356 0.0795378 0.0488029 0.0119413 -0.0690566 -0.120628 0.0378751 0.104801 0.0146409 -0.074109 0.0761143 -0.0219327 -0.0688454 0.0600406 -0.00281577 -0.0324682 
0.097649 0.0788345 -0.11417 -0.062282 0.10111 0.222279 0.0383298 -0.0935125 -0.185697 -0.0510632 -0.0347996 0.0406278 0.0928168 0.0502026 -0.029894 -0.0704536 -0.00720369 -0.00729402 -0.00357252 0.115607 0.0310434 -0.00828633 0.0864786 0.00196925 -0.0355909 0.0663225 -0.0689827 -0.0898476 0.0706619 0.0412013 -0.0338989 0.104036 -0.128678 0.0499712 0.00591162 0.0512308 -0.0191493 0.165679 0.0251093 -0.0631094 0.0210262 -0.00656252 -0.0415158 0.024012 -0.190984 0.0820514 0.139863 0.0702968 -0.149283 0.0584102 -0.0163519 0.0824516 -0.0202472 0.0510223 0.105311 -0.0373214 0.0421742 0.219375 -0.0153844 -0.139264 -0.0580229 0.120679 0.264246 -0.169961 0.0888669 0.0318446 0.0392413 0.0883589 -0.0759719 0.144603 0.00486705 0.0908028 -0.0190011 0.124309 0.016971 -0.0192327 -0.0220333 -0.034862 0.0789685 -0.00727976 -0.0138502 0.0674637 0.0186148 -0.0795272 -0.0216786 -0.124831 0.0438791 0.064208 0.0407198 0.0522411 0.171003 -0.103688 0.035887 0.00185104 0.0042713 -0.136411 0.117737 0.152509 0.0420742 -0.048124 0.00877057 0.135467 -0.0442946 0.155908 -0.177007 0.096781 -0.0895528 0.0913591 0.0255301 -0.0315965 0.122506 0.145946 -0.0707801 0.0771564 0.0468723 0.0142707 -0.0709476 -0.124589 0.03788 0.107438 0.0169063 -0.0593358 0.0819689 -0.0139788 -0.0634501 0.0513329 0.00298224 -0.0401484 
0.0893404 0.0883521 -0.109089 -0.0603011 0.0888845 0.21387 0.0329408 -0.109111 -0.196202 -0.021581 -0.0293521 0.0379213 0.107954 0.0601665 -0.0304206 -0.0723104 -0.00432783 0.00358392 0.0114303 0.116216 0.0253853 -0.0170197 0.083087 -0.00342175 -0.038051 0.0775083 -0.074536 -0.0876082 0.0820989 0.0556271 -0.0421358 0.117089 -0.123778 0.0373436 0.0120116 0.0492843 -0.0221494 0.173796 0.0418942 -0.0664503 0.00447798 -0.0202647 -0.0498935 0.0128888 -0.19071 0.0862165 0.138027 0.0742727 -0.147687 0.0454238 -0.00447443 0.107264 -0.0142674 0.05116 0.0998058 -0.0402794 0.0564392 0.202476 -0.014501 -0.135309 -0.0541505 0.115785 0.256757 -0.161583 0.0909166 0.0321149 0.0410092 0.0878667 -0.0821352 0.140201 0.000998413 0.0847335 -0.0275733 0.12204 0.0187314 -0.0198688 -0.020236 -0.0387451 0.0876158 0.00324888 -0.014933 0.0547246 0.0213659 -0.0688555 -0.0122879 -0.136535 0.0372049 0.06206 0.0508741 0.0480373 0.152886 -0.0893973 0.055606 0.0176167 -0.0117658 -0.153676 0.118646 0.164436 0.0512982 -0.0566087 0.0267901 0.151479 -0.0491913 0.160658 -0.160192 0.0977692 -0.0751429 0.0934484 0.0472787 -0.0265449 0.105246 0.138996 -0.0715199 0.0748198 0.0424873 0.0181638 -0.0701651 -0.119825 0.0333811 0.109335 0.0138791 -0.0790025 0.0745616 -0.0298515 -0.0658159 0.0645304 0.00617167 -0.0282795 
0.105481 0.0615744 -0.0924199 -0.0633073 0.116365 0.215513 0.0616287 -0.0804355 -0.18377 -0.062389 -0.0472345 0.0468795 0.103278 0.0258156 -0.0315224 -0.0820051 -0.0204621 -0.0201703 -0.045298 0.131056 0.0281821 -0.00475604 0.0783504 -0.0295552 -0.0506921 0.0689891 -0.0977212 -0.0887613 0.0624763 0.018752 -0.0373149 0.131573 -0.146125 0.0692093 0.00130152 0.0341086 -0.00763277 0.183562 0.0324221 -0.0703461 0.0617124 -0.0180516 -0.043834 0.00527296 -0.206203 0.0723513 0.118865 0.0756042 -0.131833 0.0589229 -0.0249523 0.0718876 -0.0307455 0.0697455 0.100126 -0.0648428 0.0403977 0.196054 -0.0306462 -0.130248 -0.0553375 0.117926 0.235481 -0.149927 0.0919863 0.0257721 0.043253 0.0940115 -0.0663671 0.111536 0.00568819 0.0857918 0.00441999 0.140857 0.0175221 -0.0106342 -0.0263841 -0.0451178 0.0794996 0.00648733 -0.00508007 0.0527377 0.0385376 -0.0598158 -0.0119724 -0.118324 0.0727286 0.0941999 0.025619 0.0462225 0.182851 -0.11004 0.0407034 0.0072906 -0.0438183 -0.144559 0.117781 0.131375 0.037921 -0.0396915 0.0111001 0.132396 -0.0509317 0.186944 -0.14681 0.075953 -0.0916261 0.135986 0.031104 -0.0238065 0.108707 0.152226 -0.0955089 0.0954837 0.0400918 0.00476062 -0.0889141 -0.103863 0.0232309 0.101465 0.00977516 -0.0390089 0.0812749 -0.0086385 -0.0368295 0.0275931 -0.0218161 -0.0489116 
0.113882 0.0820101 -0.0757243 -0.0485557 0.111331 0.235353 0.0603946 -0.093107 -0.193893 -0.0648612 -0.0584402 0.0448966 0.0959733 0.00765958 -0.0325139 -0.0832674 0.00769872 0.000675465 -0.0489926 0.121436 0.0167251 0.0237795 0.0632424 -0.0190284 -0.0621268 0.0580628 -0.100919 -0.0768805 0.0412798 0.0270329 -0.0435013 0.147449 -0.142692 0.0960524 0.020873 0.0212733 0.027933 0.154477 0.0299745 -0.0860887 0.0663049 -0.042625 -0.00338744 -0.00249547 -0.203575 0.0744191 0.126106 0.0805915 -0.149373 0.0788394 0.0220846 0.0577734 -0.0177854 0.0773268 0.108795 -0.0596259 0.0398084 0.162944 -0.00860011 -0.137212 -0.0494294 0.128699 0.205277 -0.177157 0.103239 0.0142627 0.0425178 0.0628617 -0.104628 0.123485 -0.0129221 0.0526804 0.00379666 0.132238 0.00612975 -0.00717802 -0.00561291 -0.0404641 0.0821284 -0.00422453 0.00785179 0.0548014 0.045675 -0.056198 -0.0011266 -0.128604 0.0577095 0.0714512 0.0162616 0.0946183 0.17054 -0.122577 0.0381018 0.0120993 -0.0575761 -0.108664 0.128872 0.132977 0.0246814 -0.0355647 0.0347644 0.17073 -0.0573644 0.202296 -0.129177 0.0541451 -0.0867129 0.123515 -7.13042e-05 -0.0091626 0.108542 0.138901 -0.0831735 0.0983939 0.0240708 -0.0205079 -0.0826815 -0.103113 0.0141494 0.0974646 0.0253359 -0.0462154 0.0964789 -0.026656 -0.00170433 0.0199272 -0.00237738 -0.0761109 
0.102905 0.0697428 -0.0847649 -0.0728999 0.112009 0.211009 0.047268 -0.0800991 -0.21021 -0.0485125 -0.0572935 0.0466509 0.0988609 0.0318324 -0.0191681 -0.075065 0.00451145 -0.00483018 -0.0220873 0.129079 0.0101174 0.0271873 0.0740491 -0.0273536 -0.0656775 0.0876229 -0.0860566 -0.0804192 0.0624879 0.0205518 -0.0556372 0.134515 -0.130975 0.0720674 0.013178 0.0345504 0.0142262 0.1733 0.0322522 -0.0684932 0.0502975 -0.0127878 -0.0185024 0.00865581 -0.206718 0.0956286 0.137661 0.0706195 -0.149735 0.0670293 0.0010082 0.0670417 -0.0319445 0.0761308 0.107313 -0.0631533 0.0507932 0.182108 -0.0142216 -0.131362 -0.0473848 0.123002 0.220164 -0.154286 0.0971644 0.0137499 0.0407183 0.083343 -0.0732431 0.121783 0.00141399 0.0676572 0.00482181 0.138121 0.0161455 -0.00897667 -0.0263462 -0.0319596 0.0887077 -0.0180706 0.00748553 0.0706954 0.0347984 -0.0586968 -0.00244171 -0.134285 0.0593604 0.0835872 0.0298177 0.0720778 0.168456 -0.0996153 0.0354951 0.00839041 -0.0370335 -0.12598 0.131697 0.148185 0.0284127 -0.046575 0.0104959 0.152267 -0.0432467 0.183593 -0.156586 0.0676751 -0.0937771 0.115416 0.0218126 -0.0237385 0.115475 0.143097 -0.0846648 0.0901574 0.028761 -0.0109421 -0.0788721 -0.13124 0.0120655 0.0886986 0.0234754 -0.0449947 0.0987501 -0.0246241 -0.0306752 0.0224588 -0.00614016 -0.0615366 
0.0825244 0.0692654 -0.0763967 -0.0738859 0.0698441 0.212607 0.0283847 -0.121761 -0.195433 -0.0265979 -0.0451429 0.046213 0.103533 0.0851111 -0.00453564 -0.0987169 -0.0321741 0.0101709 0.0351444 0.100244 0.00686071 0.0183683 0.0648669 0.020047 -0.0534821 0.0900102 -0.070808 -0.0921319 0.0469167 0.0687499 -0.066978 0.0925275 -0.120048 0.0306627 0.0436312 0.0571609 -0.013293 0.159159 0.0363592 -0.0555286 -0.000548566 -0.0131117 -0.0517468 0.00348743 -0.184681 0.109268 0.138481 0.0664173 -0.153994 0.0523031 -0.00202099 0.082101 0.021685 0.0684769 0.126114 -0.0258766 0.0518908 0.208498 -0.0208569 -0.141977 -0.0347597 0.139745 0.243718 -0.145031 0.0764416 0.0403694 0.0624594 0.0838129 -0.0822781 0.133471 0.0139903 0.0672741 -0.0230656 0.106535 0.0239391 0.00260508 -0.0495075 -0.0781816 0.118332 0.00765891 0.0107855 0.0805921 0.00521036 -0.078624 -0.0126755 -0.14629 0.037712 0.0430979 0.0448423 0.0766666 0.148523 -0.0821816 0.0903389 0.0251693 -0.0507184 -0.141597 0.114693 0.153475 0.0835177 -0.0580259 0.0473692 0.159102 -0.045991 0.123644 -0.174442 0.0909307 -0.0841444 0.0585844 0.00217853 -0.00516011 0.137658 0.122432 -0.0650868 0.036553 0.0181361 0.0410293 -0.0803297 -0.127225 0.00798507 0.0867639 0.0345072 -0.100036 0.0723071 -0.0458521 -0.0695747 0.0827727 0.0147648 -0.0303377 
0.047269 0.0830541 -0.0857429 -0.051777 0.063403 0.224454 0.0230369 -0.143711 -0.21022 0.0129352 -0.0711967 0.038728 0.0832594 0.090504 0.0149701 -0.080805 -0.0186142 0.0382898 0.0807616 0.0727909 -0.0406906 0.00824961 0.0609074 0.0267201 -0.045525 0.0823528 -0.0870485 -0.0831685 0.0372878 0.0673003 -0.0564047 0.116584 -0.124694 -0.00232972 0.0581644 0.0834767 -0.018106 0.0900787 0.0258336 -0.0603778 -0.000347889 -0.0151844 -0.0104259 -0.00551642 -0.174387 0.114802 0.16045 0.0769108 -0.164421 0.0366924 0.0142248 0.0432068 0.0501206 0.0330797 0.117116 0.00865192 0.0437364 0.209978 0.0174461 -0.125755 -0.0410621 0.185118 0.227996 -0.174412 0.100301 0.0851065 0.0458362 0.0497719 -0.115748 0.138753 0.00186364 0.0858549 -0.0213766 0.114084 0.0167612 0.0164195 -0.0371216 -0.078905 0.118282 -0.0545455 0.0290419 0.0887394 -0.0318144 -0.0858477 -0.0199628 -0.131497 -0.000175789 0.0148412 0.0364782 0.0935815 0.132779 -0.0427641 0.0989248 0.0129197 -0.0117021 -0.0879327 0.120256 0.170395 0.077131 -0.0416393 0.0494646 0.143456 -0.0342154 0.0734193 -0.181864 0.105384 -0.0757678 0.0119562 -0.0229498 0.0345063 0.130889 0.108904 0.000608039 -0.0136954 0.00350684 0.0104056 -0.0573762 -0.1077 0.0198355 0.0696729 0.0557414 -0.141548 0.0883964 -0.0675644 -0.0997921 0.107991 -0.00549463 -0.0444938 
0.0740004 0.0604061 -0.0844188 -0.0563499 0.0763325 0.224922 0.0247048 -0.132543 -0.197793 -0.0186577 -0.0553489 0.0534512 0.0837877 0.0514832 0.00256449 -0.0839877 -0.0336578 0.0365945 0.0524714 0.102882 6.25521e-05 0.0106706 0.0756027 0.0633091 -0.0439425 0.0774094 -0.0670324 -0.120729 0.0379754 0.0683869 -0.0495222 0.0828287 -0.125475 0.0221122 0.0611745 0.0673799 -0.0214969 0.111593 0.017782 -0.0677747 0.00262547 -0.0204816 -0.0279598 0.0305128 -0.184827 0.0987281 0.164313 0.082701 -0.160767 0.0668848 0.0147732 0.0334293 0.0396583 0.0373938 0.13585 -0.00996019 0.0439521 0.219111 0.00790674 -0.144446 -0.0371147 0.157797 0.248326 -0.159651 0.0944861 0.0328836 0.0409634 0.050317 -0.101535 0.143407 -0.0087461 0.081839 -0.0301775 0.101863 0.008092 -0.00576832 -0.0462954 -0.050528 0.122068 -0.00632447 0.0210135 0.0885726 -0.0231427 -0.0919175 -0.0178978 -0.140751 0.0176063 0.0306821 0.0337336 0.09185 0.151882 -0.0591099 0.074623 0.00393476 -0.0293089 -0.104806 0.108269 0.167917 0.0781394 -0.0602845 0.0521239 0.142697 -0.0381142 0.0893623 -0.173359 0.0843305 -0.0825268 0.0338147 -0.0132405 0.0221516 0.139148 0.133648 -0.0234177 -6.2397e-05 0.011936 0.0364911 -0.0680837 -0.127746 0.00491185 0.0931028 0.048257 -0.110514 0.0758963 -0.0488719 -0.105089 0.0931407 0.00411489 -0.041106 
0.0539563 0.101215 -0.0704962 -0.0528478 0.0710136 0.222319 0.0316758 -0.135252 -0.212206 -0.00366513 -0.0560091 0.0488929 0.0794851 0.0639275 -0.00534169 -0.0749677 -0.00823203 0.0462628 0.0502683 0.0826535 -0.0146085 0.0229815 0.0473886 0.0378317 -0.0541824 0.0841462 -0.0773782 -0.0769599 0.0693425 0.0737933 -0.0684828 0.1206 -0.122919 0.0214536 0.0588772 0.0621105 -0.00471129 0.0996448 0.0257526 -0.0673362 0.0125462 -0.0238857 0.00244371 0.00575058 -0.177037 0.111949 0.173088 0.0700482 -0.192077 0.0352229 0.025027 0.0573849 0.0209797 0.0376076 0.124356 0.00681436 0.0331814 0.205014 -0.00263926 -0.121122 -0.0413424 0.161012 0.237067 -0.173356 0.112355 0.0607199 0.0361043 0.0295954 -0.129896 0.148315 -0.00577802 0.061826 -0.0228889 0.113315 0.0195493 0.00846826 -0.0211945 -0.0449337 0.110111 -0.0626757 0.0222155 0.0957024 -0.0129206 -0.0778279 -0.0138906 -0.136827 0.00969124 0.0228869 0.026126 0.116537 0.14287 -0.0693763 0.0669418 0.0204864 -0.0115097 -0.089283 0.123922 0.165484 0.0679839 -0.0400508 0.0455613 0.158635 -0.0463521 0.10589 -0.171273 0.10321 -0.0646363 0.0366375 -0.0146747 0.00590817 0.124606 0.112709 -0.0212561 0.0148872 0.0140554 -0.000603008 -0.0641154 -0.122498 0.0204865 0.0821477 0.0506037 -0.123595 0.0843881 -0.0647009 -0.0728677 0.107945 0.00707706 -0.0655816 
0.0738371 0.0678826 -0.084297 -0.0476724 0.102688 0.225157 0.025592 -0.129926 -0.20743 -0.0237011 -0.0525778 0.0638582 0.077151 0.0617915 -0.0125367 -0.0590043 0.00973344 0.0475152 0.0423739 0.11001 0.0120374 0.0283988 0.0688231 0.0496055 -0.0500603 0.0834616 -0.0685594 -0.0973946 0.0636977 0.0698175 -0.0623423 0.11504 -0.118321 0.0320354 0.0538137 0.0714534 -0.00341111 0.107775 0.015507 -0.0766729 0.0153208 0.00131512 -0.00309094 0.0113329 -0.187242 0.106022 0.176413 0.0707082 -0.16887 0.0457324 0.0232253 0.0396588 0.0122596 0.0409149 0.139133 -0.00415096 0.048113 0.211081 -0.000303246 -0.123081 -0.0366357 0.152265 0.2415 -0.178401 0.121251 0.0277827 0.0258472 0.0476546 -0.106312 0.162301 -0.00269566 0.0767692 -0.0238169 0.0981359 0.00459401 0.00837331 -0.0201351 -0.0152037 0.0991462 -0.0639191 0.0185817 0.110496 -0.00854131 -0.0772816 -0.0115491 -0.135258 0.0213115 0.0461496 0.0116516 0.103586 0.153835 -0.0683042 0.0477851 0.0171415 -0.00273665 -0.0935977 0.118132 0.170527 0.0603481 -0.0422477 0.0440953 0.146406 -0.0459906 0.11095 -0.169153 0.0912068 -0.0726438 0.0271799 -0.0137659 0.0050903 0.111586 0.118967 -0.0186817 0.027007 0.0233458 0.00962423 -0.0681112 -0.139129 -0.00541417 0.0904122 0.0400071 -0.091391 0.0869297 -0.0572205 -0.0870534 0.103725 0.0013014 -0.0602237 
0.0809922 0.0475006 -0.0851415 -0.0579429 0.0956815 0.238461 0.0295119 -0.110778 -0.201051 -0.0562096 -0.0550268 0.0619175 0.0833997 0.0437402 -0.026396 -0.0914671 -0.02896 0.0128336 0.0141951 0.115818 0.011116 0.0193344 0.0776493 0.0385454 -0.0626848 0.0744323 -0.0706084 -0.0993871 0.044142 0.0360292 -0.0461933 0.0847942 -0.149643 0.0436565 0.0328975 0.0675143 -0.0247278 0.120213 -0.00109702 -0.0502366 0.0361629 -0.00228951 -0.0431454 0.0250196 -0.200855 0.0813722 0.149948 0.0827032 -0.14344 0.0716302 0.00303727 0.0416422 -0.00131133 0.0519402 0.12641 -0.0282569 0.0446828 0.224347 0.00190315 -0.130493 -0.0389555 0.163768 0.252617 -0.15876 0.0997777 0.00425127 0.0515343 0.0579351 -0.0834988 0.158836 0.00163371 0.0910102 0.000570679 0.126368 0.00580072 -0.00443947 -0.0405278 -0.0337772 0.0995235 -0.0193707 0.015515 0.0792215 0.0126291 -0.0778783 -0.0244125 -0.131642 0.0505704 0.061732 0.0101166 0.0718455 0.17086 -0.0802848 0.0635132 0.00153324 -0.0284923 -0.119488 0.117472 0.149593 0.0542907 -0.0405402 0.0337006 0.15439 -0.0512402 0.126761 -0.158991 0.0819023 -0.0873831 0.0634013 -0.0232178 0.0133672 0.132704 0.138405 -0.0373357 0.0483752 0.005801 0.0275307 -0.0644237 -0.120725 0.00140045 0.0935107 0.0212996 -0.0862171 0.0752913 -0.0502775 -0.0865334 0.0781574 -0.0233086 -0.0429413 
0.0731198 0.058623 -0.10178 -0.0657194 0.0807373 0.217082 0.0193885 -0.111579 -0.201869 -0.0411852 -0.0481758 0.0439964 0.0955598 0.0465771 -0.0312433 -0.0838645 -0.0508288 0.00128053 0.0189263 0.125578 0.0149119 -0.0165359 0.0873 0.011657 -0.0514644 0.0881719 -0.0775276 -0.11414 0.0477948 0.0357046 -0.0477572 0.086016 -0.139548 0.0254282 0.0232486 0.067107 -0.0415898 0.150351 0.0126387 -0.0547747 0.0190354 -0.014768 -0.0538733 0.0322129 -0.18914 0.0951189 0.155028 0.0767264 -0.151999 0.061756 -0.022334 0.0582712 0.000261234 0.0544841 0.116109 -0.0382152 0.0520488 0.213391 0.00325422 -0.14731 -0.0344703 0.150833 0.261842 -0.13525 0.0884224 0.0223464 0.0482076 0.0787621 -0.0573741 0.134597 0.00173734 0.0918899 -0.00443818 0.125768 0.0221552 -0.0136337 -0.0563957 -0.0413017 0.101452 0.00420218 0.00245419 0.0670989 -0.00231866 -0.0817059 -0.0361322 -0.119086 0.0432505 0.0649919 0.039108 0.0467675 0.164133 -0.0721686 0.0695517 -0.00744478 -0.0345564 -0.136993 0.116918 0.164182 0.0635912 -0.0585288 0.0252314 0.139635 -0.0406787 0.121056 -0.165661 0.0949931 -0.08934 0.0943645 0.00208464 -0.000733112 0.129447 0.145214 -0.0581421 0.0365045 0.0165478 0.0347412 -0.0788271 -0.123329 0.0188164 0.086911 0.0140411 -0.0849265 0.0776403 -0.0376373 -0.0941953 0.0721232 -0.0160213 -0.0253986 
0.0682436 0.0571863 -0.0940319 -0.0669088 0.0758735 0.219202 0.0241318 -0.111612 -0.200019 -0.0419526 -0.04971 0.045043 0.0954463 0.0570923 -0.0272382 -0.0935235 -0.0531189 0.000391702 0.0231585 0.119726 0.0112517 -0.0132547 0.0805169 0.014148 -0.0549907 0.0865644 -0.0796848 -0.108544 0.0470871 0.0377903 -0.04977 0.0843461 -0.140376 0.0237311 0.0267787 0.0694335 -0.0391534 0.147819 0.00842494 -0.0532622 0.0231869 -0.0137036 -0.0565853 0.0259768 -0.190403 0.0946719 0.149994 0.0760621 -0.151296 0.0564781 -0.0251911 0.0583259 0.00595539 0.0555062 0.119546 -0.031137 0.0472314 0.216146 0.000125273 -0.145641 -0.0343721 0.156589 0.259495 -0.135836 0.0887303 0.0304704 0.0544749 0.0743152 -0.0612438 0.135704 0.00372594 0.088467 -0.00290832 0.125341 0.0239995 -0.0085317 -0.0565694 -0.0494756 0.105863 0.000101632 0.00235014 0.0678285 -0.00161077 -0.0815304 -0.033026 -0.123356 0.0463852 0.0628235 0.0371074 0.0508897 0.165563 -0.0732131 0.0797723 -0.00500531 -0.0393274 -0.138975 0.117312 0.159585 0.0691453 -0.0540204 0.0306434 0.144967 -0.0414161 0.114955 -0.167661 0.0976579 -0.086687 0.0858174 -0.00500308 0.00192015 0.132358 0.13895 -0.0580697 0.0318856 0.0127881 0.0361738 -0.0763892 -0.121722 0.0168324 0.0845863 0.0154627 -0.0926334 0.0719986 -0.0412547 -0.0934554 0.0792905 -0.015896 -0.0240814 
0.0663536 0.0535035 -0.0896421 -0.0580068 0.0877114 0.222105 0.0240524 -0.125018 -0.197996 -0.0450933 -0.0508861 0.0558741 0.0929159 0.0693538 -0.0258651 -0.0964772 -0.0401529 0.0130604 0.0290227 0.117817 0.0130202 -0.00152042 0.0745608 0.0273935 -0.0543252 0.0803843 -0.0825942 -0.101666 0.044526 0.0515203 -0.0486168 0.084818 -0.138045 0.0215871 0.0356842 0.0787767 -0.033837 0.131255 0.00438685 -0.0551213 0.0270868 0.000512846 -0.0492577 0.0212839 -0.195292 0.0959059 0.154053 0.0757828 -0.142064 0.0510556 -0.0169542 0.0543723 0.00974227 0.0517579 0.129344 -0.0203925 0.04374 0.222048 0.000639853 -0.137474 -0.0362576 0.164705 0.253661 -0.144184 0.0945341 0.0242109 0.0571512 0.0665849 -0.0710287 0.146033 0.0126972 0.0897513 -0.000439694 0.116557 0.0162515 0.00381775 -0.0537689 -0.0466398 0.103974 -0.0149476 0.00699474 0.0825597 0.000512271 -0.0768046 -0.0279578 -0.126274 0.0458211 0.0605777 0.022755 0.0585971 0.162714 -0.0712049 0.0841215 -0.00125922 -0.0367719 -0.138479 0.112606 0.159315 0.0699984 -0.0487521 0.0340293 0.15238 -0.0391372 0.11099 -0.170349 0.0994893 -0.0841386 0.068014 -0.0117536 0.0148445 0.129536 0.125857 -0.0525378 0.0345805 0.00343694 0.0373594 -0.0716789 -0.124277 0.00402212 0.0866718 0.0178356 -0.0940154 0.0644665 -0.0488261 -0.0986772 0.0909479 -0.0187011 -0.0253791 
0.0728873 0.06444 -0.0844345 -0.0739068 0.0767406 0.22047 0.0355614 -0.106544 -0.204226 -0.0366487 -0.0566555 0.0373023 0.107281 0.0939964 -0.0141007 -0.101377 -0.0370081 -0.0166798 0.0210609 0.0983412 0.000405194 0.00418028 0.0660559 -0.0136387 -0.058361 0.0846424 -0.0865016 -0.0782337 0.0483445 0.042389 -0.0601861 0.101059 -0.143595 0.0275529 0.0214647 0.0691745 -0.0242172 0.15381 0.0185929 -0.049472 0.0228001 -0.00619608 -0.0533643 -0.00184512 -0.190042 0.10943 0.128436 0.0755689 -0.144893 0.0389287 -0.0178495 0.0789486 0.00456607 0.0669659 0.119373 -0.0290846 0.0457028 0.215427 -0.00591364 -0.13485 -0.0365514 0.158136 0.237357 -0.142822 0.0872236 0.0505802 0.063227 0.0971709 -0.0627985 0.132033 0.0205 0.0856436 0.00246171 0.12034 0.0265512 0.0127649 -0.0472578 -0.0732052 0.106286 -0.00812968 0.0127454 0.0563308 0.0149523 -0.073381 -0.0282613 -0.132473 0.0553323 0.0599154 0.0325074 0.0584237 0.157359 -0.0829495 0.0911561 0.0133132 -0.051683 -0.140728 0.127173 0.143731 0.0712022 -0.0419075 0.0384623 0.162555 -0.0427826 0.126243 -0.175144 0.0968192 -0.0941367 0.0805984 -0.00715252 -0.0048285 0.134031 0.123579 -0.0693475 0.0465711 0.0160455 0.0320681 -0.0779395 -0.108002 0.0115513 0.0802467 0.0155042 -0.0988424 0.077532 -0.044479 -0.0661045 0.0775748 -0.015631 -0.0271773 
0.0788417 0.0494942 -0.0924536 -0.0649176 0.0923559 0.221695 0.0355536 -0.110866 -0.198081 -0.0386455 -0.0533045 0.0507868 0.0996348 0.0603831 -0.0146288 -0.0953883 -0.0457723 0.00417084 0.0135379 0.116436 0.011823 -0.0108815 0.0886882 0.0112066 -0.0475679 0.0782582 -0.0872762 -0.108091 0.0402022 0.0379406 -0.0443999 0.0964872 -0.142589 0.032655 0.0231674 0.0653068 -0.0376907 0.151428 0.0151696 -0.0557352 0.0312323 -0.00935254 -0.0581219 0.018216 -0.201576 0.0886846 0.136341 0.076451 -0.138146 0.0570145 -0.0195864 0.0567465 0.00153063 0.055579 0.115986 -0.0347599 0.0491558 0.220948 -0.00428733 -0.137628 -0.0388872 0.151386 0.249279 -0.142883 0.0913894 0.0304169 0.0505297 0.0866583 -0.0667091 0.138799 0.00992035 0.0994336 -0.00379328 0.124064 0.0156916 -0.00330052 -0.0545006 -0.0594565 0.104175 0.000772943 -0.00320372 0.0657059 0.00654926 -0.0774093 -0.0318837 -0.130714 0.0556699 0.0661503 0.0322493 0.0473557 0.163698 -0.075767 0.0802348 -0.00529423 -0.042724 -0.143136 0.113355 0.155429 0.0663951 -0.0503578 0.0291629 0.141219 -0.0408302 0.128152 -0.163243 0.0893703 -0.0945147 0.0876835 0.00409189 0.00125057 0.126343 0.141839 -0.0621248 0.0428662 0.0193841 0.0350921 -0.0768508 -0.117158 0.0155104 0.0948852 0.0216519 -0.0861643 0.0668396 -0.033887 -0.0865844 0.0692326 -0.0185024 -0.0244716 
0.0849263 0.052706 -0.0893261 -0.0440454 0.108605 0.24773 0.0258244 -0.13114 -0.198116 -0.0589241 -0.0511967 0.0693764 0.0825275 0.0439802 -0.0367801 -0.074802 -0.0185654 0.0345432 0.00949316 0.114057 0.0289963 0.0182542 0.0815577 0.0451894 -0.0523689 0.0623802 -0.0743569 -0.103213 0.0396506 0.0580347 -0.0508609 0.0945463 -0.143571 0.0451344 0.0440936 0.0670815 -0.0214268 0.103646 0.00502552 -0.0675712 0.0302505 -0.00105217 -0.0227836 0.017768 -0.198911 0.0754849 0.159553 0.0812376 -0.151246 0.0688303 0.0169191 0.0293414 0.00743866 0.049856 0.131393 -0.021138 0.049248 0.217835 -0.000321625 -0.130938 -0.0366853 0.166107 0.252118 -0.17295 0.112016 0.009154 0.0344289 0.0581168 -0.098981 0.163715 0.003052 0.0889697 -0.00610758 0.100724 -0.00379886 0.00959147 -0.0293439 -0.0354577 0.0908651 -0.0300247 0.018522 0.088384 0.0110069 -0.0720961 -0.0326006 -0.120544 0.0416652 0.0564128 -0.000238823 0.0857594 0.165688 -0.0871885 0.0533973 0.012713 -0.0291467 -0.107076 0.10534 0.158998 0.0516491 -0.0346006 0.0514068 0.150541 -0.05541 0.12479 -0.14867 0.0832576 -0.0824884 0.0548339 -0.0342565 0.0174428 0.11968 0.126855 -0.0249158 0.0497294 0.00821196 0.0284191 -0.0768742 -0.106253 -0.00862018 0.097215 0.0219537 -0.0865382 0.0765068 -0.0601828 -0.0828114 0.0952654 -0.020009 -0.0511062 
0.0400587 0.0462583 -0.0425019 -0.0443137 0.0473533 0.209358 0.0464085 -0.14048 -0.186784 -0.0455351 -0.0914653 0.0663359 0.0625816 0.0434385 0.0254111 -0.12358 -0.0656973 0.0388622 0.0632634 0.0769007 -0.0303458 0.0221256 0.0579095 0.0767947 -0.0584264 0.0744853 -0.0886076 -0.134379 -0.00755378 0.0685275 -0.052295 0.0992972 -0.107677 0.0277278 0.0833248 0.0563269 0.0118516 0.0852157 -0.00357016 -0.0612494 0.0461191 -0.0411852 0.00662938 0.0212791 -0.190351 0.105058 0.180401 0.0519475 -0.166313 0.0686363 0.00396697 -0.0289875 0.080422 0.0526719 0.159048 0.0176608 0.0382328 0.205762 0.0121252 -0.143059 -0.0241967 0.182962 0.199237 -0.160264 0.106424 0.0556046 0.0628097 -0.00632885 -0.116128 0.11869 -0.0257742 0.0468749 -0.0254899 0.120714 0.0244799 0.00948865 -0.0656797 -0.0800796 0.127701 -0.0261924 0.0119047 0.106843 -0.0437331 -0.0865638 -0.0166905 -0.122951 0.0232162 -0.00380601 0.00154031 0.104385 0.152244 -0.0631089 0.103249 -0.042769 -0.052002 -0.0634741 0.0987912 0.16801 0.098457 -0.036471 0.0350876 0.128303 -0.0176791 0.0835637 -0.163304 0.060399 -0.0880474 0.038983 -0.0839047 0.0456554 0.132 0.109043 -0.0262225 -0.0618457 -0.0250977 0.0255847 -0.0392026 -0.15326 0.0159597 0.0792154 0.0859254 -0.11426 0.0626205 -0.0530398 -0.101163 0.0807096 -0.00466258 -0.0453815 
0.0014745 0.0759412 -0.0547883 -0.031198 0.0301033 0.177116 0.0365357 -0.151634 -0.197101 0.00117431 -0.0889286 0.0693704 0.0593291 0.0918443 0.0232606 -0.121284 -0.00776756 0.0434686 0.121185 0.0728899 -0.0705697 0.00735354 0.0416657 0.0662953 -0.0621273 0.0865269 -0.0783962 -0.0865205 0.0181186 0.082406 -0.0591587 0.118958 -0.0710815 -0.00682155 0.0770634 0.0734524 0.0270292 0.0801178 -0.0102315 -0.0610591 0.0217966 -0.0264847 0.0283206 0.00109859 -0.184875 0.12598 0.192057 0.0441787 -0.161221 0.0363806 0.0150184 0.00618906 0.0761728 0.0358989 0.161056 0.0417206 0.0308551 0.18914 0.0229041 -0.116868 -0.0312317 0.175644 0.18426 -0.181393 0.12767 0.0730237 0.0622594 -0.0304676 -0.143586 0.123929 -0.0234574 0.0385224 -0.034704 0.132746 0.0372058 0.0238337 -0.0312445 -0.0516213 0.127017 -0.0845731 -0.00907793 0.104109 -0.0522334 -0.0718829 0.00862507 -0.140274 -0.00941258 -0.0158163 0.0239668 0.10481 0.1093 -0.04023 0.124932 -0.03309 -0.00109507 -0.0695461 0.118818 0.173838 0.0945864 -0.0363614 0.0214581 0.146602 -0.0113964 0.0682013 -0.176493 0.0885959 -0.0593966 0.000312026 -0.0615358 0.0485348 0.104395 0.0812913 0.00255608 -0.0634333 -0.0379106 -0.00886705 -0.000107864 -0.16752 0.0287116 0.0758124 0.0791719 -0.132836 0.0596079 -0.0712713 -0.104492 0.103852 0.000652896 -0.0460379 
0.0543093 0.0147196 -0.0468849 -0.0506725 0.0650698 0.205913 0.0475762 -0.109806 -0.178853 -0.0640705 -0.0938921 0.088453 0.0696972 0.0398127 0.0111038 -0.124084 -0.0524459 0.0328742 0.0391897 0.111171 -0.0142696 0.0296386 0.0708903 0.106093 -0.0789925 0.0654164 -0.0689439 -0.136562 -0.016198 0.059651 -0.0616871 0.0706715 -0.106113 0.045125 0.0601908 0.0537204 0.00672308 0.102761 -0.0417978 -0.0496682 0.0445328 -0.0170382 -0.00836922 0.0321416 -0.200225 0.0867348 0.172777 0.0483152 -0.145162 0.100199 0.0135127 -0.0499003 0.0561791 0.0605003 0.177349 0.00854955 0.0344942 0.221428 0.0198532 -0.147602 -0.0207564 0.176486 0.202597 -0.16178 0.10004 0.0112783 0.0590003 0.00381478 -0.111878 0.121153 -0.0178179 0.0542034 -0.0150398 0.116766 0.0118893 0.0181364 -0.0565486 -0.0544928 0.132422 -0.0257196 0.00786384 0.103478 -0.0355996 -0.0894449 -0.0123248 -0.127674 0.0408985 0.0188992 0.00381581 0.0977653 0.147627 -0.0803417 0.0941979 -0.0400754 -0.0461185 -0.0654039 0.0969536 0.152721 0.0887571 -0.0351205 0.0352297 0.126531 -0.025621 0.0974501 -0.171602 0.0487033 -0.111115 0.0230544 -0.0951242 0.0334636 0.133776 0.127633 -0.0190428 -0.038883 -0.0328587 0.0409018 -0.0366644 -0.159696 -0.0117484 0.0915706 0.0641648 -0.0899151 0.0569944 -0.0482968 -0.109065 0.0774043 -0.0226024 -0.0565003 
0.0448107 0.0284501 -0.0731896 -0.0446885 0.0567469 0.186117 0.0432316 -0.12306 -0.168906 -0.0559665 -0.0853029 0.0980689 0.0690184 0.0492796 -0.00109657 -0.122996 -0.0450128 0.0240689 0.0680004 0.119906 -0.0136823 0.0181553 0.0515258 0.109257 -0.06909 0.0791395 -0.0533034 -0.134949 -0.0150256 0.0927014 -0.0690606 0.0650419 -0.0796959 0.0268634 0.0625296 0.0576381 0.0141783 0.0967939 -0.0410814 -0.0628304 0.0322448 -0.0195795 0.0137427 0.0500349 -0.193007 0.0991678 0.19274 0.0361463 -0.140212 0.0876189 0.0134008 -0.0432332 0.0621021 0.0576355 0.20164 0.0235627 0.0105871 0.218774 0.0173924 -0.149682 -0.0239062 0.148504 0.214166 -0.161836 0.0999899 0.0112247 0.0556518 -0.00640281 -0.1086 0.104103 -0.0155369 0.0449857 -0.0293142 0.0978374 0.0219154 0.0324129 -0.0484807 -0.041474 0.127435 -0.0232347 0.00291522 0.107126 -0.0392958 -0.0796839 -0.006217 -0.130375 0.0307075 0.0111941 0.0251878 0.0999443 0.125196 -0.0859193 0.0853987 -0.0400125 -0.0372711 -0.0693336 0.100012 0.151339 0.101094 -0.0499754 0.0275347 0.13196 -0.00900679 0.0805299 -0.200524 0.0641322 -0.10927 0.0200909 -0.102894 0.034677 0.139507 0.108455 -0.0302667 -0.0493498 -0.0370525 0.0385281 -0.0276345 -0.176423 -0.00782321 0.0919832 0.0670978 -0.0888429 0.0588252 -0.046513 -0.112782 0.0898398 -0.00467984 -0.0492909 
0.0995154 0.0628075 -0.0997577 -0.0609511 0.0893065 0.214148 0.029354 -0.109603 -0.208547 -0.0176215 -0.0496285 0.0235211 0.11073 0.0885841 0.00522004 -0.0866895 0.00103822 0.000684675 0.0373331 0.110076 0.00519943 0.0030453 0.0869389 -0.00442112 -0.0358995 0.0762832 -0.0827904 -0.0903087 0.0496612 0.0516204 -0.0486816 0.115137 -0.129453 0.0288969 0.0282746 0.0655771 -0.0156046 0.158721 0.0325254 -0.0779964 0.00517351 -0.0091172 -0.0517854 0.0049496 -0.198598 0.113259 0.123668 0.0902985 -0.129835 0.0455675 0.00500898 0.0960084 0.0173632 0.055798 0.115897 -0.0483801 0.0646544 0.191 0.0151904 -0.146461 -0.0403843 0.134426 0.223944 -0.152223 0.0819714 0.0403825 0.0528326 0.107129 -0.0618968 0.138286 0.00791263 0.0904031 -0.0197239 0.102113 0.0109605 -0.00422083 -0.0414775 -0.0564473 0.109507 0.0138421 0.00989073 0.0563909 0.0145777 -0.0819092 0.00232525 -0.148199 0.0359542 0.0594276 0.0430574 0.0601644 0.153168 -0.0642102 0.0749567 0.00920262 -0.0449797 -0.150765 0.126984 0.163725 0.062692 -0.0716023 0.0517878 0.168605 -0.0256615 0.127771 -0.176497 0.0821885 -0.0879888 0.0710108 0.0373748 0.00120569 0.128427 0.12994 -0.066974 0.0454441 0.0310877 0.0239497 -0.0726547 -0.127573 0.00809301 0.0896384 0.0238713 -0.0889623 0.0838076 -0.0324959 -0.0674878 0.058825 0.0121838 -0.019871 
0.0934125 0.0422436 -0.11375 -0.0731566 0.0997418 0.209181 0.0351577 -0.0971557 -0.175394 -0.0562399 -0.0639707 0.0503283 0.0934269 0.021816 -0.0229694 -0.10869 -0.0352586 -0.00107156 0.00750339 0.135047 0.00927376 0.00314144 0.100517 0.0144691 -0.0584285 0.0701309 -0.0601385 -0.125443 0.0252487 0.0302329 -0.0361452 0.0762669 -0.119431 0.0470723 0.0373279 0.044623 -0.00791544 0.159738 -0.0150677 -0.0806519 0.0403369 -0.0188053 -0.0512198 0.0735726 -0.229695 0.0984858 0.136304 0.0944714 -0.123832 0.0886653 -0.0143684 0.0415261 0.00311829 0.0499452 0.128222 -0.0522451 0.0428509 0.192535 0.0140155 -0.159506 -0.0408092 0.118175 0.244491 -0.132174 0.089879 -0.0281064 0.0448189 0.0766554 -0.0490259 0.134515 -0.00602349 0.074226 -0.00380333 0.107616 -0.00397967 -0.0146159 -0.0643912 -0.0231367 0.102259 0.0189993 -0.00540295 0.0646143 0.00169642 -0.0742269 -0.00560713 -0.148389 0.056688 0.075021 0.0380544 0.0604443 0.173006 -0.0815368 0.0470846 -0.0450053 -0.0404947 -0.144151 0.113238 0.156755 0.0529965 -0.0784612 0.031489 0.154649 -0.0159736 0.12104 -0.171583 0.048569 -0.100717 0.0990332 0.00791996 0.0195292 0.146573 0.146586 -0.0748161 0.0493097 0.00287193 0.0225151 -0.0633421 -0.156952 0.014654 0.0968293 0.0282572 -0.0518218 0.0664764 -0.00644317 -0.0761622 0.0171002 -0.00589514 -0.0277749 
0.106395 -0.0163172 -0.0827106 -0.0595919 0.0998151 0.23511 0.0637935 -0.0695088 -0.167161 -0.0794308 -0.0855479 0.089973 0.083906 -0.0240118 0.0114295 -0.127075 -0.0488317 0.0351612 -0.00849116 0.130022 0.0127264 0.0438291 0.0760446 0.0955597 -0.0843242 0.0397478 -0.0627749 -0.175977 -0.0451991 0.0470801 -0.0500657 0.0652774 -0.123372 0.0819105 0.0567787 0.0317265 0.00779888 0.0938245 -0.0564008 -0.0642116 0.0762427 -0.0249571 -0.0294197 0.0820144 -0.231524 0.0609483 0.142882 0.0719351 -0.125415 0.128485 0.0301568 -0.0795208 0.0311096 0.0580282 0.154005 -0.0187379 0.019472 0.200119 0.0306529 -0.152804 -0.0238152 0.141913 0.198004 -0.156694 0.0897286 -0.0586792 0.0496768 0.0220045 -0.0875797 0.100289 -0.0214273 0.0528137 -0.000556593 0.0738072 -0.0298668 0.0146745 -0.0725434 -0.0447967 0.115827 0.0250827 0.0077478 0.0806118 -0.0197444 -0.0803452 -0.0139446 -0.119834 0.074966 0.0249076 -0.00703053 0.0940871 0.155325 -0.102393 0.0358149 -0.0537513 -0.0812091 -0.0698913 0.0893287 0.12133 0.0498124 -0.0439518 0.0517635 0.134963 -0.0176412 0.11183 -0.161719 0.00921228 -0.129725 0.0586061 -0.106575 0.0512155 0.149178 0.128027 -0.042012 -0.013869 -0.0371188 0.0419531 -0.0603193 -0.162223 -0.0264245 0.093885 0.0597565 -0.062917 0.0586295 -0.0112663 -0.0657495 0.0212049 -0.0302055 -0.0618849 
-0.0503984 0.11666 -0.102385 -0.0412238 -0.00994623 0.151705 0.0179721 -0.171803 -0.0944862 0.0464364 -0.0445964 0.0441242 0.0353342 0.136113 0.0432124 -0.126673 -0.00976493 0.00364209 0.171243 0.00305277 -0.106454 -0.00393893 -0.0325531 0.0526465 -0.0344863 0.0746615 -0.034658 -0.0319232 0.0372816 0.12089 -0.0119821 0.0789539 -0.00258434 -0.0755522 0.0742337 0.132831 0.0128901 -0.0196939 -0.0350536 -0.0493081 0.00573399 -0.0364068 0.0300279 0.0352508 -0.129702 0.143312 0.145516 0.0520645 -0.125867 -0.0454614 -0.0344081 0.0470133 0.108482 -0.0277176 0.144807 0.124264 -0.0775551 0.197223 -0.00815283 -0.0578343 -0.0920692 0.126256 0.208121 -0.163449 0.117601 0.128608 0.0520781 -0.0559267 -0.148641 0.094792 -0.00327048 0.0106853 -0.0584243 0.0499503 0.0705969 0.0633777 -0.0178183 -0.0582239 0.0784832 -0.115667 -0.000902044 0.0774173 -0.0853092 -0.0445036 -0.00374814 -0.100018 -0.0393696 -0.0667752 0.0320519 0.136905 0.0728023 -0.0467464 0.101055 -0.0224312 0.0482771 -0.0416495 0.0776645 0.0986245 0.132429 -0.0188972 0.0247967 0.125195 0.00886227 -0.0675247 -0.229135 0.15621 -0.0375461 -0.0719437 -0.0728951 0.0641734 0.126938 0.00927808 0.0203803 -0.116775 -0.0274584 -0.00352586 0.0355618 -0.126641 0.0852867 0.0710014 0.116264 -0.205003 0.0459171 -0.0465811 -0.092832 0.150152 0.0316581 -0.0125218 
