-0.0519763 0.105777 0.0720709 -0.103653 0.0320334 0.0530236 0.0141578 0.00421242 -0.0287797 0.151762 0.0965049 -0.0521749 0.065575 0.00227716 0.150741 0.0688731 0.00484246 0.0738842 -0.0200273 -0.0242473 0.0946765 0.049723 0.0101368 0.0865742 0.0032978 0.112309 0.00143661 -0.135992 0.23353 0.0164626 0.0908386 0.0238832 -0.00125167 0.00725928 0.0587533 0.0862708 -0.0124564 0.1934 0.0293416 0.0565717 -0.0373448 0.00292327 -0.126246 0.111831 -0.047596 0.0609289 0.105723 0.0277551 -0.139147 -0.187289 -0.0130542 0.0587036 -0.12806 -0.0881814 0.00687923 0.0994724 -0.0309547 0.170277 -0.0345125 -0.025812 -0.117272 -0.161597 0.139897 -0.0279098 0.14782 -0.0633803 0.00749855 0.0503698 0.000265935 0.148095 0.0263819 0.0983868 -0.0721505 -0.0222777 0.0338042 -0.116813 -0.112295 0.220146 0.0226396 -0.070092 -0.0320576 0.114358 -0.0376009 -0.0471436 -0.0556566 -0.134718 0.101145 0.0347568 0.00462786 -0.00055553 0.0370749 0.000871083 -0.0492651 -0.017425 0.0625754 -0.0333867 0.00481364 0.048997 0.044657 0.010489 -0.0800464 0.000381167 -0.0742219 0.0392495 -0.0804962 0.0408666 -0.0540476 -0.0698644 0.260641 -0.139957 -0.0267857 0.137469 -0.131784 -0.00571223 0.180973 0.0388059 -0.0752647 -0.228329 -0.0392905 0.0742023 0.0779663 0.0219276 -0.0297021 0.121432 -0.0485101 0.0638185 -0.000223921 -0.0107779 
-0.0345778 0.11252 0.068946 -0.0997985 0.0485276 0.0585686 0.0107195 -0.00357333 -0.0739889 0.157186 0.086161 -0.0385001 0.0846582 0.0211192 0.149748 0.0742407 0.0430311 0.0726668 -0.0234578 -0.000845527 0.0976632 0.040585 0.0133675 0.103278 0.0100435 0.109252 -0.0153596 -0.124764 0.230728 0.0285213 0.0709709 0.0449508 -0.023099 0.0153241 0.0366002 0.0806826 -0.0214309 0.197213 0.0379369 0.0563886 -0.0442565 0.0143186 -0.108263 0.0905233 -0.0480462 0.0712104 0.119475 0.0280856 -0.152689 -0.176755 0.0250493 0.0622989 -0.140079 -0.0859084 0.0132442 0.0827915 -0.0281741 0.185273 -0.0114025 -0.0285981 -0.104378 -0.138462 0.122006 -0.044316 0.143868 -0.0612342 0.00425069 0.06865 -0.0161446 0.139638 0.0330682 0.116318 -0.0669088 -0.0158217 0.0356806 -0.0999557 -0.0983628 0.218708 0.0374147 -0.0581616 -0.0316687 0.112133 -0.0270539 -0.0498679 -0.0585613 -0.138737 0.103308 0.0324972 0.0071655 -0.00330698 0.0147567 -0.000195088 -0.0387624 0.000915134 0.0504218 -0.0419823 0.0231576 0.0533391 0.0322162 -0.00748353 -0.0800691 0.0179212 -0.0765457 0.0778835 -0.102343 0.0448507 -0.0734177 -0.0510143 0.259708 -0.149998 -0.0203628 0.148612 -0.135749 0.0149217 0.167422 0.0312003 -0.0989812 -0.222131 -0.0599013 0.0826437 0.0567034 0.0298952 -0.0301948 0.112632 -0.0526666 0.069433 -0.0182007 -0.031547 
-0.0398328 0.107255 0.0624878 -0.124876 0.0500851 0.100667 0.00616771 0.0211212 -0.0522273 0.142167 0.0870201 -0.0402612 0.0786286 -0.0221196 0.14485 0.046511 -0.0147897 0.0739634 -0.0508097 -0.0060507 0.108083 0.0357626 0.0125003 0.106977 0.0169173 0.0843075 0.00441956 -0.140628 0.216409 0.00642138 0.095516 -0.00656498 -0.027332 0.0177426 0.0476893 0.0842386 -0.0495143 0.158296 0.01393 0.0424833 -0.021306 -0.0171755 -0.123194 0.141916 -0.0615474 0.045338 0.111568 0.0514107 -0.17791 -0.158509 -0.00915893 0.0304485 -0.131109 -0.106568 -0.0011419 0.0939685 -0.0735152 0.202239 -0.027205 -0.0612841 -0.119284 -0.125389 0.164794 -0.024037 0.135874 -0.0517008 -0.00371971 0.0687331 -0.0277211 0.140804 0.0290731 0.108631 -0.0649129 -0.0491415 0.0296361 -0.103464 -0.119314 0.199832 0.0422026 -0.0343431 -0.0379945 0.0949685 -0.0346857 -0.053375 -0.0753853 -0.123677 0.1112 0.0399489 0.0196954 0.0206592 0.0474012 -0.0207613 -0.0624768 0.0015497 0.0366618 -0.0340148 -0.00276074 0.0427835 0.0186387 -0.0127517 -0.0634806 0.00227572 -0.0829157 0.0291943 -0.109245 0.0619977 -0.082964 -0.0448557 0.231385 -0.148727 0.0147729 0.159258 -0.132988 0.00878881 0.173891 0.0382638 -0.122151 -0.198106 -0.0274084 0.0955795 0.0736816 -0.00505036 -0.0372201 0.117434 -0.0491017 0.0650006 -0.00818053 -0.0309616 
-0.0300994 0.108219 0.0693967 -0.120007 0.0773216 0.125001 0.0253634 -0.006999 -0.0167698 0.100427 0.088563 -0.0280289 0.0681037 -0.0279666 0.132467 0.027054 -0.0499872 0.0570305 -0.0935379 -0.00156752 0.11628 0.0333904 -0.0116087 0.087035 0.023372 0.0725123 -0.0369967 -0.1171 0.211255 0.00610727 0.112658 0.00434505 -0.061097 0.0282536 0.0556422 0.106738 -0.0594954 0.132044 0.0324057 0.0248957 0.0151323 -0.0170798 -0.120213 0.124856 -0.054685 0.0374984 0.0887177 0.0711626 -0.171278 -0.147331 -0.0618228 0.0427523 -0.138227 -0.10273 0.00602367 0.081924 -0.120675 0.220332 -0.0804214 -0.0529038 -0.125855 -0.0947673 0.198772 -0.0252861 0.117677 -0.0185454 0.00774345 0.0821128 -0.0426329 0.145998 0.0487884 0.119055 -0.0518692 -0.0316109 0.0260383 -0.0963053 -0.11445 0.160871 0.0399275 -0.0263395 -0.0250684 0.111811 -0.0256907 -0.0492572 -0.0832616 -0.11253 0.116885 0.0558362 0.0157575 0.0399973 0.0994414 -0.047151 -0.0578688 0.0215118 0.0209052 -0.0527765 -0.0172344 0.0118588 0.0164672 -0.00689282 -0.0590843 -0.0132209 -0.103555 0.0117446 -0.110766 0.102052 -0.0717733 -0.0171995 0.221728 -0.126325 0.0316198 0.148378 -0.151761 0.0348596 0.185461 0.0368618 -0.131099 -0.160383 -0.00743628 0.104417 0.0820795 0.000353946 -0.0255692 0.133029 -0.0475814 0.0683928 0.00652271 -0.0372943 
-0.0183554 0.109336 0.0553922 -0.115052 0.0607596 0.103097 0.0370679 -0.00368629 -0.00769378 0.103193 0.10304 -0.025501 0.0810306 -0.0245162 0.118571 0.0244738 -0.0466041 0.0526645 -0.0932227 0.00190889 0.124526 0.0276253 0.00168193 0.0924433 0.0206727 0.0692829 -0.011138 -0.125569 0.213968 0.0309746 0.0924267 0.00629353 -0.0344148 0.0268179 0.0481153 0.0714292 -0.0553697 0.171923 0.0201234 0.0218387 0.00032842 -0.0315046 -0.130696 0.142642 -0.0733209 0.0443575 0.0790532 0.0630345 -0.16094 -0.145688 -0.0375014 0.0698133 -0.13168 -0.0942681 0.0204863 0.0733203 -0.0997577 0.208473 -0.0782182 -0.0567792 -0.130202 -0.13803 0.199752 -0.011597 0.116403 -0.0395909 -0.00136776 0.0835274 -0.0443455 0.140077 0.0438396 0.10181 -0.0684006 -0.0427097 0.0315092 -0.0916634 -0.108744 0.157537 0.0359731 0.00229123 -0.0322603 0.0810389 -0.0166626 -0.0465974 -0.0737065 -0.123848 0.117795 0.0486341 0.0229274 0.0335913 0.0722091 -0.0617719 -0.0662969 0.0118319 0.00893235 -0.0694638 -0.0132861 0.0146464 0.0434299 -0.0225144 -0.0404904 0.00640255 -0.0846632 0.0353131 -0.110468 0.0736052 -0.074113 0.00205832 0.242157 -0.150725 0.030753 0.155189 -0.163995 0.0338018 0.188237 0.0538812 -0.124949 -0.161204 -0.000732912 0.124782 0.0749788 0.00237976 -0.0392935 0.132074 -0.029188 0.0671513 0.021618 -0.0240968 
-0.00894329 0.116158 0.0367837 -0.105381 0.0703824 0.10494 0.0325027 -0.0103619 -0.00489333 0.0985389 0.104861 -0.028323 0.0878744 -0.0346861 0.0970767 0.0552826 -0.0517089 0.0636265 -0.11914 0.00869377 0.145433 0.0253243 0.00278992 0.0974777 0.0189373 0.0675234 -0.0204664 -0.13106 0.214675 0.0429561 0.0869391 0.030294 -0.0401488 0.0352749 0.0422137 0.0663315 -0.0500531 0.172334 0.0198496 0.0144453 0.000465479 -0.026842 -0.105523 0.151339 -0.0619459 0.0292385 0.0998274 0.0688762 -0.165493 -0.14441 -0.028823 0.051679 -0.134139 -0.088816 0.0317059 0.0694605 -0.0921833 0.195229 -0.0511998 -0.0888894 -0.126972 -0.134742 0.19965 -0.00579437 0.0959357 -0.0350723 -0.00534203 0.0874832 -0.0256971 0.127958 0.0350047 0.100668 -0.0579176 -0.0436431 0.0274627 -0.0984578 -0.115733 0.166853 0.0210291 -0.000587374 -0.00225587 0.104848 -0.0245514 -0.0592379 -0.0750304 -0.0946003 0.109011 0.0492108 0.0249986 0.0356677 0.0764272 -0.0660713 -0.0927006 -0.00122683 0.00253583 -0.0536795 -0.0255036 0.0353569 0.0409646 -0.0276024 -0.0311026 -0.00668283 -0.063431 0.0503896 -0.119902 0.066346 -0.0929819 0.0185377 0.23632 -0.14233 0.0284766 0.169342 -0.1698 0.0315976 0.182922 0.0495111 -0.136025 -0.168971 -0.00891854 0.103765 0.079987 0.0249089 -0.015906 0.13333 -0.0510775 0.054904 0.0119242 -0.0267626 
-0.00376548 0.120983 0.0157263 -0.112899 0.0621629 0.0819509 0.0380787 -0.0101074 -0.00432931 0.0998705 0.106805 -0.0191379 0.0747291 -0.0314164 0.0795752 0.048845 -0.0569521 0.0508205 -0.0945718 0.0150463 0.132955 0.0392882 0.0152563 0.0743637 -0.00154452 0.0818229 0.016847 -0.138822 0.209304 0.0564446 0.0391635 0.010232 -0.011326 0.0288094 0.0483037 0.0496932 -0.0209314 0.210419 0.00711073 0.0244425 -0.0149749 -0.0239184 -0.107625 0.154394 -0.0879769 0.0702952 0.111985 0.0431418 -0.164169 -0.129194 -0.0199747 0.0741604 -0.144086 -0.0543626 0.0599167 0.0644513 -0.0639416 0.177637 -0.0675712 -0.0750717 -0.115589 -0.171895 0.211969 -0.00862823 0.120313 -0.0770657 -0.0129318 0.0887209 -0.0035873 0.137998 0.0416265 0.0898013 -0.0610161 -0.0399675 0.0393765 -0.0777549 -0.114544 0.187881 0.0164437 -0.0232705 -0.0159765 0.105709 -0.0235539 -0.0391267 -0.0718945 -0.099439 0.106618 0.0512585 0.0323843 0.0385306 0.0634855 -0.0842553 -0.093852 -0.0140707 0.00707663 -0.0763418 -0.00336527 0.0357898 0.0778099 -0.0325244 -0.0352334 0.0115276 -0.0542432 0.0555351 -0.121616 0.0425167 -0.0890977 0.0275763 0.216594 -0.149471 0.0307122 0.159004 -0.158697 0.0301828 0.174777 0.0590788 -0.119814 -0.19269 -0.0150211 0.0969849 0.079853 0.0370862 -0.00709354 0.134063 -0.0287953 0.05611 0.0244518 -0.0191459 
0.00698195 0.0928591 0.0199891 -0.113987 0.0818487 0.0752358 0.0338727 -0.00398155 0.0023981 0.0893125 0.0985687 0.000392746 0.0780648 -0.0206965 0.0741612 0.036574 -0.0366466 0.0651103 -0.0978526 0.0346287 0.140813 0.0464274 0.0164605 0.0962498 -0.00186185 0.0757714 0.0203042 -0.137999 0.193223 0.0609246 0.0401103 -0.00142407 -0.00187515 0.0338315 0.0480736 0.049063 -0.0276673 0.207968 -0.00643481 0.00752655 -0.0152996 -0.00525881 -0.109804 0.162897 -0.0991444 0.0606441 0.101658 0.0468935 -0.145974 -0.114378 -0.0154231 0.0592408 -0.140388 -0.0611388 0.0731324 0.0595494 -0.0751482 0.184534 -0.067356 -0.0778818 -0.110591 -0.176729 0.205015 -0.00342056 0.116718 -0.0981629 -0.0209145 0.100829 -0.00886676 0.137788 0.0557277 0.0876422 -0.0604158 -0.0595222 0.0179558 -0.0627703 -0.111603 0.188134 0.0271793 -0.0217557 -0.0218145 0.112993 -0.0174672 -0.0379099 -0.0599605 -0.118348 0.116917 0.066996 0.0424446 0.041823 0.0562106 -0.0824311 -0.092061 -0.0074238 0.00871776 -0.0764878 -0.00918029 0.0243936 0.063016 -0.0451212 -0.0245465 0.0169133 -0.0537912 0.0435853 -0.132217 0.0357773 -0.0985493 0.00188775 0.217798 -0.144997 0.0416048 0.15806 -0.160849 0.0426078 0.168824 0.0630767 -0.123117 -0.199382 -0.0340195 0.103108 0.0723546 0.0497269 -0.0179064 0.131573 -0.0300308 0.0539795 0.0287642 -0.0254901 
-0.014011 0.118168 0.0207795 -0.115782 0.0522482 0.0662897 0.0239348 -0.00871536 -0.0141087 0.118691 0.0997214 -0.0247021 0.0765345 -0.021751 0.0922535 0.059623 -0.0389605 0.0539969 -0.0717575 0.00982657 0.12062 0.0490759 0.0269396 0.0745113 -0.011165 0.0964164 0.0295122 -0.146888 0.20466 0.052258 0.035134 0.0110728 0.00511709 0.0237777 0.0510087 0.052687 -0.00769639 0.225284 0.00446414 0.0373851 -0.0316049 -0.0198384 -0.112532 0.147769 -0.0876484 0.0885376 0.117958 0.0360085 -0.159397 -0.135072 -0.000667447 0.0741949 -0.140902 -0.0516149 0.0565094 0.0685336 -0.0352674 0.161165 -0.050636 -0.0643912 -0.110554 -0.183527 0.186063 -0.010996 0.136255 -0.100728 -0.0144614 0.0919805 0.00824442 0.144898 0.0374704 0.0855043 -0.0681158 -0.0453567 0.0405822 -0.0738615 -0.120059 0.209472 0.0175601 -0.0337197 -0.0197458 0.104242 -0.0276454 -0.0333111 -0.0708435 -0.108722 0.106349 0.0466129 0.0249604 0.0315664 0.0389058 -0.0662989 -0.0816332 -0.0199139 0.0119522 -0.0665258 0.00607509 0.0459346 0.0820512 -0.0325213 -0.0389008 0.0185853 -0.0556338 0.0593687 -0.108247 0.0178201 -0.0926089 0.00898804 0.220855 -0.148557 0.0131065 0.156141 -0.149203 0.0181751 0.169203 0.0610675 -0.114392 -0.213015 -0.033304 0.0929196 0.0826992 0.0426755 -0.0086684 0.131997 -0.0283275 0.0535886 0.0174273 -0.0131035 
0.00397774 0.116546 0.00311735 -0.107186 0.0650704 0.0613954 0.0207735 -0.0168591 -0.0174193 0.110605 0.106248 -0.00808387 0.084774 -0.00628498 0.0621651 0.0671356 -0.0146906 0.0716195 -0.0804624 0.0298656 0.139226 0.0440138 0.0251684 0.0871089 -0.00677054 0.0890796 0.0353602 -0.133055 0.203836 0.0805762 0.0170921 0.0257028 0.0100674 0.0277318 0.0382339 0.0419167 -0.0140062 0.223575 0.00587726 0.0237032 -0.0446083 -0.0095139 -0.0939847 0.150494 -0.0877742 0.0750104 0.122003 0.0325746 -0.155022 -0.124853 0.0197277 0.0802191 -0.146422 -0.0472101 0.0685592 0.0628686 -0.0369271 0.163092 -0.0449676 -0.0734802 -0.103777 -0.19068 0.191644 -0.0114214 0.122322 -0.10769 -0.0277764 0.0969473 -0.0018841 0.143848 0.0437231 0.0797269 -0.0677717 -0.0576956 0.0275571 -0.0652748 -0.100895 0.205503 0.00980672 -0.0356955 -0.017181 0.114945 -0.0202068 -0.0358619 -0.0656259 -0.106277 0.099188 0.0485078 0.0386575 0.036521 0.0264355 -0.079906 -0.0955833 -0.00981649 0.0211416 -0.0690482 8.19516e-05 0.0509617 0.0753782 -0.0439631 -0.027897 0.028271 -0.046491 0.0784866 -0.120641 0.0216741 -0.0985891 0.0107202 0.220054 -0.1598 0.0140944 0.154298 -0.15313 0.0409111 0.163029 0.0565534 -0.113951 -0.210583 -0.0360904 0.0967712 0.069025 0.0512157 -0.00677619 0.120769 -0.0281508 0.0560866 0.0256271 -0.0212715 
-0.0176658 0.14647 0.0443394 -0.130576 0.0619269 0.0793569 0.047453 -0.0272928 -0.0206809 0.125059 0.101974 -0.0354886 0.0904295 -0.00622473 0.117188 0.0292782 -0.0220468 0.0564463 -0.0833317 0.000721974 0.104867 0.0460332 -0.0140131 0.0763528 -0.00193461 0.0669042 -0.0151413 -0.101105 0.239753 0.0679639 0.0494535 0.0133166 -0.0219022 0.0143981 0.068158 0.0671741 -0.0264394 0.170851 0.0284585 0.0182357 -0.0308245 -0.0321153 -0.114879 0.12907 -0.0668645 0.117788 0.0844785 0.0728106 -0.185114 -0.160719 -0.0335823 0.101089 -0.136039 -0.0916742 0.0162945 0.0708428 -0.102089 0.193652 -0.0959935 -0.0216454 -0.112731 -0.135494 0.191283 -0.0133745 0.123114 -0.0560568 -0.0131593 0.090325 -0.050665 0.123076 0.0530938 0.0740754 -0.0779755 -0.0609297 0.033442 -0.0584091 -0.0979868 0.169838 0.0485944 -0.0285547 -0.0118353 0.0802556 -0.0381855 -0.0269669 -0.0662732 -0.119402 0.089872 0.0222581 0.0151411 0.0657915 0.066058 -0.0699686 -0.0639103 0.0292369 0.00451327 -0.0714097 -0.00453801 0.00420301 0.0680993 -0.0254007 -0.0228956 0.0305806 -0.0901724 0.0360692 -0.11983 0.0714239 -0.0666886 0.014781 0.2399 -0.137169 0.0409362 0.122151 -0.164499 0.0381328 0.165113 0.0576359 -0.134723 -0.159545 -0.0168517 0.118849 0.0605612 -0.00760763 -0.0420475 0.141662 -0.0184226 0.075063 0.00662829 -0.0557622 
-0.0152356 0.141755 0.0234216 -0.131832 0.0685273 0.0922504 0.0298966 -0.0176878 -0.0320489 0.13805 0.0961888 -0.0374819 0.0999405 -0.0114606 0.102085 0.0547363 0.00122579 0.0745663 -0.0815393 -0.00495617 0.126428 0.0259236 -0.00149453 0.0754804 0.0123514 0.0732208 -0.00747442 -0.113246 0.240198 0.0637906 0.0690688 0.0286226 -0.0275129 0.00758252 0.0568723 0.0515036 -0.0400986 0.170364 0.0463308 0.0106986 -0.042415 -0.0269355 -0.106208 0.136931 -0.0527325 0.0788771 0.090142 0.0724571 -0.190594 -0.174381 -0.0176146 0.0794208 -0.12888 -0.105769 -0.0118335 0.0741118 -0.0830073 0.197762 -0.0691112 -0.0547414 -0.106676 -0.134057 0.189971 -0.0217061 0.12142 -0.0462544 -0.0246221 0.100412 -0.0476423 0.112634 0.0409862 0.0831216 -0.0805651 -0.0799481 0.013659 -0.0743498 -0.0939584 0.169016 0.0389256 -0.0222923 -0.024855 0.0853239 -0.0356464 -0.0344641 -0.0691435 -0.120688 0.0885362 0.0270329 0.0306045 0.0399058 0.044754 -0.0556138 -0.0771826 0.0350625 0.0270465 -0.0588412 -0.00307763 0.0333895 0.0298547 -0.0223402 -0.0217284 0.0137787 -0.0884686 0.058517 -0.118931 0.0656038 -0.070156 0.00264899 0.244035 -0.148429 0.0285497 0.13315 -0.155503 0.0462486 0.171736 0.0450747 -0.159555 -0.157078 -0.0185504 0.107812 0.0487503 -0.00412662 -0.0378539 0.120505 -0.0279788 0.0666137 -0.0134126 -0.0608153 
0.0101522 0.130951 0.0125687 -0.124985 0.0674822 0.118049 0.0349854 -0.00779849 -0.00919028 0.108959 0.101915 -0.0229222 0.0799858 -0.0682468 0.0732414 0.0375599 -0.0471246 0.07425 -0.111164 0.00312674 0.128928 0.0384155 0.00694111 0.102479 0.00479627 0.0482256 0.0309317 -0.131636 0.208484 0.0602136 0.0622259 -0.00682354 -0.0327483 0.0374544 0.0636725 0.037107 -0.0475182 0.144269 0.00739273 -0.000440859 -0.0341166 -0.0655163 -0.108094 0.187568 -0.0669778 0.0632482 0.0884244 0.0948899 -0.194961 -0.110195 -0.00301738 0.0688221 -0.125747 -0.10643 0.0100689 0.0666297 -0.0996222 0.186726 -0.0609417 -0.0751364 -0.110065 -0.143601 0.221165 -0.00849017 0.107194 -0.0921869 -0.0344186 0.0784504 -0.0568691 0.144213 0.0150436 0.0642912 -0.0817911 -0.0812221 -0.00668839 -0.0911747 -0.0890842 0.173965 0.0295608 0.0112379 -0.0101162 0.0667023 -0.0403427 -0.0493566 -0.0712012 -0.120537 0.0841759 0.0242282 0.0375564 0.0834021 0.0691888 -0.0766306 -0.110916 0.0202368 0.0140713 -0.0362622 -0.0186224 0.0223823 0.0480483 -0.0436707 0.00896627 0.0283245 -0.0841727 0.0394554 -0.108678 0.0349986 -0.082651 0.0144594 0.210455 -0.134763 0.0570466 0.167297 -0.143524 0.0411936 0.169734 0.0589294 -0.139615 -0.148544 0.000358404 0.125684 0.069209 -0.00294204 -0.0219597 0.130017 -0.0185794 0.0461936 0.0215183 -0.0621994 
0.0161398 0.128723 0.0152528 -0.125925 0.0683436 0.127563 0.0358455 0.000629503 0.000864414 0.0908763 0.104548 -0.0274045 0.0764976 -0.075264 0.0744314 0.026962 -0.0476377 0.0630441 -0.115997 -0.00365214 0.136195 0.0443873 -0.0104475 0.100197 0.0148028 0.0402834 0.0305984 -0.124784 0.205851 0.059988 0.0745512 -0.0197732 -0.038389 0.0409793 0.0702437 0.0384434 -0.0476201 0.12322 0.00974794 -0.0110331 -0.0218728 -0.0694505 -0.103606 0.19647 -0.0584222 0.0598391 0.0778921 0.0978831 -0.194646 -0.113387 -0.0153236 0.0702925 -0.117356 -0.110976 0.008351 0.0652232 -0.123642 0.186701 -0.0709695 -0.081137 -0.112881 -0.141133 0.222979 -0.00623144 0.0958315 -0.0858075 -0.0274329 0.0744823 -0.0572177 0.136143 0.0180453 0.0559018 -0.0840069 -0.0994185 -0.00826956 -0.0886603 -0.0874851 0.165073 0.0300312 0.03065 -0.00817556 0.0617959 -0.0305251 -0.0476819 -0.0663916 -0.118495 0.0874872 0.0220405 0.0351747 0.0911141 0.0799426 -0.0840796 -0.121161 0.0282669 0.00486993 -0.0365142 -0.0185658 0.00775226 0.03847 -0.0458652 0.0122407 0.0317911 -0.0857046 0.028145 -0.115502 0.0430468 -0.0784438 0.0183257 0.200854 -0.132125 0.0689384 0.151951 -0.157348 0.0429568 0.173448 0.05773 -0.146596 -0.140439 0.00706496 0.126929 0.0693789 -0.00779108 -0.0226952 0.132862 -0.00504808 0.0422657 0.0345205 -0.0645251 
0.0470555 0.0758853 0.0122339 -0.105495 0.0648848 0.115922 0.0311877 0.0373945 0.00317098 0.0674378 0.104609 0.0308127 0.089494 -0.110058 0.0133322 0.0131288 -0.0660066 0.0615771 -0.164203 0.0598178 0.152309 0.0310948 0.0143728 0.145143 -0.0193574 0.0467203 0.050291 -0.148498 0.154647 0.0387829 0.0263948 -0.0234395 -0.0349243 0.0776312 0.018604 -0.0113052 -0.0672586 0.178349 -0.0319688 -0.00858915 -0.00805714 -0.0733013 -0.136005 0.189856 -0.0814461 0.00596463 0.0685926 0.0826618 -0.173051 -0.0407242 0.0269669 0.0507233 -0.129993 -0.0721479 0.0467871 0.0261332 -0.0888715 0.160434 -0.0531042 -0.120007 -0.0874243 -0.155589 0.215524 0.0233517 0.056786 -0.130788 -0.0234816 0.0971117 -0.0342963 0.118602 0.00590822 0.0443252 -0.0626952 -0.0614358 -0.00550413 -0.0824022 -0.0927419 0.159869 0.0417989 0.0771385 -0.0241178 0.0544054 0.00320482 -0.058954 -0.0543717 -0.115491 0.126444 0.0599131 0.0606182 0.067634 0.0564512 -0.107009 -0.110881 0.0359533 -0.0431781 -0.0571421 -0.0176101 -0.0104708 0.0420285 -0.0837102 0.0459635 0.0321411 -0.0784502 0.0715374 -0.0975197 -0.0014495 -0.106641 0.0407553 0.167767 -0.146623 0.0754043 0.20414 -0.146176 0.0545448 0.151567 0.0686697 -0.168906 -0.147269 -0.0104377 0.125695 0.0485523 0.0365544 -0.0267215 0.114336 -0.00453359 0.0377557 0.0323625 -0.0567797 
0.019364 0.082629 0.00889739 -0.106021 0.0521046 0.108999 0.005564 0.032142 0.00851838 0.0658567 0.11371 0.0159077 0.0805271 -0.0984843 0.0178817 0.0244618 -0.0749063 0.0704364 -0.127697 0.0537409 0.159013 0.0250783 0.0343483 0.129262 -0.0142048 0.0619269 0.0669713 -0.160292 0.167254 0.0341602 0.0401587 -0.0370379 0.000441019 0.0609193 0.032129 0.011117 -0.0484579 0.193076 -0.0314481 -0.00562916 -0.00974087 -0.06773 -0.127204 0.197753 -0.0988977 -0.00242105 0.0940043 0.062314 -0.168277 -0.0553579 0.00353233 0.0513214 -0.125178 -0.0549538 0.0577432 0.0447943 -0.0602594 0.14629 -0.05581 -0.132666 -0.105218 -0.174106 0.226856 0.0165581 0.0813809 -0.121232 -0.0228115 0.0775833 -0.0173968 0.137089 0.00337766 0.0437002 -0.0712829 -0.0648452 0.0181609 -0.0940651 -0.107422 0.185216 0.0291183 0.0506355 -0.0424206 0.0732793 0.00289008 -0.0505406 -0.0589523 -0.0949546 0.116546 0.0720889 0.0623512 0.0567651 0.0621 -0.102616 -0.110382 0.0107924 -0.0189918 -0.0747893 -0.0266406 0.0340276 0.04217 -0.0779671 0.0230281 0.0221667 -0.064016 0.056341 -0.0809192 0.0133929 -0.0847239 0.0276518 0.18167 -0.156213 0.0387662 0.190254 -0.139496 0.0413517 0.162517 0.0666513 -0.139122 -0.179284 0.00434373 0.120842 0.0671183 0.0290736 -0.0230128 0.108551 -0.0187446 0.0465032 0.0506129 -0.0163911 
0.0331766 0.0739526 0.0131762 -0.106109 0.0685251 0.0996343 0.0224568 0.0403391 -0.00596091 0.0805356 0.104824 0.0297887 0.0897869 -0.081962 0.0232453 0.0241434 -0.0491412 0.0748479 -0.151309 0.0579265 0.151842 0.0168657 0.0367955 0.143742 -0.0130309 0.0501484 0.0536475 -0.14528 0.161493 0.0304329 0.0280728 -0.0185389 -0.0186828 0.0715015 0.00102402 -0.00485785 -0.0756469 0.196974 -0.0437834 0.003793 -0.0168446 -0.0506693 -0.134829 0.185167 -0.093375 -0.000437636 0.0763906 0.0663292 -0.165329 -0.0438411 0.0287602 0.0430561 -0.146395 -0.0715829 0.0429374 0.0377486 -0.0675617 0.170985 -0.0331662 -0.117878 -0.0928498 -0.160419 0.206407 0.0209363 0.068524 -0.122984 -0.034454 0.0991305 -0.0322859 0.138474 0.0131686 0.0618208 -0.0556428 -0.0518961 -4.57621e-05 -0.0865315 -0.0936732 0.168583 0.0330285 0.041268 -0.0431979 0.063842 0.000989421 -0.0613554 -0.0618797 -0.116518 0.127838 0.064833 0.0654824 0.0462334 0.0439095 -0.0953084 -0.102814 0.0113443 -0.0105692 -0.0578404 -0.020693 0.0168617 0.0365052 -0.0757605 0.0186188 0.0214197 -0.0644383 0.0786115 -0.0993546 0.00116879 -0.114913 0.0255125 0.188271 -0.169858 0.0576131 0.21392 -0.134556 0.0553786 0.159516 0.0617507 -0.14699 -0.164443 -0.0072072 0.129987 0.047675 0.0434891 -0.0352573 0.113364 -0.0239485 0.038392 0.0256961 -0.0419556 
-0.010104 0.126295 0.0368535 -0.125227 0.0385299 0.106263 0.0164376 0.0408155 -0.0158171 0.125802 0.114854 -0.0345963 0.0858011 -0.0733185 0.0847656 0.0341372 -0.0350194 0.0699164 -0.0961453 0.000227987 0.132793 0.0224906 0.01341 0.119673 0.0103676 0.0553913 0.0520596 -0.1256 0.2264 0.0217166 0.0737033 -0.0309554 -0.0115399 0.0405616 0.0372891 0.0249329 -0.0449076 0.166988 -0.000399781 0.0161805 -0.0179134 -0.070707 -0.120665 0.178743 -0.0705356 0.0163271 0.0866678 0.0747824 -0.186089 -0.121056 -0.000902728 0.0698043 -0.131623 -0.0970163 -0.00272721 0.0758029 -0.0777299 0.167763 -0.048476 -0.0993355 -0.124542 -0.162089 0.197455 0.000297539 0.0971752 -0.0669589 -0.0205022 0.0590198 -0.0452187 0.12988 -0.00453079 0.0583154 -0.0838341 -0.0650852 0.032336 -0.111095 -0.0934635 0.195516 0.0403227 0.0172137 -0.0440133 0.0555417 -0.00727193 -0.0449759 -0.0567269 -0.11321 0.102382 0.04557 0.0519196 0.0512944 0.0531633 -0.0643599 -0.0963421 0.0166636 0.0166315 -0.0594471 -0.0171278 0.0377799 0.0258472 -0.0475679 -0.00825766 0.0179169 -0.0746977 0.0533999 -0.0849071 0.0370284 -0.0702161 0.00333123 0.228664 -0.172661 0.0316454 0.175999 -0.137412 0.0386602 0.176537 0.0470545 -0.133093 -0.165363 0.00969048 0.121993 0.0651038 -0.0104138 -0.045295 0.117289 -0.0254925 0.05156 0.0198095 -0.0336962 
-0.0062882 0.125744 0.0323332 -0.125786 0.0453719 0.0949641 0.0361659 0.0223622 -0.0285772 0.133118 0.103862 -0.0322712 0.0947346 -0.0402662 0.0956823 0.0428372 -0.0236721 0.0663511 -0.089998 1.43089e-05 0.127305 0.0193599 0.0172742 0.105263 0.0049847 0.0632764 0.0266191 -0.126031 0.231514 0.0398568 0.0592906 0.00225636 -0.0161672 0.0330631 0.0373763 0.0270646 -0.0443233 0.193748 0.00887584 0.0140215 -0.0331029 -0.0537251 -0.119501 0.151979 -0.0694706 0.0442402 0.0856648 0.0685087 -0.188628 -0.134524 -0.00137561 0.0757284 -0.12672 -0.0926922 0.00667206 0.0726302 -0.0667924 0.187263 -0.0555094 -0.079292 -0.120483 -0.153682 0.196732 -0.0140708 0.112564 -0.0494579 -0.0287956 0.0786161 -0.053581 0.124017 0.00844109 0.0710714 -0.0882974 -0.0524826 0.0303427 -0.0959031 -0.0843704 0.174277 0.0448777 -0.000784716 -0.0395314 0.0542874 -0.0200958 -0.0515435 -0.0636409 -0.126082 0.0974633 0.0368676 0.0466479 0.0451718 0.0507021 -0.063923 -0.0824302 0.0185449 0.0202349 -0.0537612 -0.00410188 0.0398982 0.0452535 -0.0348536 -0.00998581 0.0178194 -0.0788797 0.0640871 -0.102641 0.0414878 -0.0776653 0.00412434 0.241115 -0.175416 0.0308696 0.174906 -0.141693 0.0324781 0.184447 0.0564517 -0.130274 -0.161047 0.00275193 0.127899 0.0583111 -0.00856639 -0.038299 0.11931 -0.0283757 0.0627865 0.0105235 -0.0442328 
0.0270524 0.0828775 0.0188095 -0.108885 0.0653206 0.0947448 0.0439351 0.0198804 -0.0135827 0.106876 0.107399 0.0268315 0.09775 -0.0577159 0.0505783 0.0232049 -0.0471285 0.0606907 -0.131233 0.0473655 0.130288 0.0232038 0.0134307 0.136593 -0.014538 0.076964 0.0403792 -0.137662 0.180064 0.0432495 0.0177726 0.00492043 -0.0280795 0.0589161 0.00728404 0.00845799 -0.0604604 0.2049 -0.0149041 0.0123376 -0.00786889 -0.0508561 -0.131795 0.163264 -0.0962249 0.0170505 0.0807853 0.062558 -0.164557 -0.0841694 0.0279196 0.0530934 -0.145897 -0.0658297 0.0583861 0.0468406 -0.0799059 0.191727 -0.0520136 -0.0918553 -0.102678 -0.166983 0.21136 0.00919415 0.0862452 -0.0874816 -0.0241196 0.103671 -0.0339497 0.122247 0.0197713 0.0777427 -0.0595159 -0.0361454 0.0204739 -0.0768902 -0.091574 0.168107 0.0420439 0.0202277 -0.0291018 0.069916 0.00328687 -0.0586744 -0.0647217 -0.126903 0.137308 0.0628976 0.0584768 0.042906 0.0429971 -0.0963434 -0.0829805 0.0214631 -0.024015 -0.0675974 -0.00685739 0.000666859 0.0654588 -0.0618771 0.00715651 0.0230766 -0.069478 0.078315 -0.110794 0.0210281 -0.113899 0.0248278 0.194335 -0.168109 0.0586254 0.206698 -0.14143 0.049932 0.163596 0.0593305 -0.148499 -0.163353 -0.0193797 0.117892 0.0596807 0.0282499 -0.0255713 0.11467 -0.0231859 0.0594066 0.0108656 -0.0414914 
0.00948391 0.114245 0.0207642 -0.11576 0.0516392 0.0994044 0.0408954 0.0101213 -0.0125471 0.110659 0.1162 -0.00750976 0.0865457 -0.0468895 0.0670889 0.023805 -0.0504707 0.0695897 -0.104277 0.0198979 0.129295 0.0308817 0.0117811 0.112175 -0.0106161 0.065811 0.0361478 -0.131305 0.209588 0.0510372 0.0317935 -0.00965722 -0.0143312 0.0368487 0.0354791 0.0299912 -0.0472896 0.191188 -0.00958925 0.0164554 -0.0211435 -0.0501798 -0.129103 0.170234 -0.0955512 0.0414358 0.0923504 0.0579015 -0.179615 -0.109349 -1.80838e-05 0.0777594 -0.141272 -0.0694597 0.0407326 0.066427 -0.0765553 0.187585 -0.0642287 -0.0798071 -0.116918 -0.162536 0.223001 -0.00303513 0.104886 -0.0787268 -0.0175871 0.0791092 -0.03983 0.140674 0.0252153 0.0687943 -0.0693081 -0.0463266 0.0261488 -0.0848621 -0.0969164 0.175766 0.0333751 -0.00593261 -0.0302506 0.0736154 -0.0164899 -0.0517681 -0.0658395 -0.111907 0.110083 0.043134 0.0456261 0.0556733 0.0604304 -0.0919759 -0.0889834 0.00867799 0.00207029 -0.071636 -0.0102126 0.0218269 0.0673788 -0.0416617 -0.00555282 0.0309577 -0.0679157 0.0553199 -0.110533 0.0430533 -0.0867626 0.0171151 0.213687 -0.166411 0.0469818 0.176742 -0.141053 0.0348593 0.171972 0.0627434 -0.124142 -0.172607 0.000477271 0.117858 0.0666293 0.00192492 -0.0284746 0.12183 -0.0182957 0.0646591 0.0271903 -0.031593 
0.00553601 0.0885739 0.00529371 -0.106209 0.0756343 0.076963 0.0442882 -0.00800921 0.00150164 0.108723 0.107197 0.0107895 0.0847983 -0.0241882 0.0632247 0.0185514 -0.0399084 0.0788521 -0.0858922 0.0431045 0.128772 0.0254643 0.0273675 0.108033 -0.0121827 0.0651403 0.0242323 -0.146592 0.196018 0.0660064 0.032291 -0.0126855 0.00296524 0.0191024 0.0465626 0.0468656 -0.0434659 0.207353 -0.0212152 0.00672726 -0.0260078 -0.0144612 -0.138235 0.169011 -0.122402 0.0530141 0.0931956 0.0522821 -0.139061 -0.107309 -0.0140871 0.069798 -0.140461 -0.0680112 0.0622051 0.0646579 -0.0672951 0.192061 -0.0709751 -0.0606581 -0.113542 -0.174662 0.223248 -0.00928416 0.126652 -0.107796 -0.0211176 0.0894752 -0.0257077 0.143982 0.0537303 0.0905406 -0.0629175 -0.0543243 0.00949646 -0.061185 -0.103613 0.187199 0.0319798 -0.0277195 -0.0413461 0.0917151 -0.026042 -0.0376858 -0.0598189 -0.118815 0.113296 0.059166 0.0470484 0.0340954 0.0529837 -0.0817657 -0.0745073 -0.0104576 0.0121781 -0.0959787 -0.0133567 0.0213118 0.0749325 -0.0397802 -0.00995109 0.0242481 -0.0552401 0.0329155 -0.116935 0.0416414 -0.0834543 -0.00391918 0.223704 -0.140145 0.0370526 0.161694 -0.134975 0.03583 0.161604 0.0745438 -0.111714 -0.187815 -0.0229436 0.117256 0.0577297 0.0211641 -0.0385423 0.127143 -0.0338222 0.0712437 0.0184411 -0.0171758 
0.00298618 0.0809636 -0.0106455 -0.116825 0.0749778 0.0662173 0.0307637 -0.000896536 -0.0184549 0.119059 0.0933806 0.00454747 0.0959394 -0.0221501 0.0641004 0.0364763 -0.0385117 0.0731454 -0.0722103 0.0513269 0.130251 0.00895664 0.0495256 0.0981832 -0.0104261 0.0809519 0.0376962 -0.164322 0.18355 0.0620666 0.0189278 -0.0134349 0.0176597 0.0168188 0.0404722 0.0364307 -0.0402905 0.217444 -0.0238251 -0.00936588 -0.0352972 -0.0254232 -0.118679 0.180421 -0.125406 0.0683655 0.106502 0.0506314 -0.15578 -0.106995 -0.00549588 0.0404509 -0.129931 -0.0652635 0.0675046 0.0595158 -0.0514741 0.181028 -0.0505333 -0.0787011 -0.0940055 -0.173724 0.214292 0.00297618 0.131384 -0.10292 -0.0466959 0.11049 -0.00816957 0.126365 0.0373353 0.0841129 -0.0734536 -0.0834514 0.0129468 -0.0511046 -0.10586 0.191299 0.0400417 -0.0229225 -0.0454237 0.0784191 -0.0353934 -0.0379896 -0.070857 -0.114443 0.109654 0.0623556 0.0560565 0.0314857 0.0411851 -0.0752125 -0.083629 -0.0153006 0.00187984 -0.0801923 -0.0126561 0.0445777 0.0791137 -0.0553022 -0.00303333 0.0141658 -0.0446578 0.0318183 -0.118001 0.0248152 -0.103426 0.0114607 0.212118 -0.14933 0.0367233 0.167552 -0.128592 0.0200758 0.159644 0.0724403 -0.127529 -0.194227 -0.0309567 0.11693 0.0560981 0.0271336 -0.0329794 0.125208 -0.0391492 0.0641788 0.0103252 -0.0168436 
0.00635078 0.0708436 0.00429767 -0.110347 0.0633796 0.0638996 0.0256293 -0.0032086 -0.0377747 0.122029 0.0980579 0.00774138 0.0897852 -0.0192243 0.0684184 0.0330311 -0.0320559 0.0800731 -0.0515556 0.0557526 0.124758 0.0213367 0.0473953 0.111053 -0.018799 0.0963226 0.0434713 -0.170358 0.187137 0.0596389 0.00783354 -0.0186703 0.0115787 0.0134303 0.0440732 0.0386118 -0.0427771 0.22097 -0.0184923 0.00269947 -0.0475105 -0.0194961 -0.135933 0.173157 -0.12438 0.06951 0.113222 0.0425224 -0.155939 -0.10469 0.00972355 0.0451785 -0.131285 -0.0593394 0.0673931 0.0571227 -0.0366578 0.185682 -0.0459759 -0.066596 -0.085349 -0.173475 0.213375 0.00158752 0.137847 -0.117197 -0.0323642 0.0935935 -0.00467542 0.134641 0.0349417 0.08648 -0.0676967 -0.0637285 0.00899591 -0.0676211 -0.105087 0.199982 0.0457455 -0.0246638 -0.0423312 0.0827274 -0.0372271 -0.0488099 -0.0634957 -0.129521 0.109848 0.0584708 0.0505807 0.0260825 0.0401774 -0.0611581 -0.0702049 -0.00989306 0.00439405 -0.0807197 0.000167375 0.0428152 0.0837254 -0.0507857 -0.0100456 0.0280054 -0.0521143 0.0331681 -0.110831 0.0227585 -0.0895307 -0.00533896 0.214918 -0.148668 0.0345381 0.171364 -0.118449 0.0147423 0.155488 0.0744577 -0.117414 -0.205512 -0.0442643 0.1051 0.0475885 0.0229613 -0.0316643 0.114347 -0.0379365 0.0743803 0.0118867 -0.0182751 
-0.00444722 0.0591053 -0.0176718 -0.131482 0.0539549 0.0560994 -0.00514695 -0.00976739 -0.019148 0.0994439 0.080531 0.01275 0.0723755 -0.00557645 0.057151 0.0608645 -0.0534963 0.0475215 -0.0448986 0.0589644 0.100939 0.049675 0.0746772 0.0624014 -0.0565414 0.142944 0.0712965 -0.182829 0.144991 0.0325722 -0.00290169 -0.00769797 0.0255029 0.020383 0.0432022 0.0577067 -0.000422802 0.269823 -0.0129886 0.0421447 -0.0574867 0.00352708 -0.134642 0.146121 -0.115303 0.0822737 0.127057 0.0225814 -0.140924 -0.067988 -0.00854674 0.0242008 -0.136301 -0.00653649 0.0857216 0.0517172 0.00475187 0.168237 -0.0506997 -0.0684809 -0.0850779 -0.180763 0.217718 -0.0196456 0.15314 -0.140239 -0.0252285 0.119438 0.0405747 0.147612 0.0345317 0.0881037 -0.0584475 -0.0303855 0.025895 -0.0687821 -0.118244 0.203076 0.0240369 -0.0596963 -0.0295165 0.11317 -0.0445212 -0.0434005 -0.0892515 -0.115066 0.108795 0.0709061 0.0545444 0.0120928 0.041369 -0.0695776 -0.0565861 -0.0257918 0.0346246 -0.0595539 0.00531224 0.0634937 0.0931387 -0.0349963 -0.0409075 -0.0010118 -0.0677758 0.045669 -0.0950868 0.00149671 -0.110667 -0.026301 0.165012 -0.135731 0.0112842 0.175668 -0.0962962 0.0205704 0.145921 0.0737506 -0.0967185 -0.229784 -0.0530824 0.073497 0.0755215 0.0617215 0.0238252 0.116519 -0.0417732 0.0486741 0.00334459 -0.000375213 
0.00612662 0.0784618 -0.0154615 -0.112331 0.0478913 0.0653867 0.0132275 -0.00485526 -0.0257171 0.130292 0.0873762 0.0146419 0.0671131 -0.0408858 0.0584856 0.0592262 -0.0576165 0.0504467 -0.0422911 0.0531394 0.0929959 0.0352711 0.08694 0.0814625 -0.0494463 0.117735 0.0814468 -0.18501 0.15898 0.0388502 -0.0223867 -0.0102579 0.0280238 0.0314858 0.0387241 0.0290442 0.00333049 0.263138 -0.017216 0.0289327 -0.058551 -0.0330209 -0.133511 0.12922 -0.130304 0.0845426 0.119275 0.0322174 -0.151064 -0.0503734 0.026318 0.0602735 -0.136763 -0.00825744 0.0925883 0.0476943 0.0287947 0.140584 -0.0554773 -0.0584835 -0.0882402 -0.189209 0.213853 -0.0291758 0.157992 -0.14048 -0.0435758 0.107921 0.0121785 0.165923 0.00726423 0.0863334 -0.0832075 -0.0181735 0.0374617 -0.0660868 -0.0946906 0.213017 0.0322225 -0.0470296 -0.0422332 0.0809309 -0.0314082 -0.03525 -0.0724856 -0.118249 0.0956857 0.0708105 0.0615365 0.0369485 0.0377015 -0.0699274 -0.0629174 -0.0114546 0.0173342 -0.0715189 0.00825664 0.0628642 0.111601 -0.0454799 -0.00224653 0.0150022 -0.0683971 0.0512402 -0.0679178 -0.0140428 -0.0919645 -0.012148 0.179745 -0.13856 0.00555629 0.197149 -0.0717737 0.0112714 0.161219 0.075428 -0.087526 -0.210407 -0.0363611 0.105358 0.0810652 0.0400164 0.0191803 0.111029 -0.0277159 0.0656414 0.0286778 -0.00178822 
0.0186777 0.0846508 0.000694227 -0.119124 0.0720861 0.0780926 0.0168158 -0.0177755 -0.0154437 0.0845246 0.0899653 0.0176678 0.0732584 -0.0360737 0.0527242 0.0366401 -0.0596994 0.0487456 -0.0883221 0.0522222 0.120596 0.0535625 0.0449586 0.121051 -0.0138281 0.0837382 0.064829 -0.156077 0.167384 0.0617495 0.0105243 -0.030268 -0.00564487 0.0370606 0.0357409 0.0396308 -0.0379359 0.205461 -0.0201088 0.029833 -0.0394984 -0.0241333 -0.122167 0.178441 -0.107536 0.0833668 0.116377 0.0549568 -0.15338 -0.0641014 0.0207082 0.0554194 -0.136401 -0.0549142 0.0801486 0.0458928 -0.0498498 0.191055 -0.0500804 -0.069735 -0.0917372 -0.165357 0.21881 0.00822921 0.113103 -0.145847 -0.0302586 0.106257 -0.00216779 0.1579 0.03867 0.086507 -0.0643307 -0.0546572 0.0242261 -0.0586617 -0.112194 0.195143 0.0297677 0.00887681 -0.0089408 0.093301 -0.0202405 -0.0429298 -0.0739664 -0.123639 0.109473 0.0543756 0.0315108 0.0472116 0.0455612 -0.0828061 -0.0842058 -0.00321156 -0.00491951 -0.0673687 -0.00827073 0.0272069 0.0932218 -0.0650678 -0.00806906 0.0299068 -0.0607833 0.0496062 -0.124536 0.00531274 -0.117902 0.0139477 0.184814 -0.140219 0.0642696 0.187254 -0.127905 0.0416927 0.139821 0.0827051 -0.128763 -0.186577 -0.0461344 0.119843 0.0668109 0.0474796 -0.0198278 0.116685 -0.0384096 0.0601644 0.0160848 -0.0252626 
0.00253401 0.101757 0.00574039 -0.0951576 0.0657126 0.106257 0.0339948 -0.0101101 0.0181371 0.108929 0.10165 -0.0204671 0.0539378 -0.0986995 0.0731072 0.0519494 -0.0447977 0.0778793 -0.0797374 0.0042264 0.133108 0.0373651 0.0239655 0.0941593 0.00359238 0.0737256 0.0331224 -0.182443 0.200374 0.0399061 0.0907854 0.00565908 -0.022103 0.0289414 0.092965 0.0380916 -0.0115716 0.174189 0.02654 -0.0101673 -0.0185663 -0.0495494 -0.130032 0.179557 -0.0779068 0.0405366 0.0899097 0.0795508 -0.148074 -0.123706 -0.0140148 0.0680534 -0.109959 -0.0925812 0.0213842 0.0598767 -0.0488287 0.1511 -0.0685811 -0.0777579 -0.112102 -0.181271 0.214191 -0.0266918 0.132315 -0.123669 -0.0139717 0.0603981 -0.0147055 0.14991 0.0012054 0.0773477 -0.0902617 -0.0656424 -0.0147364 -0.121167 -0.106406 0.215839 0.0158214 0.0158231 -0.031826 0.0965726 -0.0339031 -0.0465143 -0.0429009 -0.131771 0.091259 0.0539773 0.0309172 0.0397207 0.0725196 -0.0459115 -0.106464 -0.00335405 0.0231376 -0.0583194 -0.00305792 0.0352549 0.0385394 -0.0361617 0.000157008 0.00805711 -0.0802382 0.0412331 -0.0628669 0.0054935 -0.0423887 -0.0100846 0.226321 -0.0989747 0.00711242 0.164191 -0.136581 0.0242964 0.183792 0.0535796 -0.126033 -0.195864 -0.0127439 0.104082 0.0796968 0.0325101 -0.00480603 0.130928 -0.0206959 0.0335178 0.0271597 -0.0339927 
-0.0133629 0.11177 0.045164 -0.0745756 0.0878856 0.127536 0.0376853 0.00386465 0.0153477 0.0949174 0.0850402 -0.0181239 0.0413686 -0.12154 0.103371 0.0157413 -0.0432027 0.0828616 -0.070001 -0.0139694 0.145564 0.0192756 0.0167393 0.10239 0.0601044 0.0103039 0.00684863 -0.172781 0.189648 0.0400372 0.133727 -0.0376626 -0.0137637 0.032733 0.114589 0.0388234 -0.0281811 0.103991 0.0045246 -0.0464709 0.0226601 -0.0640728 -0.093626 0.195719 -0.0957597 0.0310802 0.0816223 0.0771811 -0.150247 -0.130237 -0.0139174 0.0514443 -0.0917213 -0.131683 0.0155726 0.0777122 -0.0940371 0.139747 -0.0705938 -0.0742946 -0.122342 -0.167177 0.175813 -0.0340441 0.15641 -0.109648 -0.0264666 0.0290621 -0.0544755 0.162663 0.00960233 0.0875518 -0.0987796 -0.115779 -0.0210789 -0.0879534 -0.102142 0.207298 0.0281744 0.0456849 -0.0661704 0.0704019 -0.00996771 -0.00865653 -0.0307444 -0.135008 0.0944534 0.0584395 0.0133553 0.0621705 0.0693566 -0.0394428 -0.118382 -0.00681186 -0.00339912 -0.0681939 -0.0195217 0.0330284 0.00696779 -0.0385328 0.00668501 0.0169405 -0.066972 -0.00547775 -0.0650348 0.0189553 -0.0217966 -0.00122984 0.227739 -0.0882882 0.00860097 0.127041 -0.153377 0.0132365 0.187788 0.0432802 -0.129556 -0.165248 -0.00164397 0.144993 0.0832911 0.0153671 -0.0548523 0.128956 0.00283511 0.0422931 0.0635609 -0.0254268 
