0.000367028 0.0851933 -0.132155 0.00592445 0.0428481 0.156597 -0.0391084 -0.18883 -0.120523 -0.00260779 -0.0226674 0.0431828 0.0558112 0.0125578 0.02523 -0.0122244 -0.031823 0.0273857 0.112365 0.0866783 0.0124243 -0.0167812 0.0880548 0.106895 0.00102135 0.0980911 -0.0531514 -0.231861 0.0448642 0.120935 0.0367775 0.100716 -0.0176553 -0.0525677 0.0812652 0.121867 -0.0139351 0.0895727 -0.0129486 -0.0222723 -0.0227673 -0.001279 -0.0260573 0.102361 -0.148762 0.151561 0.254563 0.0250661 -0.144022 -0.0182187 0.00591617 -0.0044379 0.0926492 -0.0302817 0.134529 0.0601304 0.0516571 0.189837 0.0656856 -0.118209 -0.0892888 0.0815006 0.221869 -0.148289 0.130548 -0.0258998 0.0593183 -0.00228185 -0.0509744 0.107574 -0.00814554 0.0836366 -0.0762202 0.0209963 0.0603171 -0.00442601 -0.130897 0.0422446 0.0317199 0.0291973 0.00538765 0.131919 -0.102384 -0.0818964 -0.0335452 -0.0412327 -0.0156727 -0.0521126 -0.0468977 0.0174728 0.0731929 -0.00607323 0.015391 -0.0681807 0.0142556 -0.0585413 0.0703647 0.193625 0.102387 -0.0649666 -0.00984788 0.0622029 0.0268133 0.0226142 -0.2212 0.0821441 -0.0715379 0.0224457 0.0209999 0.044538 0.0821953 0.0969445 -0.0330743 -0.13594 -0.00746653 0.0677249 -0.0932014 -0.21249 0.00872749 0.098681 0.0870993 -0.0634744 0.0398999 -0.000580367 -0.133764 0.109229 -0.00997467 0.0297015 
-0.00436966 0.0783263 -0.141817 0.0185865 0.0445085 0.149029 -0.0357898 -0.200077 -0.113631 -0.00956193 -0.0198454 0.048041 0.0486438 0.0156891 0.00783664 -0.00640478 -0.0397591 0.024199 0.119146 0.0896584 0.0182974 -0.0334117 0.0872788 0.102412 0.00493023 0.096792 -0.0574014 -0.238686 0.036754 0.127093 0.0330323 0.093779 -0.0179571 -0.0659426 0.0799573 0.124401 -0.0253125 0.0861601 -0.0157116 -0.0276113 -0.028222 0.00604724 -0.0276329 0.100811 -0.141954 0.15531 0.254054 0.0161466 -0.137938 -0.0271461 -0.00527293 -0.011481 0.098598 -0.0330242 0.139535 0.062275 0.0507992 0.193799 0.064052 -0.10865 -0.0800922 0.0846698 0.229057 -0.147102 0.139755 -0.023434 0.0532696 -0.00189027 -0.0439819 0.0997956 -0.00218392 0.0910254 -0.0721864 0.0149154 0.0566872 0.00445472 -0.125855 0.0419574 0.0241211 0.0266567 0.000728908 0.127451 -0.1109 -0.0817803 -0.0447004 -0.0328057 -0.0194732 -0.0525138 -0.050827 0.00437571 0.0699522 -0.00201516 0.0177375 -0.068096 0.0167569 -0.0563163 0.0682458 0.18625 0.110617 -0.057132 -0.00857294 0.0527604 0.0263032 0.00840589 -0.219845 0.0880527 -0.0634838 0.0234567 0.0118476 0.050256 0.0791221 0.088918 -0.0222265 -0.144117 -0.00702885 0.0768952 -0.0983162 -0.19645 0.00391651 0.0928137 0.0707249 -0.0607199 0.0345808 -0.00459621 -0.13888 0.124938 -0.0184322 0.0309629 
-0.0054568 0.0784778 -0.1331 0.0170226 0.0445869 0.139646 -0.0337291 -0.199416 -0.116868 -0.0196132 -0.018144 0.0561293 0.0423944 0.0145136 0.0124136 -0.0112078 -0.0429151 0.0107912 0.120288 0.0888177 0.0154134 -0.02572 0.0758577 0.0962106 0.00837725 0.109503 -0.0520483 -0.237697 0.033304 0.126418 0.032993 0.0970286 -0.0171255 -0.0567031 0.0748324 0.1256 -0.0174839 0.0911093 -0.0107769 -0.0187667 -0.0144139 0.00570468 -0.0209597 0.1028 -0.13761 0.16516 0.260744 0.00292351 -0.141003 -0.0324483 -0.0078792 -0.0137134 0.0878561 -0.0275123 0.149123 0.0646819 0.0355313 0.200333 0.0551274 -0.0980179 -0.0773154 0.0718413 0.228103 -0.14177 0.146606 -0.0307901 0.0579392 -0.00549487 -0.0353414 0.104232 -0.00211875 0.0897069 -0.0711428 0.0233996 0.0633137 0.00224012 -0.126361 0.0487002 0.0157424 0.0265144 -0.00632716 0.134475 -0.105776 -0.0811644 -0.0494451 -0.0396858 -0.00767467 -0.0538667 -0.0581138 0.00237987 0.0727012 -0.0117113 0.0151785 -0.072616 0.0159184 -0.0530407 0.0736134 0.173831 0.118916 -0.0550773 -0.0344086 0.0532919 0.0255589 0.0172587 -0.22447 0.0878327 -0.0693506 0.0355635 0.00425225 0.0397757 0.0803673 0.084218 -0.040727 -0.140843 -0.0013449 0.0679725 -0.0917507 -0.212776 0.00909778 0.093577 0.0794148 -0.0427552 0.0352609 0.00446755 -0.12924 0.116987 -0.0108782 0.029566 
0.00555274 0.062504 -0.151113 0.0274926 0.0449991 0.15601 -0.0041163 -0.190447 -0.13376 0.00146505 -0.0230365 0.0449482 0.0485072 0.0198476 0.0186344 -0.0113754 -0.0390014 0.014857 0.14206 0.0702586 0.00975994 -0.0425246 0.0704057 0.0979463 0.0132427 0.0881736 -0.0712351 -0.238386 0.0371619 0.132694 0.0278038 0.092756 -0.0427141 -0.0773677 0.074775 0.117261 -0.0424614 0.0523773 -0.0133027 -0.0357648 -0.022931 0.00258093 -0.0231372 0.104406 -0.138597 0.153965 0.238508 0.02011 -0.132312 -0.0421086 -0.00543224 -0.0229433 0.10782 -0.0464552 0.137881 0.0639184 0.0338824 0.212582 0.0717165 -0.0884076 -0.0706142 0.0968853 0.223494 -0.148908 0.139872 7.77247e-05 0.0498442 -0.0130692 -0.0448673 0.0749054 -0.00956219 0.111754 -0.0676199 0.0157153 0.0430089 0.0101199 -0.109129 0.0283123 0.0281017 0.0339037 0.0114767 0.0995261 -0.117253 -0.0912035 -0.0468549 -0.0390998 -0.0196303 -0.0687048 -0.0523656 -0.000579596 0.0750374 0.0165403 0.00905589 -0.0711385 0.010754 -0.0438453 0.0805363 0.167373 0.115617 -0.044117 -0.00230831 0.0553485 0.0385785 -0.0157063 -0.236846 0.0916787 -0.0598132 0.0271099 -0.00141792 0.0637623 0.0981002 0.0800996 -0.0111635 -0.170787 -0.00260683 0.0822932 -0.0835775 -0.169769 0.00170764 0.0876445 0.0572757 -0.0871037 0.0343997 -0.00587761 -0.146621 0.133742 -0.0303635 0.026155 
-0.000851398 0.077897 -0.144887 0.0142756 0.0360887 0.15479 -0.0245511 -0.189757 -0.118702 3.89955e-05 -0.0149097 0.0369477 0.0535444 0.011074 0.0178727 -0.00622387 -0.051486 0.0123068 0.121841 0.0759749 0.0197797 -0.0438864 0.0886323 0.092776 0.0118581 0.0946668 -0.0564045 -0.245265 0.0460318 0.123172 0.0389892 0.0926623 -0.0270355 -0.0683775 0.0718468 0.11776 -0.0419433 0.0859431 -0.0129579 -0.0265344 -0.0305029 -0.0111134 -0.040774 0.11095 -0.140091 0.152841 0.241921 0.0218837 -0.143925 -0.0372893 -0.00676478 -0.00256092 0.100041 -0.0440806 0.127568 0.0608089 0.0455501 0.203289 0.065134 -0.104231 -0.0814425 0.0808203 0.233603 -0.139815 0.139735 -0.011078 0.0522796 0.000657323 -0.0441626 0.0939033 -0.0128521 0.100396 -0.0773575 0.0147313 0.056255 -0.0056379 -0.123098 0.0332261 0.0248034 0.0492581 0.000161485 0.10018 -0.112138 -0.0906495 -0.0508577 -0.0408739 -0.016244 -0.0591972 -0.0476502 -0.0015987 0.0722957 0.00443619 0.00850072 -0.0670607 0.00890489 -0.0553356 0.0730114 0.17925 0.116877 -0.0549452 -0.00489328 0.0512495 0.026594 0.00277097 -0.223483 0.0870288 -0.0647931 0.0362559 0.0254159 0.0408147 0.0876844 0.0982391 -0.0284089 -0.155596 0.00928637 0.0834237 -0.0988408 -0.182181 0.0175568 0.101799 0.0682509 -0.0751428 0.0291754 0.000194203 -0.136019 0.123336 -0.0187492 0.0343882 
-0.00970535 0.125748 -0.120185 -0.0371401 0.0361196 0.148433 -0.035125 -0.201601 -0.122037 -0.0142631 -0.0181867 0.0453276 0.0520968 -0.0042287 0.0192833 -0.0345947 -0.0630389 0.00143665 0.0987204 0.0695172 0.00184272 0.0216309 0.0651925 0.074519 -0.0143283 0.110167 -0.0347222 -0.21137 0.0617383 0.134377 0.0182207 0.0775707 -0.0119662 -0.0432766 0.0945974 0.104221 0.00282188 0.0938409 0.0103901 0.0105307 -0.0133397 -0.0264142 -0.0235848 0.110509 -0.149724 0.198029 0.252919 0.022984 -0.171085 -0.0250114 -0.00124383 0.0350508 0.070665 -0.0185841 0.123797 0.0580421 0.038 0.192633 0.0171476 -0.0852029 -0.0863168 0.0638011 0.236823 -0.122785 0.140172 -0.0632408 0.0554057 -0.000309063 -0.0513556 0.114528 2.28307e-05 0.0513752 -0.0832645 0.0295331 0.0837639 0.00755988 -0.144188 0.0378926 0.0249469 0.0423266 0.00565011 0.122655 -0.078138 -0.0444581 -0.050334 -0.0518767 -0.000434558 -0.0682268 -0.0648503 0.039398 0.0713278 -0.0432385 0.0186689 -0.0590398 -0.00527482 -0.0768441 0.0748573 0.172008 0.123007 -0.0677983 -0.0238758 0.0905346 0.0110118 0.0467443 -0.216293 0.0704105 -0.0689857 0.0722297 0.0125017 0.029464 0.106184 0.0702612 -0.0721412 -0.107295 -0.0187495 0.0728497 -0.102571 -0.208929 0.0238931 0.113571 0.104296 -0.0608774 0.0242159 0.00548667 -0.105259 0.097506 -0.00561035 0.0222159 
0.0132581 0.092867 -0.106681 -0.0128769 0.0391103 0.160269 -0.0244444 -0.195017 -0.109075 -0.0363989 -0.0184414 0.0575777 0.0328707 -0.0280889 0.0135377 -0.0373644 -0.0777035 0.0050758 0.0893992 0.073296 0.0158576 0.0118952 0.0758111 0.0866904 -0.00432828 0.114937 -0.0337261 -0.237411 0.0433031 0.115495 0.0252972 0.0872939 -0.0285726 -0.0247337 0.0910053 0.0912965 -0.00265864 0.112644 0.01379 -0.00652396 0.00646945 -0.0290204 -0.0372289 0.106531 -0.158191 0.162447 0.243945 0.0111564 -0.160097 -0.0101361 0.000921883 0.0261365 0.0788817 -0.00723115 0.142287 0.043988 0.0550423 0.192698 0.0112224 -0.106069 -0.0797874 0.0553179 0.245639 -0.126662 0.140503 -0.0545252 0.0635424 -0.00374212 -0.0419627 0.135577 -0.0140355 0.0645944 -0.0824361 0.0523437 0.0743965 -0.0203871 -0.140326 0.0327631 0.0240296 0.0572022 -0.00712523 0.13699 -0.0690669 -0.0711712 -0.0384095 -0.0675975 0.0116134 -0.0433835 -0.0612722 0.0298448 0.0924988 -0.041969 0.0129155 -0.0647739 -0.0118672 -0.0797415 0.0801576 0.167029 0.129352 -0.0655103 -0.0229495 0.0754476 0.00782959 0.0532442 -0.198012 0.0570768 -0.0641083 0.0696494 0.0124242 0.0231635 0.101834 0.0998969 -0.069939 -0.112319 0.0114337 0.0682969 -0.101832 -0.218271 0.031068 0.110625 0.111802 -0.0388544 0.0367225 0.000396824 -0.0952883 0.0922665 0.015272 0.02804 
0.000538445 0.0994456 -0.11363 -0.0198954 0.0366298 0.155414 -0.0335115 -0.182554 -0.114206 -0.0313484 -0.0197596 0.0413657 0.0398784 -0.017565 0.0207338 -0.0321518 -0.0703904 0.00181264 0.0974133 0.0722905 0.014401 -0.000281626 0.0875023 0.0777713 -0.00351766 0.106623 -0.0348015 -0.236899 0.0516017 0.103533 0.0399971 0.0810968 -0.017046 -0.0335788 0.0849149 0.102457 -0.0068785 0.111885 0.00208847 -0.00446344 -0.000123673 -0.0234204 -0.0391478 0.112767 -0.156298 0.170847 0.247713 0.0141614 -0.165453 -0.0172619 -0.0188764 0.020825 0.0801602 -0.0177857 0.123643 0.0531131 0.0547981 0.193593 0.0246932 -0.104443 -0.0883038 0.065531 0.240946 -0.129369 0.141871 -0.0464937 0.0623157 -0.00272884 -0.0403731 0.128925 -0.0150076 0.0637015 -0.0842724 0.0435677 0.0789549 -0.0198707 -0.141923 0.0389756 0.0218508 0.0481931 -0.0177673 0.125161 -0.083056 -0.0702641 -0.0430233 -0.0529323 0.00316995 -0.0494441 -0.0619419 0.0206428 0.0963209 -0.0319714 0.0124918 -0.074526 0.00633334 -0.0741993 0.0747882 0.181937 0.116475 -0.0628524 -0.0337167 0.067265 0.0128907 0.0434911 -0.204485 0.0679149 -0.0645628 0.0659872 0.0241473 0.0166898 0.0950238 0.0968552 -0.0662432 -0.119443 0.00991252 0.0681549 -0.0966678 -0.223394 0.041598 0.113767 0.106401 -0.0453678 0.0275346 0.0106482 -0.107561 0.0874362 0.00619687 0.0331534 
0.0557226 0.056215 -0.107894 -0.0122596 0.0555657 0.189094 -0.0107092 -0.154406 -0.132114 -0.060125 -0.00229299 0.0630527 0.0308938 -0.0650519 -0.0263495 -0.035578 -0.0870428 0.0332742 0.0556786 0.0886929 0.057482 0.00634352 0.0854957 0.0678511 -0.0174883 0.121784 -0.0421844 -0.244573 0.0548047 0.0744098 0.0111019 0.0856252 -0.0707397 0.00153102 0.0848838 0.0618852 -0.0194453 0.129898 0.0431724 -0.0233241 0.0251876 -0.0163267 -0.0558455 0.104964 -0.178259 0.0893099 0.231584 0.013055 -0.159403 0.0253697 -0.0196086 0.031885 0.0406017 0.029284 0.123739 0.00163405 0.0966183 0.184259 -0.0117551 -0.132838 -0.0636049 0.0596388 0.28541 -0.1177 0.11715 -0.0551463 0.0636591 -0.00213432 -0.0180166 0.143803 -0.0223683 0.0761973 -0.0581383 0.0960332 0.0428452 -0.0675408 -0.136216 0.0262277 0.0278438 0.0483819 -0.0171215 0.151549 -0.0394936 -0.0860524 -0.0314029 -0.0600201 0.0304688 0.00572157 -0.0290019 0.007337 0.147557 -0.0419829 -0.007993 -0.063622 -0.00554883 -0.111442 0.0835361 0.186268 0.0863225 -0.0586787 -0.0246325 0.0696585 0.00302523 0.0853286 -0.153833 0.0620973 -0.04138 0.0922253 0.0264633 0.00975921 0.0933855 0.12282 -0.0681735 -0.0734511 0.0395835 0.0563782 -0.0868524 -0.217197 0.0437703 0.0857375 0.0905134 -0.0347441 0.0699967 -0.0157355 -0.0999691 0.0669893 0.0275683 0.0358227 
0.0501246 0.0533086 -0.0967372 -0.00223404 0.0576151 0.181182 -0.00698612 -0.159387 -0.128203 -0.0592718 0.00239998 0.0731811 0.0198132 -0.0578382 -0.030871 -0.0464159 -0.0781164 0.0468467 0.0690797 0.0942414 0.0534829 0.0117415 0.0796764 0.0702772 -0.0217061 0.124704 -0.0445115 -0.23204 0.0658389 0.0778876 0.00451406 0.0816745 -0.0601716 -0.00690307 0.0945901 0.0620816 -0.0145411 0.128244 0.0379324 -0.0329829 0.0278643 -0.0043896 -0.0578155 0.0968887 -0.190452 0.0859939 0.230945 0.00607354 -0.152589 0.0206026 -0.0271254 0.0440044 0.0424556 0.0303235 0.1308 0.00589115 0.0973127 0.179311 -0.0246643 -0.12261 -0.0656039 0.0583366 0.290279 -0.119603 0.126664 -0.0554286 0.0651551 -0.0219123 -0.0265267 0.155631 -0.0156108 0.0696938 -0.0540511 0.102337 0.0391556 -0.0655341 -0.129856 0.0325029 0.0286301 0.0244527 -0.0249783 0.16573 -0.035405 -0.0789267 -0.0128101 -0.0697088 0.0251575 0.0146708 -0.0279315 0.0149117 0.154401 -0.0350316 -0.0025978 -0.0587326 0.00471962 -0.126194 0.0843738 0.186918 0.0896073 -0.0562547 -0.0239906 0.0787332 0.00510931 0.0715341 -0.150205 0.0722171 -0.015534 0.0733732 0.035818 0.0177055 0.0865449 0.112377 -0.0615916 -0.0719507 0.0401487 0.0477297 -0.0703498 -0.224325 0.0435262 0.0816313 0.0873386 -0.0411427 0.0634479 -0.0277024 -0.0964039 0.084089 0.0441628 0.0400443 
0.0293871 0.0656221 -0.11234 0.00449337 0.0271709 0.177837 -0.00529332 -0.156099 -0.103766 -0.0451696 0.00503281 0.0603505 0.0148504 -0.057724 -0.0108592 -0.0574888 -0.0854183 0.0245069 0.10755 0.0590535 0.0350653 0.0117634 0.0634139 0.0702354 -0.0124776 0.123521 -0.0332906 -0.250678 0.0555764 0.0900064 0.0229142 0.0744096 -0.0352553 -0.0338498 0.0980632 0.0663841 -0.00282501 0.105909 0.0211656 -0.0209503 0.036033 -0.0201063 -0.0652836 0.127924 -0.189796 0.101079 0.231847 -0.013542 -0.148925 -0.0188803 -0.0220112 0.0352924 0.0731767 0.0142051 0.126467 0.0415982 0.0796131 0.172114 -0.003826 -0.117418 -0.078096 0.0369464 0.274344 -0.123277 0.137887 -0.0540294 0.0894541 -0.0475072 -0.0144442 0.139873 -0.0227123 0.0593058 -0.0633888 0.0730586 0.0585529 -0.0532839 -0.151204 0.0377882 0.0116015 0.0453772 -0.037942 0.150379 -0.0460924 -0.0725816 -0.00448623 -0.0601404 0.0292758 -0.0287065 -0.0488018 -0.0024344 0.123307 -0.0301531 -0.00668526 -0.0835513 -4.16493e-05 -0.120788 0.0903328 0.172181 0.106939 -0.0485635 -0.0279227 0.0793148 0.0321882 0.0390039 -0.1735 0.060491 -0.0134386 0.0687137 0.0123976 0.0248992 0.092201 0.0840753 -0.065159 -0.130707 0.0313988 0.048847 -0.0726011 -0.242357 0.0567557 0.076092 0.107203 -0.0558631 0.0429505 -0.0176642 -0.0810959 0.0853434 0.041216 0.067524 
0.0404704 0.0391156 -0.142014 0.000308936 0.0355292 0.154502 0.0127089 -0.135192 -0.116933 -0.0292251 0.000754424 0.0771783 0.0409263 -0.0243248 -0.0198028 -0.0437637 -0.0705244 0.0134341 0.0950589 0.073979 0.0368933 -0.0243464 0.0859715 0.0679343 -0.0138048 0.13003 -0.0219952 -0.256304 0.0426061 0.0940959 0.0058419 0.107406 -0.0326662 -0.0253446 0.0444341 0.0581815 -0.0177025 0.149853 0.00622487 -0.0081902 0.0263621 -0.00883343 -0.0688731 0.123137 -0.190641 0.0926078 0.225571 -0.0254097 -0.133451 -0.0155264 -0.00867691 0.022734 0.0495182 0.020815 0.138269 0.0380801 0.0899353 0.194337 0.0183371 -0.113978 -0.0723381 0.0188344 0.266101 -0.12412 0.130031 -0.0505114 0.0753257 -0.00812819 -0.00125445 0.131925 -0.0239847 0.083958 -0.0618589 0.0839829 0.0556375 -0.0425792 -0.130265 0.0379132 0.00327315 0.0323102 -0.0591214 0.135337 -0.0539068 -0.0866558 -0.0249768 -0.0642032 0.0472002 -0.0189338 -0.0254993 -0.0381382 0.100659 -0.0364246 -0.00447036 -0.0996549 0.0133541 -0.106625 0.0952859 0.17104 0.11851 -0.0446017 -0.0463943 0.0594998 0.0385846 0.0784084 -0.189025 0.0479672 -0.0648297 0.0803879 0.0151192 -0.0132661 0.0763753 0.116912 -0.0668941 -0.122854 0.0411999 0.0560042 -0.0611927 -0.249143 0.0588865 0.087951 0.09395 -0.0316838 0.0458841 -0.00340034 -0.097766 0.0711432 0.0112732 0.0650323 
0.0275695 0.0463782 -0.157625 0.00949797 0.0336631 0.151649 0.00792274 -0.148496 -0.107594 -0.0285127 -0.000154359 0.0711224 0.0375705 -0.0138352 -0.0192924 -0.0378149 -0.0654081 0.0126577 0.115082 0.0629072 0.0339269 -0.0280874 0.0762547 0.0566684 -0.00240802 0.127171 -0.031032 -0.258031 0.0432281 0.107834 0.0212753 0.115871 -0.0250492 -0.0460594 0.051257 0.0703271 -0.015422 0.128472 0.00980207 -0.0108994 0.0272658 -0.0030743 -0.0573453 0.129608 -0.182214 0.0990944 0.231827 -0.0299636 -0.124771 -0.0395424 -0.0154442 0.0192385 0.0656007 0.0091502 0.13271 0.0526873 0.0815638 0.192008 0.0264814 -0.106911 -0.0778847 0.0211298 0.262207 -0.130734 0.136444 -0.0448535 0.0814767 -0.0193645 0.00542859 0.123972 -0.0200105 0.0865324 -0.0623962 0.0667531 0.054218 -0.0335949 -0.132834 0.0393621 -0.0117035 0.0284848 -0.0562534 0.140356 -0.0614072 -0.0762444 -0.0232435 -0.0533531 0.0387766 -0.0326239 -0.036313 -0.0480263 0.0919385 -0.0267696 -0.00889732 -0.104795 0.0220678 -0.100634 0.0948262 0.174867 0.115679 -0.0364091 -0.0506711 0.055024 0.0488945 0.0613264 -0.19806 0.0565023 -0.0571948 0.0742362 0.00862045 0.00141343 0.0683824 0.0927875 -0.0697556 -0.139016 0.0335353 0.0531255 -0.0593076 -0.248367 0.0615265 0.0803694 0.0956418 -0.0366066 0.0433968 -0.00699102 -0.102215 0.0772372 0.00687531 0.0750321 
0.0239251 0.0630143 -0.16324 0.00557638 0.0315752 0.150987 -0.00333705 -0.159496 -0.108975 -0.0349974 0.0015272 0.0608628 0.0444723 0.00307217 -0.0197464 -0.0324785 -0.0610303 0.00965607 0.1099 0.0628839 0.0364663 -0.0277263 0.0782289 0.0526068 0.00112508 0.116433 -0.0323339 -0.245733 0.0434666 0.11696 0.0216957 0.117308 -0.0191241 -0.0469871 0.0502417 0.0817301 -0.0134215 0.124068 0.00732163 -0.0101301 0.0163898 -0.00217779 -0.0460216 0.127597 -0.173662 0.113393 0.238908 -0.0239175 -0.134934 -0.039295 -0.0188367 0.023198 0.0678501 0.00892358 0.13031 0.0550894 0.0742065 0.191302 0.0321587 -0.110359 -0.0816085 0.0329083 0.260661 -0.132023 0.131896 -0.0359613 0.0787178 -0.0114674 -0.00135323 0.12431 -0.0154922 0.078538 -0.0649348 0.0558784 0.062639 -0.0254314 -0.131434 0.0312086 -0.0156701 0.027961 -0.0469998 0.13717 -0.068586 -0.07799 -0.0338152 -0.038931 0.0262656 -0.0453976 -0.042325 -0.0374514 0.091113 -0.0360676 -0.00920747 -0.103684 0.0230257 -0.09397 0.0872264 0.182929 0.115163 -0.0380821 -0.050062 0.0591212 0.0505249 0.061887 -0.207548 0.0673515 -0.0660052 0.0805289 0.00712037 -0.00332114 0.0712195 0.0866933 -0.074439 -0.133999 0.0261142 0.0557814 -0.0628729 -0.241286 0.0656321 0.0851136 0.0955062 -0.0409708 0.0440095 -0.00313891 -0.10224 0.0776347 0.00822604 0.0720302 
0.018819 0.0638914 -0.148167 0.00264781 0.0431652 0.134405 -0.0147919 -0.172689 -0.106241 -0.043315 0.00291784 0.0625653 0.0397923 0.0054004 -0.00284706 -0.0348715 -0.0616778 0.00413176 0.115317 0.0727589 0.0309402 -0.0106251 0.0800545 0.0518017 0.00665712 0.122658 -0.0306283 -0.245744 0.0419365 0.118345 0.028394 0.0980375 -0.00997506 -0.0494708 0.0616919 0.0938318 -0.00804503 0.124148 0.0135175 0.00306435 0.0175973 0.0103422 -0.0493565 0.12749 -0.178856 0.134151 0.243442 -0.0275033 -0.120454 -0.0404148 -0.0240623 0.0232224 0.0636675 0.00755446 0.131676 0.0525565 0.0686432 0.191284 0.0229916 -0.0928712 -0.0811065 0.0258965 0.250108 -0.120958 0.138024 -0.0595368 0.0839377 -0.00882952 0.00928674 0.123599 0.000212443 0.084624 -0.0611308 0.0488784 0.0686543 -0.0205506 -0.148557 0.0415946 -0.0164083 0.0380816 -0.0396764 0.147173 -0.0647791 -0.0633012 -0.0346357 -0.0425031 0.0298191 -0.0416125 -0.0575995 -0.042116 0.0870231 -0.028852 -0.00146984 -0.0997117 0.0140957 -0.104903 0.0797254 0.17568 0.119323 -0.0468215 -0.067045 0.0583562 0.0497741 0.0567614 -0.20876 0.0681191 -0.0613873 0.0802509 0.0171865 0.00786376 0.0755252 0.0768786 -0.0842769 -0.123667 0.0117246 0.0629883 -0.0712844 -0.246444 0.04221 0.0850074 0.095319 -0.0222078 0.029568 0.00557948 -0.102461 0.0762285 0.00622443 0.0754759 
0.0262156 0.0702244 -0.16757 -0.00766193 0.040139 0.136063 -0.00536053 -0.169799 -0.111839 -0.0351668 0.00586411 0.0630855 0.0470079 0.00689815 -0.0177237 -0.0210937 -0.067883 0.00589094 0.105535 0.0640021 0.0367704 -0.00806457 0.0763804 0.0399591 -0.000599322 0.124274 -0.0186767 -0.243266 0.04495 0.133276 0.00540252 0.108297 -0.0141359 -0.0475306 0.0507304 0.0792577 -0.00993521 0.121708 0.0170353 0.0113151 0.00722385 0.00124688 -0.0389249 0.136011 -0.17415 0.137965 0.246685 -0.0295347 -0.133012 -0.0394293 -0.00741203 0.0269102 0.049904 0.0146681 0.128653 0.0529406 0.0755009 0.190143 0.0285736 -0.0901399 -0.0727332 0.0158795 0.257203 -0.114398 0.131556 -0.0672359 0.0716661 -0.00074966 0.0162607 0.123666 -0.00450445 0.0825797 -0.0602259 0.0442834 0.0638096 -0.0163755 -0.141061 0.0411544 -0.0294679 0.0307733 -0.0282131 0.142222 -0.0671455 -0.0627139 -0.0494191 -0.0339839 0.0296143 -0.0523689 -0.0537843 -0.0379443 0.0777741 -0.0387837 -0.0202131 -0.102498 0.0119669 -0.0920657 0.081012 0.177925 0.128336 -0.0429131 -0.0602296 0.0585209 0.0521738 0.070913 -0.210575 0.0559044 -0.0782721 0.0981079 0.00248661 -0.00324784 0.0767953 0.0784751 -0.0852681 -0.122178 0.0106151 0.0654397 -0.0693824 -0.238627 0.0458107 0.0818559 0.0953859 -0.0238363 0.0437145 0.0034543 -0.0990321 0.0696909 -0.000925164 0.0703809 
0.0231945 0.0766354 -0.167328 -0.00404121 0.0444097 0.127887 -0.00724121 -0.185142 -0.126432 -0.0193061 0.00388556 0.0598272 0.0564354 0.0303953 -0.00295573 -0.0142411 -0.0424915 0.0152061 0.119187 0.0617567 0.0242213 0.00464391 0.064853 0.038063 -0.00258817 0.126766 -0.0387297 -0.233272 0.0487968 0.149995 0.00451622 0.127421 -0.0188663 -0.0622767 0.0577746 0.0939318 -0.00606998 0.106805 0.029255 0.020308 -0.0042294 0.0207061 -0.0337961 0.123283 -0.164404 0.154562 0.250677 -0.0257271 -0.127803 -0.0572417 0.004869 0.0288645 0.0516879 0.0055757 0.120728 0.0558737 0.0711926 0.19246 0.0406801 -0.0695694 -0.0709051 0.026886 0.237734 -0.121447 0.132412 -0.070199 0.0771358 0.00200231 0.0145568 0.11363 0.011426 0.0892187 -0.0561195 0.0379462 0.0521136 -0.00512798 -0.143327 0.0385556 -0.0294835 0.0185534 -0.00974533 0.151909 -0.0754714 -0.0588754 -0.0471779 -0.0332615 0.0234949 -0.0708819 -0.0661411 -0.0425169 0.0635968 -0.0246001 -0.0122768 -0.0967763 0.0168772 -0.0856386 0.0863383 0.177222 0.12129 -0.038145 -0.0635192 0.0677223 0.0567706 0.0683365 -0.221987 0.062181 -0.0776426 0.0839278 0.00743705 0.0158516 0.0741837 0.0573344 -0.084902 -0.124722 -0.00565333 0.0622192 -0.070226 -0.239778 0.0262093 0.0692489 0.089182 -0.029097 0.0440579 0.00237591 -0.104652 0.0735633 -0.0136287 0.0652274 
0.0272926 0.0700545 -0.167286 0.0146868 0.0354001 0.159137 0.00334971 -0.166383 -0.113821 -0.0216094 0.00560464 0.0638466 0.0419667 -0.00545822 -0.0180524 -0.0272907 -0.0601195 0.0187346 0.109314 0.0588075 0.0342291 -0.0326873 0.0717951 0.0510676 0.00801692 0.113783 -0.0390876 -0.245374 0.0436071 0.124205 0.0175145 0.134142 -0.0266268 -0.044603 0.047906 0.0784686 -0.0149482 0.106374 0.0162262 -0.0134365 0.0226653 -0.0159432 -0.0345636 0.12573 -0.175636 0.109431 0.241567 -0.0205781 -0.13957 -0.0426302 -0.0019602 0.0282894 0.0616986 0.00619671 0.130023 0.055897 0.0737199 0.184202 0.0353331 -0.104535 -0.0820105 0.0303516 0.259171 -0.137124 0.132387 -0.0313158 0.0728763 -0.0171596 -0.00758008 0.129755 -0.0200088 0.0861186 -0.0661638 0.0576742 0.0602715 -0.0264707 -0.124595 0.0356903 -0.0217943 0.0258274 -0.0435744 0.139476 -0.0646326 -0.0744186 -0.035527 -0.0325698 0.0241844 -0.0499115 -0.0426007 -0.0304995 0.0854897 -0.0357977 -0.0178105 -0.101725 0.0158591 -0.0927568 0.0877855 0.180534 0.116393 -0.0397009 -0.0433395 0.0597342 0.0539576 0.0656391 -0.200036 0.0677328 -0.0654674 0.0913384 0.00361561 0.0018137 0.0653039 0.0854534 -0.0713116 -0.136284 0.0287679 0.0448949 -0.0611014 -0.235429 0.0712361 0.0872309 0.103191 -0.0459269 0.0512207 -0.00479986 -0.0990055 0.078226 0.0131948 0.0722378 
0.0303758 0.063457 -0.161641 0.0118921 0.0501451 0.155833 -0.0130377 -0.176515 -0.1097 -0.0382642 0.0209257 0.0734975 0.0435727 0.00862705 -0.0184044 -0.0290168 -0.0564646 0.0330575 0.108921 0.0599193 0.0568682 -0.0172121 0.0681901 0.07143 0.0265041 0.101079 -0.021484 -0.242797 0.0386426 0.148287 0.0222119 0.0967868 -0.0184729 -0.0484369 0.0539937 0.0902969 -0.0287737 0.0811409 0.0168314 -0.00147123 0.0123289 0.00168582 -0.0344019 0.145481 -0.177263 0.109426 0.246901 -0.0297379 -0.127649 -0.0436713 0.00838746 0.0268046 0.0541403 0.00116282 0.130953 0.0655518 0.0610871 0.196174 0.0344293 -0.0933733 -0.0787744 0.0200727 0.259006 -0.122382 0.128447 -0.0692862 0.0682626 -0.0136088 -0.00346909 0.140734 0.00460103 0.091901 -0.0644437 0.0166284 0.05284 -0.0124013 -0.136625 0.0424553 -0.0335542 0.0431969 -0.0392037 0.146776 -0.052072 -0.0593604 -0.0494175 -0.026558 0.0316807 -0.0593199 -0.0592124 -0.0359518 0.0697574 -0.0408809 -0.0246159 -0.0950152 0.00952954 -0.100916 0.0645672 0.176105 0.114224 -0.0453868 -0.0502956 0.0688218 0.0571326 0.059516 -0.202425 0.0722178 -0.0713939 0.0849289 -0.0014799 -0.000720071 0.0692703 0.0649951 -0.0829434 -0.121334 0.0138838 0.0647711 -0.0674862 -0.230909 0.050025 0.0969217 0.0975474 -0.0411503 0.0256739 -0.00917273 -0.101237 0.0888103 0.0136291 0.0818507 
0.024952 0.0591125 -0.163209 0.0182098 0.0617809 0.153959 -0.00589316 -0.179121 -0.105242 -0.0185437 0.0181892 0.0702582 0.046197 0.00320606 -0.00924484 -0.0238626 -0.050906 0.0417343 0.104719 0.0696247 0.0485143 -0.0304893 0.0776526 0.0759408 0.0238398 0.0967347 -0.0414693 -0.250809 0.0431612 0.138977 0.0333995 0.109969 -0.023989 -0.0515924 0.0567198 0.0965306 -0.0306991 0.0900113 0.0103103 -0.00873178 0.0166764 0.0050056 -0.0431629 0.13796 -0.183106 0.108491 0.241648 -0.0118954 -0.114786 -0.0467756 0.00271198 0.0212288 0.0524479 -0.0116695 0.127995 0.0612655 0.0634571 0.193664 0.0405551 -0.0902911 -0.0846414 0.024011 0.253544 -0.129758 0.134564 -0.0654882 0.064168 -0.00800517 -0.00706159 0.138223 0.00880166 0.10698 -0.0618703 0.0242021 0.044697 -0.0158627 -0.137894 0.0544605 -0.024796 0.0317967 -0.0414368 0.152166 -0.062225 -0.0597222 -0.0436367 -0.0309056 0.0289576 -0.0475919 -0.0538372 -0.0422282 0.0724671 -0.0263389 -0.0153964 -0.102639 0.013111 -0.107334 0.065529 0.175201 0.109527 -0.0475432 -0.0420692 0.0586969 0.0564341 0.0518493 -0.197613 0.0714302 -0.0676173 0.0743813 0.0185528 0.0165639 0.0604579 0.075086 -0.0712322 -0.123971 0.0181023 0.0608806 -0.070067 -0.231513 0.0406279 0.0983487 0.0938288 -0.0379482 0.0229862 0.00153527 -0.116715 0.0911812 0.00205323 0.0783591 
0.0398274 0.0672469 -0.159662 0.0193139 0.0418193 0.150768 0.00298622 -0.177438 -0.135246 -0.00243123 0.0163847 0.0750481 0.0486147 -0.00595239 -0.0310504 -0.0271238 -0.0452492 0.0451159 0.104581 0.0826162 0.0291764 -0.0350621 0.0872692 0.0499596 -0.00662411 0.126011 -0.041871 -0.239018 0.0549582 0.122281 -0.00497624 0.141045 -0.0339008 -0.0447807 0.0531237 0.0658942 -0.0210821 0.133074 0.0366827 -0.0147832 0.000676628 -0.0101097 -0.0540614 0.110176 -0.192726 0.101147 0.237145 -0.0110335 -0.13732 -0.0234809 0.0147029 0.0565008 0.0389422 0.0157007 0.119236 0.0290526 0.103454 0.173272 0.0260815 -0.0954292 -0.0723442 0.0248602 0.268374 -0.132683 0.13112 -0.0531256 0.0644391 -0.0084647 -0.0163891 0.142789 -0.0115584 0.0891754 -0.0575631 0.0813355 0.0422114 -0.0425407 -0.12069 0.0379143 -0.00755805 0.0219883 -0.0483365 0.140585 -0.0598014 -0.0720547 -0.0260973 -0.0532411 0.0188955 -0.0339913 -0.0246587 -0.0375077 0.0812165 -0.0244194 0.00117889 -0.0877194 0.0179772 -0.125653 0.0936574 0.191246 0.107919 -0.0530883 -0.0334274 0.0780885 0.042111 0.0850019 -0.169252 0.0616598 -0.0426482 0.0933762 0.039138 0.00561264 0.0529145 0.0962021 -0.057184 -0.105143 0.0250867 0.0394402 -0.058126 -0.232116 0.0593627 0.0868229 0.0831488 -0.0487416 0.0488347 -0.0160358 -0.0988404 0.0783314 0.0192098 0.0695024 
0.0333609 0.0730509 -0.153827 0.0265447 0.0419195 0.152169 0.00775499 -0.180768 -0.125553 -0.0140775 0.0144061 0.0772412 0.0448834 -0.00849395 -0.035429 -0.0296045 -0.0582104 0.0407579 0.0914206 0.0817606 0.0358389 -0.0447152 0.0801308 0.0554589 0.00344145 0.115325 -0.049952 -0.234474 0.0541874 0.127096 0.00428455 0.144424 -0.0368449 -0.0425273 0.0466017 0.0678828 -0.0297017 0.12661 0.0267388 -0.0175149 0.012519 -0.0165939 -0.0441303 0.115334 -0.18764 0.0948368 0.240385 -0.0147802 -0.136386 -0.0251202 0.0111989 0.0530506 0.0403692 0.0105721 0.126926 0.0354376 0.0865198 0.179093 0.0287645 -0.10336 -0.0780201 0.0271785 0.266708 -0.129876 0.127342 -0.0422219 0.0674234 -0.0189266 -0.0256561 0.142291 -0.0121055 0.0923223 -0.0525097 0.0832496 0.0491712 -0.0395401 -0.119151 0.0330574 -0.0121639 0.0284666 -0.0473205 0.140002 -0.0590453 -0.0723188 -0.0296085 -0.0471012 0.0202544 -0.0335248 -0.027391 -0.0339262 0.0812837 -0.0315094 -0.00282053 -0.0934531 0.0124719 -0.12077 0.0881344 0.187544 0.112195 -0.052307 -0.036881 0.0734162 0.046069 0.0865925 -0.177394 0.0693188 -0.0490875 0.10416 0.0371616 0.00137322 0.0546425 0.0992459 -0.0706032 -0.106539 0.025315 0.0399525 -0.0573815 -0.225083 0.0679033 0.0941286 0.0861299 -0.0437053 0.043116 -0.0133622 -0.101832 0.0817419 0.0206229 0.0694296 
0.022047 0.0792374 -0.14715 0.0197725 0.0472658 0.142084 -0.00419016 -0.189872 -0.115583 -0.0234552 0.0100215 0.067758 0.0452267 0.00898387 -0.0189404 -0.0208482 -0.0491688 0.0397519 0.0989012 0.0641428 0.0467019 -0.0267236 0.0715994 0.0626943 0.019513 0.109274 -0.0507027 -0.234784 0.0599506 0.144884 0.0208289 0.139259 -0.0247212 -0.0521903 0.053657 0.0794557 -0.0296867 0.109351 0.0246003 -0.00709834 0.00978249 -0.000747657 -0.0347308 0.123444 -0.170586 0.117172 0.246873 -0.023092 -0.133663 -0.0534313 0.00957986 0.044852 0.0571099 -0.00523774 0.121283 0.0532559 0.0779587 0.186636 0.0371111 -0.0962278 -0.0775409 0.0293014 0.246788 -0.119907 0.12759 -0.0505175 0.0699303 -0.0153634 -0.0166971 0.137561 0.000631155 0.090006 -0.060949 0.0468197 0.0512521 -0.0229408 -0.135226 0.0352764 -0.0242197 0.0321231 -0.03721 0.156459 -0.060512 -0.0639915 -0.0343071 -0.0409842 0.0222753 -0.0508317 -0.0557638 -0.0382491 0.0700402 -0.0248677 -0.0121903 -0.0934097 0.0130541 -0.102993 0.0768896 0.188183 0.114049 -0.0485764 -0.0442633 0.0664912 0.0524888 0.0808602 -0.199621 0.0684577 -0.0617613 0.0934677 0.0353733 0.000444671 0.0627642 0.077954 -0.089674 -0.118687 0.0183595 0.0527347 -0.0738802 -0.233038 0.0533191 0.0943653 0.0914997 -0.032788 0.0266313 -0.0121999 -0.106942 0.0878466 0.0116957 0.0694669 
0.0314026 0.0746879 -0.145736 0.0166341 0.0550839 0.149945 -0.00376117 -0.189092 -0.122726 -0.0229279 0.0161153 0.0748059 0.0440285 -0.00320168 -0.0282389 -0.0246067 -0.0476247 0.0496986 0.0902013 0.0799533 0.046105 -0.0227157 0.0817638 0.0620717 0.00571886 0.112775 -0.0460118 -0.234782 0.062192 0.133155 0.0122259 0.128234 -0.029598 -0.0446064 0.0640946 0.0764443 -0.0272967 0.121104 0.0274972 -0.0147652 0.00516968 0.00117117 -0.0439197 0.121993 -0.185225 0.111037 0.24388 -0.0113303 -0.138394 -0.0329685 0.00766987 0.0491112 0.0413283 0.000688856 0.119667 0.0383704 0.0831933 0.186011 0.0226131 -0.0942951 -0.0782647 0.0284999 0.265086 -0.124899 0.136103 -0.0646294 0.0610292 -0.0131383 -0.0256046 0.1485 0.0039014 0.0875285 -0.0563831 0.0577716 0.0415563 -0.0335227 -0.130619 0.0410851 -0.0133686 0.0259217 -0.0399107 0.152504 -0.0595331 -0.0641248 -0.0328791 -0.0514374 0.0197099 -0.0366882 -0.0446623 -0.0283145 0.0822992 -0.029631 -0.00809081 -0.0867951 0.0175766 -0.118354 0.0801008 0.190881 0.104468 -0.0518746 -0.0386156 0.0764165 0.0397973 0.0804223 -0.181257 0.0691869 -0.0470634 0.0913555 0.045225 0.00419187 0.0597603 0.0861321 -0.0757023 -0.0981346 0.0218744 0.0495727 -0.0708069 -0.228588 0.0509412 0.0980766 0.0836083 -0.0376999 0.0320188 -0.0128501 -0.102619 0.0858043 0.0188257 0.0630787 
0.0635103 0.0661915 -0.147158 0.00282287 0.0613659 0.152267 0.0141543 -0.153486 -0.129139 -0.0171629 0.0360674 0.0821666 0.0455314 -0.033007 -0.0452916 -0.0164794 -0.0400561 0.052797 0.0653294 0.0881413 0.061894 -0.0173109 0.0929829 0.0619214 -0.00877704 0.11565 -0.0212004 -0.234619 0.0857348 0.113099 -0.00597759 0.112621 -0.0438335 -0.0227111 0.0474073 0.0379206 -0.0343661 0.1577 0.0446526 -0.00294581 -0.00645031 0.000506132 -0.0761891 0.12052 -0.192907 0.089896 0.218474 -0.0156565 -0.143276 -0.0127531 0.0170587 0.0811762 -0.00140626 0.0116261 0.0973368 0.0135491 0.103677 0.192986 -0.00754494 -0.0831713 -0.0718997 -0.00405267 0.290783 -0.12274 0.128749 -0.0969462 0.0480735 0.00349099 -0.0236008 0.161143 0.00160083 0.0927137 -0.0647851 0.0833311 0.0275038 -0.0573972 -0.114192 0.0575939 -0.0107162 0.0336434 -0.0598642 0.135137 -0.0366162 -0.0687087 -0.0286981 -0.0699823 0.0354883 -0.018257 -0.0246951 -0.0411367 0.091362 -0.0465592 -0.022964 -0.0679729 0.0340538 -0.140532 0.0900663 0.1734 0.0926805 -0.0524462 -0.0410996 0.0776987 0.0142654 0.122793 -0.152755 0.0523358 -0.0376282 0.104616 0.0710619 -0.0308907 0.0542767 0.11358 -0.073697 -0.0560507 0.0528456 0.0512283 -0.0707977 -0.223892 0.0612089 0.109886 0.0646321 -0.0251953 0.0321507 -0.00532652 -0.0840301 0.0698928 0.021072 0.0506057 
0.0822096 0.0355571 -0.119282 -0.0174348 0.101665 0.182048 0.00076372 -0.116094 -0.157998 -0.0312712 0.021128 0.0956171 0.0546716 -0.0777964 -0.0571479 -0.00824785 -0.0616926 0.0902767 0.015406 0.121157 0.111695 -0.0131852 0.109146 0.088504 -0.0128351 0.0903041 -0.031169 -0.250489 0.0727307 0.0926489 -0.0243829 0.0681924 -0.0784615 0.0134735 0.0538304 0.0207178 -0.063616 0.133013 0.0366628 -0.0231917 0.000764048 -0.00274602 -0.065682 0.124814 -0.199004 0.0548325 0.220188 0.00267274 -0.161328 0.0391046 0.0300608 0.0320129 -0.0280357 0.0191507 0.100818 -0.0158637 0.109599 0.187861 -0.0146322 -0.108859 -0.041044 0.022308 0.28869 -0.0988257 0.117577 -0.129357 0.00922597 0.023411 -0.0284178 0.157504 0.00480574 0.107778 -0.0564036 0.0586873 -0.00355791 -0.0488073 -0.117029 0.0628461 0.0215604 0.0487073 -0.0468576 0.132175 -0.0130529 -0.0590753 -0.0519701 -0.0524862 0.0569705 0.0285205 -0.00927617 -0.0152735 0.109143 -0.0599082 -0.0469181 -0.0416677 -0.00363215 -0.132409 0.0591602 0.182569 0.0506647 -0.0603863 -0.010358 0.0691211 -0.0127323 0.131835 -0.119036 0.0480112 -0.0572895 0.115244 0.054531 -0.0307455 0.0588531 0.130948 -0.0692852 -0.0204311 0.0528939 0.069985 -0.0949468 -0.18983 0.0232192 0.117464 0.0432479 -0.017851 0.0360676 -0.018604 -0.0946813 0.0722403 0.0102957 0.0246245 
0.0780323 0.0465026 -0.112005 -0.0280566 0.109279 0.18509 0.0114961 -0.114701 -0.151233 -0.0409267 0.0134612 0.0946319 0.0530753 -0.0749881 -0.0466222 -0.0234936 -0.0587225 0.0794735 0.000769241 0.11577 0.100956 -0.00381895 0.0938663 0.0790617 -0.0155551 0.09255 -0.0408338 -0.237998 0.0763042 0.0852776 -0.0141468 0.0812824 -0.0824052 0.0240607 0.0535135 0.0252458 -0.0535648 0.139743 0.0311455 -0.021356 0.0247925 -0.00376327 -0.0623563 0.118545 -0.19844 0.0687536 0.215172 0.00669566 -0.167497 0.0276473 0.0154075 0.0351168 -0.0310002 0.0135711 0.10153 -0.0113625 0.0841373 0.199184 -0.0254884 -0.107749 -0.0519687 0.0269666 0.28621 -0.105494 0.122504 -0.117288 0.0180896 0.0251666 -0.0362772 0.155803 0.0103033 0.0983637 -0.0509929 0.0667258 0.00504183 -0.0424343 -0.120452 0.0566727 0.0230849 0.0382535 -0.0508381 0.140944 -0.00860273 -0.0565803 -0.0508777 -0.0626981 0.0686707 0.0304749 -0.0138989 -0.00401127 0.119232 -0.0720973 -0.040963 -0.0449123 -0.00353891 -0.129644 0.0695001 0.167463 0.0497297 -0.0582309 -0.0222672 0.0734645 -0.015728 0.138914 -0.136341 0.0518923 -0.064799 0.121541 0.0504773 -0.0331058 0.0730883 0.128724 -0.0910218 -0.0121338 0.0543066 0.0567259 -0.105102 -0.199074 0.0332509 0.118804 0.0558744 -0.0121477 0.034311 -0.00642343 -0.0810586 0.0646074 0.0065425 0.00873856 
0.0415445 0.0498182 -0.0807518 0.00374764 0.0695829 0.204018 -0.00759499 -0.129793 -0.150926 -0.0362925 0.0113009 0.0785061 0.0332201 -0.0881984 -0.0369936 -0.0341977 -0.0907603 0.0983468 0.0488501 0.0902444 0.097502 -0.0183085 0.0959075 0.0928169 -0.00103396 0.0909426 -0.0535381 -0.249123 0.0765256 0.0790587 0.0138019 0.0714188 -0.0673139 0.00271172 0.0822756 0.0401681 -0.0545295 0.100211 0.0326914 -0.0366153 0.0338525 -0.0322665 -0.0515572 0.114452 -0.203329 0.0325167 0.234948 -0.00147564 -0.170312 0.018607 0.007334 0.0256233 0.0226702 0.0164688 0.103089 0.0197845 0.110675 0.170897 -0.0109808 -0.130148 -0.0635436 0.0539946 0.27959 -0.113187 0.129969 -0.0686815 0.037527 -0.039531 -0.0527464 0.168857 -0.0230939 0.0852258 -0.062084 0.0731914 0.0239543 -0.0657149 -0.128098 0.0406517 0.0293133 0.0417658 -0.0560647 0.143487 -0.0113913 -0.0586766 -0.0339426 -0.0454451 0.0429925 0.0203042 -0.0211752 0.00506457 0.13287 -0.0374319 -0.0219983 -0.0546067 -0.0114611 -0.128397 0.0537676 0.213757 0.0564051 -0.0500992 -0.0063629 0.0730041 0.0003911 0.0922347 -0.102996 0.0714356 -0.0185378 0.0935049 0.0464844 -0.0095909 0.0471996 0.11574 -0.0642484 -0.0702417 0.051658 0.0538424 -0.0707237 -0.200559 0.05373 0.112379 0.0824849 -0.0631537 0.0298973 -0.0458605 -0.101808 0.0979266 0.0389798 0.0536951 
0.0373413 0.0802472 -0.0868071 0.00988043 0.0377466 0.197735 -0.0053419 -0.166472 -0.127835 -0.0431785 -0.00386784 0.0526738 0.0316296 -0.0836823 -0.0199591 -0.0578394 -0.106961 0.0643995 0.050638 0.076301 0.0539101 -0.00177626 0.0750726 0.0678756 -0.0100911 0.097208 -0.0713834 -0.240978 0.0480269 0.0842794 0.0169426 0.0941353 -0.0653447 -0.00512214 0.110144 0.0495168 -0.00943659 0.100442 0.0347264 -0.0443432 0.0493386 -0.0546164 -0.0381329 0.114899 -0.203876 0.0730816 0.237297 0.0226098 -0.161923 0.0215039 0.00261021 0.0370384 0.0550648 0.0298112 0.121368 0.00893761 0.100915 0.13321 0.0136689 -0.154407 -0.0727058 0.0636807 0.251153 -0.105452 0.109609 -0.0477747 0.0770792 -0.0429794 -0.0359474 0.141451 -0.0274679 0.0577107 -0.0464617 0.0816478 0.047923 -0.06467 -0.15941 0.0164188 0.033941 0.0683525 -0.0149454 0.146991 -0.0284925 -0.0607101 -0.013898 -0.0422534 0.0258566 -0.00467716 -0.0340608 0.0228691 0.12898 -0.031183 -0.000109358 -0.0877797 -0.056757 -0.135626 0.0704195 0.208076 0.0774673 -0.0730366 0.00818846 0.0970004 0.0367699 0.0731157 -0.125455 0.0514393 -0.0231225 0.120782 0.0286957 0.0403119 0.0815704 0.10038 -0.0825031 -0.0970733 0.01168 0.039695 -0.0806004 -0.212162 0.0510241 0.0820906 0.107216 -0.0637051 0.0496411 -0.0306903 -0.0896801 0.0660402 0.0477989 0.0634513 
0.0182221 0.0778619 -0.152785 -0.00316153 0.0597687 0.13529 -0.0146218 -0.190867 -0.11014 -0.0183813 -0.00546049 0.0586762 0.078802 0.0169521 -0.0233487 -0.0186584 -0.0368876 0.0488776 0.0714208 0.101822 0.0499217 -0.027795 0.101665 0.0712403 -0.01311 0.101744 -0.0576985 -0.236782 0.0632295 0.142238 0.0181003 0.129551 -0.0115844 -0.0461892 0.0739335 0.0830322 -0.011244 0.153787 0.00215601 -0.0280535 -0.0162179 0.0100377 -0.0436644 0.121798 -0.18218 0.122966 0.24298 0.0179559 -0.124653 -0.0234257 -0.00570196 0.0196884 0.0562654 -0.00528573 0.120555 0.0386728 0.0806859 0.178703 0.0437485 -0.124204 -0.0815707 0.0377608 0.242703 -0.120756 0.128784 -0.0669691 0.0586522 0.00623428 -0.0281968 0.111109 0.00325864 0.070306 -0.0576642 0.0306476 0.0365457 -0.0192898 -0.139325 0.0375262 0.0117846 0.0295719 -0.0201561 0.145704 -0.0847239 -0.0619538 -0.0276206 -0.0543941 0.00737139 -0.0304299 -0.0321669 -0.020254 0.0735037 -0.0286714 0.0103629 -0.0929811 0.00628187 -0.111635 0.0666889 0.21187 0.0966167 -0.0619649 -0.0149928 0.071378 0.0421809 0.0788446 -0.19911 0.0557735 -0.0688741 0.0758249 0.0587409 0.0215613 0.0603254 0.0932217 -0.0844823 -0.0905456 -0.00984041 0.0664608 -0.0884861 -0.228848 0.0173255 0.097216 0.0684366 -0.0288519 0.0227932 0.000627439 -0.126746 0.0765757 -0.0147612 0.0464908 
0.0224812 0.0742021 -0.165583 -0.00157806 0.0555077 0.144057 -0.014938 -0.18963 -0.108569 -0.0145032 0.00070728 0.0537667 0.0868066 0.0176889 -0.036284 -0.011826 -0.0385794 0.0591863 0.0710091 0.0935956 0.064429 -0.0353636 0.0974706 0.0820813 -0.0110189 0.0923855 -0.0544682 -0.24464 0.0635472 0.155392 0.015032 0.126837 -0.0187507 -0.0508914 0.070573 0.0800413 -0.0212371 0.131245 0.00150823 -0.0305615 -0.0253905 0.0030284 -0.041678 0.13377 -0.172922 0.110756 0.243654 0.0225586 -0.126968 -0.0292151 0.00285069 0.0118846 0.0639577 -0.00963653 0.115123 0.0461966 0.0856846 0.177346 0.0606009 -0.13205 -0.0713141 0.0439892 0.2442 -0.115811 0.116162 -0.0679613 0.0566159 0.00645422 -0.0189699 0.107667 -0.00584379 0.0696506 -0.059704 0.0100628 0.0264211 -0.0192682 -0.136423 0.0412697 0.0060887 0.0335047 -0.0138459 0.144527 -0.0910727 -0.0668849 -0.0343746 -0.038417 0.00423673 -0.0418099 -0.0339934 -0.0217224 0.0721637 -0.0259263 -3.57763e-05 -0.0930769 0.00156915 -0.101628 0.0544457 0.215939 0.0988762 -0.0594361 0.00483112 0.069195 0.0467183 0.0749085 -0.194266 0.0509453 -0.0745816 0.0739512 0.0428923 0.0251072 0.06121 0.0913775 -0.076994 -0.102656 -0.0151286 0.0756778 -0.0925937 -0.221359 0.0116429 0.090333 0.0614501 -0.0388161 0.0226559 -0.00513266 -0.138638 0.0825578 -0.0274013 0.0499873 
0.0178428 0.0706923 -0.155698 -0.0236306 0.0380589 0.148075 -0.0178538 -0.128955 -0.161036 0.0389026 0.0135291 0.0443956 0.0979476 -0.0342376 -0.0294244 0.0185255 -0.0596427 0.0627811 0.0691053 0.0812193 0.0781219 -0.0371892 0.0709884 0.0600241 -0.0167725 0.138743 -0.0499467 -0.265443 0.0855669 0.114868 -0.00489414 0.126626 -0.0636635 -0.0463465 0.0446449 0.0580877 -0.0552341 0.11886 0.0354924 0.00712496 -0.011157 -0.0253699 -0.0530804 0.162015 -0.150738 0.0820971 0.254793 0.00633554 -0.16395 -0.0610949 0.0415952 0.00109054 -0.00202857 -0.00910033 0.0808828 0.0367543 0.0857868 0.169131 0.0772151 -0.125732 -0.0401753 0.0164142 0.237186 -0.0743945 0.111719 -0.0944897 0.0565488 0.0115414 0.0380748 0.0848018 -0.0209639 0.105569 -0.0448014 0.0251135 0.0180946 -0.0529134 -0.153276 0.0884402 0.000196077 0.0457761 -0.0114272 0.131552 -0.0680731 -0.0646851 -0.0666207 -0.0254898 0.0525659 -0.0334457 -0.0149168 -0.0650424 0.0464631 -0.00894794 -0.0377935 -0.0866343 -0.0225791 -0.0863362 0.0760035 0.197452 0.072289 -0.0540203 -0.0275843 0.0572603 0.0394045 0.105702 -0.17038 0.0374346 -0.0929848 0.120048 0.0363912 -0.00260322 0.0481403 0.101288 -0.0970335 -0.109626 0.00851435 0.0524523 -0.107561 -0.23702 0.00866235 0.0534018 0.0536314 -0.0303927 0.0437368 -0.00500536 -0.134343 0.0588762 -0.0553187 0.0510948 
-0.00987461 0.086043 -0.128749 0.00166208 0.0419985 0.166841 -0.0398729 -0.152806 -0.135576 0.034316 0.00602776 0.0396683 0.0746441 -0.0449333 -0.000232105 -0.00312228 -0.0681515 0.0822761 0.0871565 0.0775706 0.0632354 -0.0415411 0.085036 0.0905302 0.0095774 0.101011 -0.0569743 -0.269913 0.0674855 0.116552 0.0367584 0.096686 -0.0271655 -0.0508729 0.0828106 0.0846348 -0.0418243 0.0832196 0.00440399 -0.0247937 0.00186534 -0.0405217 -0.0387979 0.160128 -0.173261 0.0880842 0.26434 0.0201689 -0.160174 -0.0482991 0.030753 -0.00925717 0.0480082 -0.031363 0.0970641 0.0628632 0.0724273 0.146244 0.0796737 -0.139974 -0.0720817 0.03693 0.22266 -0.0994851 0.130447 -0.0738196 0.0501271 -0.0178594 -0.0149359 0.10847 -0.0215665 0.0898062 -0.0601946 -0.00817882 0.0353268 -0.0363588 -0.164832 0.0825219 0.0137788 0.0513603 -0.0272265 0.136789 -0.0738565 -0.048698 -0.0509402 -0.0212717 0.0239486 -0.0363062 -0.0274628 -0.0235073 0.0513716 0.00126043 -0.0204421 -0.0921561 -0.0291573 -0.0901725 0.0509181 0.216463 0.069224 -0.0694121 -0.00208441 0.0636848 0.0471576 0.046404 -0.163843 0.0540433 -0.0664469 0.0800862 0.0428472 0.0305473 0.0445068 0.0901532 -0.0720096 -0.136228 -0.000408245 0.0522057 -0.104229 -0.231572 0.0151101 0.0835517 0.0852938 -0.06214 0.0183603 -0.0116491 -0.131166 0.089578 -0.0152431 0.0652416 
-0.0082112 0.0667416 -0.059135 -0.00253771 0.049407 0.15206 -0.0454311 -0.153371 -0.110448 -0.0524391 -0.0241246 0.0488025 0.0354728 -0.0715043 -0.0294531 -0.0497928 -0.118616 0.0811122 0.0413261 0.0940806 0.0830454 -0.0204878 0.0981272 0.0921246 -0.000354252 0.102766 -0.0656535 -0.247061 0.059705 0.0717804 0.0441254 0.050753 -0.0485241 -0.0269893 0.110363 0.054081 -0.033641 0.123315 0.010498 -0.0463306 0.0394252 -0.0225028 -0.040327 0.148238 -0.188056 0.0495884 0.251247 0.0202838 -0.130551 0.0136619 -0.0185498 -0.00916499 0.0598943 0.0121929 0.117023 0.0154723 0.098589 0.140594 0.0382204 -0.196837 -0.0513542 0.0614015 0.230672 -0.0467885 0.0918246 -0.0739675 0.0733181 -0.0378108 -0.000286352 0.126341 -0.0204932 0.067806 -0.0223551 0.0520344 0.0362364 -0.0768977 -0.190104 0.0432333 0.048208 0.0672704 -0.0188993 0.177806 -0.0400725 -0.0526432 -0.00985616 -0.060609 0.0310055 0.0389081 -0.0146789 -0.012562 0.113837 -0.000757451 0.0114999 -0.106978 -0.0466836 -0.131292 0.0397851 0.232811 0.0535894 -0.0830796 -0.0112818 0.0659478 0.0400278 0.0642893 -0.130067 0.0468383 -0.0423553 0.0951658 0.0571876 0.0353254 0.0808188 0.118638 -0.103609 -0.0797452 -0.00901028 0.0546099 -0.0932324 -0.228027 0.0144659 0.0638307 0.0763078 -0.0151052 0.0111275 -0.0417602 -0.14239 0.0643573 0.0123432 0.0663162 
-0.0224596 0.0669441 -0.0697809 0.0191243 0.0329432 0.182864 -0.0156713 -0.16379 -0.0751283 -0.057891 -0.034266 0.0476226 0.0297249 -0.051601 -0.0232507 -0.0621634 -0.100455 0.0507425 0.0646227 0.0859762 0.0574868 -0.0339364 0.0694278 0.116833 -0.0201552 0.0843378 -0.09461 -0.236994 0.0479176 0.0672229 0.0504046 0.0567755 -0.0423071 -0.0409888 0.127403 0.0905494 -0.0106854 0.102224 -0.0367041 -0.084359 0.0465308 -0.0160098 -0.029609 0.117258 -0.17611 0.0549701 0.236335 0.0276129 -0.132168 0.00534074 -0.0555773 -0.035734 0.108217 -0.000312384 0.152953 0.0509479 0.0456077 0.160702 0.0263317 -0.189804 -0.082316 0.104328 0.245594 -0.120969 0.129956 0.00257141 0.0787335 -0.0718119 -0.0544992 0.106222 -0.0279108 0.0488626 -0.0359187 0.0546089 0.0528935 -0.0415395 -0.149391 0.0226794 0.0692961 0.0246575 -0.0124003 0.153332 -0.068259 -0.0765851 0.00280571 -0.0570208 0.00754084 0.0188713 -0.0183854 0.0371575 0.142589 -0.0144559 0.0316287 -0.0985277 -0.0213499 -0.103954 0.0566463 0.207579 0.0662298 -0.0484476 0.0257658 0.0635342 0.0286795 -0.00541053 -0.164695 0.0855443 -0.0143109 0.0276693 0.0146539 0.0668432 0.0835933 0.101317 -0.0533014 -0.125704 0.00410052 0.0539919 -0.0820163 -0.206199 0.0228595 0.0667273 0.07865 -0.068968 0.0249016 -0.0316864 -0.137627 0.116091 0.0215424 0.0448868 
-0.0302497 0.115547 -0.106754 -0.0249763 0.0192086 0.145832 -0.0221579 -0.163116 -0.144939 0.0455627 -0.0151297 0.0147679 0.0732668 -0.0196223 0.0207651 -0.0315387 -0.0499218 0.0818869 0.108292 0.0622002 0.00416938 0.0111909 0.0366353 0.0336733 -0.0579716 0.136537 -0.0994852 -0.232499 0.0866579 0.10449 0.0126722 0.127452 -0.0356588 -0.072369 0.141004 0.0965871 0.0143174 0.0858961 0.0175154 -0.0365242 -0.000687167 -0.0279567 -0.0390288 0.136379 -0.165423 0.156454 0.255723 0.0377454 -0.185201 -0.064449 -0.0130027 0.0067681 0.0526076 -0.0204054 0.0783948 0.0592623 0.053624 0.123579 0.0541499 -0.10266 -0.0574352 0.068188 0.207348 -0.0986369 0.145774 -0.0654382 0.0790086 -0.0404136 -0.00761672 0.0868104 -0.0109544 0.0323533 -0.0350718 0.0229993 0.0189266 -0.0401711 -0.178428 0.0689239 0.0427915 -0.0183808 0.00685394 0.154182 -0.114037 -0.0460025 -0.0205595 -0.0490344 0.00541599 -0.0596087 -0.0331563 0.0220766 0.0902056 0.0196467 0.00974261 -0.0970417 -0.017167 -0.0824512 0.0871293 0.204102 0.0670818 -0.0482832 -0.00461153 0.101935 0.0397552 0.0112127 -0.170379 0.0572024 -0.0251375 0.0622268 0.0392044 0.0844488 0.0634541 0.0415685 -0.0782652 -0.150202 -0.0231452 0.0168195 -0.0799308 -0.265994 0.0165409 0.027613 0.0868541 -0.0855379 0.0407835 -0.00138753 -0.108863 0.0658741 -0.00729148 0.0340938 
-0.0231391 0.13128 -0.118453 -0.0440657 0.0183174 0.158669 -0.00336093 -0.137327 -0.143467 0.0690418 -0.00537154 0.0186737 0.0777911 -0.0527529 0.00972259 -0.0396749 -0.0600645 0.0837643 0.0857665 0.0500588 0.0063475 0.011813 0.0239218 0.0455793 -0.0596711 0.135429 -0.0808615 -0.231901 0.110083 0.0999103 0.0122513 0.116236 -0.0591069 -0.0626321 0.116577 0.0699815 0.00318535 0.0834703 0.0235843 -0.00585866 0.0132593 -0.0432531 -0.0536894 0.164314 -0.167858 0.13177 0.248669 0.0387011 -0.187326 -0.0692459 0.00786615 0.0216709 0.013514 -0.0286599 0.0597849 0.062616 0.0441341 0.142946 0.0560102 -0.100012 -0.0591594 0.0437772 0.222864 -0.0913816 0.132053 -0.0974763 0.0855415 -0.0451527 -0.000828955 0.0973507 -0.0194339 0.0478295 -0.0292832 0.0386108 0.0163342 -0.0556358 -0.1774 0.0988968 0.0322326 -0.01827 -0.00719643 0.154755 -0.0955016 -0.0371325 -0.0245247 -0.0571751 0.0291069 -0.0596885 -0.0181176 0.00524695 0.0796036 0.00245664 -0.00357844 -0.102826 -0.0115945 -0.0958149 0.0909597 0.181016 0.0673615 -0.0456326 -0.0175256 0.104624 0.0349856 0.0472171 -0.170552 0.0425221 -0.0424268 0.0806069 0.0368742 0.0659337 0.0766755 0.0634314 -0.0884784 -0.128569 -0.0203815 0.0104728 -0.0835137 -0.271064 0.026272 0.0283114 0.0888988 -0.078333 0.0321358 0.00411962 -0.110216 0.0520715 -0.0357235 0.0288269 
-0.0132105 0.118589 -0.114334 -0.0363384 0.00946189 0.149096 0.00994458 -0.1204 -0.159091 0.0762874 -0.0127793 0.0119168 0.0845083 -0.0551131 0.0125032 -0.0356687 -0.0378598 0.0836709 0.0936188 0.0505967 0.0113242 -0.00501334 0.0288589 0.0427983 -0.0678469 0.139336 -0.0937761 -0.24473 0.109189 0.0921954 0.00476353 0.138683 -0.0623179 -0.0542622 0.114763 0.0558457 0.00663281 0.105231 0.0227891 -0.0219436 0.00594541 -0.0481233 -0.0592444 0.151554 -0.159217 0.136161 0.24037 0.0337218 -0.198441 -0.0739937 0.0131685 0.0219634 0.0190477 -0.0279867 0.0594259 0.0538019 0.062519 0.129958 0.0632527 -0.102643 -0.0430619 0.0420021 0.204342 -0.0995935 0.140657 -0.0943145 0.0833615 -0.0416692 0.000253431 0.0892117 -0.0342272 0.0399662 -0.0419782 0.0453226 0.000225688 -0.0632701 -0.162347 0.10192 0.0414187 -0.0174726 -0.0259801 0.140308 -0.106234 -0.055871 -0.0155485 -0.0686427 0.0288637 -0.062689 -0.0107815 0.00054043 0.0799308 0.0129758 -0.000880245 -0.107037 -0.00857191 -0.0852558 0.10959 0.182955 0.0624334 -0.0410889 -0.00915572 0.108559 0.028971 0.060877 -0.158962 0.0267224 -0.0363548 0.0839155 0.0466821 0.0591613 0.059511 0.0688323 -0.089725 -0.144854 -0.00279687 0.00769576 -0.0784791 -0.287646 0.0300289 0.0279407 0.0772923 -0.0730634 0.0392227 0.011421 -0.0990353 0.0408212 -0.032057 0.0168921 
