0.0572241 0.133211 -0.104296 -0.066209 0.0996779 0.158879 0.0430394 -0.0169348 -0.181635 0.170639 0.0699368 -0.00706316 0.122063 0.0172432 0.112708 -0.0210877 0.111296 0.0927467 0.0542827 0.069254 0.0335298 0.00537414 0.0706304 0.109378 0.0152898 0.00357585 -0.0274858 -0.12731 0.200615 0.0921743 0.022628 0.0508547 -0.0582973 -0.012917 0.02335 0.0557066 -0.0298369 0.0976364 0.0194338 0.0150435 -0.0423982 -0.00906269 -0.105305 0.115813 -0.20012 0.0840022 0.140618 0.0890759 -0.125585 -0.0583478 0.088917 0.13663 -0.113289 -0.0840323 0.00597597 0.0305906 0.00511507 0.186192 0.0296712 -0.0279434 -0.124221 -0.0443328 0.180376 -0.157853 0.110516 -0.103358 0.0305467 0.0397277 -0.0938449 0.13865 0.0349305 0.153585 -0.0846772 0.00253482 -0.00199386 -0.0455316 -0.0497022 0.168003 0.058534 -0.00106165 -0.0564786 0.0435148 -0.00839275 -0.0275235 0.0119986 -0.101779 0.038385 -0.0168474 0.0384831 -0.00176826 0.0259374 -0.0210252 -0.0405835 -0.0110561 0.048287 -0.169267 0.0769986 0.11197 -0.00972255 -0.0681398 -0.0103415 0.127924 0.00108568 0.101619 -0.169867 0.0784798 -0.0536986 0.0142532 0.203776 -0.0529607 0.0380195 0.109587 -0.0660931 0.0192771 0.0670117 0.0220889 -0.0516176 -0.189685 -0.00166252 0.151135 0.0222758 -0.0953821 -0.0292425 0.0787516 -0.0652431 0.0647065 -0.0229444 -0.000847231 
0.0204095 0.143137 -0.145821 -0.0616518 0.0779568 0.159849 0.0119537 -0.0777234 -0.167224 0.139363 0.0779049 0.00852478 0.099783 0.0212708 0.0738041 0.00528328 0.0429323 0.0656478 0.0987146 0.0351487 0.0386551 -0.00957839 0.0771203 0.0580413 0.0329035 0.0513793 0.000482178 -0.161815 0.179091 0.115561 0.0349445 0.0450414 -0.0414767 -0.0557288 0.0271454 0.0766673 -0.0551403 0.0784235 0.0542085 0.0508978 -0.0537075 -0.0176872 -0.101573 0.138939 -0.186831 0.106469 0.174669 0.0386744 -0.141893 -0.0982758 0.063845 0.122785 -0.0891468 -0.0845906 -0.00650644 0.0622409 0.0185207 0.217216 0.0053879 0.00232329 -0.119044 -0.0534827 0.239574 -0.151921 0.14927 -0.103102 0.0183823 0.040371 -0.0624974 0.152391 0.0369495 0.163215 -0.0974095 -0.017836 0.0191542 -0.0324661 -0.0775997 0.138527 -0.00128006 0.00831738 -0.0666977 0.0481889 -0.0206625 -0.0115735 -0.0559308 -0.0742493 0.0382306 -0.050575 -0.00693191 -0.0430174 0.0122604 -0.0262816 -0.0470602 -0.018973 0.0675808 -0.148303 0.0648009 0.129275 0.0339996 -0.0419584 -0.0522944 0.0953297 -0.00703619 0.0818415 -0.162028 0.0911746 -0.0479342 0.047769 0.151807 -0.0609375 0.0258677 0.0707558 -0.0536313 -0.013859 0.0676804 0.0448251 -0.0655036 -0.170857 0.0270021 0.148659 0.0405803 -0.101205 -0.032984 0.0535075 -0.0669198 0.0943607 -0.0303729 0.0380567 
0.0599464 0.122859 -0.189721 -0.0474317 0.064835 0.183247 -0.00713154 -0.082316 -0.152798 0.0739345 0.10355 0.0402649 0.110421 -0.0103539 -0.0271835 0.0217949 -0.0321301 0.0792114 0.0320329 0.0553346 0.107275 -0.0378126 0.0743909 0.0633758 0.0387248 0.0396027 0.0232589 -0.176508 0.131521 0.14374 -0.00497961 0.042964 -0.0709486 -0.0440277 -0.0187478 0.0438632 -0.122967 0.0437179 0.0581335 0.0570027 -0.0583724 -0.0420591 -0.080459 0.189226 -0.166862 0.0375189 0.193483 0.0207002 -0.162285 -0.0471816 0.0823849 0.0960925 -0.1062 -0.0435214 0.00384059 0.0379504 0.0201641 0.215311 0.0317071 -0.0507611 -0.0848172 -0.0432166 0.293018 -0.0961351 0.0667616 -0.118958 0.0128208 0.0531122 -0.0236645 0.146614 0.0321384 0.157042 -0.0716344 -0.0209574 0.00391701 -0.0478079 -0.0862422 0.0878173 -0.0474457 0.068345 -0.0358489 0.0517327 -0.00752959 -0.034231 -0.104158 0.00591089 0.0484986 -0.0662014 0.00917154 -0.0555484 0.0125436 -0.0749573 -0.101103 -0.0217188 0.0261317 -0.133886 0.0216247 0.140146 0.039061 -0.060581 -0.0372508 0.0751033 0.0198686 0.117616 -0.159779 0.093802 -0.0943898 0.131766 0.0803447 -0.0869903 0.0466036 0.0932205 -0.0727967 -0.00704286 0.0488151 0.0608525 -0.0766697 -0.134362 0.0600667 0.130286 0.0307257 -0.0845362 -0.00278451 0.0294757 -0.0849167 0.0746154 -0.0206218 0.0600034 
0.0770132 0.117953 -0.20363 -0.0341111 0.101168 0.186182 -0.00875425 -0.13425 -0.113847 0.0111836 0.0855008 0.045125 0.0913633 0.0139383 -0.0465589 0.0311327 -0.0177838 0.0581217 0.0107529 0.0661503 0.10706 -0.000570836 0.0620454 0.0763508 0.0346424 0.0352527 -0.00624014 -0.158369 0.131129 0.157888 0.0244502 0.0761171 -0.0929324 -0.0374501 -0.0132435 0.0837917 -0.0997996 0.0345643 0.0613974 0.0519087 -0.0429542 0.00832451 -0.0644476 0.161823 -0.14134 0.0524892 0.195604 0.0452359 -0.12354 -0.0373272 0.0438432 0.101146 -0.0800317 -0.0421219 0.0332705 0.0276134 0.0133873 0.244132 0.0273288 -0.0500735 -0.096956 0.00111248 0.305132 -0.116865 0.0430577 -0.107256 0.0346796 0.0586836 -0.0145899 0.155485 0.0488756 0.162753 -0.0592004 0.0153766 -0.000805713 -0.0460191 -0.0807536 0.0819057 -0.0634197 0.0439044 0.0167218 0.113567 -0.0202506 -0.0537839 -0.0864251 0.010822 0.0301345 -0.0570744 -0.0266928 -0.0470769 0.0629281 -0.0738496 -0.0948571 -0.028577 0.0564325 -0.121489 0.0205959 0.133716 0.045686 -0.0514589 -0.0438694 0.058149 0.0188917 0.119573 -0.201545 0.110004 -0.105275 0.105254 0.0745678 -0.0392626 0.072679 0.0934645 -0.0824116 0.0149312 0.0347476 0.062245 -0.0736609 -0.138861 0.0424661 0.11908 0.0378023 -0.0445027 0.025954 0.0322622 -0.130104 0.0704266 -0.0391786 0.042781 
