{
  "descriptor": [
    -0.050190072506666183,
    0.031147321686148643,
    0.09944604337215424,
    -0.044443078339099884,
    -0.14885014295578003,
    0.024594523012638092,
    -0.07351521402597427,
    -0.04437028989195824,
    0.13474999368190765,
    -0.14183305203914642,
    0.1628488153219223,
    -0.02954513020813465,
    -0.2379809319972992,
    0.08650872111320496,
    -0.04408722370862961,
    0.14721068739891052,
    -0.164045512676239,
    -0.17229245603084564,
    -0.04271955415606499,
    -0.03975309431552887,
    0.03261345252394676,
    0.047088101506233215,
    0.02251221053302288,
    0.08186673372983932,
    -0.1528644561767578,
    -0.3931935727596283,
    -0.0837356299161911,
    -0.06669460982084274,
    0.0755227729678154,
    -0.10443398356437683,
    -0.06833522021770477,
    0.06956853717565536,
    -0.1619923710823059,
    0.053437311202287674,
    0.06695973873138428,
    0.08065915107727051,
    -0.044303081929683685,
    -0.15566754341125488,
    0.25008195638656616,
    0.09654583781957626,
    -0.27548834681510925,
    0.006465449463576078,
    0.03338492289185524,
    0.2530287206172943,
    0.1999868005514145,
    0.009141184389591217,
    0.051661986857652664,
    -0.05619587004184723,
    0.15387855470180511,
    -0.2903423607349396,
    0.054587673395872116,
    0.2117052674293518,
    0.02571335807442665,
    0.06273656338453293,
    0.08147228509187698,
    -0.17321573197841644,
    0.0030136641580611467,
    0.1125921681523323,
    -0.1440420150756836,
    0.04851442947983742,
    0.04383794590830803,
    -0.052240610122680664,
    0.012653753161430359,
    -0.08512061834335327,
    0.18668155372142792,
    0.09768706560134888,
    -0.10861550271511078,
    -0.13302309811115265,
    0.22577837109565735,
    -0.16540402173995972,
    -0.04641176760196686,
    0.08264124393463135,
    -0.14920832216739655,
    -0.17916420102119446,
    -0.1928585320711136,
    0.019372088834643364,
    0.3963693380355835,
    0.1631464660167694,
    -0.11974851042032242,
    0.08223903179168701,
    -0.004167710430920124,
    -0.02045123465359211,
    0.031899452209472656,
    0.15507066249847412,
    -0.07655724883079529,
    0.06332603096961975,
    -0.029964622110128403,
    0.06088860705494881,
    0.24119114875793457,
    0.024601373821496964,
    0.0028176596388220787,
    0.24471095204353333,
    -0.01407310739159584,
    0.026396574452519417,
    0.10492268204689026,
    0.06399190425872803,
    -0.11155923455953598,
    -0.07261601835489273,
    -0.17623299360275269,
    -0.038386087864637375,
    0.0060294377617537975,
    -0.0668407455086708,
    -0.007358909584581852,
    0.14318951964378357,
    -0.21805024147033691,
    0.14214366674423218,
    -0.07785402983427048,
    -0.06638728082180023,
    -0.024880679324269295,
    0.01360374130308628,
    -0.08707591146230698,
    0.003941535949707031,
    0.13736291229724884,
    -0.258991539478302,
    0.14790228009223938,
    0.1756351739168167,
    0.06559770554304123,
    0.11920923739671707,
    0.07829352468252182,
    0.021030131727457047,
    0.019203396514058113,
    -0.06927155703306198,
    -0.17777514457702637,
    -0.09838183969259262,
    0.05193854123353958,
    -0.04194509610533714,
    -0.003788597183302045,
    -0.010722564533352852
  ]
}