{
  "descriptor": [
    -0.05757838115096092,
    0.0568070150911808,
    0.03352237865328789,
    -0.0729508027434349,
    -0.10163672268390656,
    0.012728001922369003,
    0.06900999695062637,
    -0.04889441654086113,
    0.15452244877815247,
    -0.13802893459796906,
    0.2577202618122101,
    -0.08586902171373367,
    -0.26685819029808044,
    -0.08009916543960571,
    -0.05573226138949394,
    0.14727291464805603,
    -0.09404408931732178,
    -0.16053445637226105,
    -0.0819237232208252,
    -0.08715544641017914,
    0.0785926803946495,
    -0.006969750858843327,
    -0.08748650550842285,
    0.030498526990413666,
    -0.1624818742275238,
    -0.2781316041946411,
    0.019370898604393005,
    -0.12517660856246948,
    -0.018868032842874527,
    -0.14371664822101593,
    0.05249745398759842,
    0.06303049623966217,
    -0.10126399993896484,
    -0.045421846210956573,
    -0.03207992762327194,
    0.08442356437444687,
    -0.09959818422794342,
    -0.05172564461827278,
    0.21989183127880096,
    0.03243645280599594,
    -0.23247279226779938,
    0.044700559228658676,
    0.025864794850349426,
    0.32483601570129395,
    0.16339220106601715,
    -0.01357574388384819,
    0.03588203340768814,
    -0.004644293338060379,
    0.14741885662078857,
    -0.325130820274353,
    -0.013816466554999352,
    0.09643418341875076,
    0.13775387406349182,
    0.03195910155773163,
    0.16547095775604248,
    -0.11445289850234985,
    -0.015704598277807236,
    0.14656661450862885,
    -0.2080971896648407,
    0.08187106251716614,
    0.02475035935640335,
    -0.036152780055999756,
    -0.002751869149506092,
    -0.08299252390861511,
    0.17595107853412628,
    0.03592175245285034,
    -0.11592938005924225,
    -0.03804576396942139,
    0.17560386657714844,
    -0.16159622371196747,
    -0.1200217604637146,
    0.09045112133026123,
    -0.07083486020565033,
    -0.20978695154190063,
    -0.24130010604858398,
    0.07429558783769608,
    0.37957921624183655,
    0.1859436333179474,
    -0.13382264971733093,
    0.05201619863510132,
    0.04749898612499237,
    0.015458546578884125,
    0.12506745755672455,
    0.044415365904569626,
    -0.033853184431791306,
    0.02969069592654705,
    -0.048897504806518555,
    -0.009608604945242405,
    0.15761832892894745,
    -0.00889432244002819,
    -0.05387888476252556,
    0.22305437922477722,
    -0.03181697055697441,
    -0.025018587708473206,
    0.034614164382219315,
    -0.016249436885118484,
    -0.07293783128261566,
    0.03488495945930481,
    -0.11109559237957001,
    -0.025432221591472626,
    0.09326194226741791,
    -0.13701243698596954,
    0.053883425891399384,
    0.044232431799173355,
    -0.1927403211593628,
    0.1281142681837082,
    -0.07903861254453659,
    0.04114668443799019,
    -0.02656346932053566,
    0.041102536022663116,
    -0.09778323024511337,
    0.09702247381210327,
    0.1636170893907547,
    -0.27889251708984375,
    0.1631588190793991,
    0.18299493193626404,
    -0.014262177050113678,
    0.079607293009758,
    0.14404156804084778,
    -0.08417069166898727,
    0.051897596567869186,
    -0.04007004201412201,
    -0.18632812798023224,
    -0.11674871295690536,
    0.053974784910678864,
    -0.03768382966518402,
    0.09026987850666046,
    0.00884360820055008
  ]
}