0.0712079 0.00866771 -0.100817 -0.0909096 0.105412 0.196759 0.0242225 -0.00136328 -0.179941 -0.0703456 -0.0478165 0.0580451 0.126818 -0.104567 -0.0969043 -0.0341678 -0.136859 0.0394801 -0.121672 0.151382 0.136778 -0.0732552 0.107063 0.0142095 -0.0521946 -0.00831535 -0.0849751 -0.18821 -0.00625379 0.0284524 -0.0390999 -0.0160759 -0.146119 0.0565281 0.00338188 -0.00751152 -0.137456 0.0920654 -0.0465408 -0.0484448 0.000616352 -0.0537422 -0.0299465 0.174468 -0.164784 0.00822668 0.152853 0.0736702 -0.171991 0.132746 0.0141534 -0.0971144 -0.0823545 0.021543 0.0561183 -0.0714917 0.00751935 0.171022 0.0260018 -0.160267 0.0133693 0.0998638 0.228544 -0.0216106 0.0763864 -0.14457 -0.0389131 0.0746325 -0.0349577 0.055667 0.0171082 0.0952457 0.0194865 0.000347074 -0.0599269 0.013003 -0.0799869 -0.0134903 0.0672294 0.106866 -0.00392715 -0.0347628 -0.0122983 -0.0171159 -0.137085 -0.0191907 0.0866416 0.0691773 0.0496 0.0130961 0.104636 -0.113741 -0.0598723 -0.0274155 -0.0961287 -0.0620044 0.0241117 0.13784 -0.0416079 -0.0312672 0.0302801 0.0818011 -0.0526772 0.115201 -0.0943893 0.0323071 -0.155129 0.204003 -0.0142987 -0.0310042 0.0958194 0.130804 -0.0968203 0.0508048 -0.0060741 0.10518 -0.109699 -0.0173564 -0.0102555 0.116751 -0.063043 -0.0280176 0.0276306 0.00103358 -0.0686046 0.000931652 -0.0676418 -0.0429316 
0.0627938 0.0826573 -0.12423 -0.0897606 0.0867969 0.226786 0.0249014 -0.0205647 -0.222378 -0.0159192 -0.0225662 0.0294562 0.0891719 -0.103814 -0.0699002 -0.0611105 -0.104228 0.0535657 -0.0134071 0.110399 0.0840789 -0.0629121 0.103338 0.00347841 -0.0268537 0.019538 -0.0541455 -0.166774 0.0785049 0.011589 -0.023849 -0.0188394 -0.13586 0.0270482 0.0234284 -0.013292 -0.100748 0.0734427 0.00864853 -0.0561543 0.0174232 -0.0739184 -0.0215889 0.17059 -0.213262 0.0197164 0.183205 0.0757251 -0.206323 0.0981441 -0.00628529 -0.00280648 -0.0647733 0.0139748 0.0270668 -0.0465146 0.0509089 0.179069 0.0134868 -0.162561 -0.0237586 0.107798 0.287125 -0.0707551 0.0799762 -0.0728078 -0.0183596 0.0157345 -0.0499614 0.106492 -0.0209165 0.104164 -0.015246 0.079392 -0.0164463 -0.052613 -0.0773397 0.0151677 0.0757293 0.052856 -0.0468921 0.00791978 0.00880975 -0.0284319 -0.0707407 -0.0449036 0.0473809 0.0585077 0.0772647 0.0170652 0.153477 -0.0755416 -0.0482918 -0.0434745 -0.0241379 -0.130441 0.0602588 0.204577 -0.0403823 -0.0588886 0.00483641 0.11088 -0.0155214 0.109698 -0.116202 0.0811361 -0.0766856 0.18947 0.0310072 -0.0297567 0.121218 0.133526 -0.0603141 0.0338498 0.0143342 0.041533 -0.0611457 -0.0824975 0.0662845 0.11203 -0.0138848 -0.0847891 0.0374884 -0.0183391 -0.101626 0.0151448 -0.0228382 -0.00839297 
0.0838502 0.0659204 -0.135913 -0.0967305 0.0979243 0.205771 -0.00506346 -0.0168728 -0.204395 -0.0574519 -0.0302352 0.0133834 0.0906805 -0.0908124 -0.0606105 -0.0132629 -0.109016 0.000252039 -0.0508614 0.128473 0.0964287 -0.0493721 0.146872 -0.0643698 -0.0176625 0.0316045 -0.0426323 -0.176381 0.0321059 -0.00628995 -0.0202046 -0.0088221 -0.107855 0.045775 0.00783119 -0.00012281 -0.0911595 0.130013 0.00940285 -0.0478874 -0.00992943 -0.0513341 -0.0175195 0.160721 -0.193894 0.0550926 0.175642 0.0597207 -0.195963 0.128328 -0.0108053 -0.0112022 -0.0792043 0.0439264 0.0355367 -0.0910037 0.0655345 0.145321 0.0208835 -0.171444 -0.0273799 0.070659 0.262928 -0.0599748 0.0830326 -0.0936044 -0.0311147 0.0942103 -0.000471436 0.107303 0.0106772 0.111498 -0.00480579 0.0534809 -0.0142026 -0.0401153 -0.0952487 -0.00224622 0.0407478 0.0889465 -0.0233105 -0.00488645 0.00343101 -0.0301834 -0.103072 -0.0301481 0.0451377 0.0711581 0.0671351 0.00673218 0.135911 -0.0913251 -0.0779789 -0.0467074 -0.035044 -0.106156 0.0626534 0.197881 -0.0458917 -0.0679692 -0.0239571 0.0849223 -0.0203514 0.11527 -0.124567 0.0502505 -0.117274 0.211529 0.0447034 -0.052444 0.103714 0.148525 -0.0857928 0.0620516 0.0362291 0.04945 -0.0893038 -0.0767399 0.0496671 0.110025 -0.0142796 -0.0185883 0.0829818 0.0138708 -0.0555377 -0.03459 0.0097103 -0.00243726 
0.0961622 0.0505111 -0.134226 -0.0794597 0.0932997 0.169426 0.0244771 0.00757765 -0.137305 -0.0890049 -0.0208704 0.0308863 0.105664 -0.0971892 -0.0880755 -0.00332314 -0.101529 -0.0541699 -0.144206 0.166271 0.106188 -0.0782977 0.130565 -0.0599037 -0.0368914 0.0123784 -0.0572186 -0.153095 0.011272 -0.0133593 -0.0109801 0.0342154 -0.106289 0.083261 -0.0582525 -0.0107862 -0.0849792 0.196602 -0.0326573 -0.0281899 0.013077 -0.0547544 -0.0316596 0.13175 -0.158025 0.0236215 0.130849 0.0488851 -0.148297 0.139296 -0.00787719 -0.0178164 -0.11106 0.0496653 0.0625455 -0.102339 0.0179367 0.135536 0.0220966 -0.17049 -0.0435028 0.0301247 0.225954 -0.0540393 0.0587297 -0.104538 -0.0114651 0.113401 -0.00214662 0.0734948 0.0221185 0.095624 0.0106816 0.0763413 -0.00174027 -0.026235 -0.0629054 -0.00154153 0.014455 0.111102 -0.0240489 -0.0275884 0.010935 -0.034302 -0.0977195 -0.015836 0.0722043 0.0865 0.0666993 -0.00998397 0.107764 -0.144617 -0.0803224 -0.046467 -0.0487687 -0.0898688 0.0619982 0.119886 -0.0349505 -0.0526921 -0.0353098 0.0599059 -0.0369727 0.171783 -0.12618 0.0264765 -0.156081 0.235937 0.0438117 -0.084717 0.0732815 0.181043 -0.127925 0.0994819 0.0392616 0.0481961 -0.103457 -0.0596363 0.0445021 0.120778 -0.0397077 0.0516203 0.076534 0.0584169 -0.0195504 -0.0593297 -0.0105243 -0.0236725 
0.122372 0.0272203 -0.13988 -0.0207315 0.112954 0.129663 0.0762657 -0.00145693 -0.102248 -0.12031 -0.00901491 0.0771689 0.102016 -0.129558 -0.134282 0.00166934 -0.0536398 -0.0304059 -0.189969 0.210903 0.12288 -0.107368 0.105017 -0.00318503 -0.0516994 -0.0227758 -0.0899213 -0.163092 0.0137051 0.0219845 -0.0255477 0.102662 -0.0971231 0.109681 -0.0838179 -0.0442526 -0.0740872 0.199398 -0.0564745 -0.0509561 0.0312074 -0.0489914 -0.0198062 0.0948752 -0.129713 0.000503984 0.120479 0.0252825 -0.131506 0.137951 -0.0105713 -0.0386722 -0.0968347 0.0306686 0.0714342 -0.0938107 -0.00350906 0.131312 0.0060587 -0.127292 -0.0391532 0.0301191 0.201583 -0.0795953 0.0492658 -0.111267 -0.0194917 0.0547264 -0.0567243 0.0267881 -0.00549824 0.0579021 -0.00135011 0.110136 -0.0216974 -0.0174212 -0.000655036 0.00718247 0.000172195 0.0930297 -0.0477929 -0.0220092 -0.0185777 -0.0538854 -0.0671684 0.0132715 0.0593427 0.0609661 0.0346134 -0.00911422 0.116627 -0.156964 -0.0958542 -0.03867 -0.0199666 -0.0525019 0.0505348 0.0780208 -0.0268948 -0.0300204 -0.0280549 0.0297016 -0.0463773 0.224535 -0.111884 0.0150045 -0.129557 0.245844 0.0404266 -0.0821344 0.0389751 0.179262 -0.126909 0.0874605 0.03247 0.0377719 -0.0954864 -0.0591746 0.0515018 0.142574 -0.0681621 0.0930442 0.0464132 0.0785918 -0.0188628 -0.0515884 -0.0389093 -0.0819928 
0.100662 0.105729 -0.140054 -0.0853983 0.144119 0.156297 0.0384289 -0.00376473 -0.208721 -0.0571286 -0.0190258 0.0447702 0.0916979 -0.0162654 -0.0218537 0.0090623 0.0183906 -0.00182151 -0.053811 0.0935864 0.109923 -0.00185176 0.0678222 0.0300869 0.0394342 0.0115549 -0.0251294 -0.109926 0.106103 0.0764574 -0.0181547 0.0844121 -0.103735 0.0606664 -0.0652246 -0.0149323 -0.0539161 0.0831925 0.0241998 0.00708548 0.036135 0.00616228 0.0559736 0.137446 -0.144151 0.0777012 0.201735 0.00290661 -0.181405 0.0333147 0.0474853 0.00830704 -0.0980177 -0.0021026 0.0519098 -0.0284359 0.00505037 0.222548 0.0518014 -0.123335 -0.0551964 0.0462172 0.190076 -0.0931438 0.0168294 -0.0634658 -0.00755093 0.0632755 -0.0253066 0.0698064 0.0126315 0.11845 -0.0318146 0.0473094 0.0195144 -0.00341241 -0.0460407 0.039068 -0.00323354 0.0472167 -0.0135239 0.0815559 0.0255111 -0.0412676 -0.0496124 -0.0180453 0.0599605 0.00152497 -0.000403482 -0.0113415 0.0854308 -0.105607 -0.126917 -0.0518273 0.0271424 -0.0605582 0.0680479 0.155982 -0.0294688 -0.0647725 -0.100935 0.0551834 0.0333956 0.236245 -0.254673 0.0534855 -0.185413 0.206492 0.0378949 -0.125216 0.117156 0.130466 -0.154269 0.0663805 0.0316219 0.0095198 -0.0958235 -0.150597 0.0428145 0.126585 0.0168983 0.043161 0.0359904 0.0420831 -0.0872739 -0.0389446 -0.0557 -0.0524034 
0.139727 0.0441544 -0.15679 -0.0341803 0.0845585 0.144484 0.048919 -0.00917663 -0.140657 -0.151021 -0.03565 0.0749373 0.0767907 -0.0981481 -0.106345 0.000229578 -0.0487753 -0.0376088 -0.1284 0.147563 0.100721 0.00686466 0.0832995 0.0257533 -0.0384455 0.00743415 -0.0239505 -0.164926 -0.00756862 0.0775103 -0.0655466 0.102265 -0.0901578 0.0997797 -0.0710763 -0.0556032 -0.0403755 0.131467 -0.0499076 0.00780991 0.0141324 -0.0222762 0.0266024 0.133899 -0.127719 0.056859 0.188422 -0.0197301 -0.145934 0.15006 0.072994 -0.0472434 -0.0569041 0.0580425 0.0895073 -0.0788197 0.0271647 0.149307 0.0720311 -0.145014 -0.0328097 0.0389696 0.176349 -0.0783648 -0.00360956 -0.140658 0.0174267 0.0227323 -0.0299577 0.0266057 -0.0127204 0.0411228 0.00672296 0.078896 -0.00264985 -0.00649731 -0.0409637 -0.0300469 -0.0222561 0.116556 0.0359668 0.0339881 -0.0161205 -0.0762605 -0.0478534 0.0134743 0.0407826 -0.019487 -0.0172585 0.0118188 0.0766278 -0.144623 -0.136133 -0.0691761 -0.0290788 0.0010787 0.0764395 0.107248 0.00501439 -0.0414985 -0.0576025 0.059008 0.0184736 0.241412 -0.20826 -0.0262163 -0.186091 0.229891 -0.0483094 -0.0756149 0.11863 0.154521 -0.133653 0.0345013 -0.0247396 0.0427019 -0.0759971 -0.114771 0.0297989 0.101445 -0.0110109 0.0728747 0.0898448 0.0296466 -0.0142567 -0.0729866 -0.027774 -0.0799215 
0.123471 0.0313443 -0.121751 -0.0206491 0.0996042 0.175662 0.0933467 -0.0333854 -0.102584 -0.12716 -0.0290581 0.0815517 0.0807987 -0.135933 -0.0892873 -0.00475174 -0.095291 -0.0175629 -0.163851 0.160718 0.105739 -0.0363133 0.103302 0.0305849 -0.0691729 0.000904805 -0.101965 -0.205082 0.0119254 0.0437012 -0.0307455 0.133138 -0.114171 0.107199 -0.0343239 -0.0312306 -0.0309289 0.181035 -0.037847 -0.0165158 0.0572749 -0.0411626 -0.0234087 0.0821985 -0.164153 0.0170442 0.158784 0.00837847 -0.141174 0.137163 0.00722383 -0.0560125 -0.0623951 0.0628682 0.0987117 -0.0711959 0.038132 0.160053 -0.00197305 -0.128485 -0.0528339 0.0501501 0.21204 -0.12206 0.0625883 -0.0955445 0.0136876 0.0232553 -0.0588338 0.0565441 -0.0242117 0.0687772 -0.00535759 0.13885 -0.0019105 -0.0275941 -0.0421068 -0.0207411 0.00867067 0.0712037 0.00531599 0.0399375 -0.0259922 -0.0768505 -0.0526282 0.00926952 0.0613576 0.0278272 -0.0203994 0.018966 0.147304 -0.15981 -0.0892992 -0.0667369 -0.0349921 -0.036739 0.0542006 0.101531 0.022711 0.000117768 -0.0255864 0.0239841 -0.0314918 0.221308 -0.130073 0.00518015 -0.134867 0.212471 -0.00564507 -0.0465811 0.0647075 0.178428 -0.103549 0.0294286 0.0247738 0.0528987 -0.0786497 -0.101273 0.0379274 0.126465 0.0111156 0.0614842 0.0811127 0.0595698 -0.0352389 -0.0336845 -0.0346839 -0.0678172 
0.134255 0.0291883 -0.120227 -0.0204263 0.0985504 0.166856 0.0991827 -0.0274417 -0.101847 -0.141479 -0.0323995 0.0859884 0.0766628 -0.123042 -0.087031 -0.00999233 -0.0870258 -0.0329567 -0.171476 0.155392 0.0944719 -0.0184991 0.093762 0.0187519 -0.0673746 0.00360339 -0.100033 -0.192034 0.00371933 0.0468262 -0.0327363 0.144092 -0.11517 0.108593 -0.0460463 -0.0392192 -0.0332028 0.186709 -0.0373116 -0.00235425 0.0560429 -0.0269772 -0.0243908 0.0777223 -0.156494 0.0263031 0.149551 -0.00349242 -0.132561 0.139194 0.0146788 -0.0480161 -0.0619657 0.0635297 0.0925323 -0.0794182 0.0312459 0.165117 0.000999592 -0.119377 -0.0583385 0.0478325 0.199314 -0.117243 0.044967 -0.0970404 0.0229488 0.0278394 -0.0607281 0.0429323 -0.0109996 0.0641057 0.00576167 0.142482 -0.00300721 -0.0232202 -0.044321 -0.0505557 0.000949149 0.0859375 0.0140123 0.0358716 -0.0226352 -0.0789137 -0.0469529 0.00179979 0.0632693 0.0156165 -0.0265299 0.013187 0.135085 -0.161919 -0.0942641 -0.0638956 -0.0330192 -0.0282758 0.0664914 0.0867229 0.018997 0.00340989 -0.0407077 0.0283223 -0.0251683 0.233988 -0.153713 -0.0017321 -0.145118 0.218582 -0.00527753 -0.0526762 0.0817026 0.174462 -0.117706 0.0354726 0.0181676 0.0497946 -0.0789811 -0.0962608 0.0408916 0.121541 0.00736703 0.066969 0.0822733 0.0577787 -0.0171894 -0.0497442 -0.0308435 -0.0743626 
0.128698 0.0291915 -0.0852846 -0.0277134 0.119689 0.186554 0.118987 -0.00647204 -0.0862704 -0.135411 -0.0234883 0.0762808 0.0930725 -0.123485 -0.0511034 -0.0436588 -0.0794989 -0.0159177 -0.177266 0.141734 0.113424 -0.00562269 0.0631696 0.0878783 -0.0441646 -0.0346508 -0.12357 -0.178963 0.0491604 0.0500062 0.0211727 0.119945 -0.153521 0.103815 -0.0326298 -0.0232373 -0.0454635 0.130046 -0.0302328 0.00875727 0.0979186 -0.0216261 -0.0439319 0.105641 -0.168313 -0.0177444 0.129929 0.03309 -0.0960957 0.106456 0.00774468 -0.0434422 -0.0705639 0.0225036 0.072602 -0.0550807 -0.00826782 0.205006 0.00201607 -0.115993 -0.0780771 0.0610531 0.191554 -0.114621 0.0100599 -0.1007 0.0534112 -0.00951451 -0.0696185 0.0359901 -0.00789028 0.0945809 0.00359688 0.136084 -0.0103823 -0.0411518 -0.0558922 -0.0155983 0.0299258 0.114027 0.0207164 0.0459056 0.0078131 -0.0652835 -0.0112439 -0.00616742 0.0915298 0.0253306 -0.0462364 -0.00707439 0.154344 -0.143061 -0.0809792 -0.0643559 -0.0484285 -0.0658662 0.0431552 0.0753801 -0.00443561 -0.00257282 -0.034027 0.0365818 -0.0160593 0.235329 -0.165404 0.0196405 -0.137956 0.201981 0.0303344 -0.0345123 0.090331 0.161311 -0.14973 0.0432742 0.00357955 0.059544 -0.0725738 -0.0945766 0.0160893 0.141948 0.0121861 0.0507794 0.0248289 0.0667788 -0.0697527 -0.0422165 -0.0703958 -0.0571056 
0.128341 0.0459109 -0.101439 -0.0337803 0.116961 0.173085 0.0958802 -0.00722558 -0.0926109 -0.122696 -0.0135812 0.0775626 0.0805491 -0.117454 -0.0656933 -0.0428709 -0.0593247 -0.0257456 -0.161563 0.150949 0.102506 -0.00912928 0.0711998 0.063315 -0.0390492 -0.0060037 -0.0888449 -0.165648 0.0572204 0.0345173 0.00957467 0.114386 -0.131348 0.102905 -0.0483768 -0.0295633 -0.0410874 0.164503 -0.02523 0.00442888 0.0845152 -0.0178837 -0.0541522 0.107667 -0.169547 0.00637071 0.132515 0.0228689 -0.107703 0.104446 0.00572573 0.00121471 -0.0853122 0.0269932 0.0741324 -0.0635306 0.0017581 0.192528 -0.00219559 -0.123476 -0.0755571 0.0329244 0.206402 -0.104405 0.0140844 -0.110037 0.0475058 0.019603 -0.0490306 0.060344 -0.00191042 0.0868621 -0.00184456 0.142935 0.00141364 -0.0481383 -0.0564169 0.0064267 0.0174489 0.101915 -0.00837856 0.0610118 0.0166332 -0.0671967 -0.00827586 -0.0256538 0.0908578 0.0417107 -0.0211069 -0.014561 0.144688 -0.144206 -0.0814174 -0.0587723 -0.0253305 -0.0845938 0.0611932 0.0736835 -0.00216066 -0.0284798 -0.0505334 0.0465183 -0.0177734 0.243999 -0.172139 0.0176099 -0.137235 0.204435 0.0477185 -0.0559294 0.0980802 0.17796 -0.152772 0.067294 0.0209984 0.0355293 -0.0839404 -0.130868 0.0383427 0.135136 0.0100814 0.0723863 0.0336116 0.0691392 -0.0495445 -0.0487836 -0.0455026 -0.057514 
0.14152 0.0386841 -0.120446 -0.0354408 0.11969 0.176564 0.0976879 -0.0338279 -0.117351 -0.121539 -0.0314158 0.0863992 0.0696723 -0.100739 -0.0614954 -0.026161 -0.0608868 -0.0168466 -0.13137 0.14079 0.0906093 0.0153079 0.0794165 0.0426664 -0.0495679 0.0158473 -0.0806825 -0.176501 0.0388105 0.0587026 -0.0238523 0.135472 -0.12776 0.0977458 -0.02655 -0.0302637 -0.0261003 0.161797 -0.0127711 -0.00507892 0.0607689 -0.00861744 -0.0293403 0.097953 -0.173679 0.0388511 0.15814 0.0158468 -0.127384 0.118854 0.0236661 -0.01359 -0.0668283 0.0434501 0.0975357 -0.0704397 0.0251926 0.197683 -0.00463951 -0.11753 -0.0608902 0.0441669 0.218995 -0.118797 0.0366493 -0.101667 0.0307354 0.0276586 -0.0519696 0.0741861 -0.00538766 0.0847627 -0.00609278 0.141305 -0.0121429 -0.0379485 -0.0496113 -0.0212449 0.0157103 0.0711152 0.0199056 0.078065 -0.00613445 -0.0838274 -0.0162821 -0.0410963 0.0670886 0.0254354 -0.0212401 0.0173043 0.149916 -0.138905 -0.0949249 -0.0614771 -0.0155881 -0.0573077 0.0759025 0.0957742 0.0175678 -0.0198024 -0.0456282 0.0485494 -0.0148863 0.227518 -0.188181 0.0100674 -0.143008 0.189049 0.0178072 -0.042572 0.112 0.173267 -0.128248 0.0464901 0.0247272 0.037802 -0.068029 -0.135803 0.0317535 0.121146 0.0261355 0.0631864 0.0780803 0.0526729 -0.0437477 -0.0460906 -0.0247199 -0.0714002 
0.140795 0.0222777 -0.147422 -0.00638976 0.12607 0.162482 0.0958249 -0.0343263 -0.118249 -0.115784 -0.0216081 0.104682 0.0769149 -0.143177 -0.11278 0.00834372 -0.0653038 0.00949467 -0.152685 0.163865 0.118054 -0.030246 0.0971728 0.0466783 -0.0521341 -0.000742188 -0.0833657 -0.206219 0.0277224 0.0717716 -0.04651 0.147667 -0.121077 0.0950069 -0.0480278 -0.0564068 -0.0538537 0.143521 -0.0208142 -0.012731 0.0460653 -0.0246902 -0.0188109 0.107747 -0.164604 0.0129309 0.165106 0.00397252 -0.127366 0.121809 0.0455818 -0.0395768 -0.0711419 0.0357283 0.0777052 -0.0768369 0.0500867 0.161188 0.0154984 -0.10389 -0.0404019 0.036627 0.212538 -0.0982485 0.0401636 -0.135282 -0.00160908 0.012101 -0.0510956 0.0527287 -0.0242759 0.0810208 -0.00509838 0.123422 -0.0309597 -0.0264134 -0.0331045 -0.00412676 -0.0134464 0.0818701 0.00691166 0.0524127 -0.0178078 -0.0669999 -0.0395088 0.00868866 0.0618654 0.0193947 -0.0304775 -0.00788148 0.120536 -0.131046 -0.124702 -0.0559706 -0.02101 -0.0393602 0.0561191 0.100964 0.00970218 -0.0136793 -0.0247682 0.0269253 -0.0144679 0.241955 -0.138455 -0.0118182 -0.132126 0.224489 0.0095189 -0.0441013 0.0708529 0.169694 -0.104477 0.0339903 0.0121238 0.0475678 -0.0809004 -0.0988295 0.0327285 0.124443 -0.00745826 0.0713007 0.0655461 0.0405063 -0.0479624 -0.0347094 -0.0524668 -0.0749092 
0.130355 0.0345027 -0.11755 -0.0118766 0.104922 0.178434 0.0907585 -0.0463379 -0.120705 -0.127256 -0.0232197 0.0934524 0.0758372 -0.146359 -0.0852351 -0.0123643 -0.104067 0.00836032 -0.140062 0.156012 0.117897 -0.0183233 0.0903826 0.0600316 -0.0509902 -0.00270534 -0.097136 -0.21514 0.0256143 0.0840552 -0.0356336 0.122793 -0.119298 0.0999734 -0.0133449 -0.0414427 -0.0441187 0.13443 -0.0144591 -0.0173197 0.0458795 -0.0454465 -0.0145798 0.111536 -0.167724 0.0164869 0.181899 0.00787819 -0.143288 0.136423 0.0290307 -0.0462662 -0.0517669 0.0467348 0.0940853 -0.0646145 0.0379466 0.168625 -0.00206855 -0.117311 -0.0485981 0.0490683 0.222029 -0.104974 0.0435265 -0.116829 0.014704 -0.0123748 -0.0730699 0.0528023 -0.0311636 0.0703231 -0.0175138 0.1284 -0.0159407 -0.0377799 -0.0492999 -0.0279605 0.0165407 0.105322 0.0194914 0.0466009 -0.0234703 -0.068967 -0.0379531 0.00372489 0.0494018 0.0063996 -0.0272978 0.0234682 0.143277 -0.137066 -0.1069 -0.0568488 -0.0456781 -0.0443833 0.0440505 0.117174 0.0244195 -0.0139032 -0.021853 0.0397444 -0.0163164 0.213577 -0.14059 0.00856387 -0.121094 0.22134 0.006049 -0.0319362 0.0808065 0.15883 -0.11747 0.0138539 0.0092986 0.0657897 -0.0615024 -0.101294 0.0374335 0.135387 0.0196379 0.0411404 0.0663856 0.0405023 -0.0540438 -0.0266947 -0.0190259 -0.0618937 
0.137674 0.0328638 -0.14086 -0.0120419 0.110724 0.160796 0.0935709 -0.0457637 -0.121163 -0.130015 -0.0305432 0.0897326 0.0713013 -0.14254 -0.0975259 -0.00187667 -0.0911618 9.97734e-05 -0.141955 0.160625 0.108597 -0.0186825 0.0925916 0.0452558 -0.0533559 -0.00298384 -0.0846729 -0.208408 0.0194736 0.0841399 -0.0520239 0.132286 -0.119645 0.0937071 -0.0245508 -0.050299 -0.0397624 0.135898 -0.0223089 -0.0192901 0.040233 -0.0386137 -0.00564921 0.115382 -0.162766 0.0372651 0.181203 0.0108094 -0.139425 0.136973 0.0310838 -0.0484455 -0.0519712 0.046435 0.0933598 -0.0775972 0.040105 0.160309 0.0111111 -0.114747 -0.038968 0.0468074 0.216582 -0.0952775 0.0361175 -0.122772 0.00614097 -0.00325668 -0.0569381 0.039612 -0.030698 0.0674306 -0.00655366 0.123962 -0.019204 -0.0297978 -0.0408494 -0.0225092 0.00267484 0.0940189 0.0308057 0.0492973 -0.0373309 -0.0749 -0.0395568 0.0115099 0.0393024 0.00580498 -0.02995 0.0192939 0.137951 -0.13173 -0.121512 -0.0668813 -0.0365335 -0.0325304 0.0542511 0.109829 0.0278463 -0.018935 -0.0234491 0.0315969 -0.00613478 0.218636 -0.153295 -0.00479459 -0.130786 0.231795 -0.0017459 -0.0298731 0.0920366 0.162849 -0.11044 0.0164686 -0.00125214 0.0568869 -0.0690177 -0.0982708 0.0341049 0.119236 0.00451209 0.0577198 0.0778956 0.0454683 -0.0498677 -0.0382785 -0.0338624 -0.0795217 
0.129707 0.0570279 -0.129008 -0.0223903 0.104581 0.169939 0.0931184 -0.0489082 -0.129824 -0.123667 -0.0294333 0.0848054 0.071709 -0.119216 -0.0852658 -0.017335 -0.0886304 -0.00468248 -0.131455 0.148636 0.0993921 -0.0202356 0.094256 0.027838 -0.0485717 0.00193186 -0.0906548 -0.187677 0.0291248 0.076602 -0.0440978 0.128428 -0.112558 0.0950763 -0.0232984 -0.0439082 -0.0313762 0.154795 -0.0133541 -0.0185552 0.042237 -0.0376654 -0.00455102 0.0980143 -0.172632 0.0422998 0.180819 0.00385246 -0.151611 0.135297 0.0225314 -0.0212687 -0.0589139 0.0572649 0.095408 -0.072021 0.0430851 0.171169 -0.00136266 -0.119121 -0.0508021 0.0495464 0.223351 -0.112275 0.0460227 -0.0980676 0.0103622 0.00768186 -0.070537 0.0658948 -0.0199566 0.0690055 -0.0146691 0.141565 -0.00163432 -0.0310174 -0.0430268 -0.033606 0.0107839 0.0778663 0.00803533 0.0510825 -0.0199749 -0.069139 -0.0364874 -0.00557111 0.0399269 0.0101188 -0.0153902 0.0271026 0.14259 -0.143535 -0.100569 -0.0697318 -0.0264397 -0.0526202 0.0617904 0.124843 0.0259407 -0.0168752 -0.0380878 0.0499468 -0.00828079 0.223557 -0.159293 0.013698 -0.128681 0.228904 0.0102341 -0.0458465 0.091435 0.160022 -0.117316 0.0291084 0.0140058 0.0485389 -0.0558451 -0.110046 0.0545381 0.132025 0.0195444 0.0467308 0.076149 0.0431832 -0.0426181 -0.0373833 -0.0109114 -0.0651338 
0.127956 0.0677401 -0.137505 -0.0254134 0.0970526 0.154915 0.0909181 -0.0422953 -0.118062 -0.126054 -0.0349207 0.0782249 0.0733318 -0.125373 -0.0942947 -0.00396466 -0.0826785 -0.0284758 -0.148154 0.158583 0.0887001 -0.0245717 0.0945652 -0.000699504 -0.0608424 0.00733271 -0.0899226 -0.179591 0.018723 0.0701068 -0.0491798 0.139986 -0.0984423 0.101262 -0.0378205 -0.050393 -0.0165823 0.181358 -0.0209195 -0.0146683 0.0372007 -0.0427942 0.00783805 0.0848312 -0.157069 0.050429 0.175865 -0.00201843 -0.151503 0.143162 0.0245227 -0.0261076 -0.0654414 0.0673663 0.0966195 -0.0815451 0.0384131 0.148759 0.00327762 -0.121469 -0.0534042 0.0352316 0.207145 -0.115336 0.0494222 -0.10139 0.00638428 0.0163038 -0.0697577 0.0446815 -0.0191344 0.0544117 -0.00853359 0.145337 0.00675909 -0.0207996 -0.0343318 -0.0355648 0.00144344 0.0777144 0.0112436 0.0375049 -0.0234396 -0.0603746 -0.0390273 3.35491e-05 0.0345691 0.0111838 -0.00526214 0.028384 0.122289 -0.15639 -0.103282 -0.06945 -0.0253975 -0.0379325 0.0732818 0.112346 0.0207577 -0.0114382 -0.0466168 0.0454079 -0.013287 0.235021 -0.161281 0.00182231 -0.136412 0.238707 0.00573298 -0.0514409 0.0837502 0.161485 -0.121044 0.0404357 0.0094547 0.0375341 -0.0644355 -0.101884 0.0513616 0.124347 0.0118092 0.0660373 0.0920889 0.0512527 -0.0157642 -0.0535859 -0.0133798 -0.0779525 
0.128391 0.0436823 -0.123154 -0.0267027 0.0971698 0.174684 0.0944638 -0.0318436 -0.110347 -0.137668 -0.0345194 0.0758279 0.0782355 -0.134947 -0.0957382 0.00699916 -0.101116 -0.0265446 -0.160635 0.154265 0.115466 -0.0361808 0.0926072 0.0184628 -0.0644961 -0.00225666 -0.100854 -0.197026 0.0111424 0.0603051 -0.040102 0.129324 -0.113236 0.109859 -0.030752 -0.0374727 -0.0236364 0.166192 -0.0219138 -0.0219364 0.0441179 -0.0495195 0.00791293 0.0775036 -0.141504 0.0293643 0.169842 0.000221986 -0.159845 0.141595 0.00780351 -0.057386 -0.0589506 0.0699565 0.104581 -0.0693918 0.0331353 0.15988 -0.011479 -0.124503 -0.0449143 0.0542877 0.213884 -0.125824 0.0597044 -0.0855543 -0.00406245 0.0180943 -0.0706985 0.0448914 -0.0299674 0.057912 -0.0192258 0.130313 0.00281327 -0.0163944 -0.0224823 -0.0304906 0.00920556 0.0734475 0.0133219 0.0271191 -0.0271018 -0.0681637 -0.0642163 0.0216671 0.0456414 0.0165421 -0.0151467 0.0361984 0.145759 -0.169026 -0.102956 -0.0550396 -0.032369 -0.0158598 0.0552897 0.10897 0.0214223 0.00982676 -0.0274409 0.0249513 -0.0372409 0.220876 -0.135602 0.0132171 -0.135895 0.225409 -0.0173353 -0.0558655 0.0644249 0.16254 -0.107435 0.0283474 0.0291704 0.0575034 -0.0710257 -0.0813713 0.0445308 0.130407 0.0127509 0.0553237 0.0962538 0.052459 -0.0277817 -0.032576 -0.0209021 -0.0793081 
0.126268 0.0595959 -0.133427 -0.0300585 0.108708 0.163648 0.0890802 -0.0388824 -0.142217 -0.107307 -0.0349344 0.0741763 0.0859583 -0.124042 -0.0853978 0.00017788 -0.0759764 -0.00577812 -0.13464 0.159694 0.103472 -0.0316246 0.0954327 0.0163672 -0.0504501 0.00881425 -0.0988603 -0.187925 0.0376686 0.0693312 -0.0437019 0.139604 -0.114697 0.0955651 -0.0308942 -0.0452838 -0.0288929 0.160107 -0.00407399 -0.0243439 0.0407488 -0.0437699 0.0104245 0.0981415 -0.165353 0.0367179 0.183225 0.0116142 -0.154151 0.128023 0.0262306 -0.0325883 -0.06975 0.0552666 0.0885329 -0.0792847 0.0451794 0.158277 0.0111596 -0.127711 -0.0455494 0.0458722 0.21062 -0.107696 0.046167 -0.0966344 0.00179058 0.0137046 -0.0614281 0.043735 -0.025138 0.0717317 -0.0133659 0.136177 -0.00392443 -0.0296919 -0.037948 -0.0162385 0.0143951 0.077263 0.0131745 0.044662 -0.0183677 -0.060958 -0.0374588 0.00111531 0.0422991 0.0207372 -0.00134925 0.0171162 0.130571 -0.136728 -0.104389 -0.0659069 -0.0308329 -0.0467619 0.065342 0.13208 0.00706943 -0.0197427 -0.0381884 0.0438333 -0.0102234 0.235267 -0.155629 0.0114053 -0.134316 0.238443 0.0195835 -0.048112 0.0761021 0.162138 -0.123466 0.0379729 0.0130371 0.0378609 -0.0661981 -0.107291 0.0415473 0.12411 0.00973279 0.0537375 0.0852719 0.0458105 -0.0474807 -0.0467446 -0.0287775 -0.0695644 
0.120326 0.0861932 -0.125748 -0.0425067 0.0985897 0.170852 0.0807159 -0.0464088 -0.14079 -0.112214 -0.0268009 0.0675543 0.0778388 -0.101355 -0.0723282 -0.0168196 -0.0891687 -0.0182684 -0.118227 0.139219 0.0972546 -0.0156109 0.0883487 -0.00411067 -0.0380016 0.0134211 -0.0890988 -0.166609 0.04847 0.0746661 -0.0371035 0.126986 -0.104626 0.0924638 -0.0245757 -0.0366117 -0.0233966 0.159951 0.0109722 -0.0149219 0.0390776 -0.0456766 0.00960897 0.0915102 -0.168249 0.0532773 0.185888 0.00335261 -0.16414 0.123974 0.0134788 0.00873935 -0.0702324 0.0649979 0.0878929 -0.0739338 0.0434449 0.163536 -0.00741569 -0.129136 -0.058421 0.0418847 0.22423 -0.110195 0.038312 -0.0785137 0.0142216 0.0232667 -0.0609645 0.0696492 -0.010772 0.0715442 -0.0233139 0.141105 0.0178376 -0.032128 -0.0503153 -0.0352333 0.0114912 0.0815859 0.00626944 0.0525677 -0.00207165 -0.054713 -0.0333889 -0.00594338 0.0388326 0.0135572 0.00456388 0.0267731 0.137892 -0.145403 -0.0967684 -0.0639603 -0.0287089 -0.0690327 0.0657806 0.141959 0.0166025 -0.0289375 -0.0516545 0.0585946 -0.00446324 0.227632 -0.17102 0.0305474 -0.130872 0.241271 0.025943 -0.0592931 0.0883538 0.149521 -0.141345 0.0423942 0.0235893 0.0375967 -0.0534629 -0.11871 0.0667893 0.133047 0.0327564 0.0428132 0.0861677 0.0447012 -0.0411045 -0.047003 0.00658213 -0.0469249 
0.126695 0.0753872 -0.130743 -0.03918 0.101921 0.164766 0.0889499 -0.0408101 -0.145547 -0.114195 -0.03414 0.0703254 0.0850321 -0.104437 -0.0788743 -0.0121463 -0.0745301 -0.015165 -0.127183 0.149863 0.097668 -0.0167834 0.0849777 0.00335048 -0.0492058 0.00872106 -0.0933018 -0.16816 0.0411668 0.0792358 -0.0461323 0.13654 -0.107865 0.0982812 -0.0288112 -0.0422728 -0.0214291 0.157704 -0.00231252 -0.021473 0.036288 -0.0430612 0.0202588 0.095304 -0.162007 0.0509143 0.18621 0.00914963 -0.1639 0.129289 0.0241354 -0.0142063 -0.0685451 0.0614445 0.090936 -0.0768491 0.0346682 0.160327 0.00556894 -0.129241 -0.0508201 0.0467907 0.211601 -0.110129 0.0383481 -0.0874596 0.00830856 0.0164467 -0.0673397 0.0501205 -0.0156789 0.0623952 -0.0154009 0.135064 0.00427445 -0.0250698 -0.0380452 -0.0318861 0.0142639 0.0768779 0.0162203 0.0453939 -0.0139598 -0.0604989 -0.033638 -0.00575024 0.0374659 0.00981411 0.00276075 0.0314833 0.131733 -0.14481 -0.103042 -0.0647942 -0.0307053 -0.0483785 0.0700839 0.1345 0.00927126 -0.0232442 -0.0450639 0.0600031 -0.00650893 0.233522 -0.174914 0.0189638 -0.140141 0.240749 0.0159896 -0.0539898 0.0879315 0.150656 -0.138569 0.041196 0.0124833 0.0353188 -0.0557069 -0.113206 0.0521484 0.12797 0.0178988 0.0472797 0.0896757 0.0461709 -0.0394121 -0.0531746 -0.00951763 -0.0675939 
0.11934 0.0832167 -0.130061 -0.0412794 0.103068 0.15901 0.0797381 -0.0472224 -0.142465 -0.113373 -0.0271406 0.0744241 0.0814 -0.092098 -0.0838283 -0.0121423 -0.0803111 -0.0170816 -0.123231 0.148613 0.0990529 -0.0265741 0.0888191 -0.00017263 -0.0391609 0.0131343 -0.0834011 -0.155835 0.0469502 0.0799003 -0.0457447 0.131587 -0.100884 0.0957231 -0.0350799 -0.0392433 -0.0286393 0.163752 0.00501432 -0.0219427 0.0324508 -0.0443838 0.019646 0.0904293 -0.160098 0.0497558 0.185329 0.00467525 -0.166478 0.126263 0.0158482 0.00261333 -0.0733953 0.0620832 0.0939099 -0.0726666 0.0318822 0.166976 -0.00556282 -0.1289 -0.0544649 0.041443 0.224226 -0.105548 0.0380612 -0.0731904 0.00239495 0.0261789 -0.069892 0.0650083 -0.0132772 0.0655135 -0.0225013 0.139065 0.0137738 -0.0258254 -0.0343309 -0.0367879 0.0107073 0.0727379 0.00286137 0.0468622 -0.0058196 -0.0584446 -0.0392443 -0.0104553 0.0364832 0.0163253 0.0142324 0.0310411 0.131813 -0.14897 -0.0979601 -0.0591032 -0.0210306 -0.0602339 0.0643519 0.139894 0.0158473 -0.0292695 -0.0519506 0.0566421 -0.00839 0.232029 -0.172478 0.0330212 -0.137821 0.241511 0.0251833 -0.0702942 0.084629 0.152622 -0.142099 0.0513614 0.0250602 0.0338478 -0.0512791 -0.112752 0.0698603 0.136124 0.0224179 0.0474089 0.0844622 0.0434643 -0.0415056 -0.0442466 0.00391889 -0.0571912 
0.124073 0.101323 -0.127664 -0.0507471 0.0960976 0.171624 0.0662741 -0.0353484 -0.157887 -0.106639 -0.0155661 0.0720353 0.0766051 -0.0886551 -0.0773502 -0.0205256 -0.0682324 -0.0118486 -0.0979295 0.144727 0.10117 -0.00555718 0.0766428 0.0323508 -0.0320646 0.00492155 -0.0504495 -0.140649 0.0652632 0.0957877 -0.059697 0.0891208 -0.0944241 0.0949305 -0.0327517 -0.0353376 -0.0252467 0.127004 -0.00239532 -0.0149538 0.0157332 -0.0522933 0.0251867 0.109253 -0.16032 0.0627386 0.202037 0.00691645 -0.18473 0.137904 0.0344107 0.0231147 -0.0795534 0.0571672 0.101152 -0.0602625 0.0221291 0.173067 -0.00109747 -0.128405 -0.0546939 0.0405914 0.235857 -0.110565 0.0251426 -0.0911451 0.00378506 0.00684779 -0.080181 0.0842689 -0.0176531 0.0593031 -0.0369531 0.120476 0.0215906 -0.0237875 -0.022896 -0.00826366 0.0209587 0.0764787 0.00832186 0.048622 0.00270289 -0.0539257 -0.0273382 -0.0123178 0.0255926 0.00338705 0.0216165 0.0566284 0.127628 -0.15193 -0.109078 -0.0452136 -0.013944 -0.0677252 0.0630264 0.142826 0.0192019 -0.0467022 -0.0478459 0.0822186 -0.00665142 0.219502 -0.191392 0.0459679 -0.134643 0.224094 0.014562 -0.0772489 0.104701 0.14437 -0.132665 0.0513526 0.0187777 0.0390112 -0.0357622 -0.12184 0.0665319 0.144178 0.0240059 0.0241549 0.0798133 0.0368101 -0.0468728 -0.0271522 0.0241944 -0.0585004 
0.123296 0.104014 -0.142483 -0.0491396 0.103304 0.155529 0.0538477 -0.0416904 -0.166291 -0.0880702 0.00803782 0.0725713 0.0880638 -0.0392382 -0.0721837 -0.0282 -0.0299449 0.00718397 -0.0737226 0.132012 0.108399 -0.00523745 0.0851448 0.0505658 -0.00253214 -0.00264896 -0.0261767 -0.126506 0.0930369 0.113366 -0.0529592 0.0864969 -0.0858097 0.0685724 -0.0504401 -0.0340436 -0.0497131 0.12197 0.00686805 0.00281429 0.000303071 -0.0263098 0.000883395 0.12591 -0.176646 0.0628611 0.193424 0.00534975 -0.162687 0.100158 0.0495848 0.0708481 -0.0815557 0.0363895 0.0762526 -0.0508361 0.0355637 0.188545 0.0197941 -0.117298 -0.0649303 0.0272516 0.235625 -0.0970565 -0.000817707 -0.102668 0.0180669 0.0232061 -0.0588494 0.102638 0.00376924 0.0798258 -0.041174 0.0980988 0.0193646 -0.026908 -0.0360567 0.00259404 0.00159899 0.0897953 -0.0091394 0.0606959 0.0164537 -0.0537884 -0.0122149 -0.0175833 0.0326953 -0.00815137 0.0120069 0.014018 0.104642 -0.131247 -0.10477 -0.0466389 0.00208958 -0.109303 0.0567165 0.153685 0.0210385 -0.0751872 -0.0521426 0.092428 0.0230133 0.233466 -0.210545 0.0487551 -0.13581 0.219019 0.0534015 -0.0987323 0.106661 0.140169 -0.144415 0.0589163 0.0156738 0.042321 -0.0417759 -0.143407 0.0724082 0.152596 0.0120197 0.0215372 0.0362949 0.032692 -0.0711998 -0.0195156 0.0122645 -0.0284132 
0.112306 0.10596 -0.146019 -0.0515742 0.0881502 0.162974 0.0474694 -0.0395091 -0.166938 -0.0700324 0.022025 0.0761981 0.0896634 -0.0518472 -0.0762332 -0.0264498 -0.0506143 0.013431 -0.0587622 0.120275 0.116765 -0.0217011 0.081771 0.0566121 0.00470028 0.00529586 -0.0166138 -0.138052 0.0992307 0.117934 -0.0495866 0.0776681 -0.0831168 0.0618549 -0.0520389 -0.0345813 -0.0649566 0.106557 0.0198777 0.00893724 -0.00402859 -0.0487129 -0.00498202 0.137002 -0.174053 0.041344 0.19907 0.000600422 -0.171791 0.0900626 0.0515754 0.0750764 -0.0812716 0.0326509 0.0666684 -0.0370614 0.039963 0.18936 0.0118185 -0.117015 -0.0652358 0.0178652 0.253399 -0.0914017 0.000327637 -0.0990463 0.0135943 0.0130083 -0.0587591 0.108478 -0.00844984 0.0845981 -0.0572728 0.0943026 0.0236084 -0.0350677 -0.0377475 0.0050208 -0.00232683 0.0987396 -0.0238658 0.0518052 0.0233073 -0.0464008 -0.0248394 -0.00834037 0.0365091 -0.0149526 0.0222381 0.00423517 0.0994749 -0.127316 -0.106503 -0.0408514 0.00201168 -0.113806 0.0446129 0.162095 0.026431 -0.075523 -0.0483536 0.0857634 0.01872 0.226489 -0.192215 0.0585073 -0.127199 0.22209 0.0481936 -0.108696 0.0927107 0.136224 -0.139307 0.0436539 0.0254904 0.0502422 -0.0326694 -0.139927 0.0902851 0.161039 0.0215576 -0.000500853 0.0311406 0.0252334 -0.0815806 -0.00646897 0.0186781 -0.00637226 
0.0931178 0.124144 -0.120579 -0.0699973 0.0916652 0.170009 0.029409 -0.0383089 -0.175758 -0.0503216 0.00902208 0.0428866 0.0694971 -0.0314811 -0.0234678 -0.0423349 -0.0556366 0.0111457 -0.0114606 0.0967905 0.0886952 -0.00476387 0.0910601 0.0430308 0.0204288 0.0208331 -0.0120233 -0.133656 0.119841 0.0811405 -0.0194998 0.0514091 -0.0820625 0.040019 -0.0270085 -0.00327346 -0.0539771 0.110577 0.023483 0.0123414 0.00809598 -0.0348561 -0.0241153 0.132275 -0.188427 0.0741602 0.199279 0.00581705 -0.173011 0.0689963 0.0218699 0.0989514 -0.0760373 0.0213698 0.0641265 -0.0235314 0.0549428 0.202458 0.00752614 -0.118006 -0.0742468 0.025283 0.259268 -0.0973983 0.0290951 -0.0784292 0.0287465 0.0171083 -0.0430188 0.152325 -0.00229842 0.108402 -0.0618673 0.105319 0.0402256 -0.0501618 -0.0646219 0.0261868 0.0108697 0.066212 -0.0396674 0.0753595 0.0243985 -0.0434268 -0.0127254 -0.0381365 0.0361153 0.00330567 0.0243479 0.00594759 0.122488 -0.0960019 -0.0829575 -0.0608443 0.0267152 -0.137017 0.061297 0.183187 0.0315912 -0.07967 -0.0729916 0.0906631 0.0217129 0.19105 -0.204126 0.0773716 -0.112181 0.185031 0.0780742 -0.100954 0.10499 0.13606 -0.133175 0.033222 0.0469531 0.0401783 -0.0210972 -0.176599 0.0965815 0.152901 0.051027 -0.00791744 0.0297776 0.0289964 -0.0927256 -0.00263404 0.0353639 0.0188207 
0.0857405 0.121527 -0.135814 -0.0687385 0.106962 0.184938 0.0193184 -0.0512434 -0.181589 -0.047572 0.0156021 0.0598227 0.0728639 -0.0345446 -0.0289122 -0.0244647 -0.038777 0.0284229 0.00294907 0.0779402 0.110703 0.0100292 0.0657453 0.0690424 0.0380517 0.0218641 -0.00472277 -0.143856 0.129326 0.117979 -0.00990689 0.0538743 -0.0903709 0.0325231 -0.0234963 0.00510935 -0.0580141 0.0475597 0.0456913 0.024812 0.0187025 -0.0309728 0.00829982 0.154128 -0.17435 0.0608139 0.225586 0.00218974 -0.172924 0.0327012 0.0492864 0.0728289 -0.0719713 0.00540876 0.0619387 0.000460735 0.0374765 0.216701 0.0163041 -0.105552 -0.0722318 0.0277852 0.254808 -0.101213 0.0272681 -0.0966074 0.0253564 0.00418167 -0.036897 0.137307 -0.00156189 0.118757 -0.0713896 0.0640085 0.0342019 -0.0345654 -0.0681875 0.0509981 -0.00745271 0.0711785 -0.0202428 0.0986799 0.0387002 -0.0241555 -0.0282475 -0.0152417 0.0488811 -0.0182382 -0.00528349 -0.00344282 0.0985975 -0.0941752 -0.108069 -0.0473366 0.0207913 -0.116972 0.0474408 0.181519 0.0189997 -0.0705838 -0.0746105 0.0837935 0.0318133 0.196241 -0.212669 0.0789873 -0.126785 0.183011 0.0418093 -0.091406 0.10249 0.105363 -0.13721 0.0228392 0.0297943 0.0448305 -0.0407412 -0.173879 0.0716686 0.149265 0.0567822 -0.016197 0.0233657 0.00989064 -0.112794 0.0144875 -0.00119929 0.018803 
0.0761698 0.1215 -0.128999 -0.0763716 0.113568 0.145438 0.00857842 -0.036847 -0.204742 -0.0264878 0.01217 0.0354076 0.101636 0.0117986 -0.0188817 0.0122091 0.00241425 0.0197767 -0.00337995 0.0959459 0.122754 -0.0267972 0.0869499 0.0556249 0.0417308 0.0305588 -0.0201328 -0.13302 0.138265 0.101226 -0.00603411 0.0704745 -0.0826672 0.0282415 -0.0545991 0.0136405 -0.0597804 0.108305 0.0496736 0.0222676 -0.00441413 -0.00262082 0.0178051 0.129345 -0.15018 0.0683376 0.223355 -0.00306375 -0.174686 0.00549118 0.0380182 0.0517304 -0.0930588 0.00343688 0.0569732 -0.00495105 0.0435656 0.22606 0.041434 -0.115842 -0.0615252 0.0262957 0.220809 -0.101465 0.0348571 -0.0625949 0.00895631 0.0477491 -0.0191591 0.104926 0.00743059 0.133912 -0.0637223 0.0575717 0.0405347 -0.0334082 -0.0543208 0.0674343 0.00300565 0.0484597 -0.0378497 0.0896922 0.0189898 -0.0386385 -0.0481224 -0.0174894 0.0467814 0.000222778 0.0102457 -0.0381805 0.0773574 -0.0861367 -0.0854712 -0.0496395 0.0362787 -0.107902 0.0516894 0.195794 0.0037469 -0.0668504 -0.096061 0.0601964 0.0301686 0.219964 -0.219864 0.0838314 -0.147299 0.178596 0.0846972 -0.1305 0.0717963 0.124008 -0.143616 0.0452267 0.0422775 0.0368382 -0.0675642 -0.176861 0.0458312 0.137267 0.0222585 0.0182072 0.0132223 0.0311954 -0.124531 0.0107583 -0.0390921 0.00223476 
0.0472316 0.157111 -0.134271 -0.0684967 0.072714 0.163057 0.0140486 -0.0552491 -0.184015 0.0226976 0.0239588 0.0231567 0.0783929 0.0014765 -0.0120623 -0.0313712 -0.0325173 0.051613 0.052856 0.0548774 0.0807186 -0.0329944 0.0913433 0.0456457 0.0373865 0.0255528 -0.00418371 -0.133647 0.163429 0.104525 -0.00224251 0.0551128 -0.0577285 -0.0135452 -0.0137939 0.00939912 -0.0619189 0.0948356 0.0451219 0.020103 -0.0162125 -0.0402887 -0.0290294 0.134008 -0.191027 0.0671424 0.207894 0.00368188 -0.176202 -0.00330903 0.0337873 0.130743 -0.0602124 -0.00752188 0.0333661 0.0224505 0.0819755 0.199466 0.0168682 -0.102956 -0.0867637 0.0129134 0.262655 -0.110134 0.0599072 -0.0552424 0.0196827 0.000563316 -0.0522889 0.166075 -0.00760478 0.121546 -0.0858596 0.0753339 0.04539 -0.0465657 -0.0664982 0.054087 0.000645712 0.0268198 -0.0741891 0.0781574 0.0182785 -0.0188909 -0.01816 -0.0375602 0.0211298 -0.0140248 0.0338244 -0.0224476 0.0809406 -0.0638666 -0.0615743 -0.0639758 0.0595462 -0.154262 0.0564178 0.219529 0.035031 -0.0691674 -0.0601623 0.0923602 0.0329052 0.170467 -0.186867 0.0949965 -0.0828975 0.147063 0.107001 -0.104773 0.0667535 0.108604 -0.105965 0.00303384 0.0508718 0.0383102 -0.0134809 -0.181792 0.110618 0.152617 0.0560161 -0.0600573 -0.000899981 0.00257953 -0.115897 0.0420557 0.0179529 0.0519343 
0.0444718 0.139619 -0.124383 -0.0725233 0.0994212 0.168691 0.0190609 -0.0529236 -0.191503 0.00117437 0.0142122 0.0341292 0.092164 0.00879445 -0.0110897 -0.0114474 -0.032408 0.0403386 0.029425 0.0594584 0.116891 -0.0420005 0.0688549 0.059618 0.0570914 0.0245513 -0.0352062 -0.136249 0.161775 0.118096 0.0171542 0.0636525 -0.0839736 -0.00187056 -0.0274156 0.0268962 -0.0818769 0.06582 0.0561655 0.0171361 0.00768249 -0.0271772 0.00811265 0.135968 -0.161238 0.049831 0.21997 0.000576156 -0.178641 -0.0293394 0.0236528 0.0767819 -0.0657547 -0.0188806 0.047704 0.033618 0.0398947 0.23776 0.0207292 -0.106452 -0.0808194 0.0338632 0.249896 -0.107594 0.0558302 -0.0366026 0.0107106 0.0116317 -0.0479136 0.130803 0.00260364 0.141323 -0.082576 0.0510038 0.0425167 -0.0273345 -0.062877 0.0532568 0.00109827 0.0361809 -0.0573911 0.0868155 0.0259466 -0.0150333 -0.0469367 -0.0203657 0.0454775 -0.0103348 0.0148823 -0.0311181 0.080907 -0.0738038 -0.0722737 -0.0504362 0.0413809 -0.125022 0.0425384 0.208917 0.0179276 -0.0518722 -0.0754811 0.0688782 0.0288466 0.180169 -0.2089 0.112441 -0.114236 0.161168 0.0868964 -0.113528 0.0652219 0.0963686 -0.137006 0.00910141 0.053413 0.0482355 -0.0412229 -0.164186 0.0814236 0.15489 0.0492619 -0.0424614 -0.00600685 0.00596504 -0.141208 0.050661 -0.0206998 0.0366568 
0.0935878 0.134345 -0.143254 -0.0691649 0.118801 0.179436 0.0305068 -0.0447562 -0.201673 -0.022709 0.0146314 0.0459919 0.0877156 -0.00850709 -0.0162637 -0.0111654 -0.0117402 0.0338448 -0.00442076 0.078499 0.109184 -0.0134139 0.081525 0.0555548 0.0487233 0.000173047 -0.0200462 -0.127166 0.126764 0.118928 -0.0218989 0.0571259 -0.0875306 0.0344612 -0.0352758 0.00348431 -0.0678612 0.0596971 0.0436441 0.0116252 -0.00141704 -0.023154 0.0216017 0.134274 -0.171866 0.0750919 0.213431 0.00643801 -0.185824 0.0358227 0.0578302 0.0762724 -0.0872556 -0.000746971 0.0549426 -0.00458199 0.0356905 0.219642 0.0256887 -0.0986114 -0.0726518 0.0337274 0.241988 -0.117521 0.0342394 -0.0732444 -0.00491913 0.0353883 -0.056974 0.134603 0.0148989 0.133048 -0.0736665 0.0494659 0.0264634 -0.0133549 -0.0460623 0.0400962 -0.000862095 0.0521598 -0.0350085 0.0751951 0.0291851 -0.0236063 -0.0448537 -0.0153978 0.0354625 -0.0239455 0.0125861 0.00254551 0.0837471 -0.101977 -0.104943 -0.0449641 0.0318893 -0.111595 0.0509246 0.18505 0.0106838 -0.0672368 -0.0703254 0.0882394 0.0308636 0.198179 -0.221998 0.0867895 -0.137094 0.183119 0.0611909 -0.109145 0.0975148 0.108701 -0.123405 0.0364469 0.0452467 0.0433373 -0.0438716 -0.149503 0.0728341 0.163771 0.0414283 -0.024035 0.021266 0.0241277 -0.102524 0.016814 0.000229766 0.00375267 
0.0814581 0.132564 -0.142693 -0.0625368 0.120374 0.158198 0.0342675 -0.038467 -0.199195 0.00327992 0.0236089 0.0465111 0.112331 0.00302963 -0.0272557 -0.00103425 0.00660845 0.0544723 -0.0214165 0.0971279 0.125368 -0.0419432 0.0776716 0.0683536 0.0430998 -0.0026162 -0.0403381 -0.124934 0.142021 0.127407 -0.0221586 0.078652 -0.0807598 0.0302857 -0.0501515 0.00222263 -0.0759375 0.0810455 0.0324217 0.0027089 -0.00475617 -0.0184785 0.0212618 0.133424 -0.16768 0.0494506 0.212347 0.0117302 -0.177541 0.0131895 0.0601881 0.0674073 -0.10193 -0.00986363 0.0557389 0.00393413 0.0272906 0.214991 0.0424273 -0.108706 -0.0729315 0.024122 0.226485 -0.109192 0.0326042 -0.0657363 -0.00807132 0.0343891 -0.0600768 0.111724 0.0159757 0.133657 -0.064814 0.0441594 0.0196991 -0.0142348 -0.0392258 0.0564426 0.00291481 0.0375036 -0.0456554 0.074508 0.0215366 -0.0251332 -0.0417695 -0.00916132 0.0422624 -0.012685 0.0291495 -0.0155061 0.0667356 -0.0989694 -0.09514 -0.0485195 0.0284658 -0.118468 0.0408581 0.188976 0.00200879 -0.0670185 -0.0621948 0.081564 0.038154 0.211329 -0.217974 0.0918294 -0.13919 0.181082 0.0872235 -0.119734 0.0695085 0.114742 -0.134596 0.0410324 0.0420903 0.0363891 -0.0501958 -0.15417 0.0610546 0.159257 0.0228126 -0.016105 0.00384758 0.0306194 -0.117603 0.0248703 -0.0229295 0.00156017 
0.062251 0.152369 -0.131697 -0.0790099 0.109809 0.16165 0.0192364 -0.0400018 -0.218228 0.024956 0.0211209 0.026305 0.102352 0.0300622 0.00913264 0.00698048 0.0137079 0.0422907 0.0300777 0.0560152 0.107143 -0.0180573 0.0667651 0.0437546 0.056596 0.0249848 -0.025537 -0.112115 0.166395 0.124336 -0.0128759 0.0770387 -0.076957 0.0099284 -0.0403965 0.0204005 -0.0590895 0.0654105 0.0666903 0.0215297 -0.00580814 -0.0143508 0.0315609 0.123413 -0.159551 0.0715822 0.222408 -0.000866051 -0.190382 -0.0280262 0.0564831 0.0854033 -0.0948598 -0.00941583 0.045261 0.0241015 0.035944 0.22389 0.0312378 -0.0909997 -0.0767609 0.0199972 0.224608 -0.119243 0.0532092 -0.0378899 0.000454057 0.0342245 -0.0447234 0.127088 0.0135557 0.142173 -0.0784463 0.0412166 0.0392088 -0.0177643 -0.0458395 0.0652935 -0.0011163 0.0152708 -0.0422433 0.0875668 0.030219 -0.0159254 -0.0442332 -0.0202856 0.0407066 -0.0216431 0.0195986 -0.0166603 0.0642658 -0.0832005 -0.0907094 -0.0382832 0.0475508 -0.115982 0.0547117 0.199999 0.00813458 -0.0557958 -0.0859169 0.0823829 0.0374289 0.19649 -0.223618 0.104938 -0.12811 0.158864 0.0888045 -0.127623 0.0673639 0.0932944 -0.130217 0.0288975 0.0570623 0.0253263 -0.0421922 -0.169929 0.0669857 0.144443 0.0473556 -0.0344946 0.0136326 0.0182425 -0.114766 0.0361387 -0.0166671 0.0168488 
0.0733665 0.132779 -0.130534 -0.0648438 0.0939693 0.173463 0.027018 -0.0284382 -0.200478 0.0135533 0.0278494 0.0410791 0.103558 -0.0302443 -0.0174286 -0.0074383 -0.0217823 0.05504 -0.00370296 0.0808586 0.122705 -0.0382408 0.0721094 0.0847795 0.0422921 0.00882642 -0.0277156 -0.148866 0.145989 0.115001 -0.0137091 0.0648823 -0.0826007 0.0323423 -0.0397003 -0.000125427 -0.0756936 0.0641186 0.0358402 0.01319 0.00154941 -0.0497934 0.0110024 0.151943 -0.166331 0.0347338 0.223369 0.0100165 -0.192258 0.0144588 0.0657314 0.0623617 -0.0915136 -0.0103736 0.0494347 0.0159581 0.0378698 0.206403 0.0425055 -0.117232 -0.0725294 0.0188526 0.234182 -0.102068 0.0339921 -0.0697333 0.00399782 0.00637764 -0.0572174 0.12137 -0.0116412 0.125846 -0.0774674 0.0528792 0.0308049 -0.0383877 -0.0546453 0.0679016 0.00806425 0.0551493 -0.0490494 0.0708003 0.0227092 -0.0291613 -0.0423589 -0.00583792 0.047655 -0.0217172 0.0270571 -0.0134624 0.0730234 -0.0867719 -0.0970659 -0.052566 0.0190343 -0.112723 0.0385818 0.195548 0.00629753 -0.0686383 -0.0586092 0.0797314 0.0338625 0.199569 -0.198377 0.0863485 -0.130828 0.179807 0.0757649 -0.118042 0.0680913 0.121077 -0.127241 0.00872035 0.0459043 0.039095 -0.0392415 -0.167715 0.0762183 0.158435 0.0444267 -0.0365121 0.00584079 0.024096 -0.122789 0.0256344 -0.00935997 0.0193672 
0.0821692 0.127373 -0.134908 -0.0523129 0.101364 0.190606 0.039811 -0.0414744 -0.190112 -0.0242287 0.0204116 0.0552117 0.087657 -0.0318166 -0.0311331 -0.034864 -0.0373602 0.0499627 -0.021046 0.0795448 0.106252 -0.0333352 0.0793808 0.0922243 0.0405596 -0.0212487 -0.03105 -0.137627 0.11862 0.109906 -0.00624374 0.0452391 -0.104438 0.0310746 -0.0404055 0.000832142 -0.0979032 0.0418579 0.0118238 0.0235113 0.00889131 -0.0365362 -0.00540299 0.15515 -0.178635 0.0334535 0.206064 0.0148736 -0.176222 0.0459781 0.0626836 0.0629489 -0.0833694 -0.0186145 0.0407083 0.010179 0.025673 0.23448 0.0464265 -0.101004 -0.0816214 0.0525049 0.248734 -0.112576 0.0265171 -0.0809259 0.0125568 -0.00230957 -0.0794671 0.142739 0.00367403 0.134549 -0.0563533 0.0691455 0.0175769 -0.0290518 -0.0538119 0.0322824 -0.00114817 0.06511 -0.0451322 0.0560449 0.0201744 -0.0356695 -0.0472085 -0.00868478 0.0422298 -0.0356382 0.00505965 -0.00820222 0.0848549 -0.097062 -0.0864833 -0.0630367 0.0272886 -0.112677 0.0369429 0.177594 0.00811809 -0.059642 -0.0614248 0.0928091 0.0302894 0.192561 -0.205312 0.0882675 -0.129175 0.182563 0.0543764 -0.100636 0.0966089 0.12237 -0.110688 0.0203436 0.0253665 0.0500426 -0.0287362 -0.132911 0.0899814 0.171583 0.035686 -0.0469363 -0.00880464 0.0184434 -0.117463 0.0258326 -0.0145648 0.0120893 
0.0783854 0.13971 -0.139908 -0.0604928 0.102512 0.181678 0.0405816 -0.0376632 -0.196681 0.0139939 0.029306 0.0447947 0.0988738 -0.0190574 -0.0152354 -0.0145277 -0.0183457 0.0590936 -0.0038097 0.0713922 0.114576 -0.0355144 0.065236 0.0834486 0.0506241 -0.00574688 -0.0334629 -0.132886 0.146517 0.125539 -0.012942 0.0698179 -0.0931019 0.0281273 -0.0431626 0.000953589 -0.083061 0.0421283 0.0379431 0.0142868 0.00489935 -0.0436608 0.0150401 0.147789 -0.168262 0.0305553 0.213244 0.0140616 -0.183967 0.0133884 0.0677674 0.070627 -0.0908391 -0.0184431 0.0435812 0.0212597 0.0232992 0.222587 0.0403663 -0.103753 -0.0794227 0.029171 0.242354 -0.113013 0.0280319 -0.0571574 0.00346563 0.00308735 -0.071953 0.128732 -0.00438542 0.136241 -0.0728282 0.056876 0.0223361 -0.0310701 -0.0430461 0.0503654 0.000234566 0.0445129 -0.0439937 0.0713802 0.0217786 -0.0290693 -0.0397067 -0.00745017 0.040971 -0.032891 0.0251283 -0.00675745 0.0768109 -0.0916547 -0.0997082 -0.0508775 0.0299529 -0.112081 0.0371392 0.185559 0.00872057 -0.0615955 -0.0583122 0.0833519 0.0374515 0.194965 -0.211124 0.0969475 -0.128271 0.173839 0.0695054 -0.11125 0.0808974 0.115513 -0.12017 0.0141838 0.0439747 0.0355297 -0.0289988 -0.149642 0.0857978 0.162261 0.0472215 -0.0477281 0.00359462 0.0232536 -0.122563 0.0302331 -0.0102676 0.0147023 
0.078685 0.129296 -0.133845 -0.0618839 0.094403 0.181159 0.0342337 -0.0280055 -0.195363 -0.00791692 0.0275782 0.0460055 0.0967335 -0.031882 -0.0289113 -0.0285306 -0.0339564 0.0443172 -0.0278141 0.0945418 0.098706 -0.0351529 0.0873689 0.0807632 0.02418 -0.00872163 -0.0235985 -0.137031 0.125792 0.0900265 -0.0174358 0.0438412 -0.0942121 0.0352149 -0.0475676 0.00416752 -0.0892803 0.0717054 0.00144432 0.0244516 0.00364638 -0.040771 -0.0172496 0.154503 -0.185967 0.0439651 0.205891 0.02 -0.187317 0.0496511 0.0556832 0.0664722 -0.102122 -0.0114598 0.0419558 0.00342268 0.0289278 0.220268 0.0482382 -0.105426 -0.0829661 0.0400865 0.248004 -0.106482 0.0341547 -0.0808836 0.0103208 0.0118586 -0.0671603 0.142068 0.00297336 0.128241 -0.050419 0.0753995 0.0276525 -0.0356714 -0.0572629 0.0521957 0.00529159 0.0503013 -0.0490331 0.0501813 0.01272 -0.0406794 -0.0504636 -0.00663678 0.0451165 -0.0222007 0.0176072 -0.00588123 0.0883014 -0.0986655 -0.085264 -0.0648894 0.0264158 -0.118435 0.0414423 0.177066 0.00820923 -0.0673749 -0.0627965 0.091646 0.0273267 0.18924 -0.199886 0.0869767 -0.130447 0.183863 0.0694397 -0.112013 0.0886416 0.137523 -0.106277 0.0260317 0.0320318 0.0400367 -0.0347942 -0.145974 0.0873831 0.164583 0.0303931 -0.0416433 -0.000102266 0.0338367 -0.111053 0.0208932 -0.0130859 0.0103451 
0.0656839 0.121647 -0.138259 -0.0836295 0.129375 0.149787 0.0142504 -0.0267785 -0.210063 0.00253787 0.015597 0.0389504 0.114654 0.0223362 -0.011189 0.0182772 0.0137701 0.0294343 -0.0138455 0.0908799 0.12139 -0.0420049 0.0832658 0.0499338 0.0519087 0.0212902 -0.0253435 -0.116525 0.143953 0.100239 -0.00543742 0.0663971 -0.0802126 0.0238604 -0.0633349 0.020694 -0.0745248 0.0887354 0.0425286 0.0119698 0.00411059 0.000783744 0.0330647 0.136058 -0.156653 0.053492 0.215758 0.00767468 -0.177619 -0.0101113 0.0380013 0.0349086 -0.109129 -0.0134732 0.0526707 0.00681854 0.0136332 0.236423 0.0425966 -0.111048 -0.0725306 0.0267434 0.219932 -0.100197 0.0432727 -0.0403682 -0.0153979 0.0635104 -0.0327272 0.0967176 0.0201709 0.146932 -0.0554247 0.0317499 0.0332262 -0.012879 -0.0466073 0.0682186 0.00234808 0.0231164 -0.0435419 0.079226 0.0210695 -0.0268718 -0.0652952 -0.0126302 0.0547656 0.00664133 0.0250591 -0.0321843 0.0667016 -0.0907175 -0.0942735 -0.0427779 0.0420045 -0.103447 0.0418623 0.188601 -0.0118013 -0.0614857 -0.0947933 0.0527013 0.0339036 0.202706 -0.228916 0.100458 -0.156715 0.171453 0.0884317 -0.139346 0.0719774 0.122096 -0.132983 0.0546297 0.0491769 0.0265162 -0.0761639 -0.153289 0.0455742 0.142594 0.0198743 -0.00156783 0.00598622 0.0350302 -0.12623 0.020547 -0.0510041 -0.00197107 
