{
  "descriptor": [
    -0.06740368157625198,
    0.053786590695381165,
    0.0776592418551445,
    -0.06413077563047409,
    -0.1267765313386917,
    0.026034928858280182,
    -0.06326204538345337,
    -0.06445401161909103,
    0.16040213406085968,
    -0.1273926943540573,
    0.14888033270835876,
    -0.034502528607845306,
    -0.20608846843242645,
    0.10567526519298553,
    -0.07162059843540192,
    0.1305645853281021,
    -0.17336328327655792,
    -0.18208421766757965,
    -0.036854155361652374,
    -0.05037368834018707,
    -0.03297438472509384,
    0.09290516376495361,
    0.0014768559485673904,
    0.0932854413986206,
    -0.13395141065120697,
    -0.33914822340011597,
    -0.10498575866222382,
    -0.07969018816947937,
    0.06955891102552414,
    -0.06997092068195343,
    -0.0587720051407814,
    0.09352665394544601,
    -0.10751725733280182,
    0.02508213371038437,
    0.08833492547273636,
    0.044333115220069885,
    -0.027547912672162056,
    -0.12318609654903412,
    0.25410592555999756,
    0.12558101117610931,
    -0.24131076037883759,
    -0.0073921759612858295,
    0.06794999539852142,
    0.31709396839141846,
    0.16906729340553284,
    -0.012050190009176731,
    0.035218745470047,
    -0.08846405893564224,
    0.17214104533195496,
    -0.26282352209091187,
    0.023965192958712578,
    0.2024439126253128,
    0.12116237729787827,
    0.06093912944197655,
    0.06678245961666107,
    -0.10664351284503937,
    0.016393262892961502,
    0.11114801466464996,
    -0.15501751005649567,
    0.09142931550741196,
    0.07665024697780609,
    -0.07274230569601059,
    0.04424548149108887,
    -0.09223628044128418,
    0.1852623075246811,
    0.08470436930656433,
    -0.11991962045431137,
    -0.12579146027565002,
    0.19075247645378113,
    -0.15986181795597076,
    -0.1036013513803482,
    0.07930008322000504,
    -0.1126536875963211,
    -0.1745498925447464,
    -0.21406659483909607,
    0.025263048708438873,
    0.4219096302986145,
    0.17478834092617035,
    -0.11089711636304855,
    0.06371252238750458,
    0.0011004845146089792,
    -0.08508677035570145,
    0.008650204166769981,
    0.20428967475891113,
    -0.13728757202625275,
    0.01772882230579853,
    -0.01477255579084158,
    0.034469615668058395,
    0.26417073607444763,
    0.02392342872917652,
    0.004248741082847118,
    0.19539649784564972,
    -0.00019096239702776074,
    0.05877511948347092,
    0.062490109354257584,
    0.08301754295825958,
    -0.14005902409553528,
    -0.03985187038779259,
    -0.14121948182582855,
    0.0021869635675102472,
    -0.05711650848388672,
    -0.037786439061164856,
    0.021155020222067833,
    0.15633246302604675,
    -0.1861438900232315,
    0.165731742978096,
    -0.06476903706789017,
    -0.11037582904100418,
    -0.031694237142801285,
    0.03982657939195633,
    -0.029167775064706802,
    -0.030790360644459724,
    0.128659188747406,
    -0.22494541108608246,
    0.07079549878835678,
    0.1418183147907257,
    0.07800864428281784,
    0.12239750474691391,
    0.0559222549200058,
    0.03437700495123863,
    0.011504674330353737,
    -0.02499346062541008,
    -0.14461471140384674,
    -0.10446234047412872,
    0.0626893863081932,
    -0.06807788461446762,
    0.001852034474723041,
    -0.01304665021598339
  ]
}