0.0687192 0.0359882 -0.0409836 -0.0575449 0.0198901 0.194013 -0.0303903 -0.0786432 -0.1568 -0.0274984 0.00600797 0.0705735 0.0444132 -0.0813628 0.000793306 -0.0780653 -0.150178 -0.00829891 0.0182207 0.057226 0.0729387 0.0445217 0.0322396 0.120861 0.022833 0.0609992 0.0513035 -0.20738 -0.0237294 0.114233 -0.0322094 -0.105005 -0.094392 0.0217673 0.0459184 0.0341381 -0.122756 -0.000607315 -0.0253186 0.022997 -0.0417474 -0.0961056 -0.0716576 0.209394 -0.110022 0.111181 0.179607 0.0249248 -0.199254 0.0567406 0.116796 0.0126894 0.00373784 -0.0297955 0.123204 0.0153828 -0.0486935 0.199707 0.0276417 -0.093004 -0.00527234 0.0095653 0.221034 -0.00121831 0.0796259 -0.177538 0.0159803 0.0441234 -0.0298075 0.133326 0.0149259 0.0755184 -0.0501364 -0.0750327 -0.00365177 -0.00239482 -0.125745 0.0170752 0.0534212 0.210908 0.0228447 -0.00399491 -0.0147592 -0.0553827 -0.119013 -0.0975679 0.0784556 -0.0494151 -0.0136628 0.0779609 0.0150201 -0.0739828 -0.0548474 0.0249508 -0.140915 -0.040952 0.0504808 0.0292802 0.108145 -0.0941744 0.0326803 0.149793 -0.0350281 -0.00104032 -0.166544 0.0159109 -0.139505 0.0937049 -0.0460545 -0.026215 0.191743 0.108459 -0.0995036 -0.059745 0.0132233 0.125152 -0.124633 -0.0997867 -0.00968243 0.114637 0.0535194 -0.073378 -0.00567132 -0.0235493 0.000167577 0.0837834 0.0663565 -0.0111647 
0.0319068 0.0900089 -0.0523521 -0.0718193 -0.00671297 0.1731 -0.0368304 -0.129074 -0.170443 0.0338363 0.0234017 0.0103111 0.0467864 -0.0351576 0.07567 -0.0871203 -0.127739 -0.0527248 0.123044 0.00884337 0.00457442 0.0536232 -0.0110582 0.0863621 0.0483088 0.0919903 0.0462018 -0.175704 0.0239358 0.121909 -0.00413538 -0.11218 -0.0820224 -0.0352656 0.083561 0.0798215 -0.080176 -0.0469956 0.0396418 0.0374082 -0.0381765 -0.115819 -0.0688434 0.178484 -0.0937169 0.188283 0.17673 0.0587055 -0.187447 -0.0403848 0.0707851 0.0568229 0.0456235 -0.0584284 0.0927124 0.0454162 -0.0616533 0.194734 0.0130125 -0.0381335 -0.0224254 0.0211123 0.205145 -0.011368 0.0919642 -0.105355 0.045542 0.0313604 -0.00363872 0.0828 0.00609035 0.0768053 -0.0776688 -0.0876835 0.0557566 0.00356772 -0.139211 0.0356806 0.066709 0.206345 0.0409345 -0.0156869 -0.0237343 -0.0278985 -0.106592 -0.0857763 0.0537167 -0.0880706 -0.0402835 0.0642928 0.0191901 -0.019067 0.00108423 0.0370531 -0.152729 -0.0780039 0.0662687 0.0212179 0.14447 -0.108575 0.0247186 0.159429 -0.014294 -0.0580541 -0.183123 0.0520167 -0.0889774 0.0835207 -0.0265912 0.0266077 0.204291 0.0444578 -0.0915975 -0.102994 -0.0105168 0.118603 -0.135259 -0.095632 -0.0233253 0.0852389 0.0723151 -0.131574 -0.024132 -0.00655333 -0.0299585 0.112012 0.0349364 0.0170687 
0.0520866 0.0470791 -0.041742 -0.061393 0.00595933 0.189539 -0.0459332 -0.0898172 -0.169267 -0.0127309 0.00658353 0.0415396 0.0452701 -0.0535401 0.0409759 -0.084092 -0.134213 -0.0393178 0.0757925 0.0353785 0.0447684 0.0499377 0.0216476 0.123815 0.0459055 0.0716079 0.0572058 -0.194658 -0.00683949 0.107969 -0.000328186 -0.121531 -0.090973 -0.000860862 0.0525418 0.0631937 -0.115407 -0.0300877 -0.00963472 0.0338827 -0.0382617 -0.0984315 -0.0719148 0.205486 -0.10078 0.135202 0.179278 0.0398491 -0.181599 0.0221852 0.103351 0.0253428 0.0301502 -0.0503329 0.115827 0.0295369 -0.0546882 0.209115 0.0410886 -0.0814422 -0.0192123 0.0226807 0.204063 -0.00532234 0.0772103 -0.148281 0.0362354 0.0343025 -0.0172391 0.11657 0.00674412 0.0851002 -0.0667335 -0.0825707 0.024275 -0.00453759 -0.132174 0.0275929 0.0621836 0.228949 0.029683 -0.0180353 -0.00864254 -0.0501134 -0.108575 -0.101777 0.0720738 -0.0657375 -0.0306061 0.0604282 0.0144221 -0.0399989 -0.029795 0.0262938 -0.14164 -0.0502938 0.061164 0.0350144 0.110955 -0.104918 0.0231876 0.158951 -0.0218844 -0.0267772 -0.187092 0.0319373 -0.127518 0.077429 -0.0346459 -0.00932336 0.202201 0.0860001 -0.0981481 -0.0837289 0.00309244 0.128564 -0.117471 -0.103406 -0.0155985 0.112286 0.063686 -0.100115 -0.0197549 -0.0244823 -0.0283752 0.0960832 0.0560608 0.0134429 
0.0219638 0.114475 -0.0418503 -0.0838655 -0.0114991 0.189356 -0.0359381 -0.119669 -0.189587 0.0672693 0.0271592 -0.00738012 0.0598973 -0.0340949 0.0994213 -0.0783583 -0.123909 -0.0384283 0.110099 -0.0140361 -0.00676244 0.0603874 -0.0329044 0.0889317 0.0537546 0.076918 0.0277083 -0.149806 0.0373536 0.115133 0.000123088 -0.0993655 -0.105152 -0.0351706 0.067805 0.084695 -0.0931848 -0.09022 0.0543395 0.0616645 -0.0268964 -0.127715 -0.0576866 0.164036 -0.0764742 0.177421 0.170894 0.0719107 -0.202732 -0.0600877 0.0880008 0.051812 0.0316867 -0.071579 0.0547973 0.0578388 -0.0730518 0.191889 0.0320817 -0.0288518 -0.0306902 0.0471577 0.177897 -0.0100696 0.0666725 -0.0741351 0.0503086 0.0337913 -0.012477 0.0634319 0.0113314 0.086481 -0.0683459 -0.0878132 0.0672356 0.0115706 -0.145677 0.0271653 0.0668901 0.195835 0.0632877 -0.0192579 -0.0149911 -0.0172377 -0.119035 -0.0499373 0.0588679 -0.109349 -0.0479248 0.0668124 0.00402545 -0.0166469 0.00214148 0.0483593 -0.166248 -0.0643253 0.0541487 0.0132004 0.125212 -0.102367 0.0253945 0.154184 -0.0108816 -0.0463187 -0.181402 0.0628728 -0.100812 0.0893211 -0.0389751 0.0262759 0.204685 0.0376748 -0.0870842 -0.102496 -0.0238325 0.106679 -0.148608 -0.067994 -0.0265289 0.0718727 0.0774321 -0.163355 -0.0252041 -0.00992909 -0.0384753 0.113856 0.00218815 0.011284 
0.0105048 0.121926 -0.0173985 -0.0682065 -0.033974 0.175585 -0.0359807 -0.115706 -0.193605 0.0614362 0.0221083 -0.00470222 0.0394178 -0.0343004 0.108681 -0.109679 -0.121853 -0.0524375 0.139183 -0.0152482 -0.0314745 0.0580475 -0.041227 0.084656 0.0550867 0.0839699 0.0326808 -0.142526 0.0284548 0.101341 -0.00249354 -0.116192 -0.0903513 -0.0411367 0.0774004 0.0780997 -0.0765187 -0.078537 0.0471632 0.0610976 -0.0208941 -0.130627 -0.0620788 0.153625 -0.0867586 0.187408 0.174944 0.0473882 -0.20309 -0.0580227 0.0892814 0.0655857 0.0448212 -0.0635268 0.0654606 0.0597728 -0.0754418 0.177867 0.0271897 -0.0292576 -0.0304523 0.040932 0.163819 -0.0204272 0.0804508 -0.0707653 0.0709209 0.00430925 -0.0214345 0.0662273 0.00959557 0.0729164 -0.0623137 -0.0688041 0.0806155 0.00953345 -0.148591 0.0258277 0.077892 0.198118 0.0365214 -0.0246777 -0.0105562 -0.0159754 -0.0961323 -0.0720867 0.053757 -0.111304 -0.0451863 0.06584 -0.00199852 -0.0140799 0.0266813 0.0421202 -0.166127 -0.0813887 0.0770878 0.0037674 0.134474 -0.105062 0.00723474 0.17349 -0.00823378 -0.0543989 -0.182316 0.063566 -0.0748305 0.0839502 -0.0424627 0.0293337 0.207808 0.0277436 -0.0851705 -0.113646 -0.0305052 0.0901995 -0.137249 -0.0876219 -0.0166764 0.0634338 0.0775788 -0.163333 -0.0369784 -0.0157275 -0.00791014 0.114287 0.0274849 0.0149113 
0.0063674 0.123643 -0.00566569 -0.0846595 -0.0252077 0.159389 -0.0177088 -0.114027 -0.186738 0.0892043 0.0314158 -0.0124361 0.0387733 -0.0170819 0.130887 -0.108432 -0.113279 -0.053256 0.140858 -0.0210389 -0.0483402 0.068835 -0.0476647 0.0877143 0.0441086 0.0943872 0.0310459 -0.129109 0.0560163 0.0917887 -0.00473105 -0.119935 -0.097468 -0.0485345 0.0757514 0.0864043 -0.0787363 -0.0633384 0.0564059 0.0804171 -0.0289284 -0.111454 -0.0935753 0.135629 -0.082252 0.20649 0.151595 0.0565495 -0.194197 -0.0786616 0.0688055 0.0874113 0.0253049 -0.0788175 0.0525284 0.0652568 -0.0765781 0.1986 0.0064529 0.00814131 -0.0337893 0.034118 0.170222 -0.0143077 0.0822025 -0.0667031 0.0728991 0.0224311 -0.0122188 0.071622 0.0239507 0.0877234 -0.0614643 -0.0516844 0.0796695 0.00632536 -0.148517 0.0423844 0.084479 0.165862 0.0387864 -0.0139027 -0.0189461 -0.0156911 -0.0932413 -0.0905525 0.0613456 -0.104271 -0.0433573 0.0587548 0.00789579 8.85939e-05 0.0439039 0.0511538 -0.147052 -0.090688 0.0783225 -0.0222407 0.147819 -0.0986793 -0.00117189 0.163501 -0.0227301 -0.0654412 -0.186895 0.0700447 -0.0684816 0.0573808 -0.0105716 0.0290954 0.213791 0.036221 -0.076379 -0.104258 -0.0184011 0.0954642 -0.135649 -0.0900749 -0.0293425 0.0586134 0.0730347 -0.161043 -0.0484554 0.00129557 -0.0237128 0.125441 0.00868894 0.00470709 
0.0277228 0.113761 -0.0388206 -0.0738484 -0.019521 0.143069 -0.0225171 -0.131814 -0.181766 0.0674854 0.028882 -0.00545933 0.0469781 -0.00581132 0.106964 -0.0963274 -0.0950896 -0.0742014 0.152082 0.00504721 -0.0338458 0.0596515 -0.0320015 0.0797817 0.0443059 0.104079 0.03707 -0.144338 0.049608 0.120378 -0.0149763 -0.0979803 -0.0816951 -0.0450532 0.0744509 0.0827403 -0.0629129 -0.0308696 0.0615751 0.0570037 -0.0510234 -0.108965 -0.0877299 0.133328 -0.0802554 0.229281 0.159131 0.056866 -0.181451 -0.0671477 0.0686892 0.105428 0.0423751 -0.0661963 0.080108 0.0459211 -0.0603176 0.190413 0.00373123 -0.000297171 -0.0224534 0.0188608 0.180281 -0.0235286 0.0821108 -0.0869676 0.0674566 0.0346492 -0.00277254 0.0630981 0.0134796 0.0773684 -0.0831296 -0.0608516 0.073995 0.00912203 -0.128217 0.041442 0.0811533 0.195512 0.0379534 -0.0194983 -0.0257349 -0.0226182 -0.0807136 -0.102193 0.0452741 -0.101958 -0.0372337 0.0536624 0.00809577 -0.000842269 0.0372802 0.0558737 -0.145954 -0.0973208 0.0925472 -0.00879543 0.1614 -0.114229 0.0126233 0.16998 -0.0214536 -0.0505862 -0.198655 0.0600457 -0.0701505 0.0716398 -0.000382384 0.0322511 0.20812 0.0336098 -0.0930047 -0.101813 -0.0157165 0.109131 -0.134844 -0.10449 -0.0324422 0.0750818 0.0619531 -0.134717 -0.0357835 0.00567437 -0.0250102 0.117924 0.0254569 0.00437125 
0.0281666 0.121258 0.00722225 -0.0894696 -0.0203351 0.161705 -0.0483652 -0.0965289 -0.186157 0.0250433 0.0118812 -0.0108012 0.0263241 -0.0156622 0.0852696 -0.0797213 -0.131765 -0.0405163 0.10937 -0.00705308 0.0277625 0.0733076 0.00339909 0.0880808 0.0489275 0.0818425 0.0406356 -0.16799 0.0498407 0.105201 -0.0158132 -0.128599 -0.0856079 -0.0317027 0.0629997 0.0669058 -0.0973078 -0.00597466 0.0408403 0.0853672 -0.068847 -0.0837064 -0.0913032 0.147167 -0.0705109 0.211517 0.183356 0.00495508 -0.221202 -0.0313225 0.0837982 0.102825 0.021075 -0.040641 0.0706644 0.0421416 -0.000969866 0.194781 0.0208765 -0.0476865 -0.00603862 0.0297563 0.180376 -0.00796782 0.0731301 -0.126973 0.0633092 0.0437097 0.00762782 0.131332 0.035312 0.0901007 -0.0744779 -0.060383 0.0679495 -0.0042115 -0.161091 0.0382688 0.0651414 0.185757 0.0193111 0.0230653 -0.0100488 -0.0217486 -0.0971252 -0.0839919 0.0517225 -0.0869318 -0.0461487 0.0492622 0.00622343 -0.0212372 0.00418627 0.0360011 -0.125392 -0.0782654 0.0778844 0.0448343 0.135611 -0.0941949 -0.00450464 0.161562 -0.0272732 -0.0133922 -0.194 0.0458382 -0.0972341 0.074994 0.00369433 -0.0285972 0.201425 0.0591879 -0.108226 -0.0951798 0.00543214 0.131115 -0.134748 -0.128988 -0.0250896 0.0774643 0.0655924 -0.0996889 -0.0300572 -0.0186606 -0.01985 0.110801 0.0503841 0.0180446 
0.0297244 0.117229 -0.0223204 -0.0912874 -0.0124933 0.178884 -0.0456145 -0.0983757 -0.173369 0.0332171 0.0257307 -0.00117234 0.044234 -0.0439918 0.05887 -0.0638251 -0.14117 -0.0282852 0.0809315 0.00511997 0.0486586 0.0498136 0.00912568 0.0909584 0.0417452 0.0786012 0.0399205 -0.18636 0.0537964 0.111418 -0.00503818 -0.116135 -0.09178 -0.0269515 0.0620049 0.0641342 -0.11251 -0.00352046 0.0406582 0.0710412 -0.0689423 -0.10226 -0.0969268 0.171907 -0.0709826 0.180146 0.18001 0.0276256 -0.228618 -0.029506 0.0776791 0.0869211 0.00759314 -0.0549651 0.0611541 0.0422531 -0.0181093 0.202876 0.0160587 -0.0572682 -0.0149429 0.0199341 0.212829 -0.0102241 0.0811652 -0.136199 0.0461059 0.0490271 -0.0053032 0.125449 0.025173 0.0880171 -0.0812544 -0.0733836 0.0483567 -0.0135102 -0.151163 0.043537 0.0574734 0.196578 0.0146347 0.00563934 -0.0174383 -0.0253687 -0.118274 -0.0789852 0.0572384 -0.0836575 -0.0334581 0.0488681 0.00989136 -0.0345256 -0.0115166 0.0398842 -0.122701 -0.0746484 0.0622336 0.0453025 0.123035 -0.0924114 0.0128268 0.148356 -0.0428842 -0.00867912 -0.176373 0.0492008 -0.0992397 0.0859023 0.00667918 -0.0288369 0.186676 0.0704937 -0.104446 -0.0828992 0.0166289 0.134871 -0.146643 -0.111185 -0.0133376 0.0933183 0.0597184 -0.10678 -0.0279709 -0.0102129 -0.0266203 0.109433 0.0380725 0.0118612 
0.0424421 0.0857057 0.00163663 -0.0817379 0.00585134 0.197045 -0.0256019 -0.103994 -0.164059 0.00532032 0.00130088 0.0137972 0.0370312 -0.0599647 0.0716813 -0.087377 -0.164441 -0.0345214 0.0637515 0.00693503 0.0477943 0.0690722 0.00432233 0.0908758 0.0358168 0.059182 0.0070826 -0.182738 0.0244451 0.112506 -0.0010166 -0.113112 -0.107528 -0.00915232 0.0876196 0.06235 -0.111211 -0.0335688 0.0246942 0.0412791 -0.0417368 -0.109083 -0.0868251 0.162401 -0.0839006 0.172074 0.157512 0.0496971 -0.206727 0.00120991 0.0771847 0.0660915 0.0290214 -0.0529259 0.0870455 0.0284544 -0.037187 0.194841 -0.00329706 -0.0522269 -0.011065 0.0441282 0.196334 -0.00410669 0.0825818 -0.132166 0.0405418 0.0419826 -0.0251286 0.120888 0.0233596 0.0843537 -0.0726304 -0.0731571 0.0256835 0.00393329 -0.146687 0.00231172 0.078866 0.218506 0.0444392 -0.00964166 -0.0110111 -0.0215007 -0.104463 -0.0992364 0.0627887 -0.0701357 -0.0403081 0.0889411 0.0333656 -0.0332083 -0.0125567 0.0472911 -0.165098 -0.0645756 0.0562722 0.0288544 0.120424 -0.0874045 0.0489228 0.160203 -0.0473767 -0.0422095 -0.168822 0.0398661 -0.0990521 0.083609 -0.00911868 0.011046 0.204293 0.0614593 -0.111805 -0.0874509 0.0117923 0.144929 -0.132917 -0.078278 -0.023516 0.108144 0.0738183 -0.115787 -0.0212209 -0.0192574 -0.0169967 0.10745 0.0612705 0.0048427 
0.010677 0.11923 0.0118929 -0.101761 -0.0109605 0.157362 -0.0503626 -0.0882432 -0.181129 0.0527992 0.0107411 -0.0190868 0.0308107 -0.0280614 0.109205 -0.0647663 -0.121908 -0.0566036 0.111683 -0.00669471 0.0193304 0.0568792 0.00504513 0.0861729 0.0566322 0.0979916 0.0377489 -0.169165 0.0670079 0.076708 0.020966 -0.128829 -0.09107 -0.0274745 0.0644169 0.0822713 -0.101179 0.00719167 0.0478475 0.0788948 -0.0655911 -0.0898423 -0.103645 0.148044 -0.0539733 0.205418 0.169336 0.0354536 -0.218252 -0.0510292 0.0669565 0.0928562 0.0100377 -0.0797992 0.0603936 0.0469974 -0.0304457 0.211456 0.0128926 -0.037733 -0.0167654 0.0178809 0.18389 -0.010353 0.0975431 -0.117113 0.0474388 0.0579486 0.00234744 0.129879 0.0229339 0.105014 -0.0871217 -0.0603827 0.0597202 -0.0211896 -0.150655 0.0663155 0.0768277 0.187335 0.00658106 0.00452824 -0.0160663 -0.0254793 -0.106833 -0.122565 0.0624124 -0.0666763 -0.0305811 0.0408841 0.0101647 0.00185586 0.0130518 0.0470769 -0.108455 -0.0656326 0.0850829 0.0274815 0.119296 -0.097094 -0.0145598 0.142133 -0.0567306 -0.0302991 -0.186878 0.0496548 -0.0976024 0.0531219 0.0419792 -0.0286335 0.192861 0.0788387 -0.108707 -0.0803764 0.0338482 0.12171 -0.145707 -0.124373 -0.0311436 0.0919571 0.0651606 -0.0913753 -0.0386314 0.00186041 -0.0318688 0.106594 0.0395399 0.00269978 
0.0206507 0.118193 -5.23873e-05 -0.0881723 -0.0208362 0.171115 -0.055301 -0.102 -0.184303 0.0335726 0.0208719 -0.00703445 0.0361929 -0.0444729 0.0708141 -0.0626977 -0.144079 -0.0297737 0.096048 0.00730774 0.0388572 0.0596723 0.0154743 0.10025 0.0377443 0.0891777 0.0392658 -0.187557 0.0596777 0.100017 -0.0101537 -0.12233 -0.0860089 -0.0256222 0.0688708 0.0666835 -0.101396 0.00254426 0.0402045 0.0750201 -0.0694661 -0.101169 -0.0961772 0.157981 -0.0718735 0.187892 0.190394 0.0245351 -0.23131 -0.0249316 0.0773277 0.0830807 0.0172125 -0.0490918 0.0676043 0.0425888 -0.00123933 0.193277 0.0185561 -0.058666 -0.0129267 0.0297264 0.200622 -0.00560974 0.0831392 -0.12733 0.0521373 0.0344 -0.00358815 0.12374 0.0138792 0.0833884 -0.0787547 -0.0563017 0.0630122 -0.0225256 -0.157653 0.0481794 0.0704016 0.192971 0.022308 0.0126985 -0.018686 -0.0281151 -0.107467 -0.0833858 0.0508286 -0.0794825 -0.0406223 0.0528043 0.018465 -0.0191149 0.000352935 0.0410379 -0.126634 -0.0729795 0.0652735 0.0577371 0.128017 -0.0955796 0.00911906 0.14916 -0.0419689 -0.014358 -0.171642 0.0471605 -0.0878278 0.0760729 0.013624 -0.0256615 0.188002 0.0755246 -0.0943629 -0.0932122 0.0105605 0.133485 -0.141216 -0.11974 -0.0232609 0.0844222 0.0636522 -0.106452 -0.0294559 -0.0192073 -0.0364663 0.118025 0.0419324 0.0131122 
0.0148786 0.115322 -0.0358813 -0.114962 -0.0204581 0.174829 -0.0520907 -0.0889417 -0.172753 0.0493155 0.0244874 0.00424564 0.0442126 -0.00815924 0.0641282 -0.0642395 -0.137337 -0.0329815 0.10373 -0.00509676 0.0250901 0.0524405 0.0092833 0.093227 0.030072 0.105623 0.0806684 -0.166246 0.0528057 0.100942 -0.0244341 -0.130505 -0.0638111 -0.0287073 0.0480288 0.073411 -0.0887096 0.00704236 0.0277418 0.0722454 -0.0692801 -0.0923776 -0.073222 0.169909 -0.084405 0.172633 0.192929 0.0186668 -0.234687 -0.0279756 0.067057 0.0590047 0.00604578 -0.0359702 0.0874091 0.0692201 -0.0272067 0.225293 0.0151192 -0.0704008 -0.0309548 0.0145256 0.233065 -0.0189921 0.0891009 -0.0882502 0.0333366 0.0522455 -0.0075736 0.134262 0.0152629 0.0817073 -0.0828535 -0.0644797 0.0790261 -0.00665126 -0.142144 0.0445847 0.063477 0.131244 0.0129578 0.0241651 -0.0193423 -0.0341387 -0.125342 -0.085758 0.0569694 -0.0701585 -0.00480126 0.063685 0.0177204 -0.0481793 -0.00276178 0.0276907 -0.0896792 -0.0604306 0.0605598 0.0626321 0.139947 -0.084735 -0.00716777 0.133645 -0.0287939 -0.0309096 -0.199776 0.0666534 -0.122117 0.047806 -0.0214788 -0.0555054 0.196113 0.0801557 -0.0729437 -0.0888767 0.0240617 0.119687 -0.117959 -0.126865 -0.00297015 0.0799352 0.0842332 -0.126799 -0.0097183 -0.0192139 -0.042072 0.122189 0.0390474 0.0191732 
0.00463058 0.0980661 -0.0438424 -0.100281 -0.00839592 0.155448 -0.0705475 -0.108876 -0.160627 0.0245103 0.0126842 0.0201592 0.0527261 0.00198674 0.0387787 -0.043916 -0.139079 -0.0427289 0.104141 0.016801 0.057649 0.0158686 0.0363615 0.0973805 0.0526915 0.108118 0.0843319 -0.175922 0.0401613 0.11899 -0.0146684 -0.128658 -0.0400638 -0.0248039 0.0451298 0.0691144 -0.09677 0.0313838 0.0199637 0.0372264 -0.0807768 -0.0905898 -0.0478383 0.174884 -0.0789154 0.159333 0.20361 0.0131911 -0.220836 -0.0213664 0.0593819 0.0345892 0.0294464 -0.0383674 0.113485 0.0662584 -0.0235251 0.224828 0.0170571 -0.0958705 -0.0211025 0.00684327 0.237935 -0.011016 0.103298 -0.0801825 0.00288988 0.0622299 -0.0152309 0.127148 0.00108996 0.0809929 -0.100351 -0.0912707 0.0746171 0.00528467 -0.12265 0.0330858 0.0634481 0.154557 -0.00350787 0.0104028 -0.0170836 -0.0302979 -0.133224 -0.100836 0.0473988 -0.0481849 0.00465052 0.0543735 0.00903466 -0.0487177 -0.00236287 0.0325688 -0.0905833 -0.0531521 0.0448897 0.0938648 0.144796 -0.0955165 0.00247703 0.115587 -0.0306471 -0.0285469 -0.197827 0.0634102 -0.127665 0.0551716 -0.0117488 -0.0695103 0.176811 0.0863821 -0.0802467 -0.0798429 0.0348349 0.136397 -0.124608 -0.110932 -0.00750471 0.108008 0.071458 -0.100719 -0.0211204 -0.0309851 -0.061306 0.134558 0.0459732 0.0249817 
0.00527528 0.134204 -0.0338828 -0.0959945 -0.0143392 0.16512 -0.0461369 -0.110629 -0.184751 0.0706441 0.0269256 -0.0197331 0.0437154 -0.0179976 0.0994762 -0.061725 -0.11121 -0.044777 0.138739 -0.019139 0.00807963 0.0477589 -0.0284555 0.0678966 0.0612088 0.102916 0.0394082 -0.159788 0.0684961 0.109354 0.00712358 -0.103659 -0.0791282 -0.0469866 0.0707927 0.0895895 -0.0861829 -0.0461289 0.0702526 0.0602175 -0.0526919 -0.10975 -0.066263 0.154265 -0.0552386 0.209186 0.183922 0.0400749 -0.230185 -0.0924444 0.0553028 0.0794005 0.0317376 -0.077816 0.0513843 0.0705162 -0.053367 0.202146 0.0111741 -0.0286143 -0.0240614 0.0237946 0.196538 -0.0193538 0.0937784 -0.0744205 0.0434697 0.0433803 0.00105752 0.0872461 0.0153377 0.0840861 -0.0948101 -0.0914479 0.0719352 0.00222718 -0.141431 0.0557098 0.0609235 0.166723 0.0186892 0.00764728 -0.0242468 -0.0148166 -0.115187 -0.0718264 0.0495177 -0.0970968 -0.0365714 0.0507334 0.00989334 -0.00665361 0.0010803 0.0524876 -0.115268 -0.063213 0.0724241 0.0298476 0.128513 -0.0959467 -0.00567205 0.138013 -0.0290043 -0.0458795 -0.195008 0.0756858 -0.0859386 0.0699693 -0.00301624 -0.00834417 0.189958 0.0319148 -0.0994039 -0.107558 0.0160077 0.105747 -0.152292 -0.113668 -0.0142814 0.0714589 0.0746004 -0.134654 -0.0279727 -0.00277207 -0.0342955 0.119613 0.0216091 0.0087529 
0.00309699 0.115946 -0.0217817 -0.0941585 -0.0311331 0.176402 -0.0529414 -0.0741725 -0.203235 0.0488348 -0.00100159 -0.0066796 0.0386621 -0.0672879 0.0776201 -0.0610539 -0.148022 -0.0555225 0.127795 -0.00408393 0.0309092 0.0229808 0.00395011 0.0686922 0.0531802 0.117449 0.0394876 -0.206702 0.0466847 0.0769952 0.00557941 -0.107171 -0.0836359 -0.0242483 0.0616948 0.055796 -0.0871619 -0.00147697 0.0584079 0.0530681 -0.038227 -0.127612 -0.0588819 0.165396 -0.0674883 0.169847 0.211117 0.0101831 -0.248431 -0.0500384 0.067684 0.037941 0.0326677 -0.0467982 0.0705532 0.054147 -0.0147146 0.193698 0.025208 -0.0859706 -0.00852863 0.022393 0.198346 -0.0218981 0.108988 -0.0847683 0.0425367 0.0263072 0.00662046 0.0870174 -0.019359 0.0882522 -0.0934858 -0.0541222 0.077998 -0.0238458 -0.14697 0.0500843 0.0757169 0.19403 -0.011853 -0.00504156 -0.00832419 -0.0250974 -0.116673 -0.0852812 0.065831 -0.0683857 -0.0157864 0.0273227 0.0131928 -0.0156628 -0.00198125 0.028462 -0.123806 -0.0523914 0.0903393 0.0744769 0.109764 -0.0898361 -0.0201152 0.125723 -0.0336585 -0.00638125 -0.174705 0.0489394 -0.0983526 0.10188 -0.019564 -0.0369309 0.174886 0.0710579 -0.104467 -0.117639 0.0266719 0.104441 -0.144849 -0.132606 -0.00129314 0.0764625 0.0756169 -0.109808 -0.0104261 -0.0216165 -0.0319916 0.0982288 0.0285676 0.0163886 
0.00449002 0.130698 -0.0401637 -0.0826567 -0.00377491 0.153058 -0.0238781 -0.0967832 -0.188804 0.0695008 0.0183308 -0.014575 0.0359427 -0.0589333 0.0932528 -0.0576291 -0.117222 -0.0508628 0.141524 0.000325228 0.01466 0.0253953 -0.018606 0.0677822 0.06368 0.109566 0.0202907 -0.193172 0.0887516 0.0943691 0.0191476 -0.0955564 -0.0863946 -0.0468311 0.0768913 0.0701987 -0.0809776 -0.0127414 0.0704089 0.04592 -0.0313017 -0.109762 -0.0670368 0.171503 -0.0747464 0.19943 0.202731 0.0326413 -0.228145 -0.0913597 0.0367741 0.0666324 0.0232177 -0.0824167 0.0578267 0.0585792 -0.0446485 0.206999 0.00758013 -0.0402777 -0.0250265 0.0064161 0.210455 -0.0272212 0.112009 -0.0841646 0.045095 0.0170942 0.00906498 0.0703324 0.000357082 0.104456 -0.0927997 -0.0527233 0.070509 -0.0233078 -0.141547 0.0836525 0.0672591 0.172354 -0.00354863 0.0104706 -0.0289356 -0.019415 -0.0978945 -0.0853361 0.0526064 -0.0748398 -0.0273273 0.0181037 0.0284063 0.00913227 -0.0120988 0.0233578 -0.100923 -0.0768149 0.0932571 0.0460707 0.116693 -0.0985077 -0.030825 0.118271 -0.0214951 -0.0288076 -0.20194 0.0699944 -0.0706225 0.0982043 0.0291072 -0.00672074 0.183171 0.0542848 -0.112654 -0.112267 0.0282696 0.0957873 -0.146437 -0.138033 -0.0117299 0.0759108 0.0629729 -0.102097 -0.0277475 0.0136578 -0.0503011 0.102855 0.0133947 0.00561296 
-0.0110217 0.136473 -0.0435529 -0.0795755 -0.0255324 0.139726 -0.0383598 -0.077895 -0.206151 0.112195 0.0245726 -0.0350678 0.0449381 -0.0815564 0.106231 -0.055335 -0.109328 -0.0620102 0.163862 -9.69438e-05 -0.0070061 0.0032521 -0.0152845 0.0639868 0.0643975 0.112646 0.0349395 -0.191176 0.0900836 0.0725899 0.0201499 -0.110027 -0.0788586 -0.0496057 0.070837 0.0594785 -0.0755703 -0.0249848 0.0754846 0.0463958 -0.0365306 -0.147042 -0.0740347 0.168705 -0.0662551 0.196407 0.194342 0.0549199 -0.224218 -0.102764 0.0513527 0.0733583 0.0282898 -0.0971458 0.0364786 0.0564886 -0.0342932 0.165382 0.0284348 -0.0385953 -0.0178564 0.000363957 0.179339 -0.0138529 0.105952 -0.0798305 0.042935 0.011133 0.0212357 0.0372622 -0.0311154 0.0932665 -0.100871 -0.062684 0.0811815 -0.0306443 -0.135244 0.109284 0.0826961 0.200932 -0.0127113 -0.0310919 -0.0257454 -0.00607811 -0.0918606 -0.0771302 0.0481257 -0.0739913 -0.0127513 0.00703115 0.00480425 0.0367836 0.00498328 0.0370356 -0.125572 -0.0858468 0.097009 0.0391918 0.110562 -0.118923 -0.0129498 0.122798 -0.0248068 -0.03713 -0.165628 0.0544394 -0.0529501 0.106653 0.035051 0.00824302 0.167167 0.0544179 -0.0938498 -0.119503 0.0142554 0.0866769 -0.156513 -0.123816 -0.0164303 0.0660795 0.0514315 -0.120265 -0.0428394 0.0126739 -0.0510958 0.0997587 -0.00281006 0.00994772 
-0.00190113 0.13539 -0.0387587 -0.0766284 -0.0218744 0.157138 -0.036656 -0.0846532 -0.19146 0.0898388 0.0297749 -0.0310913 0.0453258 -0.075684 0.103162 -0.0662321 -0.11577 -0.0546326 0.141015 -0.000681538 0.00349815 0.0133755 -0.0195313 0.0759372 0.0664469 0.0982492 0.0274933 -0.189965 0.0834396 0.0781099 0.0323264 -0.109613 -0.0878475 -0.0464283 0.0706433 0.0695193 -0.0863891 -0.030915 0.0644486 0.0502528 -0.0313164 -0.134984 -0.0829707 0.177431 -0.069569 0.186199 0.190782 0.0521943 -0.22165 -0.0939004 0.0490585 0.0730827 0.026075 -0.0958803 0.0361783 0.057963 -0.0499615 0.181755 0.0287762 -0.0480826 -0.0294296 0.0092819 0.188777 -0.0166153 0.0971776 -0.082411 0.0563981 0.0106404 0.0113118 0.0519296 -0.014741 0.094149 -0.0899166 -0.0653009 0.0762413 -0.0317023 -0.144909 0.0927092 0.0745249 0.204778 -0.00530045 -0.0198341 -0.0266997 -0.0168103 -0.0927862 -0.0721328 0.0525706 -0.0824432 -0.024494 0.0144431 0.0131847 0.0189018 0.000300282 0.0326683 -0.126023 -0.087324 0.0868404 0.0336959 0.107542 -0.111082 -0.0142375 0.127659 -0.0221955 -0.034867 -0.178901 0.0642732 -0.0605347 0.102292 0.0308799 0.00491693 0.177551 0.0566337 -0.103575 -0.113624 0.0130378 0.0907092 -0.159037 -0.122648 -0.0102575 0.0706935 0.0559667 -0.121141 -0.0444203 0.01419 -0.0439179 0.100627 0.00567781 0.010705 
-0.00473268 0.112244 -0.0520829 -0.0980147 -0.0101826 0.172383 -0.0700277 -0.0805398 -0.172082 0.0383022 0.00432261 0.00918863 0.0440353 -0.0637479 0.0403504 -0.0332229 -0.156693 -0.0395732 0.105543 0.0101775 0.061342 0.0031322 0.0334334 0.0851852 0.0602512 0.112937 0.0696141 -0.205556 0.0579783 0.0901733 0.0133825 -0.111235 -0.0610109 -0.0231712 0.0442888 0.0524762 -0.101424 0.0114681 0.0374666 0.0425821 -0.044935 -0.118834 -0.0377259 0.201749 -0.079489 0.131947 0.224432 0.0155948 -0.233199 -0.0312548 0.0620391 0.0213747 0.0188185 -0.0505967 0.0839715 0.0614752 -0.0131062 0.20892 0.0330681 -0.116185 -0.024155 0.00202969 0.235104 -0.00911272 0.0992522 -0.0901127 0.0119115 0.0302524 0.000423903 0.110874 -0.0273029 0.0966099 -0.0991363 -0.0651593 0.0733808 -0.0291273 -0.136794 0.0617666 0.0556824 0.173089 -0.012382 0.0149296 -0.00651689 -0.0212148 -0.123839 -0.0820499 0.0583484 -0.042265 0.00683215 0.024004 0.0138179 -0.0298932 -0.0311736 0.010776 -0.0878249 -0.0506261 0.0574577 0.114095 0.106661 -0.0969644 -0.0199431 0.0976109 -0.0213321 -0.00166816 -0.184356 0.0540474 -0.120151 0.0972814 -0.00610228 -0.0602406 0.163535 0.0923574 -0.0965931 -0.0936308 0.0376514 0.110016 -0.125937 -0.130562 0.0118061 0.099495 0.0827356 -0.0911511 -0.00985243 -0.027619 -0.0733448 0.101151 0.0287787 0.0342276 
-0.000413652 0.106772 -0.0355376 -0.0822079 -0.00390948 0.179257 -0.0680311 -0.0827364 -0.168052 0.0437184 0.0075543 -0.00204683 0.0444423 -0.0639396 0.054284 -0.0367546 -0.146344 -0.0153443 0.101382 0.00978282 0.0786688 0.00116456 0.0306374 0.0997433 0.0699702 0.0920003 0.0435411 -0.213559 0.0626545 0.0974034 0.0249193 -0.106262 -0.0641385 -0.0250767 0.0617413 0.0625018 -0.110948 0.000242993 0.0312144 0.0209613 -0.0478992 -0.115969 -0.0474845 0.199254 -0.0754834 0.131663 0.2184 0.0237747 -0.232868 -0.0429276 0.065557 0.0308782 0.0287481 -0.0633821 0.0840194 0.0632975 -0.0140471 0.195942 0.0380781 -0.121006 -0.0228366 0.0089323 0.220544 -0.00950297 0.100296 -0.0907723 0.0134521 0.0275341 -0.00870826 0.12064 -0.0176666 0.0991753 -0.102536 -0.0845721 0.0560947 -0.0319898 -0.140725 0.0653759 0.0643668 0.180316 -0.0143146 0.020339 -0.0130418 -0.0279329 -0.112166 -0.0820298 0.0533993 -0.0421867 2.1703e-05 0.0351654 0.0184914 -0.0163399 -0.034336 0.0133204 -0.0997392 -0.0523114 0.0519149 0.114875 0.0993037 -0.0965753 0.0037664 0.107814 -0.0210365 -0.018337 -0.178307 0.0590746 -0.107825 0.0807544 0.0189184 -0.0487917 0.154361 0.0871997 -0.103909 -0.105368 0.0503038 0.113021 -0.129517 -0.137896 0.00466992 0.103716 0.0813162 -0.096854 -0.0181989 -0.0265876 -0.0702351 0.111332 0.0476383 0.0343916 
0.00563205 0.0881077 -0.0591936 -0.0900173 -0.00195981 0.160361 -0.0876632 -0.10919 -0.14183 0.00621868 -0.000235897 0.0259584 0.0384299 -0.0509384 0.005949 -0.0320858 -0.1621 -0.0265797 0.102361 0.0253802 0.0830672 0.0224129 0.05 0.0864492 0.0500329 0.111185 0.0874594 -0.2069 0.0319571 0.126021 -0.0086253 -0.126596 -0.0316797 -0.024518 0.073035 0.0483567 -0.0912768 0.0185811 0.0262522 0.0132985 -0.0763845 -0.106111 -0.0329473 0.206027 -0.0837685 0.133676 0.217398 0.0206541 -0.207297 -0.000165567 0.0671826 0.0301552 0.045752 -0.0311802 0.11666 0.0463517 0.00813684 0.179957 0.0157549 -0.124998 -0.00782338 -0.0092362 0.243113 0.00940446 0.0961969 -0.12599 -0.00498971 0.0402462 0.00263815 0.12376 -0.0202405 0.0686495 -0.104682 -0.102116 0.0473633 -0.0111991 -0.13427 0.0414474 0.0558975 0.186746 0.0077466 0.0238194 -0.00784733 -0.0112683 -0.113263 -0.0986422 0.0400424 -0.0288331 0.0132167 0.0514135 0.00773059 -0.0336457 -0.0369 0.0250545 -0.10121 -0.0544006 0.0387051 0.124677 0.123237 -0.109228 0.0281446 0.112892 -0.024468 -0.0290184 -0.169004 0.0356839 -0.110884 0.0734079 -0.0122073 -0.0367144 0.165807 0.0769716 -0.0912697 -0.0845661 0.0285133 0.137972 -0.116641 -0.12055 -0.00762731 0.103893 0.0811704 -0.080603 -0.00215081 -0.0527003 -0.0677067 0.111814 0.0651815 0.0421356 
0.0124396 0.0762828 -0.068153 -0.0908359 -0.00534983 0.15485 -0.0741563 -0.093552 -0.139055 0.00705969 0.0184839 0.0400361 0.0610932 -0.0273816 -0.0119662 -0.039037 -0.156953 -0.0279962 0.0642191 0.0381476 0.0798293 -4.57025e-05 0.0601176 0.114382 0.0425501 0.0983117 0.107043 -0.181619 0.0302156 0.117772 -0.0194456 -0.13139 -0.037892 -0.0188899 0.0247006 0.0407203 -0.122805 0.0422561 -0.0119787 0.0321793 -0.075477 -0.0965088 -0.0536444 0.221222 -0.097986 0.104643 0.199491 0.0222628 -0.194685 0.011548 0.0762052 0.0227442 0.0140101 -0.0355074 0.113801 0.0485393 -0.0199029 0.214885 0.0370604 -0.128037 -0.0240099 -0.0126178 0.253419 0.0210969 0.0770956 -0.11299 -0.00401874 0.0506482 -0.0115688 0.127458 -0.0112159 0.0757476 -0.0794055 -0.0892326 0.0580468 -0.0103971 -0.124063 0.0337002 0.0489421 0.179734 0.00494324 0.000856737 -0.00630835 -0.0358488 -0.129824 -0.0970948 0.0560274 -0.0304365 0.0213831 0.0391243 -0.00167359 -0.0587762 -0.0304175 0.0127369 -0.092183 -0.0618984 0.0291565 0.106062 0.133384 -0.10962 0.0177721 0.110056 -0.0132929 -0.00841875 -0.183941 0.0434998 -0.138655 0.0812684 -0.00815879 -0.0796438 0.175149 0.115202 -0.0802624 -0.059805 0.024603 0.138029 -0.115278 -0.100143 0.00632188 0.116767 0.0593401 -0.0856938 -0.0260936 -0.0442393 -0.0732152 0.118882 0.0408511 0.0379676 
0.00419578 0.0805995 -0.0589553 -0.0967392 -0.0150922 0.154416 -0.0949696 -0.0879708 -0.158926 0.0174844 0.00554699 0.034045 0.0573423 -0.0288938 0.00209518 -0.0298892 -0.14279 -0.0320855 0.0945846 0.0342282 0.0803693 0.00394709 0.0529346 0.107835 0.0474163 0.118899 0.104012 -0.192151 0.0243611 0.114981 -0.0181468 -0.129882 -0.0301626 -0.0154764 0.0333557 0.0458689 -0.107676 0.0399515 0.0108736 0.0295102 -0.0863469 -0.101247 -0.0367847 0.199896 -0.0749987 0.112986 0.215529 0.00904647 -0.21407 0.00317986 0.0843862 0.0133509 0.0307392 -0.0289769 0.115983 0.0532591 -0.00484251 0.202478 0.0353022 -0.135796 -0.010074 -0.0090251 0.238156 0.00675024 0.0876643 -0.105575 -0.00767328 0.0557639 -0.00754918 0.114437 -0.0191995 0.0698678 -0.0994131 -0.0974555 0.0600176 -0.00773642 -0.12226 0.0369953 0.0609444 0.179829 -0.00659732 0.00737583 -0.00138596 -0.0296758 -0.130068 -0.101711 0.0528277 -0.03072 0.031398 0.0384588 -0.0141951 -0.0489415 -0.0236746 0.0338036 -0.0918348 -0.0421115 0.0419385 0.115575 0.119707 -0.108499 0.0124451 0.109417 -0.0299823 -0.0060947 -0.181207 0.0437015 -0.137224 0.0639776 -0.0237563 -0.0783214 0.164817 0.101498 -0.0809655 -0.0737593 0.0316748 0.13353 -0.122985 -0.116892 -0.00502359 0.106664 0.0647885 -0.0864363 -0.00858417 -0.0565511 -0.0674991 0.120162 0.0481042 0.0310945 
0.00632273 0.0673834 -0.0676317 -0.0929435 -0.0053023 0.171269 -0.0814072 -0.0734637 -0.135722 -0.00634537 -0.0013405 0.0426271 0.0598558 -0.0709235 -0.0265495 -0.0209555 -0.179941 -0.0334594 0.0473145 0.049334 0.106141 -0.0125005 0.0584269 0.0972056 0.0326412 0.1012 0.0819965 -0.211878 0.0118198 0.10832 -0.0130233 -0.120641 -0.0383096 0.00285621 0.0372646 0.0405117 -0.112681 0.0397813 -0.0102789 0.00708767 -0.0676039 -0.118105 -0.0249374 0.215626 -0.0747641 0.085646 0.217017 0.0190498 -0.21885 0.0311808 0.0622655 -0.0204477 0.0220455 -0.0217235 0.127712 0.0452262 -0.0192071 0.192463 0.0229022 -0.155343 -0.0128062 -0.00442301 0.255997 0.00980811 0.092485 -0.110065 -0.024667 0.0513008 -0.0143354 0.107642 -0.0307265 0.0642919 -0.0935555 -0.092705 0.0463028 -0.00880366 -0.113655 0.0298007 0.0563536 0.181598 -0.000747434 -0.00441644 -0.0121139 -0.0300839 -0.147213 -0.078575 0.056377 -0.0132982 0.0385009 0.0533576 0.0113236 -0.0702438 -0.0513608 0.0226579 -0.10066 -0.0233653 0.025059 0.118405 0.107593 -0.0947247 0.0266053 0.087178 -0.0382298 -0.0120397 -0.164808 0.0415629 -0.145261 0.089551 -0.0385539 -0.0721717 0.151362 0.111845 -0.0868639 -0.0729353 0.0418229 0.139045 -0.116498 -0.0948445 0.00806186 0.118562 0.0652214 -0.0774695 0.0118812 -0.0445895 -0.0682139 0.10824 0.0503571 0.0230455 
0.0111478 0.0806164 -0.0620596 -0.0913384 -0.0232116 0.136221 -0.0818385 -0.0818819 -0.145886 0.0171641 0.0172837 0.044561 0.0666984 -0.0369528 -0.0288343 -0.00839125 -0.166123 -0.0496634 0.0475877 0.0564449 0.0832971 -0.0166596 0.0781728 0.103237 0.0305023 0.114211 0.124915 -0.171558 0.0250683 0.117285 -0.0543391 -0.112696 -0.0125762 0.0117335 -0.00219681 0.0194117 -0.106352 0.0847709 -0.0130894 0.025108 -0.0972264 -0.128826 -0.0279355 0.188886 -0.0793568 0.098951 0.205469 0.0121626 -0.21259 0.0421853 0.0944072 0.0231556 0.00617523 -0.00587981 0.13648 0.0377757 -0.00036274 0.182021 0.0263666 -0.140207 -0.0171203 -0.0302032 0.24641 0.0234986 0.0779304 -0.0911022 -0.035482 0.0619231 -0.0253816 0.117507 -0.0403733 0.0541931 -0.0978507 -0.0661222 0.0806537 -0.00647757 -0.0860151 0.0252793 0.0543744 0.177159 0.00558193 -0.0263027 0.00198602 -0.0354168 -0.138077 -0.0946819 0.0438752 -0.0154161 0.0528349 0.0618598 -0.0125676 -0.0800457 -0.0351177 0.0415263 -0.0979705 -0.0363464 0.0268697 0.11672 0.151461 -0.114267 0.0290589 0.0976659 -0.0323495 0.0181751 -0.159775 0.0316066 -0.148058 0.0943586 -0.00915045 -0.11636 0.146726 0.145369 -0.0724342 -0.0488084 0.0438638 0.137037 -0.104193 -0.0815044 0.015101 0.132673 0.0608699 -0.0755019 0.00272327 -0.0498044 -0.0612115 0.124258 0.0665401 0.0247566 
0.00751304 0.0562331 -0.0538467 -0.0712917 -0.0176236 0.143831 -0.0923951 -0.0709009 -0.141442 0.00846177 0.00339638 0.0486683 0.0560621 -0.0991914 -0.0328893 -0.00864378 -0.177628 -0.0241112 0.0435267 0.0736899 0.102837 -0.0157966 0.0795757 0.113712 0.0206268 0.116776 0.0960543 -0.232244 0.00676558 0.0993549 -0.0292091 -0.106237 -0.0282993 0.0162724 0.0331213 0.0219319 -0.104553 0.0741315 -0.0161513 0.00842804 -0.0804628 -0.132888 -0.0439472 0.213918 -0.0782615 0.0831038 0.222265 0.0187586 -0.207503 0.0470491 0.0969626 -0.0105668 0.0142781 -0.0153801 0.134088 0.0268607 0.0151603 0.150391 0.0430402 -0.157433 0.00246543 -0.0323515 0.229767 0.0307057 0.0914794 -0.151135 -0.0208535 0.0394795 0.000484282 0.110226 -0.0536656 0.0543571 -0.0898005 -0.07407 0.0395273 -0.0361292 -0.114133 0.0608349 0.0581375 0.20356 -0.000473519 -0.00973626 -0.0146699 -0.0386467 -0.1289 -0.0952096 0.0547446 -0.00397025 0.0424203 0.0439074 -0.00725957 -0.0500887 -0.0473609 0.0215878 -0.117499 -0.026399 0.030641 0.120218 0.117834 -0.114407 0.0338317 0.0943181 -0.0418626 0.0114486 -0.124879 0.00183521 -0.133114 0.0957222 -0.0130352 -0.0695612 0.124878 0.141832 -0.0848974 -0.0724725 0.0352297 0.131391 -0.113466 -0.119498 -0.00713984 0.114314 0.0571737 -0.0453855 0.00918663 -0.0448308 -0.0594906 0.0983291 0.0602991 0.0214459 
0.0122916 0.0991344 -0.0720156 -0.0977148 -0.00116717 0.179112 -0.0800068 -0.0918801 -0.151467 0.0170534 0.00449149 0.00954484 0.0559064 -0.0390298 0.0269928 -0.0293493 -0.138657 -0.0309459 0.0922273 0.0227081 0.0805649 0.0134869 0.0417019 0.0902182 0.0492809 0.0894094 0.0712342 -0.204058 0.0326006 0.12212 0.0010648 -0.114536 -0.0388434 -0.0181457 0.0604554 0.0671633 -0.0901662 0.00850754 0.0157753 0.0132934 -0.0740845 -0.108548 -0.031172 0.19963 -0.0734632 0.148115 0.216305 0.0299784 -0.233249 -0.00977775 0.0595606 0.0163844 0.0389194 -0.0418637 0.104995 0.0594038 -0.0209418 0.195512 0.0275555 -0.122921 -0.0201271 0.0102054 0.238335 -0.0208264 0.0980437 -0.101654 -0.00590666 0.0557729 -0.012296 0.114551 -0.0132025 0.0680582 -0.111546 -0.115972 0.050708 -0.00174553 -0.123035 0.043565 0.0584213 0.171241 0.00148775 0.0117577 -0.0273189 -0.0275187 -0.128016 -0.0715506 0.0375869 -0.0518767 0.00964295 0.0643702 0.0164042 -0.0530038 -0.0422166 0.0260878 -0.0925208 -0.0343809 0.0406651 0.111827 0.111271 -0.0984815 0.0239333 0.108899 -0.0289403 -0.0283881 -0.190265 0.0558054 -0.130053 0.0692822 -0.0246215 -0.0472487 0.165413 0.0765527 -0.0882277 -0.0922193 0.0343259 0.129872 -0.129547 -0.122749 0.0012164 0.111136 0.0788576 -0.0970034 0.00212213 -0.0236428 -0.0595586 0.107974 0.051716 0.0207381 
-0.0104337 0.0852022 -0.0539956 -0.0892558 -0.022246 0.132385 -0.117258 -0.0993072 -0.145378 0.0112437 -0.00416348 0.0233765 0.0486855 -0.0480632 0.000900454 -0.0121007 -0.147694 -0.0407402 0.100505 0.0440867 0.0863234 0.00249242 0.0717635 0.0925421 0.0436785 0.130952 0.0977856 -0.219203 0.0168302 0.112997 -0.00723884 -0.116362 -0.00865944 -0.010017 0.051425 0.0493073 -0.0847094 0.0676419 0.0182109 0.0232293 -0.100337 -0.112928 -0.0393879 0.188761 -0.0592221 0.138836 0.226534 0.0100474 -0.213861 0.00543881 0.0781845 0.0188901 0.0470896 -0.0262166 0.119489 0.0440137 0.028082 0.162707 0.0344636 -0.138884 0.00257813 -0.0203934 0.218522 0.0111017 0.10226 -0.13589 -0.0131703 0.0597369 0.0108968 0.112397 -0.033973 0.0523864 -0.115781 -0.103794 0.0576579 -0.0176924 -0.129215 0.0561265 0.0582593 0.198502 -0.0146424 0.00918512 -0.015301 -0.0202438 -0.127072 -0.102441 0.0405272 -0.0264476 0.0237109 0.0337708 -0.0206716 -0.0344817 -0.0176325 0.0341393 -0.0987377 -0.0339712 0.041752 0.129437 0.121437 -0.117002 0.0196927 0.103588 -0.04577 -0.00189424 -0.150675 0.0174111 -0.124168 0.0681879 -0.00870822 -0.0611482 0.137246 0.0964462 -0.0924252 -0.0827826 0.0299582 0.139459 -0.129501 -0.138941 -0.0142434 0.108825 0.0685661 -0.0518451 -0.00568657 -0.0480615 -0.0636931 0.10659 0.0586709 0.0310151 
0.0260279 0.0871408 -0.0475165 -0.0775326 0.00261587 0.181922 -0.0702344 -0.115642 -0.142461 -0.000281025 -0.00398281 -0.00479872 0.0319914 -0.0521503 0.0550909 -0.0595128 -0.139083 -0.0271894 0.109264 0.0148106 0.0638147 0.0458344 0.0304538 0.0893847 0.0530298 0.0753831 0.0307044 -0.217822 0.0277654 0.121296 0.0294491 -0.118903 -0.0676146 -0.0361462 0.10441 0.0775437 -0.0969393 -0.0147301 0.0320396 0.0157819 -0.0721491 -0.0901555 -0.0772553 0.190516 -0.0732833 0.170311 0.186939 0.0464553 -0.196508 -0.0129477 0.0516908 0.0536602 0.0692666 -0.0614135 0.0853647 0.0381377 -0.00714237 0.183676 0.0204174 -0.0968808 -0.0127445 0.0316915 0.217588 -0.0140134 0.0867176 -0.135854 0.0350655 0.0409896 -0.000554984 0.112404 0.00942608 0.0762377 -0.097243 -0.11007 0.019919 -0.016345 -0.154104 0.0268427 0.0674797 0.218725 0.0233052 0.0185795 -0.0330645 -0.0301398 -0.0917114 -0.0941674 0.0328299 -0.0637428 -0.0239269 0.0547644 0.0299298 -0.00974359 -0.0214313 0.0283265 -0.114752 -0.0637723 0.0553942 0.0819395 0.102074 -0.101895 0.0414927 0.136495 -0.0337528 -0.0562865 -0.182345 0.0436708 -0.0870181 0.0517732 0.00503323 0.0194297 0.188892 0.0523988 -0.103121 -0.10342 0.0134255 0.144353 -0.137512 -0.121717 -0.020276 0.095416 0.0714198 -0.0956001 -0.0155225 -0.024987 -0.050953 0.0999628 0.0611295 0.0244664 
0.00842847 0.109264 -0.0342804 -0.0907615 -0.0134381 0.183101 -0.0633532 -0.107731 -0.155432 0.0162869 -0.00207565 -0.0142235 0.0354379 -0.0633158 0.0698863 -0.0571298 -0.164883 -0.0581203 0.105822 -0.00249867 0.0532291 0.0307911 0.0115392 0.0582372 0.0586784 0.0913343 0.0226914 -0.208959 0.0339319 0.105435 0.0290992 -0.107978 -0.0730926 -0.0254709 0.0898789 0.0772664 -0.0900929 -0.0176511 0.0552539 0.0281734 -0.0501298 -0.126432 -0.0627159 0.170292 -0.0557825 0.181368 0.191553 0.0408657 -0.225907 -0.0388067 0.0349214 0.0517539 0.0610808 -0.0560569 0.0775797 0.046968 -0.0218886 0.18203 0.00163213 -0.0870161 -0.0131807 0.0339167 0.211281 -0.0108412 0.0970967 -0.0909142 0.030507 0.0464629 0.0039315 0.0947564 -0.00562254 0.0742454 -0.104642 -0.0942425 0.0579635 -0.0128636 -0.150682 0.0223455 0.0687632 0.21919 0.0143063 -0.00141388 -0.0233984 -0.0180012 -0.118851 -0.0745146 0.0468821 -0.0668217 -0.024953 0.0565701 0.0350389 -0.020586 -0.0124215 0.0395491 -0.136273 -0.0544507 0.057891 0.069324 0.113255 -0.0952443 0.0235732 0.121141 -0.0441982 -0.0462963 -0.169623 0.0569095 -0.0913127 0.0899866 -0.00950722 -0.00224757 0.179895 0.0516362 -0.116604 -0.110227 0.0263146 0.134332 -0.150179 -0.10512 -0.000860093 0.0937471 0.0838676 -0.106539 -0.00932508 -0.0144323 -0.0394215 0.101871 0.0525949 0.0215706 
0.0127346 0.110734 -0.0333157 -0.0921626 -0.00673733 0.20503 -0.0534428 -0.0931495 -0.167002 0.0325391 0.00874946 0.00521286 0.0369714 -0.0865977 0.0498114 -0.0547906 -0.178067 -0.0250634 0.0873995 -0.00203956 0.0623273 0.0348512 0.00569235 0.0714376 0.0470789 0.0878379 0.0295919 -0.211334 0.0433044 0.102575 0.00706028 -0.113329 -0.0884205 -0.0266024 0.08318 0.0604222 -0.102594 -0.0383114 0.0528688 0.0380887 -0.038812 -0.127897 -0.0592605 0.185529 -0.0726684 0.147462 0.2017 0.0300971 -0.241808 -0.0295321 0.0577171 0.0384158 0.0285936 -0.0484161 0.0688086 0.0514843 -0.022054 0.1859 0.00170133 -0.0856602 -0.0137108 0.0304186 0.228565 -0.010448 0.0988107 -0.105162 0.0260633 0.0317882 -0.00440712 0.1068 -0.00439126 0.0851908 -0.0879794 -0.0842117 0.0507117 -0.0128379 -0.152465 0.0356411 0.0625135 0.193217 0.0158014 0.0110742 -0.0120872 -0.00910781 -0.125754 -0.060386 0.058215 -0.0608288 -0.0191774 0.0595542 0.0294562 -0.0330886 -0.0330247 0.0416547 -0.134617 -0.05704 0.0498129 0.0732067 0.103983 -0.0822003 0.0224455 0.118574 -0.0410185 -0.0366446 -0.158326 0.0590469 -0.0920794 0.097404 -0.0284426 -0.00999333 0.175661 0.0590827 -0.0972331 -0.103945 0.0253784 0.122578 -0.148536 -0.0970094 -6.129e-05 0.0862947 0.0814662 -0.121218 -0.00347158 -0.0303346 -0.0372599 0.111646 0.041233 0.0218796 
3.08841e-05 0.12339 -0.00790933 -0.0870759 -0.0229011 0.192197 -0.0547523 -0.0861906 -0.173951 0.0320449 -0.00308888 -0.0208681 0.025521 -0.0856927 0.0929223 -0.0732222 -0.158118 -0.0631001 0.107756 -0.00426809 0.0259281 0.0363822 -0.00402025 0.075827 0.0544504 0.0912402 0.0100026 -0.202265 0.04792 0.0652913 0.0409014 -0.115563 -0.0979535 -0.024058 0.0809168 0.0820282 -0.0908829 -0.0273721 0.0476946 0.0519115 -0.0248254 -0.126046 -0.0798054 0.158916 -0.0552589 0.179482 0.193797 0.037421 -0.237427 -0.0418006 0.0380644 0.0511363 0.0427963 -0.0683688 0.0587073 0.0502949 -0.0373303 0.189399 0.0128444 -0.0775347 -0.0226555 0.0488342 0.197093 -0.024661 0.0972205 -0.0866377 0.0563265 0.0233651 -0.00146549 0.0929261 -0.00643002 0.0869086 -0.0872046 -0.0546347 0.0724398 -0.0246611 -0.159539 0.0482586 0.0791219 0.206747 0.00350183 -0.000190034 -0.0214876 -0.0243207 -0.108714 -0.0747989 0.0568554 -0.0715986 -0.0337658 0.0461613 0.0381065 -0.00948855 0.00202392 0.0353367 -0.130114 -0.0557475 0.0796455 0.0464713 0.0994075 -0.0906869 -0.00484501 0.122457 -0.0519927 -0.0383534 -0.176099 0.0636729 -0.0840972 0.0866035 -0.0103924 0.00171394 0.188963 0.0670145 -0.1062 -0.115621 0.0218654 0.110526 -0.15843 -0.116625 -0.00342472 0.0827963 0.0793414 -0.110325 -0.0158658 -0.00600523 -0.0345835 0.100424 0.0346178 0.00658216 
0.00782251 0.106275 -0.0492076 -0.0916906 0.00212604 0.198211 -0.0543126 -0.0751039 -0.191297 0.0405894 -0.0130014 0.000944937 0.059331 -0.0870702 0.0395427 -0.0330709 -0.157206 -0.0220067 0.0766939 0.0290313 0.0792763 -0.0135409 0.0329712 0.0865577 0.0469587 0.0848688 0.00591241 -0.226963 0.0481119 0.0857315 0.014747 -0.0969274 -0.0939761 -0.0167475 0.0660709 0.0562405 -0.109601 0.00371247 0.0345222 0.0142892 -0.0454004 -0.118469 -0.0385095 0.187181 -0.0715169 0.129643 0.224608 0.0381595 -0.250825 -0.00992232 0.0534427 -0.000469345 0.0200014 -0.0507722 0.0809002 0.0423576 -0.0131731 0.199796 0.0350592 -0.130905 -0.0101861 0.0444043 0.228604 -0.0256907 0.103457 -0.0876594 0.00572394 0.03747 -0.0159018 0.0870767 -0.0200268 0.101218 -0.0891354 -0.0642132 0.0461732 -0.0248631 -0.135984 0.0497259 0.0847706 0.181605 -0.0054831 0.00267206 -0.0264366 -0.0301593 -0.131719 -0.0652146 0.0511815 -0.0389394 0.0141134 0.0374909 0.0322486 -0.0285071 -0.0285162 0.0156 -0.112182 -0.0431233 0.0604052 0.117373 0.0754745 -0.0846843 0.0117259 0.101274 -0.036967 -0.00650907 -0.173702 0.0619554 -0.116966 0.106349 -0.00698695 -0.0296151 0.158 0.0933379 -0.093701 -0.0968153 0.0349385 0.117104 -0.145107 -0.10989 -0.00264378 0.0990125 0.0591008 -0.102715 0.00421859 -0.0219847 -0.0777328 0.100708 0.0177763 0.00685344 
0.00851744 0.108102 -0.0226232 -0.08844 -0.0142232 0.187839 -0.0573223 -0.0833924 -0.171069 0.0372818 0.0161819 0.00530158 0.0369773 -0.0943613 0.0507914 -0.0540273 -0.169027 -0.0354026 0.0853413 0.0163981 0.0559313 0.0331875 0.0128813 0.0885891 0.0360584 0.100372 0.0348822 -0.219697 0.0497065 0.0823447 0.0069513 -0.122381 -0.0876909 -0.0186106 0.0722027 0.0658154 -0.0976106 -0.00187548 0.0385521 0.0545879 -0.0402888 -0.121366 -0.0833196 0.180167 -0.0726773 0.154142 0.205111 0.0297163 -0.238023 -0.0254577 0.0594926 0.0465765 0.0110857 -0.0484886 0.0765105 0.0456441 -0.0148042 0.185627 0.00942408 -0.0830861 -0.0149909 0.0175284 0.224079 -0.010357 0.104651 -0.128837 0.037907 0.0310934 0.00836849 0.110562 -0.00582446 0.0872942 -0.0830367 -0.0608693 0.0618868 -0.0264482 -0.157365 0.0725338 0.0675526 0.193738 0.00241837 0.010449 -0.0141158 -0.0182718 -0.124253 -0.0697776 0.0675802 -0.0522523 -0.0199813 0.0431493 0.025477 -0.0270872 -0.0175759 0.0346639 -0.131651 -0.0661654 0.0621474 0.060619 0.108552 -0.0910328 0.00904578 0.121208 -0.0510481 -0.0229272 -0.153855 0.0493958 -0.0905447 0.0934098 -0.0108497 -0.017396 0.16954 0.0814693 -0.0954593 -0.0988504 0.0250728 0.122434 -0.152803 -0.121506 -0.0141365 0.0857918 0.0699226 -0.0988298 -0.0118783 -0.0155648 -0.0403982 0.112096 0.0335612 0.0167979 
-0.0155664 0.0869763 -0.0566326 -0.0851403 0.00534348 0.15029 -0.0673638 -0.082792 -0.166597 0.0663379 0.0183987 0.0116437 0.0787837 -0.0554339 0.0213658 -0.00528413 -0.150708 -0.0191351 0.0777834 0.0520667 0.0927903 -0.0467597 0.0470985 0.121556 0.0589929 0.103704 0.0441011 -0.214855 0.0807687 0.0949681 0.0170461 -0.10471 -0.0652228 -0.0348605 0.0280868 0.057084 -0.138791 0.0373068 0.0194588 0.0199248 -0.0634535 -0.112036 -0.0569695 0.203829 -0.0745196 0.0944563 0.212659 0.0435786 -0.207395 -0.045222 0.0510829 -0.00166188 0.00821811 -0.0748186 0.0845286 0.0591348 -0.0177075 0.218406 0.0461353 -0.125708 -0.0234517 0.000732517 0.237781 0.0157672 0.0927577 -0.0741867 -0.010661 0.0424361 -0.00376006 0.0726842 -0.0290113 0.11631 -0.0899349 -0.0769936 0.0634521 -0.0332084 -0.12243 0.0786078 0.0729335 0.179186 -0.00527306 -0.00628893 -0.0236725 -0.0304348 -0.130878 -0.0769835 0.0597794 -0.00981436 0.0305581 -0.0015234 0.00417105 -0.00886381 -0.0234308 0.023085 -0.0999072 -0.0593977 0.0296752 0.117068 0.100544 -0.100885 0.0104569 0.0708022 -0.0267641 -0.0132216 -0.173178 0.0691726 -0.115693 0.0891542 0.0435824 -0.0642833 0.13574 0.122035 -0.0872732 -0.0838575 0.0429294 0.131931 -0.143807 -0.0945563 -0.0200128 0.107501 0.0343138 -0.0915622 -0.03407 -0.0263038 -0.122886 0.136964 -0.0112672 0.0288688 
0.0309793 0.113864 -0.0467928 -0.0722041 -0.015098 0.177707 -0.0412727 -0.076304 -0.194508 0.0468049 0.0273988 0.00134146 0.0455624 -0.0954783 0.038583 -0.0320044 -0.152693 -0.0354425 0.0929465 0.0231404 0.0685793 0.0106105 0.0231655 0.0740684 0.0504905 0.0973982 0.0320998 -0.224951 0.0710187 0.0996993 -0.00867035 -0.0930062 -0.0906261 -0.0241508 0.0499685 0.0365725 -0.11296 0.0119466 0.059577 0.0505883 -0.0554211 -0.126875 -0.0783305 0.181662 -0.0782883 0.149108 0.210164 0.0110966 -0.241498 -0.0328458 0.0750987 0.0714035 0.00431641 -0.0451734 0.0595209 0.031079 0.0099125 0.182238 0.0172001 -0.0802192 -0.0114056 -5.4018e-05 0.228354 -0.0140547 0.0925844 -0.12033 0.0314839 0.0255464 0.00614085 0.0904932 -0.0154859 0.101965 -0.093056 -0.0462838 0.0579735 -0.0392547 -0.136536 0.0623396 0.0544958 0.216754 -0.00392099 -0.00774902 -0.0116269 -0.0259877 -0.112809 -0.0589176 0.054234 -0.0629521 -0.0138359 0.0131793 0.0159418 -0.0194902 -0.0436792 0.0359961 -0.121977 -0.0771838 0.075381 0.0812281 0.107083 -0.094465 0.00046596 0.117395 -0.0313044 0.013843 -0.161985 0.050075 -0.0810967 0.132926 0.0208663 -0.0406334 0.155313 0.0885871 -0.105546 -0.0992949 0.0376701 0.118858 -0.144761 -0.115796 0.00300202 0.0926763 0.0490561 -0.0956377 -0.00642955 -0.0167518 -0.0400354 0.103654 0.0374184 0.0224275 
0.0146112 0.100219 -0.0609781 -0.0609887 -0.00533404 0.181477 -0.0263164 -0.0591373 -0.17869 0.0568428 0.0166099 0.0210045 0.070202 -0.12685 0.0044819 -0.0267817 -0.168003 -0.0239088 0.0488002 0.0524838 0.0908359 -0.0480415 0.0298854 0.103656 0.0416017 0.0804389 0.0136958 -0.237182 0.0633515 0.0946957 -0.00126432 -0.0776243 -0.0904066 -0.0055858 0.03179 0.0251126 -0.125723 0.0200746 0.0139155 0.0119433 -0.0305094 -0.153685 -0.0539788 0.204919 -0.0860576 0.0967698 0.216891 0.0328677 -0.235974 -0.0172512 0.0743452 0.0162886 -0.00618304 -0.0566885 0.0853062 0.0405692 -0.0181295 0.181494 0.0401254 -0.119938 -0.0181444 0.00095815 0.231333 -0.00831355 0.0986616 -0.106976 0.00369201 0.0104777 -0.0209048 0.0697103 -0.0444567 0.0993083 -0.0886053 -0.0453065 0.0522047 -0.0322513 -0.113476 0.0782779 0.0671634 0.20642 -0.0207008 -0.0300638 -0.0175002 -0.0265862 -0.123984 -0.052363 0.0659022 -0.0343434 0.018377 0.0190453 0.0138682 -0.0358196 -0.0487991 0.013491 -0.132985 -0.0605311 0.056571 0.0944882 0.0951761 -0.0942893 0.021445 0.100068 -0.0270656 0.0207421 -0.151447 0.0467898 -0.104275 0.151715 0.0119435 -0.0471661 0.131492 0.116304 -0.101956 -0.0993552 0.0408032 0.114741 -0.137898 -0.0996432 0.0109972 0.11723 0.041534 -0.0943515 -0.0122934 -0.0126781 -0.0679987 0.108887 0.0126245 0.013165 
