0.118349 -0.00501663 -0.167619 0.0295978 0.138125 0.115211 0.0720138 -0.0193165 0.0407338 -0.0795311 0.0819999 0.101291 0.101996 -0.165279 -0.14553 -0.00200087 -0.0647484 0.0923148 -0.241147 0.195637 0.16699 -0.112365 0.0750991 0.127091 -0.0297817 -0.10171 -0.0703796 -0.199453 0.0113366 0.0706981 0.0176798 0.111763 -0.0841837 0.0966987 -0.0725501 -0.011465 -0.0993491 0.0692216 -0.0842993 -0.0488708 0.0621613 -0.0616731 -0.0904563 0.146773 -0.132749 -0.0867023 0.0721481 0.0875252 -0.0576284 0.0894031 -0.0230801 -0.0433034 -0.102816 -0.0422686 0.0229142 -0.0343142 -0.0487525 0.0962398 -0.0020325 -0.0776264 -0.0528035 -0.0131438 0.202726 -0.0348658 -0.0370912 -0.157088 -0.00680109 0.0443677 -0.0309642 0.0471122 -0.012444 0.0611016 -0.00566131 0.0135939 -0.0700169 -0.0446835 -0.0289523 0.0799946 -0.061506 0.0868293 -0.0483494 0.0549399 -0.0695706 -0.0619883 -0.0773383 0.118392 0.0736956 0.0217194 -0.00777981 -0.0222877 0.123682 -0.13228 -0.127693 -0.0558697 -0.0336163 -0.0767251 -0.0827871 -0.00234107 -0.00771335 -0.0635422 0.0438041 -0.0526844 -0.00428129 0.151078 -0.0364901 0.0124516 -0.10666 0.191378 0.0333793 -0.0149559 0.0110931 0.158817 -0.0912059 0.039627 0.0128947 0.0460022 -0.110401 -0.0781745 0.0597075 0.141721 -0.0303779 0.0911702 -0.0401923 0.14436 -0.0843189 -0.0308175 -0.0790676 -0.0492759 
0.117543 -0.00393274 -0.150372 0.0256768 0.124579 0.11464 0.0732069 -0.0127162 0.0287291 -0.075656 0.0866142 0.102055 0.108179 -0.166935 -0.149514 0.00531999 -0.0672213 0.0864997 -0.253671 0.198626 0.16712 -0.111369 0.0745525 0.128601 -0.042855 -0.0914267 -0.0720307 -0.194734 0.0199372 0.0631907 0.00678271 0.114479 -0.0868424 0.100323 -0.0831586 -0.0191285 -0.108938 0.0869603 -0.0864311 -0.0360029 0.0538077 -0.0665071 -0.100733 0.137322 -0.124856 -0.0885822 0.0700681 0.0791475 -0.072152 0.090381 -0.0139112 -0.0391157 -0.110087 -0.0368657 0.0196933 -0.035957 -0.0447459 0.100999 -0.00223652 -0.0738621 -0.0521207 -0.0126445 0.202222 -0.0309945 -0.03156 -0.153396 -0.00733397 0.0422325 -0.0392542 0.0454472 -0.0147279 0.054593 -0.00191507 0.0277537 -0.0613533 -0.046764 -0.0241482 0.0753005 -0.0575747 0.0889976 -0.0436722 0.0392329 -0.0656071 -0.0692088 -0.084302 0.115782 0.0798979 0.0203001 -0.0106906 -0.0203933 0.118815 -0.138494 -0.124345 -0.042204 -0.0364398 -0.0668072 -0.077016 -0.00678228 -0.00338293 -0.0549478 0.0454162 -0.047182 -0.0190427 0.164584 -0.0286282 0.0117161 -0.105955 0.194113 0.0397876 -0.0351059 0.00596942 0.172053 -0.089738 0.0422685 0.0186935 0.0489342 -0.11765 -0.0676764 0.058236 0.142371 -0.0391049 0.0857428 -0.0391247 0.137361 -0.0732192 -0.0205918 -0.0800929 -0.0569917 
0.112895 -0.0154823 -0.152299 0.0211308 0.129401 0.108425 0.0739485 -0.00636023 0.031616 -0.081335 0.0745537 0.0993423 0.109801 -0.167892 -0.147474 -0.00162451 -0.0722774 0.0841685 -0.251715 0.201698 0.164366 -0.115512 0.0823088 0.11843 -0.0482224 -0.0904907 -0.074633 -0.20134 0.0127224 0.0521318 0.0105994 0.11265 -0.0849588 0.0995937 -0.0786539 -0.0197164 -0.100358 0.0952926 -0.0883294 -0.043935 0.0638434 -0.0639174 -0.102529 0.136688 -0.135771 -0.0898435 0.0644621 0.0830876 -0.0623269 0.0901304 -0.0304783 -0.0519814 -0.102013 -0.0327353 0.0197838 -0.0412643 -0.0348158 0.0931105 -0.00409127 -0.0810613 -0.0485024 -0.00996132 0.19727 -0.0244384 -0.028158 -0.154178 -0.00529448 0.0460696 -0.0248397 0.0356819 -0.0169611 0.0524588 0.00206989 0.0264548 -0.0635467 -0.0450452 -0.0318022 0.0751637 -0.0516994 0.0856902 -0.0502958 0.041313 -0.0662447 -0.0637955 -0.0798795 0.11516 0.0836898 0.0349918 -0.00838178 -0.0280482 0.127177 -0.133402 -0.117545 -0.0525252 -0.0414703 -0.0731373 -0.0772512 -0.00134068 -0.00696638 -0.0567153 0.0455425 -0.053978 -0.0155763 0.162358 -0.0210143 0.00381317 -0.105568 0.196283 0.0382044 -0.0259408 0.00482841 0.169258 -0.092369 0.0432136 0.0121493 0.0501478 -0.118268 -0.072622 0.0544382 0.135535 -0.0410661 0.092234 -0.0409885 0.138187 -0.0804206 -0.0310694 -0.0926583 -0.0530919 
0.117226 -0.0146172 -0.153444 0.031711 0.130935 0.107211 0.0654726 -0.0159448 0.0333089 -0.0812348 0.0798817 0.107516 0.106873 -0.162488 -0.145282 0.00329558 -0.0638388 0.0896863 -0.248579 0.204545 0.166999 -0.110851 0.0874562 0.130602 -0.0403014 -0.092391 -0.0683732 -0.20464 0.00668033 0.0658895 0.00783526 0.115387 -0.0738827 0.100828 -0.0815079 -0.0156649 -0.103953 0.0938638 -0.0931802 -0.041685 0.0533 -0.0579816 -0.102503 0.137368 -0.136343 -0.0849152 0.0714 0.0743026 -0.0607757 0.0955446 -0.0127897 -0.0476358 -0.0999891 -0.0344282 0.027088 -0.0379986 -0.0338052 0.0912862 0.00306928 -0.0795688 -0.0525215 -0.0167504 0.191754 -0.0287201 -0.0305742 -0.161863 -0.00607753 0.048833 -0.0320814 0.0469991 -0.010721 0.0532852 -0.0030046 0.0168914 -0.0639011 -0.0403055 -0.0325786 0.0726719 -0.058794 0.0929015 -0.050054 0.0466141 -0.0689925 -0.0674493 -0.0776904 0.113806 0.0794611 0.0247028 -0.0134054 -0.0238718 0.113 -0.13409 -0.122568 -0.0482714 -0.0405128 -0.0691734 -0.0814295 -0.000960152 -0.00253961 -0.0622542 0.0460759 -0.0505398 -0.0110019 0.161927 -0.0299957 0.00288051 -0.110802 0.186834 0.0401945 -0.0297926 0.00298815 0.171312 -0.0907001 0.0400053 0.0135394 0.0528715 -0.118238 -0.0800967 0.0522866 0.143901 -0.0363338 0.0958571 -0.0427937 0.137049 -0.0732195 -0.0251782 -0.0764704 -0.05052 
0.120135 -0.0120356 -0.151342 0.0178072 0.128214 0.118873 0.0750841 0.00561654 0.0304935 -0.0929497 0.0805837 0.0956248 0.107732 -0.159211 -0.141828 -0.010751 -0.0621728 0.0778723 -0.253833 0.191601 0.165465 -0.104891 0.0740528 0.124278 -0.0367024 -0.104382 -0.0666332 -0.187893 0.0138806 0.0513727 0.017651 0.0990691 -0.086433 0.101679 -0.0880904 -0.015768 -0.107215 0.0774321 -0.0970729 -0.0340663 0.0685645 -0.05717 -0.101003 0.145173 -0.133224 -0.0870185 0.0617788 0.0783357 -0.0654744 0.090023 -0.0287405 -0.0462519 -0.103576 -0.0379047 0.0119967 -0.0362791 -0.0501693 0.105015 0.0017709 -0.0803772 -0.0571589 -0.00241007 0.194872 -0.0295517 -0.0438729 -0.150925 0.00058641 0.0460797 -0.0299776 0.0389826 -0.00736347 0.0522543 0.0019585 0.0178918 -0.0587514 -0.0402379 -0.032072 0.0686884 -0.0567885 0.0919412 -0.0506869 0.038849 -0.0606003 -0.0681809 -0.0794882 0.122777 0.0851947 0.0224835 -0.0175837 -0.0257307 0.128442 -0.140963 -0.12506 -0.0522526 -0.0349694 -0.0688643 -0.0779988 -0.00868433 -0.0131517 -0.0576044 0.0357819 -0.0485904 -0.00822501 0.162828 -0.0426131 0.0101598 -0.117222 0.195878 0.0302922 -0.0369322 0.0188812 0.165533 -0.0971215 0.0456894 0.0108613 0.0487791 -0.118475 -0.0721513 0.061429 0.14239 -0.0401602 0.0846278 -0.0484292 0.142847 -0.0764973 -0.0350538 -0.0886413 -0.0541212 
0.120964 -0.0235821 -0.15309 0.0257781 0.125003 0.112307 0.0743437 -0.00704404 0.0213198 -0.0873723 0.0700536 0.096245 0.112601 -0.159166 -0.1465 -0.00449114 -0.0642672 0.0824247 -0.241953 0.207878 0.169624 -0.118699 0.0910714 0.131171 -0.0492702 -0.0961008 -0.0732332 -0.208398 0.0110602 0.0571986 0.00519247 0.105277 -0.0824306 0.100376 -0.0770981 -0.0167503 -0.101531 0.10191 -0.0989271 -0.0531257 0.0503496 -0.0614487 -0.106416 0.132942 -0.135971 -0.0800245 0.0683795 0.0813004 -0.0665939 0.0980263 -0.0290337 -0.0541833 -0.0866733 -0.0293244 0.0289119 -0.0407783 -0.0252171 0.0980512 0.00360881 -0.0878642 -0.0444929 0.00062052 0.197744 -0.0346153 -0.0250608 -0.151921 -0.00555261 0.043122 -0.0320526 0.0366622 -0.0232976 0.0475129 -0.00644628 0.0235477 -0.0645402 -0.0413836 -0.0216341 0.0727048 -0.0423313 0.0888225 -0.0532407 0.0325652 -0.076691 -0.0777362 -0.0748731 0.110594 0.0748709 0.0314554 -0.0109993 -0.0221647 0.136268 -0.13334 -0.11091 -0.0511721 -0.039452 -0.0661494 -0.0730798 0.00771045 0.00246839 -0.0549573 0.056428 -0.0457966 -0.018725 0.159955 -0.0281504 0.00407541 -0.106828 0.184969 0.0377971 -0.0279334 0.00598089 0.175569 -0.0849948 0.0348449 0.013272 0.0628013 -0.112924 -0.0756454 0.0500123 0.141984 -0.0508373 0.0845735 -0.0411561 0.135384 -0.0849295 -0.0208915 -0.0882085 -0.0593598 
