0.129828 0.0614012 -0.149581 -0.0277937 0.0910809 0.148443 0.0607744 -0.0207286 -0.160474 -0.0819058 0.00579494 0.0765444 0.114119 -0.0883984 -0.114707 -0.00770779 -0.0397701 -0.00371405 -0.139615 0.192232 0.106003 -0.0788277 0.122317 0.0124272 -0.0490261 -0.0118396 -0.0602535 -0.153201 0.0258335 0.0615684 -0.0709441 0.0898515 -0.0806947 0.101002 -0.0782343 -0.0439278 -0.0746718 0.186438 -0.0499638 -0.033029 -0.0140849 -0.0551944 -0.0158157 0.103513 -0.164816 0.02887 0.157287 0.0174325 -0.167932 0.156231 0.047596 -0.00374091 -0.101977 0.0465143 0.0747318 -0.0839691 0.0286507 0.140698 0.0369054 -0.123948 -0.0441015 0.0293438 0.214611 -0.0965012 0.0501393 -0.114272 -0.0222854 0.0495335 -0.0828193 0.0686929 -0.00621936 0.0594374 -0.0120721 0.104094 -0.011587 -0.0157557 -0.00471925 -0.0102066 0.00650668 0.0865304 -0.0379511 -0.0286778 -0.0155953 -0.0631527 -0.0656351 -0.00267441 0.0391938 0.0163182 0.0443993 0.0171832 0.0892918 -0.155295 -0.087748 -0.0428911 -0.0209691 -0.0681881 0.0581292 0.123508 -0.00136386 -0.0466023 -0.0221551 0.0833744 -0.0206608 0.224988 -0.134377 0.0216737 -0.136166 0.235161 0.0377496 -0.0944348 0.0582326 0.175275 -0.103416 0.0720543 0.0178338 0.0424855 -0.0600663 -0.077148 0.0617574 0.154546 -0.0469331 0.0331378 0.0532852 0.0546181 -0.0203452 -0.0323231 -0.00119999 -0.0612238 
0.112221 0.0831349 -0.136591 -0.0422663 0.0750974 0.142024 0.0406789 -0.00557268 -0.179988 -0.0517228 0.00184279 0.0602587 0.11298 -0.0898062 -0.103143 0.00129434 -0.0434489 -0.0101702 -0.120606 0.184651 0.0939815 -0.0773546 0.124734 0.0148504 -0.0433602 0.00594885 -0.0456577 -0.144559 0.0474151 0.0447523 -0.0703823 0.0685154 -0.0821666 0.0878709 -0.0857758 -0.0448629 -0.0846204 0.187486 -0.0461004 -0.0132157 -0.0282381 -0.0626256 -0.014067 0.119465 -0.158658 0.0353799 0.172048 0.0176558 -0.179312 0.1524 0.0660973 0.0130753 -0.119154 0.0402459 0.0677376 -0.0828696 0.0352718 0.138732 0.0609917 -0.135866 -0.0439796 0.020395 0.208235 -0.0805194 0.0459983 -0.121085 -0.0206177 0.0457697 -0.0713036 0.0753707 -0.00790153 0.0728066 -0.0107544 0.112744 0.0025737 -0.0300408 -0.0159588 0.0143783 0.0174232 0.0909675 -0.0327187 -0.0327331 -0.00388438 -0.0559147 -0.0615802 -0.0147736 0.0375587 0.0228119 0.0654243 0.00764978 0.0658086 -0.134545 -0.0872622 -0.0436522 -0.0159675 -0.0737826 0.0718677 0.140608 -0.00825192 -0.0615219 -0.0377394 0.0923946 -0.013777 0.224067 -0.146291 0.0232116 -0.140113 0.232157 0.0595018 -0.107955 0.0642438 0.188614 -0.10252 0.0714248 0.0184279 0.0331678 -0.0580665 -0.087756 0.059216 0.145629 -0.0447199 0.0287477 0.0576086 0.0446189 -0.0301784 -0.0316462 0.00260568 -0.0499595 
0.109287 0.0831097 -0.13889 -0.0413216 0.0779572 0.140275 0.0400152 -0.011049 -0.17942 -0.049269 0.000701693 0.0646861 0.111404 -0.094923 -0.102281 0.00407863 -0.0440331 -0.00596347 -0.123711 0.185725 0.0892068 -0.0749002 0.125228 0.0179174 -0.0443467 0.00793905 -0.0448005 -0.148183 0.0438115 0.0452655 -0.0693165 0.070822 -0.0823151 0.0879643 -0.0845898 -0.0441364 -0.0852981 0.184141 -0.0482785 -0.00948465 -0.0260542 -0.0615399 -0.0116832 0.123945 -0.159731 0.0367396 0.1762 0.0192992 -0.178035 0.152801 0.0702567 0.00478295 -0.120287 0.0359907 0.0673269 -0.0819559 0.0321656 0.141044 0.064452 -0.132932 -0.0455013 0.0204699 0.206256 -0.0788774 0.0477985 -0.126639 -0.0217285 0.0445724 -0.0730525 0.0734281 -0.00737952 0.0744633 -0.00657284 0.112512 0.00158077 -0.0289364 -0.0199069 0.0168329 0.0144911 0.0884403 -0.0287927 -0.0275125 -0.00804588 -0.0553411 -0.0649723 -0.014539 0.0376103 0.0207843 0.0605806 0.00715923 0.0608875 -0.13202 -0.0887516 -0.0467855 -0.0158044 -0.0681399 0.069407 0.137719 -0.00909104 -0.0621144 -0.0411538 0.0880195 -0.0128034 0.22422 -0.147855 0.0188758 -0.143962 0.232192 0.0567549 -0.103379 0.0671805 0.191181 -0.0991294 0.0712049 0.0116997 0.0312853 -0.0624446 -0.0884151 0.0549728 0.144067 -0.042176 0.0321275 0.0561204 0.0455895 -0.0327365 -0.0333751 -0.00519482 -0.0546898 
0.123285 0.061916 -0.142335 -0.0332847 0.0890311 0.149714 0.0538031 -0.0250732 -0.172691 -0.0706589 0.00179061 0.0741559 0.116615 -0.0763994 -0.112555 -0.00271224 -0.0420531 -0.00127327 -0.12617 0.187974 0.107649 -0.0822212 0.126953 0.0116208 -0.046086 0.0013947 -0.0605019 -0.151162 0.0336143 0.0599942 -0.071063 0.0867803 -0.0854343 0.0953101 -0.0753795 -0.0399122 -0.0794003 0.194298 -0.0370593 -0.0322328 -0.0232244 -0.0518989 -0.0144662 0.0980059 -0.163065 0.0244079 0.162065 0.0169485 -0.168616 0.151242 0.0510985 0.00179879 -0.101965 0.0500053 0.079766 -0.0835711 0.0409383 0.148273 0.0359894 -0.130714 -0.0403914 0.0310815 0.219943 -0.0954786 0.0565315 -0.104687 -0.0255142 0.0562138 -0.0801108 0.0772162 -0.00637684 0.0712064 -0.0156881 0.110188 -0.00968658 -0.0200437 -0.00428047 -0.00935441 0.0154226 0.0813959 -0.0377049 -0.0268586 -0.00788156 -0.0624166 -0.0681719 -0.0167405 0.0400418 0.0281913 0.0559703 0.0111737 0.087122 -0.146722 -0.0765952 -0.0370171 -0.018029 -0.0723945 0.0609933 0.139873 -8.66861e-05 -0.0451611 -0.0220304 0.0875277 -0.0256429 0.225466 -0.131757 0.0275937 -0.135221 0.225428 0.0483015 -0.100251 0.0539018 0.180592 -0.10062 0.0758299 0.0262983 0.0455211 -0.0559164 -0.0760139 0.0574807 0.152895 -0.0457431 0.0276034 0.0587336 0.0407628 -0.0317349 -0.0215508 0.000615655 -0.0535271 
0.125228 0.068034 -0.140377 -0.0362717 0.0876246 0.15429 0.0569009 -0.01983 -0.173239 -0.0686649 0.00592487 0.0696394 0.11757 -0.0828989 -0.10743 -0.00726324 -0.0425722 -0.0053531 -0.134288 0.187722 0.0983216 -0.0755202 0.123262 0.00624252 -0.050349 -0.00172809 -0.063453 -0.144862 0.0360964 0.0503949 -0.0673127 0.0868598 -0.0923395 0.0992293 -0.078709 -0.0394221 -0.0770034 0.189355 -0.0368545 -0.0243468 -0.0144469 -0.0568384 -0.0192393 0.0993872 -0.167674 0.0218132 0.15576 0.0238591 -0.167564 0.154569 0.0500275 0.00451971 -0.111764 0.049546 0.0693563 -0.0867318 0.0341183 0.145317 0.0375074 -0.125078 -0.0462296 0.0327805 0.217526 -0.0963258 0.0516522 -0.106748 -0.0183345 0.052906 -0.0800514 0.0751396 -0.00568036 0.0716153 -0.00805409 0.119374 -0.00778558 -0.0258625 -0.00699381 -0.00811691 0.0139659 0.0835629 -0.0327662 -0.0315122 -0.00452741 -0.059294 -0.0656038 -0.0125145 0.0431285 0.0251366 0.0532459 0.0121126 0.0915702 -0.14894 -0.0777173 -0.0388572 -0.0214111 -0.0767711 0.0618811 0.131727 -0.00673352 -0.0451997 -0.0264356 0.09075 -0.0250803 0.227993 -0.129122 0.0277541 -0.13398 0.232708 0.0490233 -0.0952913 0.0574974 0.18059 -0.101684 0.0824186 0.0202059 0.0373635 -0.0547477 -0.0733363 0.058846 0.149383 -0.044358 0.0258151 0.0585525 0.0484711 -0.0273522 -0.0311725 -0.00331183 -0.0532613 
0.106932 0.0924767 -0.116028 -0.0402229 0.0553892 0.153806 0.0533922 0.00579675 -0.160343 -0.0559659 0.0203638 0.045223 0.129585 -0.110471 -0.0889218 -0.0154526 -0.0776823 -0.0045133 -0.153469 0.184608 0.100097 -0.0949049 0.121209 0.0421247 -0.0478061 -0.0458517 -0.0671538 -0.149893 0.0394583 0.0479879 -0.0540041 0.0399522 -0.0844781 0.101814 -0.0835075 -0.0364213 -0.0972135 0.154415 -0.070557 -0.00062152 -0.0235326 -0.0983566 -0.0226209 0.124152 -0.155047 0.0124211 0.15919 0.0343778 -0.187026 0.176259 0.0510635 -0.012552 -0.121427 0.0319583 0.0475092 -0.0676428 0.00636576 0.133763 0.056218 -0.123679 -0.0572107 0.041307 0.199759 -0.0834197 0.0309928 -0.116433 -0.014854 0.0161887 -0.106256 0.0590195 -0.0161288 0.0615031 -0.0163528 0.105014 0.0120217 -0.0328018 -0.0119161 1.4295e-05 0.0264789 0.117097 -0.0292235 -0.0765149 -0.0211535 -0.0506021 -0.0807263 0.0355215 0.0294924 -0.0100539 0.0513857 0.0276489 0.0788749 -0.155895 -0.0825516 -0.0439848 -0.043353 -0.0657826 0.028078 0.128048 -0.00758108 -0.0473974 -0.0203023 0.0843125 -0.0183549 0.205112 -0.119179 0.0393804 -0.135146 0.247359 0.048621 -0.103009 0.0508411 0.179791 -0.0961313 0.052555 0.000771195 0.0598021 -0.0433657 -0.0470915 0.0704829 0.173932 -0.0444774 -0.00540821 0.0256432 0.072469 -0.0347378 -0.0275029 -0.00115151 -0.0430126 
0.128763 0.0622967 -0.147267 -0.0313043 0.0917274 0.146365 0.0621495 -0.0228182 -0.168331 -0.070276 0.00376433 0.0699155 0.121346 -0.0814149 -0.109724 -0.00497681 -0.0374897 0.000402244 -0.136088 0.193913 0.103527 -0.0822474 0.126341 0.00779083 -0.0514682 -0.00759407 -0.0695586 -0.151762 0.0325456 0.0596797 -0.0711285 0.0944903 -0.0862084 0.0984 -0.0749346 -0.0422087 -0.0746066 0.195408 -0.0410537 -0.035878 -0.0188849 -0.0535393 -0.0169976 0.0977715 -0.167689 0.0251093 0.154591 0.0249986 -0.16347 0.154407 0.0471969 -0.000943194 -0.103409 0.0482343 0.0733247 -0.0883653 0.036993 0.139786 0.0377724 -0.126378 -0.0435818 0.030943 0.213381 -0.0962531 0.0511785 -0.10722 -0.0234844 0.0537633 -0.081449 0.0652986 -0.00626216 0.0660947 -0.0110044 0.111009 -0.0144676 -0.0203888 -0.00392722 -0.0110032 0.0152329 0.0831854 -0.0333941 -0.0310832 -0.0148325 -0.061902 -0.0621062 -0.00958012 0.0374267 0.0238664 0.05381 0.0130749 0.0914803 -0.147554 -0.0796564 -0.0417375 -0.0225209 -0.0740044 0.059283 0.131901 -0.00407994 -0.0460888 -0.0180405 0.0867293 -0.0214526 0.226557 -0.130096 0.0234443 -0.133111 0.232362 0.0522972 -0.0910013 0.0543531 0.179003 -0.10229 0.0769777 0.0195042 0.0425221 -0.056102 -0.0744613 0.0558377 0.151111 -0.0496002 0.0299562 0.0566622 0.0523734 -0.0289393 -0.0320722 -0.00502441 -0.05867 
0.108284 0.0946063 -0.118621 -0.0441724 0.0596617 0.156666 0.0522934 0.00571781 -0.167836 -0.053634 0.0172985 0.0457182 0.127109 -0.108059 -0.0874681 -0.0140352 -0.0714199 -0.00465298 -0.151516 0.184093 0.0932012 -0.0866221 0.119426 0.0380192 -0.0501415 -0.0399628 -0.0656386 -0.145065 0.0413409 0.0437204 -0.0556661 0.0430587 -0.0892121 0.101215 -0.084875 -0.0339128 -0.0949694 0.152578 -0.0686006 0.00327714 -0.0209486 -0.0921768 -0.0199571 0.12368 -0.156238 0.0179648 0.162495 0.0355688 -0.189323 0.175918 0.0539161 -0.0118628 -0.126341 0.0321655 0.0473193 -0.0697263 0.00692779 0.138439 0.0603688 -0.122873 -0.0575004 0.0454712 0.200605 -0.0859477 0.0312369 -0.116832 -0.0143178 0.0199348 -0.103386 0.0621991 -0.0130293 0.0653258 -0.0108043 0.110963 0.0115247 -0.0325719 -0.0134939 0.0033276 0.0252944 0.106947 -0.0251962 -0.0679462 -0.0198739 -0.0513891 -0.0798111 0.0310041 0.0302059 -0.00856336 0.0515271 0.0277242 0.0794591 -0.153136 -0.0833392 -0.0462873 -0.0372077 -0.0635344 0.0352857 0.127717 -0.011871 -0.0474449 -0.0274903 0.0865754 -0.0173768 0.207276 -0.127488 0.0394028 -0.139759 0.244813 0.045906 -0.100861 0.0577177 0.181427 -0.0932461 0.0573197 -0.00139638 0.0517802 -0.0442688 -0.0524317 0.0676238 0.167166 -0.0421659 -0.00344703 0.0328617 0.069943 -0.0362878 -0.0308468 -0.00580343 -0.0476921 
0.111541 0.0852114 -0.13881 -0.0406573 0.0776458 0.133186 0.0467292 -0.00719701 -0.175847 -0.0476866 0.00257178 0.0643079 0.113054 -0.0874936 -0.106109 0.00827516 -0.0380471 -0.0172862 -0.130339 0.186632 0.0869814 -0.0785999 0.120682 0.00124869 -0.0467516 0.0130342 -0.048811 -0.136822 0.0455281 0.0427834 -0.0738317 0.0847502 -0.0822088 0.0886502 -0.0946898 -0.0484143 -0.0822448 0.201337 -0.0426819 -0.00845743 -0.024372 -0.0592864 -0.013491 0.108684 -0.153733 0.0383945 0.164928 0.0139019 -0.173627 0.146629 0.0684237 0.0172394 -0.12645 0.0421587 0.0669335 -0.0873889 0.0307695 0.135043 0.0577943 -0.127969 -0.046316 0.0116292 0.201874 -0.0801326 0.047422 -0.117432 -0.0212071 0.0555164 -0.0701776 0.0684314 -0.00201584 0.0740126 -0.00349632 0.118885 0.00511802 -0.0238432 -0.0129746 0.0111011 0.0102679 0.0854461 -0.0314594 -0.0319716 -0.00102207 -0.0527419 -0.0637697 -0.0173804 0.0416446 0.0262104 0.0662608 0.00215187 0.0552584 -0.137907 -0.0870878 -0.0400076 -0.0157574 -0.0719213 0.0776211 0.12698 -0.0078878 -0.0595817 -0.0431285 0.0881241 -0.0171485 0.234275 -0.146333 0.0191982 -0.143412 0.237102 0.0618084 -0.112125 0.0614304 0.191176 -0.106633 0.0806664 0.0199072 0.0254417 -0.0666284 -0.0836304 0.0569995 0.141063 -0.0478787 0.0396268 0.0610464 0.0491227 -0.019158 -0.0351062 -0.00353739 -0.0555862 
0.13516 0.057849 -0.131257 -0.0290273 0.0844288 0.166731 0.0733807 -0.0166181 -0.170799 -0.0761458 0.00500057 0.057903 0.131867 -0.0885417 -0.102286 -0.0117494 -0.053365 0.00965694 -0.140404 0.186613 0.120663 -0.0910822 0.124316 0.0160646 -0.051266 -0.0324666 -0.0942619 -0.162349 0.0294421 0.0648887 -0.0613134 0.0856443 -0.0998347 0.106182 -0.0592483 -0.0406807 -0.0795993 0.175895 -0.0336243 -0.0435658 -0.0242895 -0.0678298 -0.0164484 0.0886466 -0.159832 0.00339905 0.14784 0.0300861 -0.170103 0.165564 0.0394693 -0.015132 -0.0916934 0.050725 0.0627217 -0.0842305 0.0388343 0.139515 0.0298638 -0.126168 -0.0398697 0.0520659 0.211752 -0.110279 0.0504904 -0.0955995 -0.0218749 0.0360406 -0.101067 0.0595946 -0.0153774 0.0652142 -0.0245433 0.107975 -0.0242555 -0.0267842 0.00570011 -0.0299521 0.0293935 0.100154 -0.0321337 -0.0559431 -0.0184301 -0.0607924 -0.0663291 0.00665875 0.0311282 0.0101419 0.0519229 0.0234375 0.11031 -0.152838 -0.0746556 -0.0331512 -0.035378 -0.066894 0.0422992 0.142322 -0.010553 -0.0262556 8.15634e-05 0.0895318 -0.0335563 0.219178 -0.107404 0.0346236 -0.119762 0.231542 0.0474545 -0.0834944 0.0379373 0.165954 -0.101298 0.0643211 0.0232065 0.0638062 -0.0389246 -0.049695 0.0583165 0.163848 -0.0498931 0.005163 0.0530143 0.0521498 -0.0335562 -0.0276005 0.00271015 -0.0522592 
0.10975 0.088352 -0.137982 -0.0392529 0.0724389 0.133124 0.0423414 -0.00485114 -0.180152 -0.0392962 0.00689442 0.0624467 0.116976 -0.0969894 -0.102773 0.00440876 -0.0393007 -0.00584213 -0.12499 0.191165 0.089117 -0.0776041 0.119366 0.0176216 -0.0455354 0.00739169 -0.0454251 -0.143529 0.0502087 0.0500144 -0.075597 0.0748472 -0.0773433 0.0882161 -0.0897118 -0.0492837 -0.0844428 0.186479 -0.0489334 -0.00969224 -0.029998 -0.0689582 -0.012761 0.125163 -0.15797 0.0358208 0.173775 0.0189249 -0.178308 0.150809 0.0767501 0.0137252 -0.126599 0.0357573 0.0646176 -0.0831316 0.0265794 0.128998 0.0663458 -0.130575 -0.0459155 0.0092511 0.199994 -0.0740797 0.0420289 -0.130089 -0.0204063 0.0395447 -0.0739871 0.0657388 -0.00787018 0.0690562 -0.00699004 0.11106 0.00182326 -0.0296343 -0.0160424 0.0220415 0.0157606 0.0939889 -0.028567 -0.0347449 -0.00651157 -0.0514585 -0.0577294 -0.0127344 0.0367999 0.0178618 0.0683714 0.00795659 0.0525164 -0.13237 -0.0930905 -0.0415432 -0.021644 -0.0731394 0.070765 0.132175 -0.00900451 -0.0679313 -0.0382095 0.0939112 -0.0104088 0.227358 -0.146692 0.0189321 -0.139841 0.237242 0.0643147 -0.106373 0.0620869 0.188702 -0.106017 0.0714645 0.0115312 0.0268427 -0.0604483 -0.090275 0.0552874 0.143569 -0.0462649 0.0313865 0.0542015 0.0497902 -0.0257381 -0.034807 0.0012495 -0.0538362 
0.117764 0.075411 -0.122092 -0.0382912 0.0663567 0.144158 0.0523754 -0.00521296 -0.172066 -0.0572998 0.00332444 0.0559979 0.120863 -0.100351 -0.0968045 -0.000567362 -0.0621889 -0.0148493 -0.142321 0.19012 0.093617 -0.0831613 0.12827 0.0122908 -0.0570011 -0.00587949 -0.0680236 -0.153665 0.0341083 0.0416501 -0.0687424 0.0696085 -0.0892223 0.0966089 -0.0779124 -0.0427565 -0.0894755 0.197764 -0.0522017 -0.0131364 -0.0338547 -0.0722904 -0.0284761 0.109181 -0.15317 0.0309727 0.157348 0.0243862 -0.177935 0.169625 0.0577095 -0.000165973 -0.117087 0.0443137 0.0635219 -0.0903866 0.028306 0.133076 0.0504704 -0.126394 -0.0442234 0.0267409 0.202375 -0.081833 0.0504304 -0.121679 -0.0194755 0.0435942 -0.0858298 0.0645258 -0.00778179 0.0669705 -0.00723513 0.118081 -0.00346557 -0.0321039 -0.0124516 -0.00745965 0.0263966 0.106604 -0.022359 -0.0591029 -0.0179935 -0.0603037 -0.0704817 -0.00966286 0.0351446 0.0152823 0.0605583 0.0174671 0.0747864 -0.141793 -0.0814166 -0.0371265 -0.0332737 -0.0645953 0.0633284 0.12642 -0.00427631 -0.0467164 -0.0250737 0.0898238 -0.0281076 0.214169 -0.126427 0.0209369 -0.133998 0.235642 0.0626281 -0.100101 0.0567604 0.190778 -0.100176 0.0652845 0.0183805 0.0504353 -0.0544763 -0.0635785 0.0556166 0.152777 -0.0516972 0.021797 0.0562092 0.0573511 -0.0181986 -0.0329335 0.00761414 -0.0549715 
0.108629 0.101049 -0.117129 -0.0526288 0.0601951 0.16063 0.0512614 0.00854398 -0.174307 -0.0497219 0.0155073 0.0393363 0.12808 -0.0963397 -0.0791008 -0.0202062 -0.0654911 -0.00877346 -0.142328 0.17907 0.088658 -0.0806294 0.119225 0.0360928 -0.0455406 -0.0393262 -0.0610379 -0.135295 0.050433 0.0421174 -0.0525581 0.0342901 -0.0902398 0.0972349 -0.0822081 -0.0326715 -0.0951832 0.154443 -0.0650822 0.00293334 -0.0248857 -0.0878139 -0.0217557 0.124765 -0.160421 0.0232604 0.158801 0.0400316 -0.189809 0.172668 0.0529373 0.00318798 -0.124247 0.0300949 0.0467109 -0.0700071 0.00534865 0.145942 0.0603 -0.128697 -0.0629163 0.0460073 0.203839 -0.0881497 0.0278947 -0.110032 -0.0114317 0.025329 -0.104527 0.0664979 -0.00791763 0.0684098 -0.0130698 0.109323 0.0132843 -0.032277 -0.0150949 0.000213821 0.0335122 0.110104 -0.0247039 -0.0693444 -0.0125547 -0.0509327 -0.0710742 0.0175473 0.0297753 -0.00558695 0.0597646 0.0302194 0.0800803 -0.150634 -0.0781767 -0.0428767 -0.033863 -0.0739829 0.0413902 0.131986 -0.0140027 -0.0536636 -0.02759 0.0970429 -0.0159393 0.204968 -0.140106 0.0449533 -0.139484 0.237646 0.056799 -0.103042 0.0681938 0.18177 -0.0978017 0.0647106 0.00206256 0.0508991 -0.0440172 -0.0545815 0.0691977 0.168432 -0.0409156 -0.0104211 0.0315917 0.0662531 -0.0372671 -0.0299536 0.000167968 -0.0451429 
0.114302 0.0831232 -0.137091 -0.0397468 0.0759594 0.141684 0.0510908 -0.00897473 -0.17193 -0.0535286 0.00809267 0.0615306 0.119228 -0.0957362 -0.102326 -0.000645079 -0.0501194 -0.00701986 -0.133811 0.186123 0.0988024 -0.0810145 0.119591 0.0174867 -0.0450211 -0.00388828 -0.0559777 -0.147959 0.0467727 0.0533809 -0.0684627 0.0763738 -0.0833005 0.0924302 -0.0833523 -0.045979 -0.0853123 0.182106 -0.0462971 -0.0149272 -0.0224827 -0.0706071 -0.0144678 0.120533 -0.158559 0.0317274 0.167525 0.0224466 -0.178357 0.150871 0.0608747 0.00798661 -0.11918 0.0371049 0.0640571 -0.0803578 0.024481 0.137058 0.0540946 -0.128838 -0.047453 0.0195937 0.206915 -0.0789166 0.0420945 -0.119074 -0.0206169 0.0409819 -0.0784543 0.0660793 -0.00909002 0.0684834 -0.0118722 0.109524 0.00102351 -0.0284863 -0.0149451 0.00799147 0.0155505 0.097216 -0.0296386 -0.0384472 -0.0100419 -0.054198 -0.0647151 -0.00307365 0.0385849 0.0137831 0.0589572 0.0117003 0.0706665 -0.140619 -0.0905611 -0.0439353 -0.0253663 -0.0722584 0.060706 0.133412 -0.00518136 -0.0587263 -0.0316473 0.0881654 -0.0134257 0.224737 -0.140375 0.0242776 -0.138767 0.243384 0.0593045 -0.104751 0.0597659 0.183946 -0.10922 0.0676271 0.0156829 0.0381897 -0.0578589 -0.080315 0.0619843 0.152475 -0.0426859 0.0259055 0.0504329 0.0556861 -0.0305485 -0.0333825 -8.51041e-05 -0.0514067 
0.120473 0.0834539 -0.136598 -0.0407646 0.0774947 0.140381 0.0428286 -0.009138 -0.185352 -0.049456 0.00268212 0.0587765 0.114967 -0.0843237 -0.0973696 0.00689693 -0.0315 -0.00931622 -0.123061 0.182875 0.0905989 -0.0654878 0.120587 0.0171642 -0.042512 0.00886284 -0.0451963 -0.141182 0.0484682 0.0507108 -0.0744908 0.0778648 -0.0867454 0.0898251 -0.0857935 -0.047511 -0.083397 0.188225 -0.0411592 -0.00944019 -0.0337932 -0.0554368 -0.0133126 0.118505 -0.153556 0.0409628 0.170204 0.0186207 -0.178054 0.150324 0.0784834 0.0145994 -0.11916 0.0382603 0.0656296 -0.087222 0.0318603 0.140787 0.0676022 -0.132593 -0.0444193 0.0171124 0.201367 -0.0813677 0.0401127 -0.123138 -0.0172321 0.0498828 -0.072369 0.0699112 -0.00382472 0.0728328 -0.00643531 0.109549 -0.00228671 -0.0302414 -0.0152155 0.0105451 0.016392 0.0950736 -0.0190594 -0.028987 -0.00515446 -0.0615367 -0.05807 -0.0224806 0.0362986 0.0149222 0.0607658 0.0094193 0.0588884 -0.132047 -0.0919238 -0.0382222 -0.0183419 -0.0667824 0.0768845 0.132873 -0.00905725 -0.0627874 -0.0375003 0.0966483 -0.0133082 0.23047 -0.15664 0.0174143 -0.144986 0.227859 0.0620906 -0.107393 0.072258 0.190988 -0.105593 0.0754646 0.0164397 0.0312115 -0.0656889 -0.0878787 0.0493389 0.138369 -0.0460239 0.0316201 0.0627907 0.0447557 -0.0229683 -0.0352461 0.00087366 -0.059317 
0.121103 0.0715604 -0.144327 -0.04061 0.0973015 0.158507 0.0581384 -0.0150869 -0.181047 -0.0586084 0.00628038 0.0725004 0.119004 -0.0853882 -0.10206 -0.00385543 -0.0334345 0.00360418 -0.129519 0.186775 0.0998861 -0.0739596 0.119959 0.012689 -0.0475185 -0.0020919 -0.0624893 -0.146137 0.0449148 0.0510386 -0.0673293 0.0886493 -0.0909323 0.100968 -0.0804076 -0.0379765 -0.0733737 0.175265 -0.0357287 -0.0230749 -0.00348713 -0.0570877 -0.00824247 0.102118 -0.1731 0.0202953 0.163828 0.0244163 -0.173022 0.145933 0.0530619 -0.00381079 -0.117778 0.0450196 0.0678423 -0.0779918 0.0328706 0.148787 0.039161 -0.121941 -0.0478125 0.0350394 0.215906 -0.102043 0.0558436 -0.105715 -0.0236747 0.0489344 -0.0811349 0.0745348 -0.00955367 0.0756083 -0.0105394 0.114386 -0.00553131 -0.0215938 -0.00606312 0.00673587 0.0130037 0.068294 -0.0373388 -0.0210561 -0.00129504 -0.051737 -0.0662479 -0.00590758 0.0474782 0.0256699 0.05042 0.0134497 0.0908807 -0.148192 -0.0843853 -0.0407143 -0.0170128 -0.0746294 0.0589616 0.135716 -0.0135649 -0.0441933 -0.0302817 0.0862732 -0.0222016 0.231516 -0.131741 0.0309989 -0.137609 0.231779 0.0420186 -0.096479 0.0547637 0.176258 -0.0972713 0.0814606 0.0186661 0.0305856 -0.0569384 -0.081057 0.0559147 0.151441 -0.0386781 0.0223887 0.0555738 0.0487016 -0.0372673 -0.0286898 -0.0157022 -0.0560154 
0.105756 0.0945709 -0.112917 -0.0499074 0.0609112 0.158348 0.0480823 0.0138129 -0.177554 -0.0484127 0.00830919 0.0447692 0.124216 -0.100668 -0.078047 -0.0113249 -0.0630429 -0.0125628 -0.142214 0.18163 0.0853625 -0.0831967 0.125761 0.0301635 -0.0476453 -0.0289062 -0.0618936 -0.14111 0.0422608 0.0319139 -0.0521711 0.0433248 -0.0862369 0.100719 -0.0874307 -0.0348373 -0.0912482 0.169072 -0.0637839 0.00419862 -0.022328 -0.0850311 -0.0182402 0.115785 -0.158872 0.0186714 0.161826 0.0291222 -0.189203 0.174955 0.059594 -0.00844777 -0.126256 0.0352663 0.0518014 -0.071368 0.0131629 0.143125 0.0621915 -0.129248 -0.062103 0.0416345 0.196297 -0.0936643 0.0394653 -0.108865 -0.0163327 0.0292197 -0.103904 0.0662769 -0.00999617 0.0712877 -0.0118325 0.11672 0.0154226 -0.0314429 -0.0135293 0.00134296 0.0323642 0.104883 -0.0307699 -0.0693548 -0.0083025 -0.0511932 -0.0739233 0.0112103 0.0346713 0.00328588 0.0619296 0.0239132 0.072154 -0.150807 -0.0778139 -0.0419563 -0.030073 -0.0641442 0.049258 0.133521 -0.0193489 -0.0467651 -0.0366217 0.0904815 -0.0215183 0.212077 -0.134074 0.0386482 -0.142211 0.233156 0.0545716 -0.110191 0.0585273 0.188238 -0.0940721 0.065414 0.008578 0.0442049 -0.0454577 -0.0580675 0.066351 0.167392 -0.0391101 -2.5938e-05 0.039211 0.0622994 -0.0288127 -0.0323167 0.000439595 -0.0470995 
0.106636 0.0990324 -0.113295 -0.0497826 0.056868 0.152409 0.0491043 0.00990009 -0.172366 -0.0503522 0.0155923 0.0400239 0.129281 -0.0907521 -0.0780899 -0.0207699 -0.0666674 -0.0145193 -0.143071 0.184175 0.0865952 -0.0859381 0.122017 0.0374358 -0.0430142 -0.0385352 -0.0595323 -0.131256 0.0469968 0.0412756 -0.053317 0.0330529 -0.0854597 0.0981426 -0.089313 -0.0314893 -0.0965507 0.161951 -0.0700178 0.00394591 -0.0268275 -0.0883065 -0.0218211 0.122483 -0.159146 0.0212689 0.157785 0.0368694 -0.184372 0.176183 0.053065 0.00321696 -0.12527 0.0325786 0.0519894 -0.0710822 0.0025892 0.143152 0.0638405 -0.129566 -0.0640089 0.041792 0.198453 -0.0841508 0.0249664 -0.10656 -0.0102976 0.0263133 -0.104094 0.0649686 -0.00754021 0.0693522 -0.0111269 0.112588 0.0189229 -0.0322215 -0.0132362 -0.00172651 0.0341957 0.11408 -0.0266851 -0.0739282 -0.0109929 -0.0519022 -0.070718 0.0158922 0.0295662 -0.00203917 0.0638616 0.0270156 0.0759701 -0.150146 -0.074615 -0.0429284 -0.0365613 -0.0753994 0.0405027 0.131158 -0.0102611 -0.0575069 -0.0315448 0.0960566 -0.0132873 0.204439 -0.141813 0.0463516 -0.141552 0.237654 0.0618443 -0.10862 0.066086 0.186446 -0.100029 0.0649853 0.00194685 0.0507743 -0.0397962 -0.0542828 0.0688503 0.170506 -0.0425098 -0.00637145 0.029414 0.067755 -0.0374382 -0.0295925 0.00470182 -0.040953 
0.114995 0.0803217 -0.140829 -0.0396873 0.0805662 0.138106 0.0465357 -0.00736855 -0.181762 -0.0438708 0.00351324 0.0645976 0.115226 -0.0892635 -0.101147 0.00698507 -0.0331905 -0.00889713 -0.123378 0.187665 0.0898301 -0.0743978 0.121102 0.0112179 -0.0459645 0.0133542 -0.0497414 -0.144296 0.048422 0.0464447 -0.0722877 0.085668 -0.0841083 0.0908873 -0.0895809 -0.0463527 -0.0798887 0.194495 -0.0392065 -0.0115502 -0.024282 -0.0581397 -0.0139734 0.112816 -0.15761 0.0328716 0.169082 0.01702 -0.173328 0.146014 0.0710592 0.0127298 -0.123679 0.0408286 0.0676338 -0.0854033 0.0343082 0.137575 0.059183 -0.129746 -0.0458816 0.0136422 0.204415 -0.0839595 0.0472771 -0.11945 -0.0200901 0.0505714 -0.0702015 0.0683969 -0.00684442 0.0753563 -0.00761363 0.117839 5.20598e-05 -0.0299406 -0.0131698 0.0154622 0.0137681 0.0846037 -0.0308046 -0.0266858 -0.00269185 -0.0563289 -0.0595459 -0.0193074 0.0415763 0.0246799 0.0655569 0.00298545 0.0614479 -0.133461 -0.0883252 -0.0399633 -0.0154094 -0.0718346 0.0753856 0.13234 -0.0102979 -0.0589319 -0.0401634 0.0894294 -0.0158029 0.233379 -0.146824 0.019948 -0.141775 0.230459 0.0618705 -0.106779 0.0609792 0.190829 -0.104478 0.0763687 0.0196578 0.0262911 -0.0620826 -0.0915039 0.0539609 0.14012 -0.0438376 0.0348157 0.0627469 0.0473452 -0.0271208 -0.0340992 -0.004248 -0.0556143 
0.12625 0.0742821 -0.122859 -0.0372265 0.0660809 0.158977 0.0550981 -0.0066526 -0.186753 -0.0583925 0.00653649 0.0525392 0.12695 -0.0883847 -0.0973719 -0.00267941 -0.0472903 -0.0053273 -0.128016 0.185434 0.101215 -0.0772143 0.122731 0.00856686 -0.0560977 -0.00168142 -0.0763879 -0.150814 0.0434791 0.0484353 -0.0664241 0.084565 -0.0944354 0.1009 -0.0728296 -0.0419243 -0.0799299 0.193371 -0.0302791 -0.0223101 -0.0354877 -0.0694395 -0.0225722 0.0936546 -0.1525 0.01524 0.158599 0.0213557 -0.182313 0.163024 0.056784 0.00712441 -0.10636 0.0539029 0.0582448 -0.0892227 0.0421596 0.133462 0.044421 -0.132271 -0.044889 0.0374882 0.208435 -0.100742 0.0467003 -0.100492 -0.0126786 0.0386762 -0.0918433 0.0639304 -0.0151463 0.0637675 -0.0176463 0.124928 -0.00809922 -0.0404337 -0.00272203 -0.0185714 0.0306298 0.10232 -0.0262084 -0.0542089 -0.00925058 -0.0642863 -0.059763 -0.0124378 0.0321973 0.0127675 0.0654447 0.0180942 0.0892989 -0.141378 -0.0753003 -0.0253461 -0.0281251 -0.0674002 0.064581 0.144847 -0.0134285 -0.0381533 -0.0202722 0.0995156 -0.0326796 0.227222 -0.122635 0.0328924 -0.122947 0.227202 0.0609153 -0.0999233 0.0473711 0.181621 -0.103435 0.0671739 0.0259779 0.0453555 -0.04367 -0.0684532 0.0604572 0.150282 -0.0476957 0.00722349 0.0673591 0.043352 -0.0222512 -0.0299736 0.0148079 -0.0503723 
0.114566 0.0686895 -0.128242 -0.0411637 0.0759624 0.149322 0.0459488 -0.00730296 -0.183097 -0.0510829 0.0038066 0.0619174 0.11861 -0.0896544 -0.103797 0.00197254 -0.047666 -0.00948289 -0.123574 0.189791 0.0965044 -0.083016 0.12509 0.00479669 -0.0504411 0.0171094 -0.0612806 -0.146141 0.0471268 0.034913 -0.0652019 0.0822011 -0.0924844 0.0964154 -0.0828222 -0.0408774 -0.0820932 0.201611 -0.0289507 -0.0218976 -0.0219064 -0.0647431 -0.0211369 0.100655 -0.158418 0.0123734 0.160726 0.0212309 -0.171658 0.151931 0.0540322 0.00898659 -0.118964 0.0512128 0.0677794 -0.0888998 0.0401116 0.138222 0.0419941 -0.134848 -0.0423735 0.0238888 0.214731 -0.0865721 0.0543649 -0.102573 -0.0194094 0.0493808 -0.0729048 0.0727217 -0.0141316 0.0756476 -0.0108057 0.131023 -0.00165945 -0.0415016 -0.00712222 0.00364877 0.0255596 0.0869444 -0.0347383 -0.0376149 0.00217566 -0.0595608 -0.0624655 -0.0238275 0.0449091 0.0390425 0.0736034 0.00413502 0.0845471 -0.135695 -0.0740018 -0.0316011 -0.0202329 -0.0780825 0.0702571 0.140797 -0.0126651 -0.0480656 -0.0327964 0.0899149 -0.0303898 0.22685 -0.121596 0.0306105 -0.128218 0.226748 0.0658048 -0.105476 0.0488797 0.191486 -0.102236 0.080969 0.0303169 0.0307744 -0.0503283 -0.0797664 0.0594581 0.143138 -0.0454445 0.0256034 0.0664402 0.0408549 -0.0310714 -0.0284667 0.00409767 -0.0463831 
0.114739 0.0762883 -0.127681 -0.0459907 0.0739273 0.15536 0.0533783 -0.00507154 -0.186405 -0.0443525 0.00338179 0.054326 0.119533 -0.0900857 -0.0932203 -0.00474321 -0.0477161 -0.0112776 -0.118474 0.185114 0.0890076 -0.0756629 0.118565 -0.00595574 -0.055665 0.0190887 -0.0686 -0.144538 0.0533879 0.0326421 -0.0630389 0.0878197 -0.0956215 0.0976944 -0.0744638 -0.0372794 -0.0679296 0.20138 -0.023911 -0.0243804 -0.0143346 -0.0698337 -0.0208078 0.0976322 -0.165919 0.0176195 0.160147 0.0275484 -0.174529 0.147975 0.0473297 0.0166071 -0.120715 0.0560952 0.0677089 -0.0892385 0.0393874 0.133269 0.0365352 -0.135598 -0.0466835 0.0238314 0.21573 -0.094888 0.0573064 -0.0953783 -0.0125739 0.0474509 -0.0719033 0.0728599 -0.0161218 0.0747581 -0.011855 0.138025 0.00133607 -0.0459817 -0.00971232 0.005693 0.0305286 0.0808415 -0.03257 -0.0357451 0.00225869 -0.0585327 -0.0549762 -0.0262393 0.0446202 0.0400641 0.0774307 0.0115181 0.0950423 -0.136212 -0.0714868 -0.0358303 -0.0242132 -0.0852333 0.0748452 0.142337 -0.0124547 -0.0473428 -0.0324068 0.0967476 -0.02843 0.224578 -0.122449 0.0333217 -0.123627 0.229112 0.0671215 -0.0966211 0.0499055 0.187388 -0.107192 0.0788952 0.0315051 0.0238822 -0.0429823 -0.0882999 0.0622628 0.14033 -0.037106 0.0203261 0.0741855 0.0477555 -0.0286208 -0.0351962 0.00837823 -0.0449235 
0.124688 0.047037 -0.103957 -0.0306676 0.0610144 0.164239 0.0714711 0.0137592 -0.145383 -0.0897291 0.0109728 0.0664812 0.11715 -0.135693 -0.107437 -0.00936285 -0.0738874 -0.0243678 -0.176175 0.200256 0.0993 -0.0769942 0.109686 0.00524699 -0.0864979 -0.012252 -0.0935691 -0.159494 0.019342 0.0121798 -0.0537563 0.0820778 -0.0989802 0.128215 -0.078521 -0.0412362 -0.0660773 0.198244 -0.0521467 -0.0149783 0.000807988 -0.082097 -0.0400892 0.0778371 -0.143473 -0.0154996 0.13139 0.0217136 -0.16739 0.186536 0.0219662 -0.0322559 -0.120105 0.0664847 0.057258 -0.0914239 0.0153356 0.120183 0.00421146 -0.110553 -0.0463815 0.0413951 0.20616 -0.104601 0.0594857 -0.110165 -0.00668798 0.0221214 -0.0968981 0.0476706 -0.0215095 0.0420918 -0.00589722 0.150212 -0.0038839 -0.0439552 0.00768525 -0.0178618 0.0247262 0.096572 -0.0315258 -0.0670404 -0.0127177 -0.059852 -0.0704442 0.0145021 0.0502605 0.0252072 0.044859 0.025495 0.117717 -0.170591 -0.0775258 -0.0188296 -0.0362469 -0.0506214 0.0506181 0.0946035 -0.0244944 -0.0053976 -0.0219552 0.0693653 -0.0654548 0.217184 -0.0767061 0.0285255 -0.110111 0.231217 0.0298041 -0.0870549 0.0288877 0.182074 -0.0913477 0.0730547 0.0258652 0.0421281 -0.0429003 -0.0478079 0.061035 0.150751 -0.054064 0.0270242 0.0659044 0.0687049 0.00211413 -0.0396733 0.0041954 -0.0650305 
0.115493 0.0610385 -0.117805 -0.03188 0.0685393 0.149983 0.0638333 0.0089481 -0.150831 -0.0794947 0.0082302 0.071401 0.10836 -0.127111 -0.113283 -0.00136984 -0.0565717 -0.0287248 -0.164767 0.203092 0.0886052 -0.0767464 0.106012 0.00162563 -0.0746537 0.00456793 -0.0742364 -0.145057 0.0344081 0.0122949 -0.0603333 0.0911173 -0.0912599 0.119897 -0.0937 -0.0445415 -0.0651734 0.203697 -0.0539136 -0.0144275 0.00717607 -0.0751412 -0.0240062 0.0852424 -0.146687 -0.000332389 0.145343 0.0163143 -0.170394 0.169833 0.031153 -0.0153806 -0.125732 0.0581072 0.0676377 -0.0905339 0.0113768 0.123928 0.0165486 -0.119574 -0.0508115 0.0284832 0.207454 -0.0965568 0.0568177 -0.103965 -0.00991135 0.0294113 -0.0871912 0.0516104 -0.0195467 0.0491906 -0.00170155 0.153249 0.00880753 -0.0389464 0.00495764 0.00224158 0.0145977 0.0801869 -0.0346841 -0.0433493 -0.00555243 -0.0602227 -0.0621714 0.00425017 0.0499356 0.0367149 0.052814 0.0183384 0.102151 -0.161575 -0.0855711 -0.025841 -0.0212937 -0.0551203 0.0657776 0.097303 -0.021547 -0.0267848 -0.0386767 0.0668905 -0.0509953 0.228394 -0.106328 0.0287848 -0.120647 0.23588 0.0366667 -0.098547 0.0413894 0.193566 -0.0967414 0.0810669 0.0273696 0.0196242 -0.0560741 -0.0681406 0.0645077 0.143475 -0.0505572 0.0428648 0.0716701 0.0627751 -0.00412598 -0.0386153 -0.00162494 -0.0705773 
0.121296 0.0492113 -0.0963486 -0.0358348 0.0575236 0.17709 0.0768243 0.02359 -0.143373 -0.087934 0.0117082 0.066755 0.11916 -0.138218 -0.102432 -0.0197175 -0.0711879 -0.0265043 -0.174422 0.195231 0.0971612 -0.0731722 0.102337 0.00817511 -0.0902731 -0.014376 -0.0920495 -0.154448 0.0215789 0.00711991 -0.048085 0.0738133 -0.0968756 0.135771 -0.076906 -0.0430697 -0.053444 0.195463 -0.0518844 -0.0162008 0.0100369 -0.088717 -0.0367534 0.0727079 -0.147647 -0.0305015 0.126908 0.0209825 -0.168798 0.187243 0.0210337 -0.0361178 -0.119835 0.0718144 0.0589265 -0.0823722 0.00825805 0.12299 -0.00545444 -0.113279 -0.0516931 0.0417618 0.206881 -0.119619 0.0649475 -0.102199 -0.00347537 0.0137351 -0.107814 0.0474931 -0.0267353 0.0374711 -0.0106343 0.153572 -0.000318261 -0.0429441 0.015424 -0.0153952 0.0334041 0.0916292 -0.0404221 -0.0716992 -0.000856455 -0.0538483 -0.0637737 0.00825685 0.0558547 0.0290094 0.0509463 0.0326746 0.121296 -0.182823 -0.0696348 -0.0128836 -0.036197 -0.0533412 0.0503363 0.0920524 -0.0300738 0.00276934 -0.0216161 0.0766707 -0.073656 0.219331 -0.0712761 0.0329254 -0.104477 0.220397 0.019134 -0.0888648 0.0256996 0.17706 -0.0891413 0.0787668 0.0289346 0.0369128 -0.0374488 -0.0470791 0.0606368 0.155071 -0.0483994 0.0177684 0.062902 0.0663113 0.00746327 -0.0373 0.00653097 -0.0656162 
0.125437 0.0465198 -0.108248 -0.0234638 0.0719278 0.147279 0.0747333 0.0221287 -0.126758 -0.0835636 0.00371763 0.0771923 0.10932 -0.132964 -0.109331 -0.00748299 -0.0400711 -0.0322749 -0.189802 0.209511 0.0793415 -0.0795237 0.111867 -0.000938652 -0.0880261 -0.00823721 -0.0873752 -0.147057 0.00726222 0.000242376 -0.0512108 0.0994155 -0.0798171 0.135285 -0.0980225 -0.0524523 -0.0532782 0.230441 -0.0659242 -0.0175467 0.00652616 -0.0678121 -0.0385015 0.0630937 -0.141306 -0.0152146 0.11634 0.0109067 -0.151094 0.187308 0.0350456 -0.0287569 -0.122885 0.0610871 0.0627739 -0.0913424 0.0075438 0.113857 0.010203 -0.110163 -0.0562099 0.020679 0.184275 -0.114763 0.0632214 -0.113965 -0.0103571 0.0365156 -0.104791 0.0450251 -0.0120316 0.0361427 0.000833399 0.15343 -0.00664851 -0.032726 0.0161646 -0.012059 0.0185387 0.0817213 -0.050442 -0.0572213 -0.00543087 -0.0561812 -0.0539364 -0.00734454 0.055912 0.0382034 0.0572554 0.0190755 0.0894905 -0.178659 -0.0731568 -0.0198106 -0.0180354 -0.0448729 0.06843 0.0685326 -0.0369446 -0.00711515 -0.0339383 0.0674442 -0.0675477 0.234056 -0.0883625 0.012401 -0.116398 0.211469 0.0354202 -0.0955693 0.0289958 0.19305 -0.090968 0.0932649 0.0320584 0.0184986 -0.0580732 -0.0596699 0.0567239 0.147239 -0.0560058 0.0571169 0.063979 0.0727926 0.030765 -0.0540667 0.00284066 -0.0816326 
0.130207 0.0394503 -0.112763 -0.0264331 0.0777768 0.150897 0.0785169 0.0245598 -0.129821 -0.0864918 -0.00407529 0.0699931 0.110874 -0.133295 -0.105809 -0.00828982 -0.037617 -0.0308088 -0.188532 0.212056 0.0797487 -0.0787932 0.111818 0.00587531 -0.090702 -0.013353 -0.0912501 -0.153755 0.00872779 -0.00118587 -0.0478309 0.100774 -0.0884468 0.135429 -0.0931853 -0.049144 -0.0499513 0.224351 -0.0689125 -0.0241552 0.00960583 -0.0662754 -0.0375361 0.0659143 -0.139466 -0.0114948 0.116805 0.0220184 -0.149384 0.186939 0.0284025 -0.0399353 -0.114103 0.0565718 0.0644376 -0.0918828 0.00880354 0.118077 0.0163044 -0.116099 -0.0521193 0.0327564 0.18295 -0.116743 0.0602447 -0.111373 -0.00881844 0.0335087 -0.100851 0.0366608 -0.020042 0.0357649 0.000238898 0.152375 -0.0124631 -0.0358229 0.0184979 -0.0068874 0.0254395 0.0795709 -0.0426603 -0.0547234 -0.0158521 -0.0645232 -0.0486985 -0.00694345 0.0520092 0.0398982 0.0544466 0.0219414 0.102634 -0.172343 -0.0738937 -0.0247176 -0.0175729 -0.0373343 0.0686028 0.0708201 -0.0382359 -0.004496 -0.0276212 0.063092 -0.0673306 0.230976 -0.0937441 0.0100985 -0.120081 0.207799 0.0326288 -0.0862407 0.0342592 0.196492 -0.0890797 0.0886525 0.0278442 0.0216681 -0.0584464 -0.06181 0.0504709 0.142361 -0.0581104 0.0569842 0.0674089 0.0763546 0.0182259 -0.0586714 -0.0100862 -0.0900486 
0.124652 0.0515478 -0.107581 -0.0251629 0.0708388 0.156859 0.0817068 0.0196147 -0.138617 -0.0717855 0.0111255 0.0804853 0.116028 -0.131394 -0.113924 -0.0162788 -0.0390385 -0.0240335 -0.177991 0.209271 0.0774886 -0.0764072 0.103651 0.00121622 -0.0926147 -0.00489137 -0.0865125 -0.139816 0.0219221 0.00764482 -0.0606714 0.0924014 -0.0882925 0.132685 -0.0922046 -0.0565907 -0.0490666 0.222093 -0.054305 -0.0214598 0.00487658 -0.0729504 -0.0384321 0.0604613 -0.151389 -0.0275526 0.1158 0.016982 -0.151022 0.185345 0.0378291 -0.018237 -0.126531 0.0667269 0.0626583 -0.0913675 0.00845429 0.115856 -8.21276e-05 -0.105969 -0.0547539 0.0210704 0.198 -0.121021 0.0664546 -0.109643 -0.00877239 0.0262168 -0.112152 0.0439406 -0.0177154 0.039912 -0.00117292 0.163195 -0.00856281 -0.0347574 0.0262056 -0.00845091 0.0276328 0.0768302 -0.0497638 -0.0618816 0.00511882 -0.0496755 -0.0452039 -0.0146276 0.055505 0.0431185 0.0679667 0.0223696 0.0959699 -0.178399 -0.0666113 -0.00812544 -0.0205512 -0.0619191 0.0671986 0.0744924 -0.0353567 -0.00645304 -0.0272528 0.0824162 -0.0723854 0.235972 -0.080091 0.0222831 -0.101034 0.210502 0.0377566 -0.0884805 0.0276583 0.187405 -0.0841938 0.100644 0.0298158 0.0168599 -0.0469827 -0.05222 0.0549432 0.146294 -0.0606522 0.0396219 0.06359 0.0628595 0.0222634 -0.0415492 0.00262421 -0.0785234 
0.121837 0.0565625 -0.118672 -0.0310425 0.0737251 0.14834 0.085755 0.0178582 -0.126556 -0.071904 0.00829868 0.0794534 0.112977 -0.135767 -0.112176 -0.0186298 -0.0441491 -0.0326853 -0.182925 0.210731 0.0696391 -0.070919 0.0968832 -0.00200539 -0.0947324 0.000558266 -0.0851992 -0.142381 0.0282803 0.0054171 -0.0581882 0.101682 -0.0882386 0.128009 -0.0927316 -0.0533883 -0.0448108 0.225148 -0.0615274 -0.0183556 0.0209683 -0.0732359 -0.0412513 0.0689841 -0.155332 -0.0107756 0.117673 0.0232196 -0.149325 0.173787 0.0245971 -0.0139066 -0.125787 0.0611496 0.0649765 -0.091713 0.000535249 0.115486 0.00123301 -0.108233 -0.0607364 0.0165228 0.200697 -0.112675 0.0598787 -0.111218 -0.00126956 0.0305649 -0.0972167 0.0358091 -0.0165184 0.0387647 0.0049694 0.16448 0.000323066 -0.031945 0.0108254 -0.00112151 0.0208801 0.0724365 -0.0432252 -0.0470492 -0.0023281 -0.0509979 -0.041119 -0.0105907 0.0604832 0.0446211 0.0613496 0.0193429 0.100493 -0.174453 -0.0718453 -0.0232553 -0.022068 -0.0659131 0.0717969 0.0658868 -0.0258013 -0.0166362 -0.0316049 0.0718293 -0.0612865 0.232382 -0.098444 0.0174692 -0.109115 0.222338 0.0363141 -0.0816394 0.0421142 0.191333 -0.0945571 0.0933467 0.0226986 0.0125058 -0.0602944 -0.0661006 0.0556965 0.139073 -0.0539755 0.049014 0.0653917 0.0761279 0.0146276 -0.0489035 -0.0114317 -0.0804027 
0.120981 0.0530572 -0.119451 -0.0285102 0.0778451 0.145737 0.0841236 0.0179643 -0.12578 -0.0669433 0.0116186 0.0841109 0.115653 -0.139097 -0.116268 -0.0110844 -0.0428659 -0.0230429 -0.187131 0.211232 0.0797828 -0.0774472 0.100325 0.00096849 -0.0931451 -0.00129527 -0.0867422 -0.148877 0.0271426 0.00959592 -0.0598752 0.105437 -0.0850513 0.127531 -0.0951301 -0.0562167 -0.0507251 0.223743 -0.0611816 -0.0185526 0.0177977 -0.0723378 -0.0417242 0.0706456 -0.154326 -0.0164153 0.118556 0.0198216 -0.149793 0.170028 0.0310974 -0.0192613 -0.129914 0.0578794 0.0618226 -0.0889382 0.00538584 0.113175 0.00289761 -0.105123 -0.0564644 0.0120065 0.197568 -0.1087 0.0633767 -0.118954 -0.00876356 0.0336786 -0.0959869 0.0374157 -0.0159283 0.0407568 0.00308344 0.154846 -0.00557627 -0.02948 0.0104623 0.00362538 0.0157046 0.0705976 -0.0481839 -0.0460572 -0.00296481 -0.0474694 -0.0475617 -0.00407488 0.0636716 0.0436532 0.0595359 0.0146309 0.0928999 -0.174093 -0.0769735 -0.022257 -0.0228905 -0.0631892 0.0649407 0.0673881 -0.028567 -0.0147607 -0.0280531 0.0667918 -0.0616502 0.235232 -0.0893183 0.0138629 -0.110579 0.223308 0.0368502 -0.0860292 0.0319941 0.190425 -0.0933361 0.091237 0.0251984 0.0154772 -0.0647435 -0.0651556 0.0532736 0.141822 -0.0559702 0.0525922 0.0600173 0.0761472 0.0140418 -0.0458741 -0.0152093 -0.0790734 
0.115418 0.0555345 -0.113085 -0.0316083 0.0692763 0.144404 0.0812254 0.0213322 -0.134429 -0.0593767 0.00800297 0.0747832 0.118292 -0.131955 -0.111012 -0.0106185 -0.0440497 -0.0277402 -0.180002 0.214278 0.072662 -0.0826771 0.102152 0.00313659 -0.0950427 0.00327141 -0.0887425 -0.14294 0.0365812 0.00169778 -0.0577303 0.105521 -0.0894123 0.12418 -0.0987539 -0.0506702 -0.0536577 0.231267 -0.0603327 -0.0175935 0.0132183 -0.0766231 -0.0444746 0.0651831 -0.150287 -0.0159781 0.119493 0.0253105 -0.151372 0.170671 0.0283689 -0.0127351 -0.128291 0.0575508 0.0627848 -0.0900906 0.00824577 0.114942 0.00855787 -0.111338 -0.0577525 0.0187578 0.197159 -0.108342 0.0597481 -0.105134 -0.00513921 0.0310668 -0.0978808 0.0366164 -0.0213725 0.0437758 0.00223039 0.168396 0.000676378 -0.0376657 0.014706 0.00478597 0.0265729 0.0708445 -0.0454261 -0.0523652 -0.00429656 -0.0543986 -0.0429442 -0.0110718 0.0585008 0.0484607 0.068873 0.0131869 0.0961633 -0.166618 -0.0653893 -0.0199096 -0.0209483 -0.0646676 0.0704202 0.0750185 -0.0262261 -0.0174643 -0.028114 0.069112 -0.0642789 0.235207 -0.0909723 0.0209015 -0.109149 0.218399 0.0481746 -0.088435 0.0304112 0.199356 -0.0917877 0.0914416 0.0279687 0.0131796 -0.0573616 -0.0659576 0.0555605 0.141764 -0.0574929 0.0454531 0.0634802 0.0722535 0.00366789 -0.042086 -0.0145009 -0.0773578 
0.120191 0.0614149 -0.113277 -0.0350315 0.0725637 0.156375 0.0796912 0.0143022 -0.152207 -0.0588725 0.00431702 0.060704 0.11753 -0.122127 -0.0957478 -0.00593392 -0.049153 -0.0296786 -0.158341 0.202526 0.0817848 -0.0775525 0.105392 -0.00766065 -0.0802753 0.00861171 -0.0969992 -0.146794 0.0451746 0.00855778 -0.0530721 0.106645 -0.100681 0.120542 -0.0848553 -0.0438267 -0.0471112 0.223288 -0.0339177 -0.0238684 0.0138928 -0.073857 -0.0320243 0.0636894 -0.156121 -0.0150158 0.131234 0.0258696 -0.153623 0.162512 0.0265965 -0.00623739 -0.12463 0.0666607 0.0678796 -0.0941338 0.0223126 0.118936 0.00799774 -0.121332 -0.056118 0.0235968 0.203655 -0.116155 0.0623503 -0.088742 -0.00310595 0.0320513 -0.0881739 0.0408698 -0.0224391 0.0603506 -0.00364051 0.170975 0.00380639 -0.0470292 0.0105083 -0.000251172 0.0325171 0.0757036 -0.0357921 -0.0464887 0.00386059 -0.054879 -0.0389867 -0.014678 0.0542123 0.0516169 0.0716004 0.0122308 0.109997 -0.159536 -0.0670997 -0.0232556 -0.0262084 -0.0744706 0.0748406 0.0998743 -0.0252115 -0.016719 -0.0311587 0.0751828 -0.0551527 0.234391 -0.0976236 0.0309021 -0.10719 0.223258 0.0561016 -0.0856866 0.0306979 0.193314 -0.0999349 0.088397 0.0358793 0.0149889 -0.0458516 -0.0698614 0.0555235 0.137957 -0.0464267 0.0387698 0.0789988 0.0656096 -0.0072789 -0.0429722 -0.0039134 -0.0641833 
0.12241 0.046872 -0.105299 -0.0265974 0.062281 0.152885 0.0801046 0.0216415 -0.144371 -0.0775577 0.00325971 0.0601878 0.121387 -0.131084 -0.10481 -0.00641642 -0.0504041 -0.0330472 -0.173429 0.211859 0.0840047 -0.0863359 0.11273 -0.00751812 -0.0952031 -0.00789483 -0.105332 -0.1527 0.0250998 0.00178258 -0.0519986 0.0992239 -0.0951743 0.127359 -0.0887145 -0.046777 -0.049184 0.228075 -0.048312 -0.0208375 0.0028907 -0.0757778 -0.0399539 0.0524994 -0.144532 -0.0229551 0.119442 0.0206458 -0.148615 0.183245 0.0212675 -0.025725 -0.118371 0.0731217 0.0580163 -0.0984671 0.0252776 0.107545 0.00456432 -0.11064 -0.0507518 0.0350465 0.191025 -0.120208 0.0652777 -0.100815 -0.00212698 0.0225754 -0.0985775 0.0283734 -0.02367 0.0426545 -0.00409191 0.17085 -0.00245145 -0.0430708 0.023037 -0.0121781 0.032693 0.0859248 -0.0398966 -0.0719069 -0.00702283 -0.056244 -0.0469038 0.00191903 0.0475933 0.0429143 0.0613594 0.0126524 0.11029 -0.169109 -0.0614584 -0.0146744 -0.0282017 -0.0583326 0.0667172 0.0902733 -0.033374 7.43696e-05 -0.0253222 0.0710743 -0.0704183 0.235237 -0.0722998 0.024944 -0.099874 0.221027 0.0458505 -0.0835143 0.0146999 0.187844 -0.0890663 0.0873298 0.0272931 0.0268139 -0.0411655 -0.0502141 0.0529178 0.144133 -0.0658133 0.0392082 0.07044 0.0678786 0.00691709 -0.0450699 -0.00643305 -0.0718467 
0.13114 0.0475374 -0.11599 -0.0239534 0.0720914 0.160139 0.0948481 0.0235582 -0.116361 -0.0760496 0.0177986 0.0821235 0.11492 -0.149043 -0.109023 -0.023657 -0.0483618 -0.0243976 -0.192557 0.208628 0.0778236 -0.071528 0.093086 0.0146589 -0.0991237 -0.0176595 -0.0907791 -0.153402 0.0191072 0.0104206 -0.0546452 0.0975175 -0.0901318 0.138286 -0.0874286 -0.0535673 -0.0447822 0.208493 -0.0664339 -0.0199877 0.0217288 -0.0825721 -0.0486394 0.069447 -0.152445 -0.0245882 0.108809 0.0290522 -0.150078 0.183951 0.0239156 -0.0259843 -0.122388 0.0578662 0.0595892 -0.0856215 -0.00666653 0.114012 -0.00620469 -0.0992529 -0.0617651 0.0213263 0.20088 -0.12136 0.0562108 -0.115871 -0.00175429 0.0200973 -0.109713 0.0343232 -0.0232302 0.0308567 -0.00296391 0.156646 -0.00868284 -0.0353134 0.0181774 -0.00531221 0.0227764 0.0816364 -0.0449439 -0.0576981 -0.00918778 -0.0544955 -0.0447091 0.0033628 0.0604878 0.0302337 0.0528345 0.02979 0.109853 -0.183805 -0.0759391 -0.0182152 -0.0276879 -0.057422 0.0574608 0.0550223 -0.0276209 -0.00794444 -0.0169147 0.069379 -0.068188 0.224481 -0.0823015 0.0173718 -0.103259 0.217156 0.0251816 -0.0753121 0.0355385 0.185024 -0.0865215 0.0838 0.0240529 0.0234482 -0.0532556 -0.0557445 0.0586542 0.148786 -0.0513394 0.037687 0.0581399 0.0859701 0.0182492 -0.0480061 -0.00545752 -0.0825192 
0.112601 0.0584155 -0.114382 -0.037937 0.0626587 0.155806 0.0675033 0.00717278 -0.156252 -0.0702063 0.0089484 0.0615241 0.118233 -0.114351 -0.106174 -0.0152718 -0.070199 -0.0245668 -0.154041 0.200751 0.0907097 -0.0867743 0.111994 -0.00294656 -0.0763113 0.00353415 -0.0856416 -0.147633 0.0388425 0.013177 -0.0576916 0.0857651 -0.0979164 0.115934 -0.0820258 -0.0364391 -0.0662834 0.210181 -0.0451566 -0.0249489 0.00434924 -0.0827323 -0.0370629 0.0798348 -0.15789 -0.00691029 0.138718 0.0281648 -0.165092 0.167734 0.0166014 -0.00485779 -0.12051 0.0656807 0.0676574 -0.0907923 0.0221706 0.124035 0.0102493 -0.124426 -0.0481865 0.0344127 0.21653 -0.0968885 0.0574743 -0.0907736 -0.00629795 0.0327325 -0.0840114 0.0565665 -0.0236158 0.0553466 -0.00620657 0.158967 0.00704321 -0.047241 0.00293186 -0.00659478 0.0302741 0.0833662 -0.0399904 -0.0542134 -0.00556736 -0.0611069 -0.0595282 -0.00237863 0.0493742 0.0444737 0.0677444 0.0170722 0.118631 -0.157695 -0.0636343 -0.0293694 -0.0317053 -0.0762626 0.0602774 0.112006 -0.0119236 -0.0267398 -0.0253387 0.0779006 -0.0510035 0.21776 -0.0913159 0.0374924 -0.111625 0.234241 0.0486461 -0.0902241 0.0352011 0.190613 -0.0994527 0.0776509 0.0301605 0.030241 -0.0386059 -0.0673439 0.0703625 0.147102 -0.0485836 0.0244424 0.067517 0.0632567 -0.0201117 -0.0340945 0.00301824 -0.0532714 
0.125535 0.0616501 -0.102128 -0.0235896 0.053762 0.171313 0.0777013 0.00638525 -0.13068 -0.0906071 0.0165882 0.0678222 0.110734 -0.123706 -0.108314 -0.0251109 -0.0593596 -0.0353419 -0.171995 0.196929 0.0819407 -0.0739982 0.105496 -0.00160022 -0.0858734 -0.0141069 -0.0879442 -0.138299 0.0206222 0.0126317 -0.0474471 0.0830393 -0.0881212 0.131814 -0.0778988 -0.0427823 -0.0456793 0.219891 -0.0497931 -0.0247017 0.000727596 -0.08226 -0.0428619 0.0554312 -0.148246 -0.023195 0.116795 0.0204555 -0.159365 0.190724 0.0210634 -0.0037865 -0.109733 0.0732116 0.067088 -0.0894993 0.00805261 0.118817 -0.00983344 -0.11499 -0.0657254 0.0318853 0.212749 -0.13216 0.0625489 -0.0875855 0.00191299 0.0224978 -0.119964 0.058012 -0.0187774 0.0348346 -0.0127734 0.165339 0.00512982 -0.0426952 0.0208909 -0.030666 0.0300895 0.0940962 -0.044946 -0.0710927 0.00119408 -0.0607057 -0.0486805 -0.00953084 0.0425586 0.0299442 0.0611491 0.0355136 0.116425 -0.186376 -0.0579056 -0.00896886 -0.0243793 -0.0668253 0.0624612 0.0851989 -0.0204437 -0.00651817 -0.021184 0.0872694 -0.0738774 0.220338 -0.0810929 0.0369475 -0.0931827 0.211396 0.0376935 -0.0872773 0.0306837 0.182088 -0.088147 0.0910549 0.0380654 0.0296586 -0.0365367 -0.0460039 0.0729458 0.156816 -0.0479819 0.0217166 0.0688736 0.0641388 0.0237043 -0.035668 0.0292299 -0.0637651 
0.124564 0.0625755 -0.11122 -0.0384793 0.058671 0.169099 0.0682806 0.0102225 -0.164567 -0.0823876 -0.0011358 0.0526526 0.118624 -0.12325 -0.0998159 -0.0139079 -0.0648035 -0.027317 -0.15491 0.195918 0.0874141 -0.0701618 0.112649 -0.0113553 -0.0846933 -0.0080606 -0.0915001 -0.15172 0.0247272 0.0172326 -0.057078 0.0803871 -0.0998258 0.121888 -0.0684657 -0.0413126 -0.0544866 0.200303 -0.0436891 -0.023202 -0.00915083 -0.0825247 -0.025667 0.0788228 -0.150141 0.00019389 0.140229 0.0268527 -0.173573 0.189218 0.0284827 -0.0204753 -0.111421 0.0712413 0.0604001 -0.0973611 0.0239333 0.116475 0.0163605 -0.124664 -0.0468239 0.0452937 0.204897 -0.113523 0.060622 -0.103836 -0.0044562 0.0219314 -0.0983777 0.0480026 -0.0224712 0.0432725 -0.00805474 0.1515 -0.00543831 -0.0440389 0.00750649 -0.021952 0.0352339 0.0959242 -0.0244785 -0.0686692 -0.0121517 -0.0582085 -0.0568203 -0.00181398 0.0361031 0.0257262 0.0609122 0.032883 0.115104 -0.163519 -0.0722237 -0.0230255 -0.0341263 -0.0554202 0.0653309 0.113844 -0.0267582 -0.0123041 -0.0228046 0.0894005 -0.0576706 0.217992 -0.0935695 0.028658 -0.109933 0.229486 0.0348062 -0.0786423 0.0395986 0.178592 -0.0947588 0.0774604 0.0198987 0.0344526 -0.0352877 -0.0546385 0.0599348 0.143778 -0.0508825 0.0186654 0.0809524 0.0590234 0.00265751 -0.0479208 0.0120369 -0.066202 
0.117085 0.057609 -0.117845 -0.0344562 0.0683983 0.152301 0.0641358 0.00722746 -0.152801 -0.0719198 0.00855129 0.0658703 0.115441 -0.12211 -0.10757 -0.00459283 -0.0621437 -0.0246004 -0.161466 0.204042 0.0903473 -0.0803886 0.115441 -0.00272084 -0.0779199 0.00351738 -0.0835385 -0.151069 0.0348207 0.0122502 -0.0568638 0.0911462 -0.0945206 0.116491 -0.0861327 -0.0401368 -0.0663657 0.211562 -0.0482572 -0.0179457 0.00152999 -0.0750442 -0.0363739 0.082842 -0.154806 -0.00476401 0.139718 0.0243556 -0.162075 0.17109 0.0274456 -0.0115619 -0.125283 0.0614878 0.0637625 -0.0936531 0.0228533 0.121482 0.0169345 -0.119988 -0.0504176 0.0285607 0.209357 -0.0970018 0.0584833 -0.105614 -0.00766331 0.03447 -0.0826843 0.053953 -0.0187799 0.0558712 -0.00141617 0.154837 0.00227044 -0.0448195 0.000351785 -0.00322149 0.0212052 0.0850618 -0.0340543 -0.0498471 -0.00737519 -0.0590994 -0.0594127 -0.000447935 0.0499377 0.0404804 0.0594931 0.0134352 0.107682 -0.157179 -0.0751656 -0.0282434 -0.0271016 -0.0676962 0.0618504 0.105267 -0.0198173 -0.0253159 -0.030092 0.0717717 -0.0507918 0.223022 -0.0956501 0.0286218 -0.115662 0.232904 0.0490585 -0.0900873 0.0355689 0.193339 -0.096814 0.0810527 0.0272738 0.0274746 -0.0485273 -0.0674191 0.0625433 0.143455 -0.0508599 0.0374498 0.0697012 0.0649891 -0.0114364 -0.0399198 -0.00128135 -0.0594364 
