{
  "descriptor": [
    -0.10087957978248596,
    0.08066374063491821,
    0.09824720025062561,
    -0.0662020742893219,
    -0.18027469515800476,
    0.04897858202457428,
    -0.10791729390621185,
    -0.03384045138955116,
    0.18528854846954346,
    -0.15527085959911346,
    0.1483575701713562,
    -0.008367478847503662,
    -0.18785659968852997,
    0.1155318170785904,
    -0.014062076807022095,
    0.13105417788028717,
    -0.18210294842720032,
    -0.1653243899345398,
    -0.014953715726733208,
    -0.05126402899622917,
    -0.026000211015343666,
    0.10448199510574341,
    -0.004033593460917473,
    0.07188146561384201,
    -0.17827968299388885,
    -0.40112367272377014,
    -0.0906144231557846,
    -0.0511651486158371,
    0.03141430392861366,
    -0.058466240763664246,
    -0.07955185323953629,
    0.11223024129867554,
    -0.1234375536441803,
    0.056435853242874146,
    0.08280151337385178,
    0.12086253613233566,
    -0.06248003616929054,
    -0.11514218896627426,
    0.21674707531929016,
    0.09006327390670776,
    -0.26088032126426697,
    -0.001558832940645516,
    0.05359887704253197,
    0.2446393072605133,
    0.23019468784332275,
    -0.013079593889415264,
    0.0456019788980484,
    -0.06335797905921936,
    0.1736956685781479,
    -0.2713373005390167,
    0.035741839557886124,
    0.2443629950284958,
    0.020612820982933044,
    0.05727822706103325,
    0.09239716827869415,
    -0.12524311244487762,
    -0.041161052882671356,
    0.11531668156385422,
    -0.07733195275068283,
    0.010929428972303867,
    0.08223561942577362,
    -0.05178214982151985,
    0.006022962275892496,
    -0.09464765340089798,
    0.17339973151683807,
    0.12900656461715698,
    -0.1089828684926033,
    -0.14267092943191528,
    0.2152785062789917,
    -0.14423105120658875,
    -0.10392031073570251,
    0.0659029558300972,
    -0.14493408799171448,
    -0.1859857589006424,
    -0.17707528173923492,
    0.05276956409215927,
    0.3761712908744812,
    0.14484983682632446,
    -0.09601569175720215,
    0.06893793493509293,
    0.018870295956730843,
    -0.03964308276772499,
    0.010035846382379532,
    0.15314605832099915,
    -0.11415456980466843,
    -0.002263425150886178,
    -0.023101672530174255,
    0.06213471293449402,
    0.28479713201522827,
    0.043917689472436905,
    0.032852135598659515,
    0.20197045803070068,
    -0.0028810238000005484,
    0.05086498335003853,
    0.09584461152553558,
    0.0963941216468811,
    -0.11623409390449524,
    -0.05566715821623802,
    -0.1933724284172058,
    -0.010828021913766861,
    0.017198016867041588,
    -0.0611783042550087,
    -0.028859544545412064,
    0.17906467616558075,
    -0.20506760478019714,
    0.17258456349372864,
    -0.07906049489974976,
    -0.07020547986030579,
    -0.02205289900302887,
    0.014173238538205624,
    -0.06636461615562439,
    0.012286089360713959,
    0.15117092430591583,
    -0.19546890258789062,
    0.11493316292762756,
    0.11480937898159027,
    0.031109429895877838,
    0.15471810102462769,
    0.09924940019845963,
    0.047423508018255234,
    0.0020350958220660686,
    -0.05409196391701698,
    -0.17050273716449738,
    -0.12166908383369446,
    0.05231525003910065,
    -0.03594687208533287,
    -0.027534982189536095,
    -0.006163251120597124
  ]
}