0.0831246 -0.0500112 -0.110594 -0.00254317 0.147872 0.162466 0.0835619 -0.0565308 -0.00670985 -0.0911756 -0.0123023 0.06511 0.0900854 -0.0688005 -0.0679758 -0.0501894 -0.0658729 0.0464467 -0.106078 0.15239 0.167475 -0.109661 0.0694896 0.16194 0.0150256 -0.0262923 -0.118767 -0.224263 0.0707125 0.0510647 0.0830509 0.0817882 -0.129812 0.0348956 0.0164301 0.0300578 -0.0847561 0.121544 -0.0278299 -0.115001 0.0967339 0.00154195 -0.0928459 0.110638 -0.148473 -0.0706267 0.09157 0.092072 -0.0218361 0.0050671 -0.0969476 -0.0467408 0.030418 -0.0375835 0.106576 -0.0174935 -0.00259294 0.217864 -0.0100688 -0.184955 -0.0528851 0.0628762 0.234618 -0.0785089 0.0142494 -0.0170583 0.0375713 0.0343683 -0.0179866 0.0395601 -0.0263672 0.116687 -0.0414839 0.038122 -0.040083 -0.0438254 -0.0659234 0.0421079 0.0651619 0.0911591 -0.0385083 0.106332 -0.0273461 -0.101067 0.0174283 -0.038909 0.0871462 0.109648 0.00851326 -0.0526751 0.196331 -0.0583777 -0.0113513 -0.0646974 -0.0351237 -0.130598 -0.000474389 0.0999407 0.0253818 -0.0507895 0.0666738 -0.0217598 -0.00481422 0.103525 -0.129781 0.0611733 -0.0752419 0.0885433 0.0791151 0.0119377 0.0540628 0.161698 -0.125239 -0.00806566 0.0613758 0.0975364 -0.129543 -0.116295 -0.00484758 0.120985 -0.0115048 0.0312528 -0.0292546 0.0552906 -0.193568 0.0520557 -0.0921535 -0.00700938 
0.106269 -0.0612578 -0.102947 0.0116013 0.169481 0.172614 0.0784335 -0.0607322 -0.00898005 -0.110973 -0.00484594 0.0668357 0.0897385 -0.0527191 -0.0562348 -0.0341741 -0.0371113 0.050652 -0.12707 0.151337 0.177626 -0.0932967 0.0666693 0.185551 0.0370541 -0.0531975 -0.12105 -0.208625 0.051523 0.057003 0.0928485 0.0865186 -0.143998 0.0508339 0.00198241 0.0421341 -0.0885337 0.0938176 -0.024777 -0.101391 0.0998297 0.0240098 -0.0787724 0.0903819 -0.131462 -0.0782357 0.0856385 0.0924926 -0.0111447 0.00953884 -0.0725494 -0.0583195 0.0289055 -0.0411543 0.10716 -0.0219215 -0.012066 0.228446 0.00472002 -0.17728 -0.0599025 0.0801055 0.20837 -0.0959269 -0.00744901 -0.0106476 0.0379266 0.0534114 -0.0249445 0.040002 -0.00881072 0.132194 -0.0365079 0.0197651 -0.0407232 -0.0292382 -0.0565195 0.0368922 0.0509629 0.102124 -0.0167929 0.116866 -0.0151728 -0.108784 0.00642624 -0.012342 0.0872189 0.0966502 -0.0209074 -0.0493174 0.189734 -0.0681725 -0.021799 -0.0468188 -0.0403927 -0.106779 -0.015612 0.0817101 0.0125159 -0.0513241 0.0648856 -0.030669 -0.00612394 0.119653 -0.140329 0.0643277 -0.0995948 0.0781885 0.0651564 0.00703515 0.0549295 0.160492 -0.120196 0.00925676 0.0559674 0.101556 -0.148788 -0.0948793 -0.0268614 0.12419 -0.0115168 0.0431935 -0.0284961 0.0578288 -0.187684 0.0542653 -0.100778 -0.0192137 
0.0730877 -0.0620885 -0.0723965 -0.03363 0.136804 0.175346 0.0543724 -0.0233478 0.0204847 -0.109906 0.0101389 0.0714286 0.0733587 -0.0691615 -0.058141 -0.0557002 -0.0791495 0.0448744 -0.12949 0.117704 0.174544 -0.0495124 0.0377969 0.200094 0.0173673 -0.0162654 -0.070357 -0.200951 0.071832 0.0228916 0.104693 0.0215496 -0.138131 0.0394476 0.00349439 0.042741 -0.0962154 0.0862768 -0.0318745 -0.0555376 0.110834 0.0301223 -0.114418 0.136232 -0.121073 -0.106088 0.0811219 0.0842308 -0.0217104 -0.00146926 -0.0973226 -0.0697179 0.00892336 -0.0454339 0.0871846 0.00232801 -0.0406252 0.25184 -0.0157174 -0.188608 -0.0642815 0.0586664 0.236192 -0.0494628 -0.0213158 -0.030596 0.0639332 0.045882 0.00662802 0.0458569 -0.00104515 0.118067 -0.0207115 0.0126686 -0.0228321 -0.0519508 -0.104101 0.0539628 0.0508333 0.094564 -0.0136099 0.14033 0.00102562 -0.104537 0.000947196 -0.02762 0.122813 0.109033 -0.015545 -0.0595838 0.189629 -0.0683095 -0.0274599 -0.0479373 -0.028501 -0.106087 -0.0294512 0.0555345 0.00113638 -0.0468827 0.0397685 -0.0462325 -0.0150125 0.0932875 -0.147406 0.0697981 -0.10728 0.0477431 0.0345396 -0.0138748 0.093769 0.168131 -0.123587 0.0111424 0.0561124 0.0974421 -0.161008 -0.114866 -0.0267795 0.0921851 0.00534062 0.0345847 -0.0381665 0.0448715 -0.190326 0.055276 -0.113893 -0.00868162 
0.0662536 -0.0658949 -0.0441636 -0.0184071 0.0801629 0.133649 -0.00190569 -0.0258785 -0.00677923 -0.104657 0.0213097 0.0282956 0.0812929 -0.0540548 -0.0233616 -0.0477089 -0.0627092 0.0127807 -0.0434281 0.151554 0.177797 -0.0617176 0.0693041 0.163567 0.0186661 0.0506212 -0.0578618 -0.229941 0.0892084 0.0047721 0.117458 0.0170344 -0.0901068 0.0250117 0.0367577 0.0486069 -0.0647791 0.183688 0.00869484 -0.0898166 0.0566992 0.0121593 -0.137456 0.118721 -0.121096 -0.107807 0.0935661 0.0693889 -0.0199845 -0.0014042 -0.112386 -0.0301388 0.0468612 -0.010527 0.105546 -0.0325354 0.0083963 0.192402 -0.0243782 -0.228812 -0.059669 0.00589935 0.237842 -0.0481295 0.00498645 -0.0228319 0.0867197 0.0263482 0.0318468 0.0353584 -0.030382 0.0929617 -0.0572999 0.0349929 -0.00936792 -0.127373 -0.103581 0.0582833 0.0814893 0.160679 -0.0309996 0.103615 0.00120601 -0.129316 0.0505121 -0.0895928 0.0938673 0.138372 0.0398707 -0.0836147 0.188246 -0.0223852 0.00392651 -0.0261647 -0.034803 -0.1482 0.00676586 0.11319 -0.0064116 -0.0775156 0.0239837 -0.0182784 -0.0286092 0.0745311 -0.114277 0.0753227 -0.0326741 0.0310577 0.130101 -0.0258864 0.0396933 0.174354 -0.155969 0.000221639 0.092863 0.0901263 -0.117548 -0.170783 -0.0208027 0.081771 -0.0109488 0.0449981 -0.0149013 0.0386787 -0.16741 0.0403282 -0.0209857 0.0396321 
0.104102 -0.060648 -0.0912251 -0.0324553 0.118237 0.144406 0.0465223 0.0133425 -0.0292224 -0.0930292 0.0197461 0.0628048 0.104232 -0.0894033 -0.0819411 -0.0514112 -0.0389238 0.0344268 -0.119113 0.188198 0.178002 -0.0903704 0.0562269 0.170201 -0.00747885 0.00820922 -0.0535775 -0.197331 0.0889539 0.010536 0.0536642 0.0380556 -0.113024 0.0644269 -0.0206604 0.00249033 -0.0897269 0.158427 -0.0335403 -0.102468 0.0758063 -0.0132092 -0.10994 0.141847 -0.134946 -0.104879 0.0810622 0.0876185 -0.0488061 0.0399042 -0.0784935 -0.0306348 -0.0203248 -0.0184773 0.0979133 -0.047694 -0.0249822 0.188466 -0.0155453 -0.208438 -0.0434704 0.0140547 0.241125 -0.0328726 -0.0196009 -0.0622463 0.0369786 0.0341432 0.00121577 0.0178954 -0.0353445 0.0764332 -0.0403655 0.0439522 -0.0327528 -0.0899681 -0.053628 0.0774662 0.0745186 0.125872 -0.0457856 0.0791061 0.00371691 -0.112817 0.0310019 -0.0511331 0.105981 0.133805 0.0575555 -0.0537521 0.178338 -0.072198 -0.0431012 -0.0264893 -0.0334035 -0.133341 0.00898573 0.0782724 -0.0157725 -0.0827499 0.0439467 -0.0031504 -0.0252519 0.134769 -0.121457 0.0543827 -0.0780744 0.0989659 0.095452 -0.0468419 0.0595281 0.187172 -0.143222 0.0409199 0.0713785 0.0706306 -0.121539 -0.143657 0.00445432 0.112279 -0.0414488 0.0457052 -0.0183397 0.0571878 -0.157049 0.014474 -0.0603374 -0.0174349 
0.0843663 -0.0670794 -0.0567393 -0.0165083 0.13512 0.164826 0.102544 -0.0057589 0.0118857 -0.0953631 0.00424392 0.101742 0.093733 -0.173707 -0.0860224 -0.0660493 -0.122674 0.0813085 -0.170592 0.168129 0.189991 -0.0573238 0.0355577 0.174475 -0.0580159 -0.0378256 -0.114342 -0.25275 0.0468199 0.0510946 0.0262589 0.0495592 -0.123096 0.090294 0.0425058 -0.0136317 -0.0595144 0.093352 -0.0616645 -0.102234 0.119303 -0.0501638 -0.096585 0.136339 -0.169407 -0.101619 0.0794017 0.0830893 -0.0452305 0.047137 -0.0570252 -0.0914027 -0.0346953 -0.00262622 0.121192 -0.017288 -0.0269145 0.145287 -0.0584322 -0.14157 -0.0159114 0.0151876 0.212393 -0.0352527 0.0467105 -0.136632 0.0292445 -0.0112512 -0.0196815 0.0329789 -0.0396153 0.0678564 -0.0309902 0.0238407 -0.0637325 -0.0381301 -0.0727334 0.0852844 0.0678453 0.094405 -0.0236247 0.0847851 -0.0125661 -0.0515056 0.000628425 -0.00601989 0.135349 0.114344 -0.00978456 0.0100258 0.187266 -0.113468 -0.0567479 -0.0472808 -0.106378 -0.110257 -0.0364088 0.0335038 0.0197671 -0.0250514 0.0923226 0.00109189 -0.0437053 0.101735 -0.0378099 0.00749919 -0.059115 0.126449 0.0228907 0.0321566 0.0283321 0.128995 -0.122702 -0.0121752 0.0378928 0.105643 -0.113091 -0.112689 -0.0316774 0.117808 6.23287e-05 0.0440881 -0.0387501 0.0693433 -0.12068 0.0336026 -0.0819304 -0.0339487 
0.0849628 -0.0475004 -0.105963 -0.01406 0.122733 0.154793 0.0985866 -0.0494143 -0.0157625 -0.0373028 -0.00157141 0.0642684 0.100547 -0.0852395 -0.0537983 -0.0591009 -0.0845129 0.0592896 -0.0725025 0.161968 0.153356 -0.105295 0.0665868 0.142926 -0.0195814 0.0112189 -0.120138 -0.246415 0.0920483 0.0633133 0.0436466 0.0903211 -0.114808 0.0297936 0.0453983 0.0129371 -0.0757236 0.15142 -0.0171779 -0.138397 0.0712131 -0.0305985 -0.120273 0.116951 -0.176422 -0.0596536 0.0824397 0.105105 -0.040557 0.0053963 -0.0903632 -0.0168977 0.0233349 -0.0251876 0.119067 -0.0237254 0.0102098 0.179151 -0.0376637 -0.169907 -0.039323 0.0238558 0.250667 -0.0624451 0.0409308 -0.038661 0.0333558 0.0248411 -0.0167194 0.0345072 -0.0420515 0.101832 -0.0603318 0.0447611 -0.0555014 -0.0659935 -0.069892 0.046214 0.0914172 0.094682 -0.0422821 0.0845509 -0.0384102 -0.096403 0.0390872 -0.075231 0.0867447 0.116274 0.0496705 -0.0278863 0.194448 -0.0421237 -0.0121208 -0.0523402 -0.0569133 -0.161768 0.0162706 0.103077 0.0457342 -0.061328 0.0987782 0.00628225 -0.0127437 0.0750493 -0.106346 0.0474966 -0.0342237 0.0843334 0.111304 0.0312949 0.0457187 0.159495 -0.122354 -0.0342216 0.0812304 0.09589 -0.105458 -0.143014 -8.82801e-05 0.116638 -0.00363091 0.00196645 -0.0144078 0.0583193 -0.173148 0.0540435 -0.0484988 0.0054913 
0.111333 -0.0604635 -0.0870242 -0.0301162 0.146291 0.151364 0.0866744 -0.0397075 -0.00873731 -0.0867755 -0.00301936 0.0677449 0.103 -0.0546614 -0.0484595 -0.0661693 -0.0533038 0.0417928 -0.101193 0.183113 0.164511 -0.0567047 0.0490236 0.137952 -0.0317861 0.00582019 -0.115211 -0.20985 0.0778535 0.0623922 0.0390864 0.0665579 -0.112158 0.0468287 0.0579668 0.0297049 -0.0518664 0.166314 -0.0237977 -0.141462 0.0630661 0.0137545 -0.113536 0.101515 -0.16534 -0.0418035 0.0690213 0.111157 -0.0363201 0.031356 -0.105337 -0.0150827 0.0113451 -0.00465577 0.143723 -0.0450451 -0.0272616 0.184115 -0.0666543 -0.178643 -0.0403265 0.0225516 0.246393 -0.0631781 0.0260661 -0.0577302 0.0353907 0.0570144 -0.0170765 0.0264043 0.00317648 0.0826284 -0.0463121 0.0256159 -0.0631693 -0.0464759 -0.0677909 0.0348512 0.105449 0.0962259 -0.0130691 0.104264 -0.0267943 -0.0971816 0.0522837 -0.0902934 0.0908206 0.138067 0.0532368 0.000770317 0.206755 -0.0710917 -0.0190153 -0.0229903 -0.0609105 -0.156226 0.0183293 0.0736763 0.0196893 -0.0666583 0.089813 0.0254832 -0.0320489 0.068953 -0.138215 0.0617706 -0.0524322 0.0591102 0.105049 0.0312132 0.0731712 0.145287 -0.149315 0.0187645 0.0718472 0.0974389 -0.114519 -0.146449 -0.0347995 0.108201 -0.0198443 0.0319484 0.00261686 0.0702783 -0.142644 0.0401328 -0.0243084 -0.021202 
0.0996841 -0.0954286 -0.0850023 -0.00981699 0.145176 0.131705 0.100355 -0.0174348 0.0305401 -0.123679 -0.0175128 0.0936702 0.0923694 -0.142292 -0.0987601 -0.0651914 -0.10321 0.0565138 -0.159117 0.190916 0.185905 -0.0717185 0.0485205 0.167345 -0.0569606 -0.0472072 -0.110156 -0.252556 0.0229278 0.0665931 0.0136857 0.0476187 -0.109335 0.0720548 0.0418048 -0.00849837 -0.0578335 0.116522 -0.0825566 -0.131529 0.0900284 -0.0229367 -0.0962499 0.125978 -0.154274 -0.0653579 0.0664699 0.093091 -0.022243 0.0573278 -0.0854637 -0.0963586 0.0107473 -0.00454194 0.142526 -0.0372682 -0.0228708 0.141828 -0.0521027 -0.161216 0.000498944 0.0287552 0.205012 -0.0277264 0.0264617 -0.127218 0.0246011 0.0163537 -0.00386825 -0.00179318 -0.032484 0.0566559 -0.032682 0.00191614 -0.0774659 -0.0129464 -0.0621001 0.0593947 0.0776692 0.107828 -0.0109395 0.0842833 -0.0476598 -0.072134 0.0165267 -0.0133129 0.104519 0.124434 -0.00137305 0.00374267 0.194979 -0.0956333 -0.0468322 -0.0443585 -0.0973791 -0.0998532 -0.0273667 0.0308183 0.0350742 -0.0456666 0.110352 -0.0110294 -0.0338003 0.0807413 -0.0739635 -0.00142243 -0.0714117 0.109318 0.0247085 0.0471533 0.0529677 0.128774 -0.12315 -0.0150005 0.0250242 0.127787 -0.12654 -0.108592 -0.0499972 0.107993 -0.0335408 0.0662116 -0.0315389 0.0735698 -0.133844 0.0314772 -0.0867367 -0.0557379 
0.0942468 -0.067989 -0.105593 -0.0182375 0.142574 0.135796 0.09472 -0.0493098 -0.00277842 -0.0686766 -0.0128392 0.0683023 0.10361 -0.0718431 -0.0634104 -0.0612649 -0.0737468 0.0589794 -0.0868016 0.1761 0.170153 -0.092575 0.0607639 0.150556 -0.0218758 -0.00383848 -0.115468 -0.238512 0.0730328 0.077572 0.0340281 0.0727557 -0.103469 0.0336334 0.0567015 0.0117157 -0.0639701 0.147488 -0.0350903 -0.156619 0.0649085 -0.00762375 -0.0984551 0.124282 -0.170363 -0.0477046 0.0803357 0.108843 -0.0251376 0.0178119 -0.0995347 -0.0418786 0.031448 -0.0194313 0.141974 -0.0315299 -0.00511363 0.172368 -0.0398712 -0.182574 -0.023064 0.0217204 0.235324 -0.0450255 0.0280809 -0.058209 0.0218489 0.037929 -0.0061455 0.0154193 -0.0259632 0.0860978 -0.0547223 0.00912606 -0.0680215 -0.04245 -0.0681578 0.0451809 0.0987826 0.0959589 -0.0246279 0.0974983 -0.0468953 -0.0905753 0.0450405 -0.0715388 0.0829917 0.129108 0.0485272 -0.0141286 0.195642 -0.0497829 -0.022068 -0.0524846 -0.0680885 -0.149449 0.00204054 0.0957324 0.0404106 -0.0711634 0.108105 0.00628193 -0.00667788 0.0630756 -0.123195 0.0393365 -0.0515384 0.0781797 0.0969505 0.0403992 0.0603471 0.143345 -0.134521 -0.0196117 0.0637811 0.110262 -0.111518 -0.142311 -0.0320144 0.109085 -0.0182204 0.0295163 -0.0163362 0.0633691 -0.174313 0.0460111 -0.0511753 -0.0120351 
0.0996921 -0.0800257 -0.093239 -0.0156871 0.142827 0.149626 0.109698 -0.0222146 0.0056135 -0.0972407 -0.0124612 0.0724427 0.103568 -0.0864978 -0.0595239 -0.0763172 -0.0812825 0.0377811 -0.122471 0.180211 0.167711 -0.10163 0.0570666 0.164435 -0.0242051 -0.0379307 -0.123967 -0.226836 0.0557796 0.0523068 0.0442419 0.062611 -0.119664 0.0600963 0.0303172 0.0144673 -0.0752003 0.134978 -0.0558237 -0.138172 0.0910752 -0.0176728 -0.108659 0.106522 -0.161102 -0.0644813 0.0573727 0.109922 -0.023874 0.0396354 -0.108871 -0.0562028 0.0238942 -0.0213528 0.130056 -0.0320888 -0.0304242 0.183592 -0.0518033 -0.16814 -0.0306292 0.0470538 0.224768 -0.0576367 0.0136359 -0.050119 0.0283461 0.0338032 -0.0261923 0.00846667 -0.0285813 0.0816681 -0.0526198 0.0278156 -0.0572244 -0.0332597 -0.0509757 0.0281313 0.0980568 0.110261 -0.0363331 0.0706702 -0.0388343 -0.0958348 0.0299208 -0.0462982 0.0946159 0.121303 0.0278175 -0.012921 0.209451 -0.0775092 -0.0154382 -0.0452499 -0.0721762 -0.134768 -0.00764119 0.0594885 0.031462 -0.0557588 0.10081 -0.00486149 -0.0257617 0.0793554 -0.110587 0.0449756 -0.0644461 0.0938976 0.0719661 0.0280874 0.0595658 0.149228 -0.131654 -0.0100656 0.0552598 0.11689 -0.111999 -0.111517 -0.0168756 0.134688 -0.0258986 0.0262113 -0.0329047 0.080799 -0.165341 0.0405777 -0.0689229 -0.0271831 
0.102474 -0.0729667 -0.0967086 -0.0217942 0.145025 0.15598 0.110497 -0.0141057 0.0156218 -0.105252 -0.0124714 0.0729039 0.103377 -0.0779156 -0.0688311 -0.0897912 -0.0774704 0.0264464 -0.13105 0.17947 0.165059 -0.100097 0.054782 0.147297 -0.0273783 -0.0438543 -0.123449 -0.204301 0.058768 0.0441642 0.047417 0.0590667 -0.12185 0.059452 0.0200761 0.0140274 -0.0725986 0.141814 -0.0573677 -0.135365 0.0963959 -0.0118343 -0.11566 0.0987907 -0.166969 -0.0719378 0.0436516 0.111057 -0.0147056 0.0450389 -0.115892 -0.0331185 0.0135699 -0.0140196 0.125358 -0.0372837 -0.0344792 0.182877 -0.0626494 -0.171129 -0.0353926 0.0474494 0.230732 -0.0598085 0.00632127 -0.0498958 0.0351473 0.0421236 -0.0257126 0.0184783 -0.0176743 0.0792194 -0.0460552 0.0379145 -0.0537162 -0.0286776 -0.0472847 0.0219144 0.0958105 0.106911 -0.0446657 0.0700224 -0.0218403 -0.0854019 0.0423027 -0.0515217 0.0997143 0.134798 0.0368042 -0.0155694 0.212419 -0.091149 -0.0109441 -0.040243 -0.0670493 -0.153656 -0.00131217 0.0517635 0.0225934 -0.0525328 0.0959772 0.00641851 -0.0285015 0.0886124 -0.113417 0.0522178 -0.0647862 0.0950213 0.0736044 0.0244709 0.0635015 0.144664 -0.139112 0.011622 0.0556423 0.108798 -0.104432 -0.107873 -0.00697844 0.13662 -0.0305509 0.0285103 -0.0341603 0.0772436 -0.153669 0.0327812 -0.0634124 -0.0195209 
0.0804284 -0.0658645 -0.0948221 -0.0143971 0.14689 0.150988 0.0652217 -0.0429176 -0.0112858 -0.100658 -0.0201483 0.0522937 0.0985185 -0.062734 -0.0613104 -0.0398554 -0.0758477 0.0279131 -0.118148 0.167621 0.173628 -0.116687 0.0805304 0.145595 0.0121948 -0.0222082 -0.120681 -0.216612 0.0592825 0.027429 0.0836478 0.0708749 -0.133141 0.0390064 0.0103941 0.0362411 -0.089914 0.142063 -0.028079 -0.117526 0.0899624 0.00401136 -0.0962529 0.0980839 -0.135293 -0.075537 0.0832736 0.101602 -0.0178027 0.0168624 -0.108979 -0.0629056 0.0264414 -0.0279097 0.107673 -0.0380978 -0.00499801 0.204727 -0.0141727 -0.200717 -0.0397623 0.0657879 0.22268 -0.058538 0.0100944 -0.0085156 0.0337111 0.0589249 -0.002605 0.023538 -0.0229599 0.119128 -0.03293 0.0326257 -0.0382257 -0.0467501 -0.0678472 0.0328401 0.0770701 0.109108 -0.0278709 0.0897067 -0.0268733 -0.104182 0.00915914 -0.0383131 0.08943 0.135111 0.022511 -0.0591481 0.19798 -0.0537485 -0.0017512 -0.0524171 -0.0520735 -0.126132 -0.00341166 0.0991039 0.0133147 -0.0560613 0.0660862 -0.0327957 -0.0187327 0.0955079 -0.118157 0.0642974 -0.0827548 0.0927594 0.0871212 0.00486901 0.0467093 0.171074 -0.134139 0.0102646 0.0638672 0.101487 -0.14075 -0.096727 -0.0204544 0.114 -0.0275343 0.0456001 -0.0201525 0.0589216 -0.190957 0.0434946 -0.0930227 -0.00847683 
