0.109798 -0.0532665 -0.0358976 -0.0855734 0.0854044 0.222188 0.0419175 0.0517202 -0.025382 -0.0919435 0.00342555 0.0740365 0.13736 -0.0707097 0.0582192 -0.0935799 -0.117211 0.0533733 -0.159876 0.109779 0.101956 0.0816821 0.0745705 0.150681 -0.110604 -0.110257 -0.0482965 -0.172063 -0.127944 0.0613933 -0.0388721 -0.0780475 -0.067857 0.136715 0.0184506 0.0468055 0.00836319 -0.0177784 -0.12109 0.0435219 0.0642258 -0.0134306 -0.0366205 0.0989906 -0.200746 -0.083561 0.0787834 0.0721607 -0.0404494 0.211249 0.0448563 -0.228889 -0.0640991 0.0974142 0.0966005 0.0201018 -0.0530604 0.127738 0.0125001 -0.0903436 -0.0534694 0.0768444 0.102823 -0.118621 0.00850976 -0.149683 0.0539353 0.0366854 -0.0653196 0.0106174 0.0370518 0.0599966 0.0284326 -0.06733 -0.0249559 0.0673388 -0.0959791 -0.0460862 0.0708927 0.0768667 0.0654237 0.0288308 -0.00947759 0.00228849 -0.0908518 0.0974898 0.110227 -0.0283878 -0.0235363 0.10257 0.0932498 -0.208126 -0.0220689 -0.0394179 -0.167596 -0.039964 -0.103405 0.00631429 -0.0135084 0.00372558 0.0688703 0.0434504 -0.016283 0.0237132 -0.0838475 -0.00402199 -0.17266 0.0202687 -0.192695 0.0658154 0.0838913 0.0575501 -0.0131238 -0.00662338 -0.103217 0.121716 -0.0406549 -0.0348728 -0.1182 0.0934262 0.0688944 -0.0474771 0.00590706 0.0844755 -0.0320131 -0.00274671 -0.0764652 -0.00836358 
0.109798 -0.0532665 -0.0358976 -0.0855734 0.0854044 0.222188 0.0419175 0.0517202 -0.025382 -0.0919435 0.00342555 0.0740365 0.13736 -0.0707097 0.0582192 -0.0935799 -0.117211 0.0533733 -0.159876 0.109779 0.101956 0.0816821 0.0745705 0.150681 -0.110604 -0.110257 -0.0482965 -0.172063 -0.127944 0.0613933 -0.0388721 -0.0780475 -0.067857 0.136715 0.0184506 0.0468055 0.00836319 -0.0177784 -0.12109 0.0435219 0.0642258 -0.0134306 -0.0366205 0.0989906 -0.200746 -0.083561 0.0787834 0.0721607 -0.0404494 0.211249 0.0448563 -0.228889 -0.0640991 0.0974142 0.0966005 0.0201018 -0.0530604 0.127738 0.0125001 -0.0903436 -0.0534694 0.0768444 0.102823 -0.118621 0.00850976 -0.149683 0.0539353 0.0366854 -0.0653196 0.0106174 0.0370518 0.0599966 0.0284326 -0.06733 -0.0249559 0.0673388 -0.0959791 -0.0460862 0.0708927 0.0768667 0.0654237 0.0288308 -0.00947759 0.00228849 -0.0908518 0.0974898 0.110227 -0.0283878 -0.0235363 0.10257 0.0932498 -0.208126 -0.0220689 -0.0394179 -0.167596 -0.039964 -0.103405 0.00631429 -0.0135084 0.00372558 0.0688703 0.0434504 -0.016283 0.0237132 -0.0838475 -0.00402199 -0.17266 0.0202687 -0.192695 0.0658154 0.0838913 0.0575501 -0.0131238 -0.00662338 -0.103217 0.121716 -0.0406549 -0.0348728 -0.1182 0.0934262 0.0688944 -0.0474771 0.00590706 0.0844755 -0.0320131 -0.00274671 -0.0764652 -0.00836358 
0.115294 0.0177134 -0.0800988 -0.116386 0.0951343 0.232112 0.0205932 0.0380049 -0.0493734 -0.0595038 0.0177383 0.0677156 0.135738 -0.0553719 0.0605322 -0.0979774 -0.0800536 0.0270865 -0.164179 0.149835 0.0490475 0.0919511 0.0887646 0.0989872 -0.12105 -0.0744137 -0.0233123 -0.126336 -0.0778111 0.0241718 -0.0381497 -0.0489978 -0.0516848 0.141634 -0.000779603 0.0778281 0.0385186 0.0313531 -0.116971 0.0402626 0.0681274 -0.0192622 -0.0374404 0.106294 -0.23891 -0.039412 0.110659 0.10056 -0.0887849 0.2341 0.0187608 -0.147635 -0.112987 0.103736 0.0999523 -0.0054431 -0.066864 0.127612 0.00549329 -0.116951 -0.105674 0.063701 0.159023 -0.137121 0.00532777 -0.119806 0.061483 0.0760092 -0.0651875 0.0580433 0.0491458 0.0595457 0.0370334 -0.00593004 0.0149946 0.0357751 -0.102468 -0.0167075 0.0629978 0.0275165 0.0525634 0.0629806 -0.017222 -0.00855398 -0.0727126 0.0786438 0.0852032 -0.00300481 0.0270258 0.126195 0.119931 -0.217979 -0.0431336 -0.050669 -0.11181 -0.0877091 -0.0701495 0.0331506 -0.037941 -0.0461868 0.025418 0.0535103 -0.0040757 0.0326672 -0.141219 0.0506642 -0.180891 0.0410503 -0.138625 0.0399153 0.112874 0.107141 -0.0180128 0.0496505 -0.0837648 0.050007 -0.041974 -0.0960884 -0.0531423 0.0921477 0.0935988 -0.0414801 0.0616858 0.11426 -0.0271498 -0.040785 -0.0278016 -0.00964781 
0.115294 0.0177134 -0.0800988 -0.116386 0.0951343 0.232112 0.0205932 0.0380049 -0.0493734 -0.0595038 0.0177383 0.0677156 0.135738 -0.0553719 0.0605322 -0.0979774 -0.0800536 0.0270865 -0.164179 0.149835 0.0490475 0.0919511 0.0887646 0.0989872 -0.12105 -0.0744137 -0.0233123 -0.126336 -0.0778111 0.0241718 -0.0381497 -0.0489978 -0.0516848 0.141634 -0.000779603 0.0778281 0.0385186 0.0313531 -0.116971 0.0402626 0.0681274 -0.0192622 -0.0374404 0.106294 -0.23891 -0.039412 0.110659 0.10056 -0.0887849 0.2341 0.0187608 -0.147635 -0.112987 0.103736 0.0999523 -0.0054431 -0.066864 0.127612 0.00549329 -0.116951 -0.105674 0.063701 0.159023 -0.137121 0.00532777 -0.119806 0.061483 0.0760092 -0.0651875 0.0580433 0.0491458 0.0595457 0.0370334 -0.00593004 0.0149946 0.0357751 -0.102468 -0.0167075 0.0629978 0.0275165 0.0525634 0.0629806 -0.017222 -0.00855398 -0.0727126 0.0786438 0.0852032 -0.00300481 0.0270258 0.126195 0.119931 -0.217979 -0.0431336 -0.050669 -0.11181 -0.0877091 -0.0701495 0.0331506 -0.037941 -0.0461868 0.025418 0.0535103 -0.0040757 0.0326672 -0.141219 0.0506642 -0.180891 0.0410503 -0.138625 0.0399153 0.112874 0.107141 -0.0180128 0.0496505 -0.0837648 0.050007 -0.041974 -0.0960884 -0.0531423 0.0921477 0.0935988 -0.0414801 0.0616858 0.11426 -0.0271498 -0.040785 -0.0278016 -0.00964781 
0.115294 0.0177134 -0.0800988 -0.116386 0.0951343 0.232112 0.0205932 0.0380049 -0.0493734 -0.0595038 0.0177383 0.0677156 0.135738 -0.0553719 0.0605322 -0.0979774 -0.0800536 0.0270865 -0.164179 0.149835 0.0490475 0.0919511 0.0887646 0.0989872 -0.12105 -0.0744137 -0.0233123 -0.126336 -0.0778111 0.0241718 -0.0381497 -0.0489978 -0.0516848 0.141634 -0.000779603 0.0778281 0.0385186 0.0313531 -0.116971 0.0402626 0.0681274 -0.0192622 -0.0374404 0.106294 -0.23891 -0.039412 0.110659 0.10056 -0.0887849 0.2341 0.0187608 -0.147635 -0.112987 0.103736 0.0999523 -0.0054431 -0.066864 0.127612 0.00549329 -0.116951 -0.105674 0.063701 0.159023 -0.137121 0.00532777 -0.119806 0.061483 0.0760092 -0.0651875 0.0580433 0.0491458 0.0595457 0.0370334 -0.00593004 0.0149946 0.0357751 -0.102468 -0.0167075 0.0629978 0.0275165 0.0525634 0.0629806 -0.017222 -0.00855398 -0.0727126 0.0786438 0.0852032 -0.00300481 0.0270258 0.126195 0.119931 -0.217979 -0.0431336 -0.050669 -0.11181 -0.0877091 -0.0701495 0.0331506 -0.037941 -0.0461868 0.025418 0.0535103 -0.0040757 0.0326672 -0.141219 0.0506642 -0.180891 0.0410503 -0.138625 0.0399153 0.112874 0.107141 -0.0180128 0.0496505 -0.0837648 0.050007 -0.041974 -0.0960884 -0.0531423 0.0921477 0.0935988 -0.0414801 0.0616858 0.11426 -0.0271498 -0.040785 -0.0278016 -0.00964781 
0.110164 -0.00710474 -0.103458 -0.113686 0.0725154 0.231943 0.0218909 0.0405534 -0.0311032 -0.0598374 0.0266269 0.0846042 0.136508 -0.0870076 -0.0146106 -0.0752488 -0.0979475 0.0754008 -0.175262 0.133641 0.0856486 0.0585885 0.0879079 0.119068 -0.149896 -0.0635838 -0.011863 -0.168265 -0.0860755 0.0419844 -0.0549857 -0.0438774 -0.0503442 0.137924 0.00628693 0.0456692 0.00459588 0.0308453 -0.120731 0.0260564 0.0251082 -0.0305841 -0.0616556 0.130878 -0.20697 -0.0668941 0.107797 0.0904347 -0.114834 0.231181 0.0126295 -0.174657 -0.0962499 0.0916874 0.0762049 0.011602 -0.0382771 0.135901 0.00051757 -0.121054 -0.0619682 0.0679838 0.199325 -0.123089 0.0111154 -0.149186 0.0310939 0.0648261 -0.0678844 0.0604359 0.0182191 0.0279558 0.0178775 -0.0287913 -0.0351257 0.016917 -0.0863415 -0.0124453 0.0550113 0.00240369 0.028863 0.0629701 -0.0543548 -0.0321638 -0.10845 0.0888629 0.0827918 -0.0250534 0.0365679 0.116895 0.122878 -0.224361 -0.0556357 -0.050252 -0.074952 -0.0377532 -0.0930908 0.0342385 -0.0295591 -0.0171061 0.0613456 0.0345314 -0.0350893 0.0394454 -0.0882102 0.0265181 -0.172976 0.0223133 -0.176703 0.0357725 0.0936031 0.109857 0.0123274 0.0233927 -0.0696402 0.0752907 -0.0407278 -0.0910945 -0.0259778 0.0779157 0.07303 -0.0482814 0.0544602 0.095884 -0.0422406 -0.0241052 -0.0567148 -0.0310509 
0.110164 -0.00710474 -0.103458 -0.113686 0.0725154 0.231943 0.0218909 0.0405534 -0.0311032 -0.0598374 0.0266269 0.0846042 0.136508 -0.0870076 -0.0146106 -0.0752488 -0.0979475 0.0754008 -0.175262 0.133641 0.0856486 0.0585885 0.0879079 0.119068 -0.149896 -0.0635838 -0.011863 -0.168265 -0.0860755 0.0419844 -0.0549857 -0.0438774 -0.0503442 0.137924 0.00628693 0.0456692 0.00459588 0.0308453 -0.120731 0.0260564 0.0251082 -0.0305841 -0.0616556 0.130878 -0.20697 -0.0668941 0.107797 0.0904347 -0.114834 0.231181 0.0126295 -0.174657 -0.0962499 0.0916874 0.0762049 0.011602 -0.0382771 0.135901 0.00051757 -0.121054 -0.0619682 0.0679838 0.199325 -0.123089 0.0111154 -0.149186 0.0310939 0.0648261 -0.0678844 0.0604359 0.0182191 0.0279558 0.0178775 -0.0287913 -0.0351257 0.016917 -0.0863415 -0.0124453 0.0550113 0.00240369 0.028863 0.0629701 -0.0543548 -0.0321638 -0.10845 0.0888629 0.0827918 -0.0250534 0.0365679 0.116895 0.122878 -0.224361 -0.0556357 -0.050252 -0.074952 -0.0377532 -0.0930908 0.0342385 -0.0295591 -0.0171061 0.0613456 0.0345314 -0.0350893 0.0394454 -0.0882102 0.0265181 -0.172976 0.0223133 -0.176703 0.0357725 0.0936031 0.109857 0.0123274 0.0233927 -0.0696402 0.0752907 -0.0407278 -0.0910945 -0.0259778 0.0779157 0.07303 -0.0482814 0.0544602 0.095884 -0.0422406 -0.0241052 -0.0567148 -0.0310509 
0.125381 -0.0216474 -0.0906261 -0.101039 0.110906 0.230443 0.0449599 0.0277938 -0.0173689 -0.110878 0.00631114 0.0856099 0.103479 -0.0604634 0.0279258 -0.11456 -0.078513 0.0513303 -0.160925 0.122052 0.06146 0.0908627 0.0752282 0.0903135 -0.112434 -0.08335 -0.0215127 -0.131081 -0.10808 0.0174629 -0.0296528 -0.0465823 -0.0624962 0.144226 0.0334019 0.0573373 0.0398081 0.00943306 -0.109202 -0.000810645 0.0898937 0.00746583 -0.0260946 0.116248 -0.242617 -0.0463256 0.0832449 0.0880692 -0.0742393 0.224945 -0.0193834 -0.180222 -0.0848936 0.0947688 0.0954832 -0.00191174 -0.070472 0.151167 -0.0281731 -0.11142 -0.0731338 0.078232 0.177723 -0.136127 0.0125702 -0.112394 0.0456995 0.0724513 -0.0536743 0.0680104 0.047502 0.0474418 0.0413845 -0.0215564 -0.032503 0.0305355 -0.094751 -0.0419394 0.052891 -0.0131137 0.0300705 0.0959123 -0.0311798 -0.0318269 -0.0796623 0.064133 0.084299 -1.95201e-05 0.00798519 0.1265 0.16183 -0.223901 -0.0520135 -0.0744927 -0.0772605 -0.0683266 -0.0778185 0.0165783 -0.0422791 -0.0262452 0.0231587 0.0346169 -0.00324015 0.0237288 -0.119302 0.0343618 -0.164033 0.0286272 -0.182333 0.0579113 0.131986 0.0821324 -0.00993121 0.0477834 -0.069061 0.0421805 -0.0337799 -0.102226 -0.0263926 0.0757091 0.0912741 -0.0175787 0.0534432 0.115358 -0.0200105 -0.0577198 -0.0341619 -0.0317106 
0.125381 -0.0216474 -0.0906261 -0.101039 0.110906 0.230443 0.0449599 0.0277938 -0.0173689 -0.110878 0.00631114 0.0856099 0.103479 -0.0604634 0.0279258 -0.11456 -0.078513 0.0513303 -0.160925 0.122052 0.06146 0.0908627 0.0752282 0.0903135 -0.112434 -0.08335 -0.0215127 -0.131081 -0.10808 0.0174629 -0.0296528 -0.0465823 -0.0624962 0.144226 0.0334019 0.0573373 0.0398081 0.00943306 -0.109202 -0.000810645 0.0898937 0.00746583 -0.0260946 0.116248 -0.242617 -0.0463256 0.0832449 0.0880692 -0.0742393 0.224945 -0.0193834 -0.180222 -0.0848936 0.0947688 0.0954832 -0.00191174 -0.070472 0.151167 -0.0281731 -0.11142 -0.0731338 0.078232 0.177723 -0.136127 0.0125702 -0.112394 0.0456995 0.0724513 -0.0536743 0.0680104 0.047502 0.0474418 0.0413845 -0.0215564 -0.032503 0.0305355 -0.094751 -0.0419394 0.052891 -0.0131137 0.0300705 0.0959123 -0.0311798 -0.0318269 -0.0796623 0.064133 0.084299 -1.95201e-05 0.00798519 0.1265 0.16183 -0.223901 -0.0520135 -0.0744927 -0.0772605 -0.0683266 -0.0778185 0.0165783 -0.0422791 -0.0262452 0.0231587 0.0346169 -0.00324015 0.0237288 -0.119302 0.0343618 -0.164033 0.0286272 -0.182333 0.0579113 0.131986 0.0821324 -0.00993121 0.0477834 -0.069061 0.0421805 -0.0337799 -0.102226 -0.0263926 0.0757091 0.0912741 -0.0175787 0.0534432 0.115358 -0.0200105 -0.0577198 -0.0341619 -0.0317106 
0.125381 -0.0216474 -0.0906261 -0.101039 0.110906 0.230443 0.0449599 0.0277938 -0.0173689 -0.110878 0.00631114 0.0856099 0.103479 -0.0604634 0.0279258 -0.11456 -0.078513 0.0513303 -0.160925 0.122052 0.06146 0.0908627 0.0752282 0.0903135 -0.112434 -0.08335 -0.0215127 -0.131081 -0.10808 0.0174629 -0.0296528 -0.0465823 -0.0624962 0.144226 0.0334019 0.0573373 0.0398081 0.00943306 -0.109202 -0.000810645 0.0898937 0.00746583 -0.0260946 0.116248 -0.242617 -0.0463256 0.0832449 0.0880692 -0.0742393 0.224945 -0.0193834 -0.180222 -0.0848936 0.0947688 0.0954832 -0.00191174 -0.070472 0.151167 -0.0281731 -0.11142 -0.0731338 0.078232 0.177723 -0.136127 0.0125702 -0.112394 0.0456995 0.0724513 -0.0536743 0.0680104 0.047502 0.0474418 0.0413845 -0.0215564 -0.032503 0.0305355 -0.094751 -0.0419394 0.052891 -0.0131137 0.0300705 0.0959123 -0.0311798 -0.0318269 -0.0796623 0.064133 0.084299 -1.95201e-05 0.00798519 0.1265 0.16183 -0.223901 -0.0520135 -0.0744927 -0.0772605 -0.0683266 -0.0778185 0.0165783 -0.0422791 -0.0262452 0.0231587 0.0346169 -0.00324015 0.0237288 -0.119302 0.0343618 -0.164033 0.0286272 -0.182333 0.0579113 0.131986 0.0821324 -0.00993121 0.0477834 -0.069061 0.0421805 -0.0337799 -0.102226 -0.0263926 0.0757091 0.0912741 -0.0175787 0.0534432 0.115358 -0.0200105 -0.0577198 -0.0341619 -0.0317106 
0.107825 -0.0590389 -0.0878903 -0.0857725 0.0638199 0.214195 0.0249276 0.0396066 -0.0298489 -0.0948106 0.0213094 0.0964149 0.126327 -0.0673457 -0.044561 -0.10294 -0.109344 0.0850626 -0.153211 0.130089 0.10115 0.0321616 0.0875349 0.168657 -0.128442 -0.0748755 -0.000727505 -0.15736 -0.104213 0.0364574 -0.0664243 -0.0667875 -0.0699844 0.13601 -0.0108934 0.0343534 -0.0264627 0.00607187 -0.130146 0.0178106 0.0352704 -0.0265982 -0.0634889 0.13006 -0.20489 -0.110489 0.0883874 0.0779878 -0.0762884 0.23846 0.00292131 -0.190459 -0.0764164 0.0993282 0.0937876 0.0137605 -0.0244375 0.150865 0.0110411 -0.126214 -0.0256303 0.0980615 0.192127 -0.0900302 -0.0239037 -0.134601 0.0452239 0.0365677 -0.0432885 0.0714653 -0.00529805 0.0359578 0.0277 -0.00338969 -0.0464044 -0.00192924 -0.0675974 -0.0272524 0.0602274 0.00467585 0.0155992 0.068597 -0.0423034 -0.0650407 -0.107754 0.0905685 0.0879738 -0.0120869 0.0329907 0.0907367 0.150649 -0.20556 -0.0237265 -0.0694921 -0.0759068 -0.048857 -0.110769 0.0359216 -0.00932261 -0.0161199 0.0693521 0.0324496 -0.0155154 0.0385515 -0.0626808 0.0183467 -0.165548 0.0159321 -0.199215 0.0371297 0.100673 0.1144 0.0218358 0.012941 -0.0781999 0.0867207 -0.00361488 -0.0892262 -0.0185144 0.0714442 0.0507347 -0.0453995 0.0209161 0.0697999 -0.0900806 -0.00788001 -0.0746907 -0.0133998 
0.107825 -0.0590389 -0.0878903 -0.0857725 0.0638199 0.214195 0.0249276 0.0396066 -0.0298489 -0.0948106 0.0213094 0.0964149 0.126327 -0.0673457 -0.044561 -0.10294 -0.109344 0.0850626 -0.153211 0.130089 0.10115 0.0321616 0.0875349 0.168657 -0.128442 -0.0748755 -0.000727505 -0.15736 -0.104213 0.0364574 -0.0664243 -0.0667875 -0.0699844 0.13601 -0.0108934 0.0343534 -0.0264627 0.00607187 -0.130146 0.0178106 0.0352704 -0.0265982 -0.0634889 0.13006 -0.20489 -0.110489 0.0883874 0.0779878 -0.0762884 0.23846 0.00292131 -0.190459 -0.0764164 0.0993282 0.0937876 0.0137605 -0.0244375 0.150865 0.0110411 -0.126214 -0.0256303 0.0980615 0.192127 -0.0900302 -0.0239037 -0.134601 0.0452239 0.0365677 -0.0432885 0.0714653 -0.00529805 0.0359578 0.0277 -0.00338969 -0.0464044 -0.00192924 -0.0675974 -0.0272524 0.0602274 0.00467585 0.0155992 0.068597 -0.0423034 -0.0650407 -0.107754 0.0905685 0.0879738 -0.0120869 0.0329907 0.0907367 0.150649 -0.20556 -0.0237265 -0.0694921 -0.0759068 -0.048857 -0.110769 0.0359216 -0.00932261 -0.0161199 0.0693521 0.0324496 -0.0155154 0.0385515 -0.0626808 0.0183467 -0.165548 0.0159321 -0.199215 0.0371297 0.100673 0.1144 0.0218358 0.012941 -0.0781999 0.0867207 -0.00361488 -0.0892262 -0.0185144 0.0714442 0.0507347 -0.0453995 0.0209161 0.0697999 -0.0900806 -0.00788001 -0.0746907 -0.0133998 
0.107825 -0.0590389 -0.0878903 -0.0857725 0.0638199 0.214195 0.0249276 0.0396066 -0.0298489 -0.0948106 0.0213094 0.0964149 0.126327 -0.0673457 -0.044561 -0.10294 -0.109344 0.0850626 -0.153211 0.130089 0.10115 0.0321616 0.0875349 0.168657 -0.128442 -0.0748755 -0.000727505 -0.15736 -0.104213 0.0364574 -0.0664243 -0.0667875 -0.0699844 0.13601 -0.0108934 0.0343534 -0.0264627 0.00607187 -0.130146 0.0178106 0.0352704 -0.0265982 -0.0634889 0.13006 -0.20489 -0.110489 0.0883874 0.0779878 -0.0762884 0.23846 0.00292131 -0.190459 -0.0764164 0.0993282 0.0937876 0.0137605 -0.0244375 0.150865 0.0110411 -0.126214 -0.0256303 0.0980615 0.192127 -0.0900302 -0.0239037 -0.134601 0.0452239 0.0365677 -0.0432885 0.0714653 -0.00529805 0.0359578 0.0277 -0.00338969 -0.0464044 -0.00192924 -0.0675974 -0.0272524 0.0602274 0.00467585 0.0155992 0.068597 -0.0423034 -0.0650407 -0.107754 0.0905685 0.0879738 -0.0120869 0.0329907 0.0907367 0.150649 -0.20556 -0.0237265 -0.0694921 -0.0759068 -0.048857 -0.110769 0.0359216 -0.00932261 -0.0161199 0.0693521 0.0324496 -0.0155154 0.0385515 -0.0626808 0.0183467 -0.165548 0.0159321 -0.199215 0.0371297 0.100673 0.1144 0.0218358 0.012941 -0.0781999 0.0867207 -0.00361488 -0.0892262 -0.0185144 0.0714442 0.0507347 -0.0453995 0.0209161 0.0697999 -0.0900806 -0.00788001 -0.0746907 -0.0133998 
0.109978 -0.0465602 -0.120325 -0.0894611 0.0513231 0.188697 0.00785111 0.032917 -0.0260255 -0.114893 0.0245927 0.0953118 0.119559 -0.0904224 -0.0917652 -0.0720046 -0.110206 0.0529239 -0.172838 0.163057 0.0993764 0.0234355 0.0926287 0.13279 -0.154054 -0.0343007 0.0106568 -0.164397 -0.093354 0.0275678 -0.0871565 -0.0443894 -0.0490282 0.136029 -0.0258698 0.0292395 -0.0165378 0.0612529 -0.138534 0.00574642 0.019802 -0.0344738 -0.0611391 0.133898 -0.184519 -0.0734426 0.110945 0.0703304 -0.103852 0.247749 -0.0187305 -0.161381 -0.0799841 0.113444 0.109963 -0.0115324 -0.00944098 0.122231 0.00488967 -0.143988 -0.0269121 0.0822637 0.215813 -0.0714446 -0.0220295 -0.145807 0.0353305 0.0499963 -0.022021 0.0583251 -0.0133726 -0.000357039 0.0274375 0.0170976 -0.0228478 -0.00733531 -0.0659734 -0.00925543 0.0429202 0.00533699 0.0224299 0.0714484 -0.0610568 -0.0741899 -0.107821 0.0995553 0.0722618 0.00294172 0.0413646 0.0947732 0.152788 -0.209267 -0.0510377 -0.0658213 -0.0580159 -0.0350972 -0.0812436 0.0452096 -0.00184364 -0.0338941 0.0603668 0.0254244 -0.019063 0.0560555 -0.0739571 0.0157109 -0.166179 0.0542945 -0.183476 0.0182111 0.103319 0.137368 0.00730384 0.0216957 -0.0663908 0.0778349 -0.0266205 -0.11292 -0.000433323 0.0629814 0.0353525 -0.0131765 0.0593617 0.0699911 -0.076883 -0.0197294 -0.0564796 -0.0288477 
0.109978 -0.0465602 -0.120325 -0.0894611 0.0513231 0.188697 0.00785111 0.032917 -0.0260255 -0.114893 0.0245927 0.0953118 0.119559 -0.0904224 -0.0917652 -0.0720046 -0.110206 0.0529239 -0.172838 0.163057 0.0993764 0.0234355 0.0926287 0.13279 -0.154054 -0.0343007 0.0106568 -0.164397 -0.093354 0.0275678 -0.0871565 -0.0443894 -0.0490282 0.136029 -0.0258698 0.0292395 -0.0165378 0.0612529 -0.138534 0.00574642 0.019802 -0.0344738 -0.0611391 0.133898 -0.184519 -0.0734426 0.110945 0.0703304 -0.103852 0.247749 -0.0187305 -0.161381 -0.0799841 0.113444 0.109963 -0.0115324 -0.00944098 0.122231 0.00488967 -0.143988 -0.0269121 0.0822637 0.215813 -0.0714446 -0.0220295 -0.145807 0.0353305 0.0499963 -0.022021 0.0583251 -0.0133726 -0.000357039 0.0274375 0.0170976 -0.0228478 -0.00733531 -0.0659734 -0.00925543 0.0429202 0.00533699 0.0224299 0.0714484 -0.0610568 -0.0741899 -0.107821 0.0995553 0.0722618 0.00294172 0.0413646 0.0947732 0.152788 -0.209267 -0.0510377 -0.0658213 -0.0580159 -0.0350972 -0.0812436 0.0452096 -0.00184364 -0.0338941 0.0603668 0.0254244 -0.019063 0.0560555 -0.0739571 0.0157109 -0.166179 0.0542945 -0.183476 0.0182111 0.103319 0.137368 0.00730384 0.0216957 -0.0663908 0.0778349 -0.0266205 -0.11292 -0.000433323 0.0629814 0.0353525 -0.0131765 0.0593617 0.0699911 -0.076883 -0.0197294 -0.0564796 -0.0288477 
0.109978 -0.0465602 -0.120325 -0.0894611 0.0513231 0.188697 0.00785111 0.032917 -0.0260255 -0.114893 0.0245927 0.0953118 0.119559 -0.0904224 -0.0917652 -0.0720046 -0.110206 0.0529239 -0.172838 0.163057 0.0993764 0.0234355 0.0926287 0.13279 -0.154054 -0.0343007 0.0106568 -0.164397 -0.093354 0.0275678 -0.0871565 -0.0443894 -0.0490282 0.136029 -0.0258698 0.0292395 -0.0165378 0.0612529 -0.138534 0.00574642 0.019802 -0.0344738 -0.0611391 0.133898 -0.184519 -0.0734426 0.110945 0.0703304 -0.103852 0.247749 -0.0187305 -0.161381 -0.0799841 0.113444 0.109963 -0.0115324 -0.00944098 0.122231 0.00488967 -0.143988 -0.0269121 0.0822637 0.215813 -0.0714446 -0.0220295 -0.145807 0.0353305 0.0499963 -0.022021 0.0583251 -0.0133726 -0.000357039 0.0274375 0.0170976 -0.0228478 -0.00733531 -0.0659734 -0.00925543 0.0429202 0.00533699 0.0224299 0.0714484 -0.0610568 -0.0741899 -0.107821 0.0995553 0.0722618 0.00294172 0.0413646 0.0947732 0.152788 -0.209267 -0.0510377 -0.0658213 -0.0580159 -0.0350972 -0.0812436 0.0452096 -0.00184364 -0.0338941 0.0603668 0.0254244 -0.019063 0.0560555 -0.0739571 0.0157109 -0.166179 0.0542945 -0.183476 0.0182111 0.103319 0.137368 0.00730384 0.0216957 -0.0663908 0.0778349 -0.0266205 -0.11292 -0.000433323 0.0629814 0.0353525 -0.0131765 0.0593617 0.0699911 -0.076883 -0.0197294 -0.0564796 -0.0288477 
0.109978 -0.0465602 -0.120325 -0.0894611 0.0513231 0.188697 0.00785111 0.032917 -0.0260255 -0.114893 0.0245927 0.0953118 0.119559 -0.0904224 -0.0917652 -0.0720046 -0.110206 0.0529239 -0.172838 0.163057 0.0993764 0.0234355 0.0926287 0.13279 -0.154054 -0.0343007 0.0106568 -0.164397 -0.093354 0.0275678 -0.0871565 -0.0443894 -0.0490282 0.136029 -0.0258698 0.0292395 -0.0165378 0.0612529 -0.138534 0.00574642 0.019802 -0.0344738 -0.0611391 0.133898 -0.184519 -0.0734426 0.110945 0.0703304 -0.103852 0.247749 -0.0187305 -0.161381 -0.0799841 0.113444 0.109963 -0.0115324 -0.00944098 0.122231 0.00488967 -0.143988 -0.0269121 0.0822637 0.215813 -0.0714446 -0.0220295 -0.145807 0.0353305 0.0499963 -0.022021 0.0583251 -0.0133726 -0.000357039 0.0274375 0.0170976 -0.0228478 -0.00733531 -0.0659734 -0.00925543 0.0429202 0.00533699 0.0224299 0.0714484 -0.0610568 -0.0741899 -0.107821 0.0995553 0.0722618 0.00294172 0.0413646 0.0947732 0.152788 -0.209267 -0.0510377 -0.0658213 -0.0580159 -0.0350972 -0.0812436 0.0452096 -0.00184364 -0.0338941 0.0603668 0.0254244 -0.019063 0.0560555 -0.0739571 0.0157109 -0.166179 0.0542945 -0.183476 0.0182111 0.103319 0.137368 0.00730384 0.0216957 -0.0663908 0.0778349 -0.0266205 -0.11292 -0.000433323 0.0629814 0.0353525 -0.0131765 0.0593617 0.0699911 -0.076883 -0.0197294 -0.0564796 -0.0288477 
0.109978 -0.0465602 -0.120325 -0.0894611 0.0513231 0.188697 0.00785111 0.032917 -0.0260255 -0.114893 0.0245927 0.0953118 0.119559 -0.0904224 -0.0917652 -0.0720046 -0.110206 0.0529239 -0.172838 0.163057 0.0993764 0.0234355 0.0926287 0.13279 -0.154054 -0.0343007 0.0106568 -0.164397 -0.093354 0.0275678 -0.0871565 -0.0443894 -0.0490282 0.136029 -0.0258698 0.0292395 -0.0165378 0.0612529 -0.138534 0.00574642 0.019802 -0.0344738 -0.0611391 0.133898 -0.184519 -0.0734426 0.110945 0.0703304 -0.103852 0.247749 -0.0187305 -0.161381 -0.0799841 0.113444 0.109963 -0.0115324 -0.00944098 0.122231 0.00488967 -0.143988 -0.0269121 0.0822637 0.215813 -0.0714446 -0.0220295 -0.145807 0.0353305 0.0499963 -0.022021 0.0583251 -0.0133726 -0.000357039 0.0274375 0.0170976 -0.0228478 -0.00733531 -0.0659734 -0.00925543 0.0429202 0.00533699 0.0224299 0.0714484 -0.0610568 -0.0741899 -0.107821 0.0995553 0.0722618 0.00294172 0.0413646 0.0947732 0.152788 -0.209267 -0.0510377 -0.0658213 -0.0580159 -0.0350972 -0.0812436 0.0452096 -0.00184364 -0.0338941 0.0603668 0.0254244 -0.019063 0.0560555 -0.0739571 0.0157109 -0.166179 0.0542945 -0.183476 0.0182111 0.103319 0.137368 0.00730384 0.0216957 -0.0663908 0.0778349 -0.0266205 -0.11292 -0.000433323 0.0629814 0.0353525 -0.0131765 0.0593617 0.0699911 -0.076883 -0.0197294 -0.0564796 -0.0288477 
0.109978 -0.0465602 -0.120325 -0.0894611 0.0513231 0.188697 0.00785111 0.032917 -0.0260255 -0.114893 0.0245927 0.0953118 0.119559 -0.0904224 -0.0917652 -0.0720046 -0.110206 0.0529239 -0.172838 0.163057 0.0993764 0.0234355 0.0926287 0.13279 -0.154054 -0.0343007 0.0106568 -0.164397 -0.093354 0.0275678 -0.0871565 -0.0443894 -0.0490282 0.136029 -0.0258698 0.0292395 -0.0165378 0.0612529 -0.138534 0.00574642 0.019802 -0.0344738 -0.0611391 0.133898 -0.184519 -0.0734426 0.110945 0.0703304 -0.103852 0.247749 -0.0187305 -0.161381 -0.0799841 0.113444 0.109963 -0.0115324 -0.00944098 0.122231 0.00488967 -0.143988 -0.0269121 0.0822637 0.215813 -0.0714446 -0.0220295 -0.145807 0.0353305 0.0499963 -0.022021 0.0583251 -0.0133726 -0.000357039 0.0274375 0.0170976 -0.0228478 -0.00733531 -0.0659734 -0.00925543 0.0429202 0.00533699 0.0224299 0.0714484 -0.0610568 -0.0741899 -0.107821 0.0995553 0.0722618 0.00294172 0.0413646 0.0947732 0.152788 -0.209267 -0.0510377 -0.0658213 -0.0580159 -0.0350972 -0.0812436 0.0452096 -0.00184364 -0.0338941 0.0603668 0.0254244 -0.019063 0.0560555 -0.0739571 0.0157109 -0.166179 0.0542945 -0.183476 0.0182111 0.103319 0.137368 0.00730384 0.0216957 -0.0663908 0.0778349 -0.0266205 -0.11292 -0.000433323 0.0629814 0.0353525 -0.0131765 0.0593617 0.0699911 -0.076883 -0.0197294 -0.0564796 -0.0288477 
0.109978 -0.0465602 -0.120325 -0.0894611 0.0513231 0.188697 0.00785111 0.032917 -0.0260255 -0.114893 0.0245927 0.0953118 0.119559 -0.0904224 -0.0917652 -0.0720046 -0.110206 0.0529239 -0.172838 0.163057 0.0993764 0.0234355 0.0926287 0.13279 -0.154054 -0.0343007 0.0106568 -0.164397 -0.093354 0.0275678 -0.0871565 -0.0443894 -0.0490282 0.136029 -0.0258698 0.0292395 -0.0165378 0.0612529 -0.138534 0.00574642 0.019802 -0.0344738 -0.0611391 0.133898 -0.184519 -0.0734426 0.110945 0.0703304 -0.103852 0.247749 -0.0187305 -0.161381 -0.0799841 0.113444 0.109963 -0.0115324 -0.00944098 0.122231 0.00488967 -0.143988 -0.0269121 0.0822637 0.215813 -0.0714446 -0.0220295 -0.145807 0.0353305 0.0499963 -0.022021 0.0583251 -0.0133726 -0.000357039 0.0274375 0.0170976 -0.0228478 -0.00733531 -0.0659734 -0.00925543 0.0429202 0.00533699 0.0224299 0.0714484 -0.0610568 -0.0741899 -0.107821 0.0995553 0.0722618 0.00294172 0.0413646 0.0947732 0.152788 -0.209267 -0.0510377 -0.0658213 -0.0580159 -0.0350972 -0.0812436 0.0452096 -0.00184364 -0.0338941 0.0603668 0.0254244 -0.019063 0.0560555 -0.0739571 0.0157109 -0.166179 0.0542945 -0.183476 0.0182111 0.103319 0.137368 0.00730384 0.0216957 -0.0663908 0.0778349 -0.0266205 -0.11292 -0.000433323 0.0629814 0.0353525 -0.0131765 0.0593617 0.0699911 -0.076883 -0.0197294 -0.0564796 -0.0288477 
0.109978 -0.0465602 -0.120325 -0.0894611 0.0513231 0.188697 0.00785111 0.032917 -0.0260255 -0.114893 0.0245927 0.0953118 0.119559 -0.0904224 -0.0917652 -0.0720046 -0.110206 0.0529239 -0.172838 0.163057 0.0993764 0.0234355 0.0926287 0.13279 -0.154054 -0.0343007 0.0106568 -0.164397 -0.093354 0.0275678 -0.0871565 -0.0443894 -0.0490282 0.136029 -0.0258698 0.0292395 -0.0165378 0.0612529 -0.138534 0.00574642 0.019802 -0.0344738 -0.0611391 0.133898 -0.184519 -0.0734426 0.110945 0.0703304 -0.103852 0.247749 -0.0187305 -0.161381 -0.0799841 0.113444 0.109963 -0.0115324 -0.00944098 0.122231 0.00488967 -0.143988 -0.0269121 0.0822637 0.215813 -0.0714446 -0.0220295 -0.145807 0.0353305 0.0499963 -0.022021 0.0583251 -0.0133726 -0.000357039 0.0274375 0.0170976 -0.0228478 -0.00733531 -0.0659734 -0.00925543 0.0429202 0.00533699 0.0224299 0.0714484 -0.0610568 -0.0741899 -0.107821 0.0995553 0.0722618 0.00294172 0.0413646 0.0947732 0.152788 -0.209267 -0.0510377 -0.0658213 -0.0580159 -0.0350972 -0.0812436 0.0452096 -0.00184364 -0.0338941 0.0603668 0.0254244 -0.019063 0.0560555 -0.0739571 0.0157109 -0.166179 0.0542945 -0.183476 0.0182111 0.103319 0.137368 0.00730384 0.0216957 -0.0663908 0.0778349 -0.0266205 -0.11292 -0.000433323 0.0629814 0.0353525 -0.0131765 0.0593617 0.0699911 -0.076883 -0.0197294 -0.0564796 -0.0288477 
0.109978 -0.0465602 -0.120325 -0.0894611 0.0513231 0.188697 0.00785111 0.032917 -0.0260255 -0.114893 0.0245927 0.0953118 0.119559 -0.0904224 -0.0917652 -0.0720046 -0.110206 0.0529239 -0.172838 0.163057 0.0993764 0.0234355 0.0926287 0.13279 -0.154054 -0.0343007 0.0106568 -0.164397 -0.093354 0.0275678 -0.0871565 -0.0443894 -0.0490282 0.136029 -0.0258698 0.0292395 -0.0165378 0.0612529 -0.138534 0.00574642 0.019802 -0.0344738 -0.0611391 0.133898 -0.184519 -0.0734426 0.110945 0.0703304 -0.103852 0.247749 -0.0187305 -0.161381 -0.0799841 0.113444 0.109963 -0.0115324 -0.00944098 0.122231 0.00488967 -0.143988 -0.0269121 0.0822637 0.215813 -0.0714446 -0.0220295 -0.145807 0.0353305 0.0499963 -0.022021 0.0583251 -0.0133726 -0.000357039 0.0274375 0.0170976 -0.0228478 -0.00733531 -0.0659734 -0.00925543 0.0429202 0.00533699 0.0224299 0.0714484 -0.0610568 -0.0741899 -0.107821 0.0995553 0.0722618 0.00294172 0.0413646 0.0947732 0.152788 -0.209267 -0.0510377 -0.0658213 -0.0580159 -0.0350972 -0.0812436 0.0452096 -0.00184364 -0.0338941 0.0603668 0.0254244 -0.019063 0.0560555 -0.0739571 0.0157109 -0.166179 0.0542945 -0.183476 0.0182111 0.103319 0.137368 0.00730384 0.0216957 -0.0663908 0.0778349 -0.0266205 -0.11292 -0.000433323 0.0629814 0.0353525 -0.0131765 0.0593617 0.0699911 -0.076883 -0.0197294 -0.0564796 -0.0288477 
0.109978 -0.0465602 -0.120325 -0.0894611 0.0513231 0.188697 0.00785111 0.032917 -0.0260255 -0.114893 0.0245927 0.0953118 0.119559 -0.0904224 -0.0917652 -0.0720046 -0.110206 0.0529239 -0.172838 0.163057 0.0993764 0.0234355 0.0926287 0.13279 -0.154054 -0.0343007 0.0106568 -0.164397 -0.093354 0.0275678 -0.0871565 -0.0443894 -0.0490282 0.136029 -0.0258698 0.0292395 -0.0165378 0.0612529 -0.138534 0.00574642 0.019802 -0.0344738 -0.0611391 0.133898 -0.184519 -0.0734426 0.110945 0.0703304 -0.103852 0.247749 -0.0187305 -0.161381 -0.0799841 0.113444 0.109963 -0.0115324 -0.00944098 0.122231 0.00488967 -0.143988 -0.0269121 0.0822637 0.215813 -0.0714446 -0.0220295 -0.145807 0.0353305 0.0499963 -0.022021 0.0583251 -0.0133726 -0.000357039 0.0274375 0.0170976 -0.0228478 -0.00733531 -0.0659734 -0.00925543 0.0429202 0.00533699 0.0224299 0.0714484 -0.0610568 -0.0741899 -0.107821 0.0995553 0.0722618 0.00294172 0.0413646 0.0947732 0.152788 -0.209267 -0.0510377 -0.0658213 -0.0580159 -0.0350972 -0.0812436 0.0452096 -0.00184364 -0.0338941 0.0603668 0.0254244 -0.019063 0.0560555 -0.0739571 0.0157109 -0.166179 0.0542945 -0.183476 0.0182111 0.103319 0.137368 0.00730384 0.0216957 -0.0663908 0.0778349 -0.0266205 -0.11292 -0.000433323 0.0629814 0.0353525 -0.0131765 0.0593617 0.0699911 -0.076883 -0.0197294 -0.0564796 -0.0288477 
0.109978 -0.0465602 -0.120325 -0.0894611 0.0513231 0.188697 0.00785111 0.032917 -0.0260255 -0.114893 0.0245927 0.0953118 0.119559 -0.0904224 -0.0917652 -0.0720046 -0.110206 0.0529239 -0.172838 0.163057 0.0993764 0.0234355 0.0926287 0.13279 -0.154054 -0.0343007 0.0106568 -0.164397 -0.093354 0.0275678 -0.0871565 -0.0443894 -0.0490282 0.136029 -0.0258698 0.0292395 -0.0165378 0.0612529 -0.138534 0.00574642 0.019802 -0.0344738 -0.0611391 0.133898 -0.184519 -0.0734426 0.110945 0.0703304 -0.103852 0.247749 -0.0187305 -0.161381 -0.0799841 0.113444 0.109963 -0.0115324 -0.00944098 0.122231 0.00488967 -0.143988 -0.0269121 0.0822637 0.215813 -0.0714446 -0.0220295 -0.145807 0.0353305 0.0499963 -0.022021 0.0583251 -0.0133726 -0.000357039 0.0274375 0.0170976 -0.0228478 -0.00733531 -0.0659734 -0.00925543 0.0429202 0.00533699 0.0224299 0.0714484 -0.0610568 -0.0741899 -0.107821 0.0995553 0.0722618 0.00294172 0.0413646 0.0947732 0.152788 -0.209267 -0.0510377 -0.0658213 -0.0580159 -0.0350972 -0.0812436 0.0452096 -0.00184364 -0.0338941 0.0603668 0.0254244 -0.019063 0.0560555 -0.0739571 0.0157109 -0.166179 0.0542945 -0.183476 0.0182111 0.103319 0.137368 0.00730384 0.0216957 -0.0663908 0.0778349 -0.0266205 -0.11292 -0.000433323 0.0629814 0.0353525 -0.0131765 0.0593617 0.0699911 -0.076883 -0.0197294 -0.0564796 -0.0288477 
0.109978 -0.0465602 -0.120325 -0.0894611 0.0513231 0.188697 0.00785111 0.032917 -0.0260255 -0.114893 0.0245927 0.0953118 0.119559 -0.0904224 -0.0917652 -0.0720046 -0.110206 0.0529239 -0.172838 0.163057 0.0993764 0.0234355 0.0926287 0.13279 -0.154054 -0.0343007 0.0106568 -0.164397 -0.093354 0.0275678 -0.0871565 -0.0443894 -0.0490282 0.136029 -0.0258698 0.0292395 -0.0165378 0.0612529 -0.138534 0.00574642 0.019802 -0.0344738 -0.0611391 0.133898 -0.184519 -0.0734426 0.110945 0.0703304 -0.103852 0.247749 -0.0187305 -0.161381 -0.0799841 0.113444 0.109963 -0.0115324 -0.00944098 0.122231 0.00488967 -0.143988 -0.0269121 0.0822637 0.215813 -0.0714446 -0.0220295 -0.145807 0.0353305 0.0499963 -0.022021 0.0583251 -0.0133726 -0.000357039 0.0274375 0.0170976 -0.0228478 -0.00733531 -0.0659734 -0.00925543 0.0429202 0.00533699 0.0224299 0.0714484 -0.0610568 -0.0741899 -0.107821 0.0995553 0.0722618 0.00294172 0.0413646 0.0947732 0.152788 -0.209267 -0.0510377 -0.0658213 -0.0580159 -0.0350972 -0.0812436 0.0452096 -0.00184364 -0.0338941 0.0603668 0.0254244 -0.019063 0.0560555 -0.0739571 0.0157109 -0.166179 0.0542945 -0.183476 0.0182111 0.103319 0.137368 0.00730384 0.0216957 -0.0663908 0.0778349 -0.0266205 -0.11292 -0.000433323 0.0629814 0.0353525 -0.0131765 0.0593617 0.0699911 -0.076883 -0.0197294 -0.0564796 -0.0288477 
0.109978 -0.0465602 -0.120325 -0.0894611 0.0513231 0.188697 0.00785111 0.032917 -0.0260255 -0.114893 0.0245927 0.0953118 0.119559 -0.0904224 -0.0917652 -0.0720046 -0.110206 0.0529239 -0.172838 0.163057 0.0993764 0.0234355 0.0926287 0.13279 -0.154054 -0.0343007 0.0106568 -0.164397 -0.093354 0.0275678 -0.0871565 -0.0443894 -0.0490282 0.136029 -0.0258698 0.0292395 -0.0165378 0.0612529 -0.138534 0.00574642 0.019802 -0.0344738 -0.0611391 0.133898 -0.184519 -0.0734426 0.110945 0.0703304 -0.103852 0.247749 -0.0187305 -0.161381 -0.0799841 0.113444 0.109963 -0.0115324 -0.00944098 0.122231 0.00488967 -0.143988 -0.0269121 0.0822637 0.215813 -0.0714446 -0.0220295 -0.145807 0.0353305 0.0499963 -0.022021 0.0583251 -0.0133726 -0.000357039 0.0274375 0.0170976 -0.0228478 -0.00733531 -0.0659734 -0.00925543 0.0429202 0.00533699 0.0224299 0.0714484 -0.0610568 -0.0741899 -0.107821 0.0995553 0.0722618 0.00294172 0.0413646 0.0947732 0.152788 -0.209267 -0.0510377 -0.0658213 -0.0580159 -0.0350972 -0.0812436 0.0452096 -0.00184364 -0.0338941 0.0603668 0.0254244 -0.019063 0.0560555 -0.0739571 0.0157109 -0.166179 0.0542945 -0.183476 0.0182111 0.103319 0.137368 0.00730384 0.0216957 -0.0663908 0.0778349 -0.0266205 -0.11292 -0.000433323 0.0629814 0.0353525 -0.0131765 0.0593617 0.0699911 -0.076883 -0.0197294 -0.0564796 -0.0288477 
0.109978 -0.0465602 -0.120325 -0.0894611 0.0513231 0.188697 0.00785111 0.032917 -0.0260255 -0.114893 0.0245927 0.0953118 0.119559 -0.0904224 -0.0917652 -0.0720046 -0.110206 0.0529239 -0.172838 0.163057 0.0993764 0.0234355 0.0926287 0.13279 -0.154054 -0.0343007 0.0106568 -0.164397 -0.093354 0.0275678 -0.0871565 -0.0443894 -0.0490282 0.136029 -0.0258698 0.0292395 -0.0165378 0.0612529 -0.138534 0.00574642 0.019802 -0.0344738 -0.0611391 0.133898 -0.184519 -0.0734426 0.110945 0.0703304 -0.103852 0.247749 -0.0187305 -0.161381 -0.0799841 0.113444 0.109963 -0.0115324 -0.00944098 0.122231 0.00488967 -0.143988 -0.0269121 0.0822637 0.215813 -0.0714446 -0.0220295 -0.145807 0.0353305 0.0499963 -0.022021 0.0583251 -0.0133726 -0.000357039 0.0274375 0.0170976 -0.0228478 -0.00733531 -0.0659734 -0.00925543 0.0429202 0.00533699 0.0224299 0.0714484 -0.0610568 -0.0741899 -0.107821 0.0995553 0.0722618 0.00294172 0.0413646 0.0947732 0.152788 -0.209267 -0.0510377 -0.0658213 -0.0580159 -0.0350972 -0.0812436 0.0452096 -0.00184364 -0.0338941 0.0603668 0.0254244 -0.019063 0.0560555 -0.0739571 0.0157109 -0.166179 0.0542945 -0.183476 0.0182111 0.103319 0.137368 0.00730384 0.0216957 -0.0663908 0.0778349 -0.0266205 -0.11292 -0.000433323 0.0629814 0.0353525 -0.0131765 0.0593617 0.0699911 -0.076883 -0.0197294 -0.0564796 -0.0288477 
0.109978 -0.0465602 -0.120325 -0.0894611 0.0513231 0.188697 0.00785111 0.032917 -0.0260255 -0.114893 0.0245927 0.0953118 0.119559 -0.0904224 -0.0917652 -0.0720046 -0.110206 0.0529239 -0.172838 0.163057 0.0993764 0.0234355 0.0926287 0.13279 -0.154054 -0.0343007 0.0106568 -0.164397 -0.093354 0.0275678 -0.0871565 -0.0443894 -0.0490282 0.136029 -0.0258698 0.0292395 -0.0165378 0.0612529 -0.138534 0.00574642 0.019802 -0.0344738 -0.0611391 0.133898 -0.184519 -0.0734426 0.110945 0.0703304 -0.103852 0.247749 -0.0187305 -0.161381 -0.0799841 0.113444 0.109963 -0.0115324 -0.00944098 0.122231 0.00488967 -0.143988 -0.0269121 0.0822637 0.215813 -0.0714446 -0.0220295 -0.145807 0.0353305 0.0499963 -0.022021 0.0583251 -0.0133726 -0.000357039 0.0274375 0.0170976 -0.0228478 -0.00733531 -0.0659734 -0.00925543 0.0429202 0.00533699 0.0224299 0.0714484 -0.0610568 -0.0741899 -0.107821 0.0995553 0.0722618 0.00294172 0.0413646 0.0947732 0.152788 -0.209267 -0.0510377 -0.0658213 -0.0580159 -0.0350972 -0.0812436 0.0452096 -0.00184364 -0.0338941 0.0603668 0.0254244 -0.019063 0.0560555 -0.0739571 0.0157109 -0.166179 0.0542945 -0.183476 0.0182111 0.103319 0.137368 0.00730384 0.0216957 -0.0663908 0.0778349 -0.0266205 -0.11292 -0.000433323 0.0629814 0.0353525 -0.0131765 0.0593617 0.0699911 -0.076883 -0.0197294 -0.0564796 -0.0288477 
0.109978 -0.0465602 -0.120325 -0.0894611 0.0513231 0.188697 0.00785111 0.032917 -0.0260255 -0.114893 0.0245927 0.0953118 0.119559 -0.0904224 -0.0917652 -0.0720046 -0.110206 0.0529239 -0.172838 0.163057 0.0993764 0.0234355 0.0926287 0.13279 -0.154054 -0.0343007 0.0106568 -0.164397 -0.093354 0.0275678 -0.0871565 -0.0443894 -0.0490282 0.136029 -0.0258698 0.0292395 -0.0165378 0.0612529 -0.138534 0.00574642 0.019802 -0.0344738 -0.0611391 0.133898 -0.184519 -0.0734426 0.110945 0.0703304 -0.103852 0.247749 -0.0187305 -0.161381 -0.0799841 0.113444 0.109963 -0.0115324 -0.00944098 0.122231 0.00488967 -0.143988 -0.0269121 0.0822637 0.215813 -0.0714446 -0.0220295 -0.145807 0.0353305 0.0499963 -0.022021 0.0583251 -0.0133726 -0.000357039 0.0274375 0.0170976 -0.0228478 -0.00733531 -0.0659734 -0.00925543 0.0429202 0.00533699 0.0224299 0.0714484 -0.0610568 -0.0741899 -0.107821 0.0995553 0.0722618 0.00294172 0.0413646 0.0947732 0.152788 -0.209267 -0.0510377 -0.0658213 -0.0580159 -0.0350972 -0.0812436 0.0452096 -0.00184364 -0.0338941 0.0603668 0.0254244 -0.019063 0.0560555 -0.0739571 0.0157109 -0.166179 0.0542945 -0.183476 0.0182111 0.103319 0.137368 0.00730384 0.0216957 -0.0663908 0.0778349 -0.0266205 -0.11292 -0.000433323 0.0629814 0.0353525 -0.0131765 0.0593617 0.0699911 -0.076883 -0.0197294 -0.0564796 -0.0288477 
0.109978 -0.0465602 -0.120325 -0.0894611 0.0513231 0.188697 0.00785111 0.032917 -0.0260255 -0.114893 0.0245927 0.0953118 0.119559 -0.0904224 -0.0917652 -0.0720046 -0.110206 0.0529239 -0.172838 0.163057 0.0993764 0.0234355 0.0926287 0.13279 -0.154054 -0.0343007 0.0106568 -0.164397 -0.093354 0.0275678 -0.0871565 -0.0443894 -0.0490282 0.136029 -0.0258698 0.0292395 -0.0165378 0.0612529 -0.138534 0.00574642 0.019802 -0.0344738 -0.0611391 0.133898 -0.184519 -0.0734426 0.110945 0.0703304 -0.103852 0.247749 -0.0187305 -0.161381 -0.0799841 0.113444 0.109963 -0.0115324 -0.00944098 0.122231 0.00488967 -0.143988 -0.0269121 0.0822637 0.215813 -0.0714446 -0.0220295 -0.145807 0.0353305 0.0499963 -0.022021 0.0583251 -0.0133726 -0.000357039 0.0274375 0.0170976 -0.0228478 -0.00733531 -0.0659734 -0.00925543 0.0429202 0.00533699 0.0224299 0.0714484 -0.0610568 -0.0741899 -0.107821 0.0995553 0.0722618 0.00294172 0.0413646 0.0947732 0.152788 -0.209267 -0.0510377 -0.0658213 -0.0580159 -0.0350972 -0.0812436 0.0452096 -0.00184364 -0.0338941 0.0603668 0.0254244 -0.019063 0.0560555 -0.0739571 0.0157109 -0.166179 0.0542945 -0.183476 0.0182111 0.103319 0.137368 0.00730384 0.0216957 -0.0663908 0.0778349 -0.0266205 -0.11292 -0.000433323 0.0629814 0.0353525 -0.0131765 0.0593617 0.0699911 -0.076883 -0.0197294 -0.0564796 -0.0288477 
0.109978 -0.0465602 -0.120325 -0.0894611 0.0513231 0.188697 0.00785111 0.032917 -0.0260255 -0.114893 0.0245927 0.0953118 0.119559 -0.0904224 -0.0917652 -0.0720046 -0.110206 0.0529239 -0.172838 0.163057 0.0993764 0.0234355 0.0926287 0.13279 -0.154054 -0.0343007 0.0106568 -0.164397 -0.093354 0.0275678 -0.0871565 -0.0443894 -0.0490282 0.136029 -0.0258698 0.0292395 -0.0165378 0.0612529 -0.138534 0.00574642 0.019802 -0.0344738 -0.0611391 0.133898 -0.184519 -0.0734426 0.110945 0.0703304 -0.103852 0.247749 -0.0187305 -0.161381 -0.0799841 0.113444 0.109963 -0.0115324 -0.00944098 0.122231 0.00488967 -0.143988 -0.0269121 0.0822637 0.215813 -0.0714446 -0.0220295 -0.145807 0.0353305 0.0499963 -0.022021 0.0583251 -0.0133726 -0.000357039 0.0274375 0.0170976 -0.0228478 -0.00733531 -0.0659734 -0.00925543 0.0429202 0.00533699 0.0224299 0.0714484 -0.0610568 -0.0741899 -0.107821 0.0995553 0.0722618 0.00294172 0.0413646 0.0947732 0.152788 -0.209267 -0.0510377 -0.0658213 -0.0580159 -0.0350972 -0.0812436 0.0452096 -0.00184364 -0.0338941 0.0603668 0.0254244 -0.019063 0.0560555 -0.0739571 0.0157109 -0.166179 0.0542945 -0.183476 0.0182111 0.103319 0.137368 0.00730384 0.0216957 -0.0663908 0.0778349 -0.0266205 -0.11292 -0.000433323 0.0629814 0.0353525 -0.0131765 0.0593617 0.0699911 -0.076883 -0.0197294 -0.0564796 -0.0288477 
