{
  "descriptor": [
    -0.07790147513151169,
    0.05276957154273987,
    0.08063144236803055,
    -0.04761775955557823,
    -0.18309670686721802,
    0.05179360508918762,
    -0.09837781637907028,
    -0.02021227590739727,
    0.16512879729270935,
    -0.15417177975177765,
    0.1616060584783554,
    -0.00448447372764349,
    -0.2058655470609665,
    0.09879440069198608,
    -0.07150576263666153,
    0.14897359907627106,
    -0.1652470827102661,
    -0.18786725401878357,
    -0.026284227147698402,
    -0.05672706663608551,
    -0.014397009275853634,
    0.1030554547905922,
    -0.013005816377699375,
    0.06717535853385925,
    -0.14791855216026306,
    -0.3885590136051178,
    -0.07988050580024719,
    -0.08237793296575546,
    0.06671524047851562,
    -0.11326959729194641,
    -0.08486922085285187,
    0.09750790894031525,
    -0.1232098862528801,
    0.02743687853217125,
    0.09231852740049362,
    0.05198344588279724,
    -0.03583633527159691,
    -0.13447265326976776,
    0.2357463836669922,
    0.09232821315526962,
    -0.24821819365024567,
    -0.03157219663262367,
    0.08302073180675507,
    0.266798198223114,
    0.19996057450771332,
    -0.008527480065822601,
    0.03826827183365822,
    -0.07539919763803482,
    0.17819811403751373,
    -0.2847746014595032,
    0.02670585736632347,
    0.20278845727443695,
    0.05442947894334793,
    0.06680332124233246,
    0.0677732527256012,
    -0.12962374091148376,
    -0.02604120783507824,
    0.09765024483203888,
    -0.11935977637767792,
    0.05006973817944527,
    0.05369723215699196,
    -0.06487254053354263,
    -0.014551663771271706,
    -0.08968711644411087,
    0.17490112781524658,
    0.0911020040512085,
    -0.1002495139837265,
    -0.14194761216640472,
    0.23486191034317017,
    -0.17092742025852203,
    -0.08639468252658844,
    0.05828120931982994,
    -0.12262856215238571,
    -0.16993016004562378,
    -0.1962609738111496,
    0.020882198587059975,
    0.3770734965801239,
    0.15966323018074036,
    -0.08309241384267807,
    0.08054816722869873,
    0.025202961638569832,
    -0.05648377910256386,
    -0.01961914263665676,
    0.16103388369083405,
    -0.12152180820703506,
    0.016967639327049255,
    -0.00789429061114788,
    0.06912832707166672,
    0.27421122789382935,
    0.032037053257226944,
    0.032611165195703506,
    0.197745680809021,
    -0.009469911456108093,
    0.0487087182700634,
    0.10391730070114136,
    0.11279571056365967,
    -0.12764407694339752,
    -0.07594241201877594,
    -0.17650237679481506,
    -0.004812484607100487,
    -0.007002923637628555,
    -0.05137336999177933,
    0.0008872002363204956,
    0.178343266248703,
    -0.18303145468235016,
    0.13815422356128693,
    -0.09644748270511627,
    -0.0888202115893364,
    -0.024273648858070374,
    0.011151786893606186,
    -0.05141519010066986,
    -0.022475140169262886,
    0.13321031630039215,
    -0.17364221811294556,
    0.09835086762905121,
    0.13127075135707855,
    0.07317343354225159,
    0.13867327570915222,
    0.08304736018180847,
    0.02138437330722809,
    0.011170373298227787,
    -0.06727050989866257,
    -0.17813964188098907,
    -0.12056131660938263,
    0.05111757293343544,
    -0.06286118924617767,
    -0.035645607858896255,
    -0.018933773040771484
  ]
}