0.0725969 -0.0419187 0.0229368 0.0466623 0.127935 0.164482 0.165541 -0.00670522 0.0400174 -0.0734032 0.036328 0.0779093 0.1018 -0.073875 0.00457296 -0.0597066 -0.09088 0.124119 -0.208325 0.0738707 0.181573 -0.0721167 0.015816 0.256802 0.0132635 -0.182291 -0.184244 -0.183891 0.0184811 0.0842085 0.0788193 0.0518921 -0.152473 0.108206 -0.0147789 0.0207843 -0.0883794 -0.0114983 -0.0786399 0.0051029 0.135864 -0.0106105 -0.0620256 0.047133 -0.122185 -0.14873 0.0357494 0.0399192 -0.00587223 0.0209277 -0.0104806 -0.142581 -0.0486647 -0.0376023 0.0599568 0.0712338 -0.0573815 0.220211 -0.00261829 -0.0328498 -0.0587009 0.0887725 0.100332 -0.120332 0.0159785 -0.0350854 0.0354936 -0.0432022 -0.12174 0.05693 0.0141162 0.140933 -0.01024 0.0202619 -0.0376331 0.0137396 -0.0273307 0.021508 0.0241232 0.036428 -0.0389851 0.0581013 -0.00263981 -0.0409151 -0.0742581 0.0932407 0.129691 -0.0134397 -0.110858 -0.012061 0.138124 -0.145223 0.00579936 -0.0764678 -0.0921831 -0.0511833 -0.121045 -0.00589323 0.0413447 0.0634578 0.0533603 -0.039744 -0.0137501 0.126011 -0.0311236 0.0384822 -0.0893573 0.0759677 -0.0166343 -0.00612138 -0.0204019 0.0852106 -0.0672622 -0.0351084 0.0150484 0.127405 -0.0559493 0.000452366 -0.0436972 0.165886 0.0197526 0.00268504 -0.139615 0.10471 -0.148331 0.0850852 -0.138503 -0.0162221 
0.0440295 -0.0426708 0.106252 0.0941025 0.0912919 0.158378 0.139442 -0.0463565 0.0619649 -0.0616803 0.0283219 0.0714521 0.0775601 -0.0573247 0.0423621 -0.0735511 -0.119159 0.132066 -0.182291 0.0368812 0.176729 -0.0672044 0.0247097 0.281182 0.0543243 -0.180374 -0.201445 -0.188244 -0.000176788 0.0942272 0.105163 0.0571578 -0.138544 0.105568 0.00246181 0.0243543 -0.0966042 0.000754261 -0.0693897 0.0112043 0.131319 -0.0292203 -0.0797253 0.00778219 -0.109726 -0.176728 0.0218183 0.0154704 0.0253234 0.00533562 0.0345228 -0.109945 0.000832395 -0.0328484 0.0815593 0.0797683 -0.0300847 0.188052 0.0144117 -0.0433943 -0.0660993 0.0751307 0.0438824 -0.11575 0.0250254 -0.00624605 0.0682525 -0.062881 -0.140821 0.0966816 0.0158591 0.158912 -0.0166972 0.030005 -0.0231702 -0.00134792 -0.048952 -0.0143364 0.0318933 0.0829281 -0.0359341 0.0636608 0.0251495 -0.0465324 -0.0474313 0.0470065 0.131096 -0.00964395 -0.122715 -0.0154572 0.0978137 -0.119251 0.0619067 -0.0724238 -0.134912 -0.0632168 -0.130876 -0.00296779 0.0757467 0.0625482 0.0768377 -0.0253044 -0.0162272 0.106419 0.00815696 0.0243859 -0.0642662 0.0306442 0.0140778 0.00150913 -0.0483086 0.0902977 -0.0738517 -0.0647934 0.0329221 0.134798 -0.0457795 0.00889636 -0.0548657 0.165828 0.0499623 -0.0023334 -0.159843 0.0631734 -0.121637 0.12281 -0.0837065 0.0306412 
0.0354985 -0.0555919 0.116632 0.113301 0.0768642 0.144253 0.150573 -0.0517117 0.0717945 -0.0615221 0.0104025 0.0763666 0.057749 -0.0848782 0.055446 -0.0619022 -0.118527 0.121217 -0.160521 0.0186292 0.158609 -0.0542611 0.0229995 0.279789 0.0421162 -0.168951 -0.198693 -0.219778 -0.02854 0.0952116 0.100466 0.0904997 -0.124223 0.123597 0.012926 0.00560859 -0.0499342 0.000620411 -0.0619425 0.018117 0.149094 -0.0414079 -0.0631049 -0.0251219 -0.0952391 -0.161889 0.0248387 -0.00459637 0.032485 -0.00329549 0.0536644 -0.145377 0.0327786 -0.0201507 0.0898728 0.0877973 -0.00185254 0.156044 0.0128119 -0.0167254 -0.0515585 0.0666888 0.00143148 -0.141245 0.0576043 -0.0122438 0.0696451 -0.087934 -0.136146 0.0793966 -0.0205801 0.143213 -0.0321987 0.044425 -0.0190816 0.00461366 -0.0356936 -0.00459564 0.0233468 0.0746177 -0.0405861 0.062526 0.0146438 -0.0422766 -0.0422451 0.0416397 0.132202 -0.0271079 -0.158075 -0.0145216 0.0894697 -0.111205 0.0699221 -0.0798233 -0.142484 -0.0237475 -0.12076 -0.016531 0.100439 0.0821967 0.0799663 -0.0435521 -0.0265629 0.120815 0.0457034 -0.0213486 -0.0513953 0.0224155 -0.0289411 0.0241256 -0.0744478 0.0780946 -0.052304 -0.101303 0.0255756 0.129818 -0.0396173 0.00140532 -0.0729872 0.151933 0.0686583 0.0212099 -0.149704 0.0629017 -0.103834 0.118006 -0.100197 0.0112836 
0.0636204 -0.0312659 0.0789678 0.10332 0.15516 0.186675 0.149075 -0.0618256 0.0622808 -0.064564 0.00486362 0.112874 0.0196588 -0.098218 0.0832862 -0.053443 -0.0498816 0.144657 -0.152993 0.0112541 0.115779 0.0131663 0.00507367 0.27014 0.0684255 -0.166837 -0.169033 -0.191199 -0.0205622 0.0770766 0.135683 0.102162 -0.133566 0.11095 0.0381525 0.0227946 -0.0347821 -0.068966 -0.053275 0.0114794 0.186143 0.00788736 -0.0290134 0.00296744 -0.130336 -0.121159 0.0406925 -0.00622874 0.0177349 -0.00789738 0.06988 -0.148662 0.00652113 -0.0680908 0.0680368 0.0956962 -0.0576384 0.203131 0.00875223 0.0176006 -0.0917791 0.0609999 0.0283692 -0.195794 0.0800549 -0.0356818 0.0461764 -0.0822091 -0.16103 0.127214 0.022468 0.166248 -0.0235518 0.0178486 -0.0436965 0.026612 -0.0442696 0.0249655 -0.00773773 0.0132647 -0.0381611 0.127497 0.0223301 -0.0290993 -0.0256297 0.0189554 0.126565 -0.033495 -0.179953 0.0168412 0.0926101 -0.0997854 -0.000248659 -0.0816892 -0.0667775 -0.00448103 -0.0892309 -0.0288873 0.0465746 0.0667139 0.0211449 -0.0518773 -0.0136033 0.105664 -0.0317281 -0.000749918 -0.0587242 -0.0105589 -0.0394007 0.042019 -0.0342706 0.057091 -0.0309287 -0.0691093 0.0368972 0.0563043 -0.0667785 -0.0294327 -0.0609583 0.157684 0.112545 0.0356412 -0.124083 0.0736036 -0.0726724 0.0853448 -0.0836389 -0.0244558 
0.063796 -0.013368 0.0647858 0.090417 0.153979 0.195394 0.134301 -0.0399514 0.0335603 -0.0511573 0.0232341 0.114103 0.0383503 -0.119853 0.0625141 -0.051348 -0.0602339 0.163894 -0.161402 0.0416797 0.141884 -0.0063329 0.00674382 0.281208 0.0642927 -0.17601 -0.161058 -0.190566 -0.000124308 0.0894507 0.11261 0.0725022 -0.126616 0.115695 0.0280102 0.0224964 -0.0552087 -0.0884971 -0.0656871 0.000791403 0.170126 -0.0145094 -0.0178835 0.0399885 -0.141011 -0.134959 0.0730831 0.00451745 -0.0178955 0.0152481 0.0744181 -0.153289 -0.0287896 -0.0679488 0.0682982 0.0985771 -0.0726375 0.197316 0.0112638 0.000668145 -0.0867953 0.0601732 0.056743 -0.176091 0.0710154 -0.0550304 0.0275899 -0.0988498 -0.169857 0.12367 0.0135247 0.15906 -0.0259178 0.00687208 -0.0437086 0.0184169 -0.0362237 0.0505494 0.0022604 0.0147703 -0.0407024 0.110202 0.0177193 -0.0239381 -0.0348845 0.0499525 0.118745 -0.0302943 -0.146676 0.0342004 0.095381 -0.114065 -0.0328241 -0.0734731 -0.071494 -0.0150596 -0.107032 -0.00694202 0.0281419 0.0535162 0.0244834 -0.0396288 -0.00660557 0.101051 -0.0345099 0.0270363 -0.0632242 0.0183897 -0.0350649 0.025079 -0.0349841 0.0612395 -0.0382082 -0.0582216 0.0309465 0.0570681 -0.05154 -0.0299411 -0.0466054 0.1713 0.0960367 0.0157897 -0.124606 0.0759915 -0.0870266 0.0867633 -0.0713958 -0.025108 
0.0359325 -0.0433932 0.108239 0.116681 0.0897509 0.145981 0.143594 -0.0599962 0.0777022 -0.0858763 0.0286333 0.0856966 0.0503822 -0.0872413 0.0289456 -0.0558468 -0.123883 0.125579 -0.183055 0.0318613 0.172456 -0.0688925 0.0139254 0.280987 0.0588603 -0.184429 -0.190615 -0.194024 -0.0222779 0.0966402 0.107538 0.0671782 -0.129107 0.116656 0.00857689 0.0156144 -0.0803145 -0.0251974 -0.0664153 0.0109214 0.146818 -0.0368248 -0.0542169 -0.00779928 -0.0846404 -0.163748 0.0287693 -0.00208849 0.019304 0.00572086 0.0371595 -0.134597 0.0151852 -0.038396 0.0808782 0.0891151 -0.038341 0.177131 -0.00137748 -0.0118496 -0.0578395 0.0726378 0.0331652 -0.128524 0.0466819 -0.00806951 0.0492596 -0.0864062 -0.152715 0.090123 -0.00305715 0.144163 -0.0246502 0.0280742 -0.0210408 0.00873777 -0.0256656 -0.0075631 0.0103227 0.0754322 -0.0419802 0.0585941 0.0152175 -0.0425935 -0.0651367 0.0611454 0.119957 -0.0254602 -0.156135 -0.00639155 0.0949889 -0.123159 0.047309 -0.0692333 -0.125496 -0.0227959 -0.134794 -0.0227234 0.0852323 0.0747928 0.0671411 -0.0483988 -0.0306188 0.107956 0.0375039 0.0136337 -0.0478825 0.0373991 -0.0247976 0.00874661 -0.0641208 0.072415 -0.0571049 -0.0725808 0.0306085 0.12627 -0.0481936 0.0290345 -0.0502537 0.168688 0.0543266 0.0169544 -0.158924 0.0634448 -0.101641 0.126824 -0.0867623 0.00470597 
0.0308673 -0.0295717 0.121778 0.114374 0.0804533 0.165814 0.135643 -0.0617484 0.0472148 -0.0254221 0.0175327 0.0645439 0.0602835 -0.0625152 0.0651159 -0.0756227 -0.112543 0.142036 -0.146284 0.016295 0.152389 -0.0828787 0.0310626 0.276177 0.0824623 -0.172756 -0.207863 -0.185367 0.0013359 0.0842116 0.12131 0.0847994 -0.146711 0.109325 0.00253571 0.0171459 -0.100308 -0.0102592 -0.0455292 0.00495953 0.136121 -0.0524594 -0.070994 -0.0152285 -0.106011 -0.193307 0.0182129 0.0133146 0.0283013 -0.00747837 0.0688968 -0.095722 0.0171785 -0.0452187 0.0711281 0.0835527 -0.0129584 0.173597 0.0281085 -0.0385237 -0.0693995 0.074437 0.0214859 -0.133803 0.039224 0.0230835 0.0687194 -0.0842105 -0.163664 0.116084 -0.00751498 0.182445 -0.0300607 0.0564444 -0.025743 -0.0225601 -0.0331511 -0.0236334 0.0316214 0.0842093 -0.0545011 0.0588461 0.0362452 -0.0434674 -0.0318016 0.011779 0.123103 -0.0116646 -0.109919 -0.0247893 0.0787003 -0.0895105 0.0844264 -0.0714161 -0.127084 -0.0614085 -0.119651 0.00979765 0.0769242 0.063056 0.0750436 -0.0245377 -0.0195234 0.113272 0.0324032 0.0206102 -0.0469629 0.0174186 0.0299478 0.00986295 -0.0665331 0.102204 -0.0596608 -0.0773572 0.0460722 0.108483 -0.0238418 0.013404 -0.0368087 0.168479 0.0665208 -0.0128115 -0.156751 0.0464005 -0.116693 0.124949 -0.0691664 0.0393804 
0.0392598 -0.027205 0.0979335 0.0792968 0.0899062 0.169962 0.154743 -0.0405782 0.0608976 -0.0474093 0.021057 0.0521052 0.0855064 -0.0634341 0.0600816 -0.061331 -0.115009 0.122632 -0.184852 0.021141 0.169743 -0.0670477 0.0190958 0.269105 0.0480473 -0.177028 -0.210213 -0.196852 0.0101377 0.08639 0.11857 0.077562 -0.140876 0.115903 0.0133751 0.0228817 -0.0718156 0.00693002 -0.0541074 0.00861979 0.140274 -0.0415295 -0.0663981 0.000486583 -0.100822 -0.16282 0.0218249 0.0266734 0.0100195 -0.0104878 0.023786 -0.127235 0.00790782 -0.0364513 0.0721677 0.0853839 -0.0309047 0.189183 0.00953079 -0.0467356 -0.0744109 0.0774613 0.0412765 -0.136555 0.036874 0.0162615 0.0637207 -0.0572391 -0.14394 0.081069 -0.000837082 0.151556 -0.0329871 0.0257649 -0.0126695 -0.00201034 -0.0443052 -0.00752813 0.0381458 0.0706337 -0.0335083 0.0600238 0.0180808 -0.0459765 -0.0550751 0.0478518 0.12916 -0.0175834 -0.125849 -0.00502333 0.109597 -0.124929 0.0588396 -0.0755538 -0.133446 -0.0436511 -0.126367 0.00285397 0.0736408 0.071843 0.0786346 -0.0382739 -0.0255924 0.116697 0.00754724 0.0179308 -0.0694296 0.0334226 0.0082094 0.00122226 -0.0540198 0.0924074 -0.0739568 -0.0723033 0.0407413 0.131153 -0.0592893 0.00947597 -0.0545532 0.165637 0.0649064 -0.00519504 -0.143481 0.0795302 -0.123144 0.113576 -0.0995354 0.012509 
0.0620718 -0.0339296 0.0692825 0.0652718 0.118932 0.175828 0.151133 -0.0214785 0.0588383 -0.0536853 0.0493234 0.0979311 0.0807134 -0.105734 0.0370935 -0.04888 -0.101753 0.139398 -0.208021 0.0438696 0.169392 -0.031486 0.00672288 0.28056 0.0236432 -0.172222 -0.168656 -0.192183 0.0126231 0.090968 0.0944633 0.0575665 -0.137376 0.121774 0.0026124 0.0118759 -0.0723924 -0.0336147 -0.0573486 0.031443 0.147217 -0.0281334 -0.065032 0.0327014 -0.119338 -0.17289 0.03121 0.0315843 0.00342095 0.0147443 0.0420035 -0.141315 -0.0416859 -0.0435011 0.0548216 0.0853872 -0.0573495 0.198964 -0.0150472 -0.00820681 -0.0793435 0.0555806 0.0718037 -0.12854 0.0299564 -0.0489677 0.0425463 -0.0644422 -0.144327 0.0760421 0.00620608 0.141408 -0.020072 0.015938 -0.0295529 0.0056506 -0.0399999 0.0244198 0.0177946 0.0556973 -0.0201896 0.0684497 0.0253662 -0.0246253 -0.0606617 0.0739926 0.141664 -0.0246352 -0.133423 0.00231512 0.102692 -0.141588 0.00481665 -0.0542083 -0.116129 -0.0390521 -0.136136 -0.0318059 0.0448038 0.069406 0.0604583 -0.0433224 -0.0293142 0.118317 0.00408498 0.0161115 -0.0739617 0.0411149 -0.0205655 0.00429327 -0.0366509 0.0781945 -0.0569478 -0.041783 0.0180361 0.117715 -0.0631513 0.0147587 -0.0595578 0.168269 0.0620108 -0.000749777 -0.142794 0.0839787 -0.10949 0.0980966 -0.116923 -0.00540071 
0.0503381 -0.00928714 0.0845705 0.0745917 0.152517 0.19027 0.129858 -0.0238548 0.0663254 -0.0445614 0.0401416 0.113864 0.0386643 -0.118468 0.0717462 -0.053242 -0.0893456 0.150445 -0.189488 0.0314799 0.158403 -0.0145881 0.0220882 0.258841 0.0729405 -0.176106 -0.144419 -0.187213 0.0046405 0.0776326 0.122355 0.0401832 -0.100352 0.124295 0.0299066 0.0194996 -0.0634429 -0.0464358 -0.0726143 -0.00765374 0.163893 -0.0175981 -0.0412198 0.0531391 -0.149621 -0.144789 0.0503051 0.00717466 -0.0220675 0.0163146 0.0586104 -0.13366 -0.0487682 -0.0706698 0.0739319 0.0996783 -0.091019 0.19453 -0.0319641 -0.0142671 -0.0977033 0.0126428 0.0751823 -0.147828 0.0837367 -0.0493991 0.00981569 -0.0469103 -0.167519 0.151416 0.0314885 0.161392 -0.0312597 -0.0158425 -0.0366764 0.0184092 -0.0528073 0.0424751 0.00534933 0.0280851 -0.0604399 0.0996264 0.0334281 -0.0203459 -0.0510645 0.0229251 0.138041 0.00223184 -0.119584 0.0430151 0.0904728 -0.141074 -0.037841 -0.0588678 -0.0814469 -0.0346026 -0.126023 -0.0297728 0.0249311 0.0511192 0.0313297 -0.0461387 -0.0243888 0.0726908 -0.0234058 0.0267294 -0.0736535 0.010421 -0.000534309 -0.00744733 -0.0287952 0.0833268 -0.0593434 -0.0321365 0.0750754 0.0683325 -0.0722325 -0.0206199 -0.0291181 0.19307 0.102681 0.02891 -0.131567 0.0893879 -0.0501221 0.0875488 -0.0346219 -0.0113001 
0.082715 0.011346 0.0565772 0.0712752 0.139169 0.200077 0.153644 0.0134568 0.0330291 -0.0414594 0.0520734 0.104133 0.0630486 -0.15264 0.0558006 -0.0294687 -0.0699673 0.126564 -0.199878 0.041373 0.174268 -0.0172486 -0.000726535 0.251795 0.0486545 -0.184703 -0.16394 -0.191473 0.023319 0.091497 0.0958086 0.0600193 -0.121173 0.13581 -0.000587876 -0.00804414 -0.0519849 -0.0593442 -0.0553173 0.0225349 0.158105 -0.0296865 -0.0204638 0.0506478 -0.127491 -0.149165 0.066972 -0.00942236 -0.0408807 0.0227089 0.0793528 -0.136235 -0.085134 -0.0489277 0.051746 0.0852875 -0.0803385 0.176786 -0.0166463 0.00187089 -0.087063 0.0170401 0.0647671 -0.167298 0.0603579 -0.0765942 0.0212304 -0.0780724 -0.160747 0.0971774 0.0128611 0.157596 -0.0362488 0.007288 -0.0329104 0.0148969 -0.0279205 0.0636841 -0.00215905 0.0511582 -0.0455769 0.0660922 0.0402686 -0.00528448 -0.0451181 0.0741849 0.135553 -0.0375906 -0.122833 0.0270488 0.0784523 -0.157142 -0.074514 -0.0479375 -0.0873141 -0.0287773 -0.102875 -0.0281462 0.00561472 0.0693291 0.0105894 -0.0343376 -0.0165055 0.132044 -0.0356865 0.0244284 -0.0744794 0.0708418 -0.0173128 -0.0202071 -0.0413499 0.0634967 -0.0708561 -0.0393546 0.056661 0.0702612 -0.0578955 -0.0137558 -0.0354999 0.19046 0.0749675 0.0276287 -0.11642 0.104349 -0.0506308 0.061822 -0.059841 -0.0206992 
0.0905657 0.038226 -0.00733678 0.0293504 0.132804 0.196068 0.107908 0.0412869 0.0165384 -0.0202789 0.0882416 0.11294 0.0880032 -0.173984 -0.00385658 -0.0324228 -0.0594315 0.138515 -0.217889 0.107754 0.179155 -0.0355646 0.0235952 0.24492 0.0114798 -0.169354 -0.0975259 -0.184626 0.0408187 0.0901927 0.0354761 0.00195368 -0.0736246 0.135903 -0.0270539 -0.0149354 -0.0637312 -0.0205932 -0.099439 0.00381055 0.105851 -0.0470545 -0.0314825 0.115367 -0.155916 -0.145235 0.100191 0.0122592 -0.0975746 0.084712 0.0793246 -0.127621 -0.138904 -0.0396337 0.051353 0.0694902 -0.101718 0.155168 -0.0161729 -0.0500199 -0.0808593 -0.0153975 0.136478 -0.135224 0.048404 -0.131017 -0.00659909 -0.051245 -0.157423 0.0955733 0.0118326 0.112158 -0.0302762 -0.0169311 -0.0305343 0.00550154 -0.0261732 0.101492 0.00525419 0.0376769 -0.0648099 0.0561981 0.0145137 -0.00975775 -0.049316 0.0864998 0.117917 -0.0191459 -0.0422518 0.0561062 0.0667031 -0.195196 -0.112407 -0.0342688 -0.0633346 -0.0576224 -0.106321 -0.0126864 -0.022043 0.0213179 0.0152947 -0.0149141 -0.0164163 0.120395 -0.0620763 0.0412112 -0.0941885 0.0887248 -0.0207333 -0.0545052 -0.00902349 0.0988479 -0.0546657 0.005665 0.0420439 0.0527929 -0.0755879 -0.0429693 -0.0135167 0.190201 0.0345901 0.0221723 -0.0968775 0.117217 -0.0330934 0.0444512 -0.0385877 -0.0393284 
0.0905657 0.038226 -0.00733678 0.0293504 0.132804 0.196068 0.107908 0.0412869 0.0165384 -0.0202789 0.0882416 0.11294 0.0880032 -0.173984 -0.00385658 -0.0324228 -0.0594315 0.138515 -0.217889 0.107754 0.179155 -0.0355646 0.0235952 0.24492 0.0114798 -0.169354 -0.0975259 -0.184626 0.0408187 0.0901927 0.0354761 0.00195368 -0.0736246 0.135903 -0.0270539 -0.0149354 -0.0637312 -0.0205932 -0.099439 0.00381055 0.105851 -0.0470545 -0.0314825 0.115367 -0.155916 -0.145235 0.100191 0.0122592 -0.0975746 0.084712 0.0793246 -0.127621 -0.138904 -0.0396337 0.051353 0.0694902 -0.101718 0.155168 -0.0161729 -0.0500199 -0.0808593 -0.0153975 0.136478 -0.135224 0.048404 -0.131017 -0.00659909 -0.051245 -0.157423 0.0955733 0.0118326 0.112158 -0.0302762 -0.0169311 -0.0305343 0.00550154 -0.0261732 0.101492 0.00525419 0.0376769 -0.0648099 0.0561981 0.0145137 -0.00975775 -0.049316 0.0864998 0.117917 -0.0191459 -0.0422518 0.0561062 0.0667031 -0.195196 -0.112407 -0.0342688 -0.0633346 -0.0576224 -0.106321 -0.0126864 -0.022043 0.0213179 0.0152947 -0.0149141 -0.0164163 0.120395 -0.0620763 0.0412112 -0.0941885 0.0887248 -0.0207333 -0.0545052 -0.00902349 0.0988479 -0.0546657 0.005665 0.0420439 0.0527929 -0.0755879 -0.0429693 -0.0135167 0.190201 0.0345901 0.0221723 -0.0968775 0.117217 -0.0330934 0.0444512 -0.0385877 -0.0393284 
0.0905657 0.038226 -0.00733678 0.0293504 0.132804 0.196068 0.107908 0.0412869 0.0165384 -0.0202789 0.0882416 0.11294 0.0880032 -0.173984 -0.00385658 -0.0324228 -0.0594315 0.138515 -0.217889 0.107754 0.179155 -0.0355646 0.0235952 0.24492 0.0114798 -0.169354 -0.0975259 -0.184626 0.0408187 0.0901927 0.0354761 0.00195368 -0.0736246 0.135903 -0.0270539 -0.0149354 -0.0637312 -0.0205932 -0.099439 0.00381055 0.105851 -0.0470545 -0.0314825 0.115367 -0.155916 -0.145235 0.100191 0.0122592 -0.0975746 0.084712 0.0793246 -0.127621 -0.138904 -0.0396337 0.051353 0.0694902 -0.101718 0.155168 -0.0161729 -0.0500199 -0.0808593 -0.0153975 0.136478 -0.135224 0.048404 -0.131017 -0.00659909 -0.051245 -0.157423 0.0955733 0.0118326 0.112158 -0.0302762 -0.0169311 -0.0305343 0.00550154 -0.0261732 0.101492 0.00525419 0.0376769 -0.0648099 0.0561981 0.0145137 -0.00975775 -0.049316 0.0864998 0.117917 -0.0191459 -0.0422518 0.0561062 0.0667031 -0.195196 -0.112407 -0.0342688 -0.0633346 -0.0576224 -0.106321 -0.0126864 -0.022043 0.0213179 0.0152947 -0.0149141 -0.0164163 0.120395 -0.0620763 0.0412112 -0.0941885 0.0887248 -0.0207333 -0.0545052 -0.00902349 0.0988479 -0.0546657 0.005665 0.0420439 0.0527929 -0.0755879 -0.0429693 -0.0135167 0.190201 0.0345901 0.0221723 -0.0968775 0.117217 -0.0330934 0.0444512 -0.0385877 -0.0393284 
0.0905657 0.038226 -0.00733678 0.0293504 0.132804 0.196068 0.107908 0.0412869 0.0165384 -0.0202789 0.0882416 0.11294 0.0880032 -0.173984 -0.00385658 -0.0324228 -0.0594315 0.138515 -0.217889 0.107754 0.179155 -0.0355646 0.0235952 0.24492 0.0114798 -0.169354 -0.0975259 -0.184626 0.0408187 0.0901927 0.0354761 0.00195368 -0.0736246 0.135903 -0.0270539 -0.0149354 -0.0637312 -0.0205932 -0.099439 0.00381055 0.105851 -0.0470545 -0.0314825 0.115367 -0.155916 -0.145235 0.100191 0.0122592 -0.0975746 0.084712 0.0793246 -0.127621 -0.138904 -0.0396337 0.051353 0.0694902 -0.101718 0.155168 -0.0161729 -0.0500199 -0.0808593 -0.0153975 0.136478 -0.135224 0.048404 -0.131017 -0.00659909 -0.051245 -0.157423 0.0955733 0.0118326 0.112158 -0.0302762 -0.0169311 -0.0305343 0.00550154 -0.0261732 0.101492 0.00525419 0.0376769 -0.0648099 0.0561981 0.0145137 -0.00975775 -0.049316 0.0864998 0.117917 -0.0191459 -0.0422518 0.0561062 0.0667031 -0.195196 -0.112407 -0.0342688 -0.0633346 -0.0576224 -0.106321 -0.0126864 -0.022043 0.0213179 0.0152947 -0.0149141 -0.0164163 0.120395 -0.0620763 0.0412112 -0.0941885 0.0887248 -0.0207333 -0.0545052 -0.00902349 0.0988479 -0.0546657 0.005665 0.0420439 0.0527929 -0.0755879 -0.0429693 -0.0135167 0.190201 0.0345901 0.0221723 -0.0968775 0.117217 -0.0330934 0.0444512 -0.0385877 -0.0393284 
0.0905657 0.038226 -0.00733678 0.0293504 0.132804 0.196068 0.107908 0.0412869 0.0165384 -0.0202789 0.0882416 0.11294 0.0880032 -0.173984 -0.00385658 -0.0324228 -0.0594315 0.138515 -0.217889 0.107754 0.179155 -0.0355646 0.0235952 0.24492 0.0114798 -0.169354 -0.0975259 -0.184626 0.0408187 0.0901927 0.0354761 0.00195368 -0.0736246 0.135903 -0.0270539 -0.0149354 -0.0637312 -0.0205932 -0.099439 0.00381055 0.105851 -0.0470545 -0.0314825 0.115367 -0.155916 -0.145235 0.100191 0.0122592 -0.0975746 0.084712 0.0793246 -0.127621 -0.138904 -0.0396337 0.051353 0.0694902 -0.101718 0.155168 -0.0161729 -0.0500199 -0.0808593 -0.0153975 0.136478 -0.135224 0.048404 -0.131017 -0.00659909 -0.051245 -0.157423 0.0955733 0.0118326 0.112158 -0.0302762 -0.0169311 -0.0305343 0.00550154 -0.0261732 0.101492 0.00525419 0.0376769 -0.0648099 0.0561981 0.0145137 -0.00975775 -0.049316 0.0864998 0.117917 -0.0191459 -0.0422518 0.0561062 0.0667031 -0.195196 -0.112407 -0.0342688 -0.0633346 -0.0576224 -0.106321 -0.0126864 -0.022043 0.0213179 0.0152947 -0.0149141 -0.0164163 0.120395 -0.0620763 0.0412112 -0.0941885 0.0887248 -0.0207333 -0.0545052 -0.00902349 0.0988479 -0.0546657 0.005665 0.0420439 0.0527929 -0.0755879 -0.0429693 -0.0135167 0.190201 0.0345901 0.0221723 -0.0968775 0.117217 -0.0330934 0.0444512 -0.0385877 -0.0393284 
0.0905657 0.038226 -0.00733678 0.0293504 0.132804 0.196068 0.107908 0.0412869 0.0165384 -0.0202789 0.0882416 0.11294 0.0880032 -0.173984 -0.00385658 -0.0324228 -0.0594315 0.138515 -0.217889 0.107754 0.179155 -0.0355646 0.0235952 0.24492 0.0114798 -0.169354 -0.0975259 -0.184626 0.0408187 0.0901927 0.0354761 0.00195368 -0.0736246 0.135903 -0.0270539 -0.0149354 -0.0637312 -0.0205932 -0.099439 0.00381055 0.105851 -0.0470545 -0.0314825 0.115367 -0.155916 -0.145235 0.100191 0.0122592 -0.0975746 0.084712 0.0793246 -0.127621 -0.138904 -0.0396337 0.051353 0.0694902 -0.101718 0.155168 -0.0161729 -0.0500199 -0.0808593 -0.0153975 0.136478 -0.135224 0.048404 -0.131017 -0.00659909 -0.051245 -0.157423 0.0955733 0.0118326 0.112158 -0.0302762 -0.0169311 -0.0305343 0.00550154 -0.0261732 0.101492 0.00525419 0.0376769 -0.0648099 0.0561981 0.0145137 -0.00975775 -0.049316 0.0864998 0.117917 -0.0191459 -0.0422518 0.0561062 0.0667031 -0.195196 -0.112407 -0.0342688 -0.0633346 -0.0576224 -0.106321 -0.0126864 -0.022043 0.0213179 0.0152947 -0.0149141 -0.0164163 0.120395 -0.0620763 0.0412112 -0.0941885 0.0887248 -0.0207333 -0.0545052 -0.00902349 0.0988479 -0.0546657 0.005665 0.0420439 0.0527929 -0.0755879 -0.0429693 -0.0135167 0.190201 0.0345901 0.0221723 -0.0968775 0.117217 -0.0330934 0.0444512 -0.0385877 -0.0393284 
0.0905657 0.038226 -0.00733678 0.0293504 0.132804 0.196068 0.107908 0.0412869 0.0165384 -0.0202789 0.0882416 0.11294 0.0880032 -0.173984 -0.00385658 -0.0324228 -0.0594315 0.138515 -0.217889 0.107754 0.179155 -0.0355646 0.0235952 0.24492 0.0114798 -0.169354 -0.0975259 -0.184626 0.0408187 0.0901927 0.0354761 0.00195368 -0.0736246 0.135903 -0.0270539 -0.0149354 -0.0637312 -0.0205932 -0.099439 0.00381055 0.105851 -0.0470545 -0.0314825 0.115367 -0.155916 -0.145235 0.100191 0.0122592 -0.0975746 0.084712 0.0793246 -0.127621 -0.138904 -0.0396337 0.051353 0.0694902 -0.101718 0.155168 -0.0161729 -0.0500199 -0.0808593 -0.0153975 0.136478 -0.135224 0.048404 -0.131017 -0.00659909 -0.051245 -0.157423 0.0955733 0.0118326 0.112158 -0.0302762 -0.0169311 -0.0305343 0.00550154 -0.0261732 0.101492 0.00525419 0.0376769 -0.0648099 0.0561981 0.0145137 -0.00975775 -0.049316 0.0864998 0.117917 -0.0191459 -0.0422518 0.0561062 0.0667031 -0.195196 -0.112407 -0.0342688 -0.0633346 -0.0576224 -0.106321 -0.0126864 -0.022043 0.0213179 0.0152947 -0.0149141 -0.0164163 0.120395 -0.0620763 0.0412112 -0.0941885 0.0887248 -0.0207333 -0.0545052 -0.00902349 0.0988479 -0.0546657 0.005665 0.0420439 0.0527929 -0.0755879 -0.0429693 -0.0135167 0.190201 0.0345901 0.0221723 -0.0968775 0.117217 -0.0330934 0.0444512 -0.0385877 -0.0393284 
0.0905657 0.038226 -0.00733678 0.0293504 0.132804 0.196068 0.107908 0.0412869 0.0165384 -0.0202789 0.0882416 0.11294 0.0880032 -0.173984 -0.00385658 -0.0324228 -0.0594315 0.138515 -0.217889 0.107754 0.179155 -0.0355646 0.0235952 0.24492 0.0114798 -0.169354 -0.0975259 -0.184626 0.0408187 0.0901927 0.0354761 0.00195368 -0.0736246 0.135903 -0.0270539 -0.0149354 -0.0637312 -0.0205932 -0.099439 0.00381055 0.105851 -0.0470545 -0.0314825 0.115367 -0.155916 -0.145235 0.100191 0.0122592 -0.0975746 0.084712 0.0793246 -0.127621 -0.138904 -0.0396337 0.051353 0.0694902 -0.101718 0.155168 -0.0161729 -0.0500199 -0.0808593 -0.0153975 0.136478 -0.135224 0.048404 -0.131017 -0.00659909 -0.051245 -0.157423 0.0955733 0.0118326 0.112158 -0.0302762 -0.0169311 -0.0305343 0.00550154 -0.0261732 0.101492 0.00525419 0.0376769 -0.0648099 0.0561981 0.0145137 -0.00975775 -0.049316 0.0864998 0.117917 -0.0191459 -0.0422518 0.0561062 0.0667031 -0.195196 -0.112407 -0.0342688 -0.0633346 -0.0576224 -0.106321 -0.0126864 -0.022043 0.0213179 0.0152947 -0.0149141 -0.0164163 0.120395 -0.0620763 0.0412112 -0.0941885 0.0887248 -0.0207333 -0.0545052 -0.00902349 0.0988479 -0.0546657 0.005665 0.0420439 0.0527929 -0.0755879 -0.0429693 -0.0135167 0.190201 0.0345901 0.0221723 -0.0968775 0.117217 -0.0330934 0.0444512 -0.0385877 -0.0393284 
0.0905657 0.038226 -0.00733678 0.0293504 0.132804 0.196068 0.107908 0.0412869 0.0165384 -0.0202789 0.0882416 0.11294 0.0880032 -0.173984 -0.00385658 -0.0324228 -0.0594315 0.138515 -0.217889 0.107754 0.179155 -0.0355646 0.0235952 0.24492 0.0114798 -0.169354 -0.0975259 -0.184626 0.0408187 0.0901927 0.0354761 0.00195368 -0.0736246 0.135903 -0.0270539 -0.0149354 -0.0637312 -0.0205932 -0.099439 0.00381055 0.105851 -0.0470545 -0.0314825 0.115367 -0.155916 -0.145235 0.100191 0.0122592 -0.0975746 0.084712 0.0793246 -0.127621 -0.138904 -0.0396337 0.051353 0.0694902 -0.101718 0.155168 -0.0161729 -0.0500199 -0.0808593 -0.0153975 0.136478 -0.135224 0.048404 -0.131017 -0.00659909 -0.051245 -0.157423 0.0955733 0.0118326 0.112158 -0.0302762 -0.0169311 -0.0305343 0.00550154 -0.0261732 0.101492 0.00525419 0.0376769 -0.0648099 0.0561981 0.0145137 -0.00975775 -0.049316 0.0864998 0.117917 -0.0191459 -0.0422518 0.0561062 0.0667031 -0.195196 -0.112407 -0.0342688 -0.0633346 -0.0576224 -0.106321 -0.0126864 -0.022043 0.0213179 0.0152947 -0.0149141 -0.0164163 0.120395 -0.0620763 0.0412112 -0.0941885 0.0887248 -0.0207333 -0.0545052 -0.00902349 0.0988479 -0.0546657 0.005665 0.0420439 0.0527929 -0.0755879 -0.0429693 -0.0135167 0.190201 0.0345901 0.0221723 -0.0968775 0.117217 -0.0330934 0.0444512 -0.0385877 -0.0393284 
0.0905657 0.038226 -0.00733678 0.0293504 0.132804 0.196068 0.107908 0.0412869 0.0165384 -0.0202789 0.0882416 0.11294 0.0880032 -0.173984 -0.00385658 -0.0324228 -0.0594315 0.138515 -0.217889 0.107754 0.179155 -0.0355646 0.0235952 0.24492 0.0114798 -0.169354 -0.0975259 -0.184626 0.0408187 0.0901927 0.0354761 0.00195368 -0.0736246 0.135903 -0.0270539 -0.0149354 -0.0637312 -0.0205932 -0.099439 0.00381055 0.105851 -0.0470545 -0.0314825 0.115367 -0.155916 -0.145235 0.100191 0.0122592 -0.0975746 0.084712 0.0793246 -0.127621 -0.138904 -0.0396337 0.051353 0.0694902 -0.101718 0.155168 -0.0161729 -0.0500199 -0.0808593 -0.0153975 0.136478 -0.135224 0.048404 -0.131017 -0.00659909 -0.051245 -0.157423 0.0955733 0.0118326 0.112158 -0.0302762 -0.0169311 -0.0305343 0.00550154 -0.0261732 0.101492 0.00525419 0.0376769 -0.0648099 0.0561981 0.0145137 -0.00975775 -0.049316 0.0864998 0.117917 -0.0191459 -0.0422518 0.0561062 0.0667031 -0.195196 -0.112407 -0.0342688 -0.0633346 -0.0576224 -0.106321 -0.0126864 -0.022043 0.0213179 0.0152947 -0.0149141 -0.0164163 0.120395 -0.0620763 0.0412112 -0.0941885 0.0887248 -0.0207333 -0.0545052 -0.00902349 0.0988479 -0.0546657 0.005665 0.0420439 0.0527929 -0.0755879 -0.0429693 -0.0135167 0.190201 0.0345901 0.0221723 -0.0968775 0.117217 -0.0330934 0.0444512 -0.0385877 -0.0393284 
0.0905657 0.038226 -0.00733678 0.0293504 0.132804 0.196068 0.107908 0.0412869 0.0165384 -0.0202789 0.0882416 0.11294 0.0880032 -0.173984 -0.00385658 -0.0324228 -0.0594315 0.138515 -0.217889 0.107754 0.179155 -0.0355646 0.0235952 0.24492 0.0114798 -0.169354 -0.0975259 -0.184626 0.0408187 0.0901927 0.0354761 0.00195368 -0.0736246 0.135903 -0.0270539 -0.0149354 -0.0637312 -0.0205932 -0.099439 0.00381055 0.105851 -0.0470545 -0.0314825 0.115367 -0.155916 -0.145235 0.100191 0.0122592 -0.0975746 0.084712 0.0793246 -0.127621 -0.138904 -0.0396337 0.051353 0.0694902 -0.101718 0.155168 -0.0161729 -0.0500199 -0.0808593 -0.0153975 0.136478 -0.135224 0.048404 -0.131017 -0.00659909 -0.051245 -0.157423 0.0955733 0.0118326 0.112158 -0.0302762 -0.0169311 -0.0305343 0.00550154 -0.0261732 0.101492 0.00525419 0.0376769 -0.0648099 0.0561981 0.0145137 -0.00975775 -0.049316 0.0864998 0.117917 -0.0191459 -0.0422518 0.0561062 0.0667031 -0.195196 -0.112407 -0.0342688 -0.0633346 -0.0576224 -0.106321 -0.0126864 -0.022043 0.0213179 0.0152947 -0.0149141 -0.0164163 0.120395 -0.0620763 0.0412112 -0.0941885 0.0887248 -0.0207333 -0.0545052 -0.00902349 0.0988479 -0.0546657 0.005665 0.0420439 0.0527929 -0.0755879 -0.0429693 -0.0135167 0.190201 0.0345901 0.0221723 -0.0968775 0.117217 -0.0330934 0.0444512 -0.0385877 -0.0393284 
0.0905657 0.038226 -0.00733678 0.0293504 0.132804 0.196068 0.107908 0.0412869 0.0165384 -0.0202789 0.0882416 0.11294 0.0880032 -0.173984 -0.00385658 -0.0324228 -0.0594315 0.138515 -0.217889 0.107754 0.179155 -0.0355646 0.0235952 0.24492 0.0114798 -0.169354 -0.0975259 -0.184626 0.0408187 0.0901927 0.0354761 0.00195368 -0.0736246 0.135903 -0.0270539 -0.0149354 -0.0637312 -0.0205932 -0.099439 0.00381055 0.105851 -0.0470545 -0.0314825 0.115367 -0.155916 -0.145235 0.100191 0.0122592 -0.0975746 0.084712 0.0793246 -0.127621 -0.138904 -0.0396337 0.051353 0.0694902 -0.101718 0.155168 -0.0161729 -0.0500199 -0.0808593 -0.0153975 0.136478 -0.135224 0.048404 -0.131017 -0.00659909 -0.051245 -0.157423 0.0955733 0.0118326 0.112158 -0.0302762 -0.0169311 -0.0305343 0.00550154 -0.0261732 0.101492 0.00525419 0.0376769 -0.0648099 0.0561981 0.0145137 -0.00975775 -0.049316 0.0864998 0.117917 -0.0191459 -0.0422518 0.0561062 0.0667031 -0.195196 -0.112407 -0.0342688 -0.0633346 -0.0576224 -0.106321 -0.0126864 -0.022043 0.0213179 0.0152947 -0.0149141 -0.0164163 0.120395 -0.0620763 0.0412112 -0.0941885 0.0887248 -0.0207333 -0.0545052 -0.00902349 0.0988479 -0.0546657 0.005665 0.0420439 0.0527929 -0.0755879 -0.0429693 -0.0135167 0.190201 0.0345901 0.0221723 -0.0968775 0.117217 -0.0330934 0.0444512 -0.0385877 -0.0393284 
0.0905657 0.038226 -0.00733678 0.0293504 0.132804 0.196068 0.107908 0.0412869 0.0165384 -0.0202789 0.0882416 0.11294 0.0880032 -0.173984 -0.00385658 -0.0324228 -0.0594315 0.138515 -0.217889 0.107754 0.179155 -0.0355646 0.0235952 0.24492 0.0114798 -0.169354 -0.0975259 -0.184626 0.0408187 0.0901927 0.0354761 0.00195368 -0.0736246 0.135903 -0.0270539 -0.0149354 -0.0637312 -0.0205932 -0.099439 0.00381055 0.105851 -0.0470545 -0.0314825 0.115367 -0.155916 -0.145235 0.100191 0.0122592 -0.0975746 0.084712 0.0793246 -0.127621 -0.138904 -0.0396337 0.051353 0.0694902 -0.101718 0.155168 -0.0161729 -0.0500199 -0.0808593 -0.0153975 0.136478 -0.135224 0.048404 -0.131017 -0.00659909 -0.051245 -0.157423 0.0955733 0.0118326 0.112158 -0.0302762 -0.0169311 -0.0305343 0.00550154 -0.0261732 0.101492 0.00525419 0.0376769 -0.0648099 0.0561981 0.0145137 -0.00975775 -0.049316 0.0864998 0.117917 -0.0191459 -0.0422518 0.0561062 0.0667031 -0.195196 -0.112407 -0.0342688 -0.0633346 -0.0576224 -0.106321 -0.0126864 -0.022043 0.0213179 0.0152947 -0.0149141 -0.0164163 0.120395 -0.0620763 0.0412112 -0.0941885 0.0887248 -0.0207333 -0.0545052 -0.00902349 0.0988479 -0.0546657 0.005665 0.0420439 0.0527929 -0.0755879 -0.0429693 -0.0135167 0.190201 0.0345901 0.0221723 -0.0968775 0.117217 -0.0330934 0.0444512 -0.0385877 -0.0393284 
0.0905657 0.038226 -0.00733678 0.0293504 0.132804 0.196068 0.107908 0.0412869 0.0165384 -0.0202789 0.0882416 0.11294 0.0880032 -0.173984 -0.00385658 -0.0324228 -0.0594315 0.138515 -0.217889 0.107754 0.179155 -0.0355646 0.0235952 0.24492 0.0114798 -0.169354 -0.0975259 -0.184626 0.0408187 0.0901927 0.0354761 0.00195368 -0.0736246 0.135903 -0.0270539 -0.0149354 -0.0637312 -0.0205932 -0.099439 0.00381055 0.105851 -0.0470545 -0.0314825 0.115367 -0.155916 -0.145235 0.100191 0.0122592 -0.0975746 0.084712 0.0793246 -0.127621 -0.138904 -0.0396337 0.051353 0.0694902 -0.101718 0.155168 -0.0161729 -0.0500199 -0.0808593 -0.0153975 0.136478 -0.135224 0.048404 -0.131017 -0.00659909 -0.051245 -0.157423 0.0955733 0.0118326 0.112158 -0.0302762 -0.0169311 -0.0305343 0.00550154 -0.0261732 0.101492 0.00525419 0.0376769 -0.0648099 0.0561981 0.0145137 -0.00975775 -0.049316 0.0864998 0.117917 -0.0191459 -0.0422518 0.0561062 0.0667031 -0.195196 -0.112407 -0.0342688 -0.0633346 -0.0576224 -0.106321 -0.0126864 -0.022043 0.0213179 0.0152947 -0.0149141 -0.0164163 0.120395 -0.0620763 0.0412112 -0.0941885 0.0887248 -0.0207333 -0.0545052 -0.00902349 0.0988479 -0.0546657 0.005665 0.0420439 0.0527929 -0.0755879 -0.0429693 -0.0135167 0.190201 0.0345901 0.0221723 -0.0968775 0.117217 -0.0330934 0.0444512 -0.0385877 -0.0393284 
0.0905657 0.038226 -0.00733678 0.0293504 0.132804 0.196068 0.107908 0.0412869 0.0165384 -0.0202789 0.0882416 0.11294 0.0880032 -0.173984 -0.00385658 -0.0324228 -0.0594315 0.138515 -0.217889 0.107754 0.179155 -0.0355646 0.0235952 0.24492 0.0114798 -0.169354 -0.0975259 -0.184626 0.0408187 0.0901927 0.0354761 0.00195368 -0.0736246 0.135903 -0.0270539 -0.0149354 -0.0637312 -0.0205932 -0.099439 0.00381055 0.105851 -0.0470545 -0.0314825 0.115367 -0.155916 -0.145235 0.100191 0.0122592 -0.0975746 0.084712 0.0793246 -0.127621 -0.138904 -0.0396337 0.051353 0.0694902 -0.101718 0.155168 -0.0161729 -0.0500199 -0.0808593 -0.0153975 0.136478 -0.135224 0.048404 -0.131017 -0.00659909 -0.051245 -0.157423 0.0955733 0.0118326 0.112158 -0.0302762 -0.0169311 -0.0305343 0.00550154 -0.0261732 0.101492 0.00525419 0.0376769 -0.0648099 0.0561981 0.0145137 -0.00975775 -0.049316 0.0864998 0.117917 -0.0191459 -0.0422518 0.0561062 0.0667031 -0.195196 -0.112407 -0.0342688 -0.0633346 -0.0576224 -0.106321 -0.0126864 -0.022043 0.0213179 0.0152947 -0.0149141 -0.0164163 0.120395 -0.0620763 0.0412112 -0.0941885 0.0887248 -0.0207333 -0.0545052 -0.00902349 0.0988479 -0.0546657 0.005665 0.0420439 0.0527929 -0.0755879 -0.0429693 -0.0135167 0.190201 0.0345901 0.0221723 -0.0968775 0.117217 -0.0330934 0.0444512 -0.0385877 -0.0393284 
0.0905657 0.038226 -0.00733678 0.0293504 0.132804 0.196068 0.107908 0.0412869 0.0165384 -0.0202789 0.0882416 0.11294 0.0880032 -0.173984 -0.00385658 -0.0324228 -0.0594315 0.138515 -0.217889 0.107754 0.179155 -0.0355646 0.0235952 0.24492 0.0114798 -0.169354 -0.0975259 -0.184626 0.0408187 0.0901927 0.0354761 0.00195368 -0.0736246 0.135903 -0.0270539 -0.0149354 -0.0637312 -0.0205932 -0.099439 0.00381055 0.105851 -0.0470545 -0.0314825 0.115367 -0.155916 -0.145235 0.100191 0.0122592 -0.0975746 0.084712 0.0793246 -0.127621 -0.138904 -0.0396337 0.051353 0.0694902 -0.101718 0.155168 -0.0161729 -0.0500199 -0.0808593 -0.0153975 0.136478 -0.135224 0.048404 -0.131017 -0.00659909 -0.051245 -0.157423 0.0955733 0.0118326 0.112158 -0.0302762 -0.0169311 -0.0305343 0.00550154 -0.0261732 0.101492 0.00525419 0.0376769 -0.0648099 0.0561981 0.0145137 -0.00975775 -0.049316 0.0864998 0.117917 -0.0191459 -0.0422518 0.0561062 0.0667031 -0.195196 -0.112407 -0.0342688 -0.0633346 -0.0576224 -0.106321 -0.0126864 -0.022043 0.0213179 0.0152947 -0.0149141 -0.0164163 0.120395 -0.0620763 0.0412112 -0.0941885 0.0887248 -0.0207333 -0.0545052 -0.00902349 0.0988479 -0.0546657 0.005665 0.0420439 0.0527929 -0.0755879 -0.0429693 -0.0135167 0.190201 0.0345901 0.0221723 -0.0968775 0.117217 -0.0330934 0.0444512 -0.0385877 -0.0393284 
0.0905657 0.038226 -0.00733678 0.0293504 0.132804 0.196068 0.107908 0.0412869 0.0165384 -0.0202789 0.0882416 0.11294 0.0880032 -0.173984 -0.00385658 -0.0324228 -0.0594315 0.138515 -0.217889 0.107754 0.179155 -0.0355646 0.0235952 0.24492 0.0114798 -0.169354 -0.0975259 -0.184626 0.0408187 0.0901927 0.0354761 0.00195368 -0.0736246 0.135903 -0.0270539 -0.0149354 -0.0637312 -0.0205932 -0.099439 0.00381055 0.105851 -0.0470545 -0.0314825 0.115367 -0.155916 -0.145235 0.100191 0.0122592 -0.0975746 0.084712 0.0793246 -0.127621 -0.138904 -0.0396337 0.051353 0.0694902 -0.101718 0.155168 -0.0161729 -0.0500199 -0.0808593 -0.0153975 0.136478 -0.135224 0.048404 -0.131017 -0.00659909 -0.051245 -0.157423 0.0955733 0.0118326 0.112158 -0.0302762 -0.0169311 -0.0305343 0.00550154 -0.0261732 0.101492 0.00525419 0.0376769 -0.0648099 0.0561981 0.0145137 -0.00975775 -0.049316 0.0864998 0.117917 -0.0191459 -0.0422518 0.0561062 0.0667031 -0.195196 -0.112407 -0.0342688 -0.0633346 -0.0576224 -0.106321 -0.0126864 -0.022043 0.0213179 0.0152947 -0.0149141 -0.0164163 0.120395 -0.0620763 0.0412112 -0.0941885 0.0887248 -0.0207333 -0.0545052 -0.00902349 0.0988479 -0.0546657 0.005665 0.0420439 0.0527929 -0.0755879 -0.0429693 -0.0135167 0.190201 0.0345901 0.0221723 -0.0968775 0.117217 -0.0330934 0.0444512 -0.0385877 -0.0393284 
0.0905657 0.038226 -0.00733678 0.0293504 0.132804 0.196068 0.107908 0.0412869 0.0165384 -0.0202789 0.0882416 0.11294 0.0880032 -0.173984 -0.00385658 -0.0324228 -0.0594315 0.138515 -0.217889 0.107754 0.179155 -0.0355646 0.0235952 0.24492 0.0114798 -0.169354 -0.0975259 -0.184626 0.0408187 0.0901927 0.0354761 0.00195368 -0.0736246 0.135903 -0.0270539 -0.0149354 -0.0637312 -0.0205932 -0.099439 0.00381055 0.105851 -0.0470545 -0.0314825 0.115367 -0.155916 -0.145235 0.100191 0.0122592 -0.0975746 0.084712 0.0793246 -0.127621 -0.138904 -0.0396337 0.051353 0.0694902 -0.101718 0.155168 -0.0161729 -0.0500199 -0.0808593 -0.0153975 0.136478 -0.135224 0.048404 -0.131017 -0.00659909 -0.051245 -0.157423 0.0955733 0.0118326 0.112158 -0.0302762 -0.0169311 -0.0305343 0.00550154 -0.0261732 0.101492 0.00525419 0.0376769 -0.0648099 0.0561981 0.0145137 -0.00975775 -0.049316 0.0864998 0.117917 -0.0191459 -0.0422518 0.0561062 0.0667031 -0.195196 -0.112407 -0.0342688 -0.0633346 -0.0576224 -0.106321 -0.0126864 -0.022043 0.0213179 0.0152947 -0.0149141 -0.0164163 0.120395 -0.0620763 0.0412112 -0.0941885 0.0887248 -0.0207333 -0.0545052 -0.00902349 0.0988479 -0.0546657 0.005665 0.0420439 0.0527929 -0.0755879 -0.0429693 -0.0135167 0.190201 0.0345901 0.0221723 -0.0968775 0.117217 -0.0330934 0.0444512 -0.0385877 -0.0393284 
0.0905657 0.038226 -0.00733678 0.0293504 0.132804 0.196068 0.107908 0.0412869 0.0165384 -0.0202789 0.0882416 0.11294 0.0880032 -0.173984 -0.00385658 -0.0324228 -0.0594315 0.138515 -0.217889 0.107754 0.179155 -0.0355646 0.0235952 0.24492 0.0114798 -0.169354 -0.0975259 -0.184626 0.0408187 0.0901927 0.0354761 0.00195368 -0.0736246 0.135903 -0.0270539 -0.0149354 -0.0637312 -0.0205932 -0.099439 0.00381055 0.105851 -0.0470545 -0.0314825 0.115367 -0.155916 -0.145235 0.100191 0.0122592 -0.0975746 0.084712 0.0793246 -0.127621 -0.138904 -0.0396337 0.051353 0.0694902 -0.101718 0.155168 -0.0161729 -0.0500199 -0.0808593 -0.0153975 0.136478 -0.135224 0.048404 -0.131017 -0.00659909 -0.051245 -0.157423 0.0955733 0.0118326 0.112158 -0.0302762 -0.0169311 -0.0305343 0.00550154 -0.0261732 0.101492 0.00525419 0.0376769 -0.0648099 0.0561981 0.0145137 -0.00975775 -0.049316 0.0864998 0.117917 -0.0191459 -0.0422518 0.0561062 0.0667031 -0.195196 -0.112407 -0.0342688 -0.0633346 -0.0576224 -0.106321 -0.0126864 -0.022043 0.0213179 0.0152947 -0.0149141 -0.0164163 0.120395 -0.0620763 0.0412112 -0.0941885 0.0887248 -0.0207333 -0.0545052 -0.00902349 0.0988479 -0.0546657 0.005665 0.0420439 0.0527929 -0.0755879 -0.0429693 -0.0135167 0.190201 0.0345901 0.0221723 -0.0968775 0.117217 -0.0330934 0.0444512 -0.0385877 -0.0393284 
0.0905657 0.038226 -0.00733678 0.0293504 0.132804 0.196068 0.107908 0.0412869 0.0165384 -0.0202789 0.0882416 0.11294 0.0880032 -0.173984 -0.00385658 -0.0324228 -0.0594315 0.138515 -0.217889 0.107754 0.179155 -0.0355646 0.0235952 0.24492 0.0114798 -0.169354 -0.0975259 -0.184626 0.0408187 0.0901927 0.0354761 0.00195368 -0.0736246 0.135903 -0.0270539 -0.0149354 -0.0637312 -0.0205932 -0.099439 0.00381055 0.105851 -0.0470545 -0.0314825 0.115367 -0.155916 -0.145235 0.100191 0.0122592 -0.0975746 0.084712 0.0793246 -0.127621 -0.138904 -0.0396337 0.051353 0.0694902 -0.101718 0.155168 -0.0161729 -0.0500199 -0.0808593 -0.0153975 0.136478 -0.135224 0.048404 -0.131017 -0.00659909 -0.051245 -0.157423 0.0955733 0.0118326 0.112158 -0.0302762 -0.0169311 -0.0305343 0.00550154 -0.0261732 0.101492 0.00525419 0.0376769 -0.0648099 0.0561981 0.0145137 -0.00975775 -0.049316 0.0864998 0.117917 -0.0191459 -0.0422518 0.0561062 0.0667031 -0.195196 -0.112407 -0.0342688 -0.0633346 -0.0576224 -0.106321 -0.0126864 -0.022043 0.0213179 0.0152947 -0.0149141 -0.0164163 0.120395 -0.0620763 0.0412112 -0.0941885 0.0887248 -0.0207333 -0.0545052 -0.00902349 0.0988479 -0.0546657 0.005665 0.0420439 0.0527929 -0.0755879 -0.0429693 -0.0135167 0.190201 0.0345901 0.0221723 -0.0968775 0.117217 -0.0330934 0.0444512 -0.0385877 -0.0393284 
0.0905657 0.038226 -0.00733678 0.0293504 0.132804 0.196068 0.107908 0.0412869 0.0165384 -0.0202789 0.0882416 0.11294 0.0880032 -0.173984 -0.00385658 -0.0324228 -0.0594315 0.138515 -0.217889 0.107754 0.179155 -0.0355646 0.0235952 0.24492 0.0114798 -0.169354 -0.0975259 -0.184626 0.0408187 0.0901927 0.0354761 0.00195368 -0.0736246 0.135903 -0.0270539 -0.0149354 -0.0637312 -0.0205932 -0.099439 0.00381055 0.105851 -0.0470545 -0.0314825 0.115367 -0.155916 -0.145235 0.100191 0.0122592 -0.0975746 0.084712 0.0793246 -0.127621 -0.138904 -0.0396337 0.051353 0.0694902 -0.101718 0.155168 -0.0161729 -0.0500199 -0.0808593 -0.0153975 0.136478 -0.135224 0.048404 -0.131017 -0.00659909 -0.051245 -0.157423 0.0955733 0.0118326 0.112158 -0.0302762 -0.0169311 -0.0305343 0.00550154 -0.0261732 0.101492 0.00525419 0.0376769 -0.0648099 0.0561981 0.0145137 -0.00975775 -0.049316 0.0864998 0.117917 -0.0191459 -0.0422518 0.0561062 0.0667031 -0.195196 -0.112407 -0.0342688 -0.0633346 -0.0576224 -0.106321 -0.0126864 -0.022043 0.0213179 0.0152947 -0.0149141 -0.0164163 0.120395 -0.0620763 0.0412112 -0.0941885 0.0887248 -0.0207333 -0.0545052 -0.00902349 0.0988479 -0.0546657 0.005665 0.0420439 0.0527929 -0.0755879 -0.0429693 -0.0135167 0.190201 0.0345901 0.0221723 -0.0968775 0.117217 -0.0330934 0.0444512 -0.0385877 -0.0393284 
0.0905657 0.038226 -0.00733678 0.0293504 0.132804 0.196068 0.107908 0.0412869 0.0165384 -0.0202789 0.0882416 0.11294 0.0880032 -0.173984 -0.00385658 -0.0324228 -0.0594315 0.138515 -0.217889 0.107754 0.179155 -0.0355646 0.0235952 0.24492 0.0114798 -0.169354 -0.0975259 -0.184626 0.0408187 0.0901927 0.0354761 0.00195368 -0.0736246 0.135903 -0.0270539 -0.0149354 -0.0637312 -0.0205932 -0.099439 0.00381055 0.105851 -0.0470545 -0.0314825 0.115367 -0.155916 -0.145235 0.100191 0.0122592 -0.0975746 0.084712 0.0793246 -0.127621 -0.138904 -0.0396337 0.051353 0.0694902 -0.101718 0.155168 -0.0161729 -0.0500199 -0.0808593 -0.0153975 0.136478 -0.135224 0.048404 -0.131017 -0.00659909 -0.051245 -0.157423 0.0955733 0.0118326 0.112158 -0.0302762 -0.0169311 -0.0305343 0.00550154 -0.0261732 0.101492 0.00525419 0.0376769 -0.0648099 0.0561981 0.0145137 -0.00975775 -0.049316 0.0864998 0.117917 -0.0191459 -0.0422518 0.0561062 0.0667031 -0.195196 -0.112407 -0.0342688 -0.0633346 -0.0576224 -0.106321 -0.0126864 -0.022043 0.0213179 0.0152947 -0.0149141 -0.0164163 0.120395 -0.0620763 0.0412112 -0.0941885 0.0887248 -0.0207333 -0.0545052 -0.00902349 0.0988479 -0.0546657 0.005665 0.0420439 0.0527929 -0.0755879 -0.0429693 -0.0135167 0.190201 0.0345901 0.0221723 -0.0968775 0.117217 -0.0330934 0.0444512 -0.0385877 -0.0393284 
0.0905657 0.038226 -0.00733678 0.0293504 0.132804 0.196068 0.107908 0.0412869 0.0165384 -0.0202789 0.0882416 0.11294 0.0880032 -0.173984 -0.00385658 -0.0324228 -0.0594315 0.138515 -0.217889 0.107754 0.179155 -0.0355646 0.0235952 0.24492 0.0114798 -0.169354 -0.0975259 -0.184626 0.0408187 0.0901927 0.0354761 0.00195368 -0.0736246 0.135903 -0.0270539 -0.0149354 -0.0637312 -0.0205932 -0.099439 0.00381055 0.105851 -0.0470545 -0.0314825 0.115367 -0.155916 -0.145235 0.100191 0.0122592 -0.0975746 0.084712 0.0793246 -0.127621 -0.138904 -0.0396337 0.051353 0.0694902 -0.101718 0.155168 -0.0161729 -0.0500199 -0.0808593 -0.0153975 0.136478 -0.135224 0.048404 -0.131017 -0.00659909 -0.051245 -0.157423 0.0955733 0.0118326 0.112158 -0.0302762 -0.0169311 -0.0305343 0.00550154 -0.0261732 0.101492 0.00525419 0.0376769 -0.0648099 0.0561981 0.0145137 -0.00975775 -0.049316 0.0864998 0.117917 -0.0191459 -0.0422518 0.0561062 0.0667031 -0.195196 -0.112407 -0.0342688 -0.0633346 -0.0576224 -0.106321 -0.0126864 -0.022043 0.0213179 0.0152947 -0.0149141 -0.0164163 0.120395 -0.0620763 0.0412112 -0.0941885 0.0887248 -0.0207333 -0.0545052 -0.00902349 0.0988479 -0.0546657 0.005665 0.0420439 0.0527929 -0.0755879 -0.0429693 -0.0135167 0.190201 0.0345901 0.0221723 -0.0968775 0.117217 -0.0330934 0.0444512 -0.0385877 -0.0393284 
0.0905657 0.038226 -0.00733678 0.0293504 0.132804 0.196068 0.107908 0.0412869 0.0165384 -0.0202789 0.0882416 0.11294 0.0880032 -0.173984 -0.00385658 -0.0324228 -0.0594315 0.138515 -0.217889 0.107754 0.179155 -0.0355646 0.0235952 0.24492 0.0114798 -0.169354 -0.0975259 -0.184626 0.0408187 0.0901927 0.0354761 0.00195368 -0.0736246 0.135903 -0.0270539 -0.0149354 -0.0637312 -0.0205932 -0.099439 0.00381055 0.105851 -0.0470545 -0.0314825 0.115367 -0.155916 -0.145235 0.100191 0.0122592 -0.0975746 0.084712 0.0793246 -0.127621 -0.138904 -0.0396337 0.051353 0.0694902 -0.101718 0.155168 -0.0161729 -0.0500199 -0.0808593 -0.0153975 0.136478 -0.135224 0.048404 -0.131017 -0.00659909 -0.051245 -0.157423 0.0955733 0.0118326 0.112158 -0.0302762 -0.0169311 -0.0305343 0.00550154 -0.0261732 0.101492 0.00525419 0.0376769 -0.0648099 0.0561981 0.0145137 -0.00975775 -0.049316 0.0864998 0.117917 -0.0191459 -0.0422518 0.0561062 0.0667031 -0.195196 -0.112407 -0.0342688 -0.0633346 -0.0576224 -0.106321 -0.0126864 -0.022043 0.0213179 0.0152947 -0.0149141 -0.0164163 0.120395 -0.0620763 0.0412112 -0.0941885 0.0887248 -0.0207333 -0.0545052 -0.00902349 0.0988479 -0.0546657 0.005665 0.0420439 0.0527929 -0.0755879 -0.0429693 -0.0135167 0.190201 0.0345901 0.0221723 -0.0968775 0.117217 -0.0330934 0.0444512 -0.0385877 -0.0393284 
0.0905657 0.038226 -0.00733678 0.0293504 0.132804 0.196068 0.107908 0.0412869 0.0165384 -0.0202789 0.0882416 0.11294 0.0880032 -0.173984 -0.00385658 -0.0324228 -0.0594315 0.138515 -0.217889 0.107754 0.179155 -0.0355646 0.0235952 0.24492 0.0114798 -0.169354 -0.0975259 -0.184626 0.0408187 0.0901927 0.0354761 0.00195368 -0.0736246 0.135903 -0.0270539 -0.0149354 -0.0637312 -0.0205932 -0.099439 0.00381055 0.105851 -0.0470545 -0.0314825 0.115367 -0.155916 -0.145235 0.100191 0.0122592 -0.0975746 0.084712 0.0793246 -0.127621 -0.138904 -0.0396337 0.051353 0.0694902 -0.101718 0.155168 -0.0161729 -0.0500199 -0.0808593 -0.0153975 0.136478 -0.135224 0.048404 -0.131017 -0.00659909 -0.051245 -0.157423 0.0955733 0.0118326 0.112158 -0.0302762 -0.0169311 -0.0305343 0.00550154 -0.0261732 0.101492 0.00525419 0.0376769 -0.0648099 0.0561981 0.0145137 -0.00975775 -0.049316 0.0864998 0.117917 -0.0191459 -0.0422518 0.0561062 0.0667031 -0.195196 -0.112407 -0.0342688 -0.0633346 -0.0576224 -0.106321 -0.0126864 -0.022043 0.0213179 0.0152947 -0.0149141 -0.0164163 0.120395 -0.0620763 0.0412112 -0.0941885 0.0887248 -0.0207333 -0.0545052 -0.00902349 0.0988479 -0.0546657 0.005665 0.0420439 0.0527929 -0.0755879 -0.0429693 -0.0135167 0.190201 0.0345901 0.0221723 -0.0968775 0.117217 -0.0330934 0.0444512 -0.0385877 -0.0393284 
0.0905657 0.038226 -0.00733678 0.0293504 0.132804 0.196068 0.107908 0.0412869 0.0165384 -0.0202789 0.0882416 0.11294 0.0880032 -0.173984 -0.00385658 -0.0324228 -0.0594315 0.138515 -0.217889 0.107754 0.179155 -0.0355646 0.0235952 0.24492 0.0114798 -0.169354 -0.0975259 -0.184626 0.0408187 0.0901927 0.0354761 0.00195368 -0.0736246 0.135903 -0.0270539 -0.0149354 -0.0637312 -0.0205932 -0.099439 0.00381055 0.105851 -0.0470545 -0.0314825 0.115367 -0.155916 -0.145235 0.100191 0.0122592 -0.0975746 0.084712 0.0793246 -0.127621 -0.138904 -0.0396337 0.051353 0.0694902 -0.101718 0.155168 -0.0161729 -0.0500199 -0.0808593 -0.0153975 0.136478 -0.135224 0.048404 -0.131017 -0.00659909 -0.051245 -0.157423 0.0955733 0.0118326 0.112158 -0.0302762 -0.0169311 -0.0305343 0.00550154 -0.0261732 0.101492 0.00525419 0.0376769 -0.0648099 0.0561981 0.0145137 -0.00975775 -0.049316 0.0864998 0.117917 -0.0191459 -0.0422518 0.0561062 0.0667031 -0.195196 -0.112407 -0.0342688 -0.0633346 -0.0576224 -0.106321 -0.0126864 -0.022043 0.0213179 0.0152947 -0.0149141 -0.0164163 0.120395 -0.0620763 0.0412112 -0.0941885 0.0887248 -0.0207333 -0.0545052 -0.00902349 0.0988479 -0.0546657 0.005665 0.0420439 0.0527929 -0.0755879 -0.0429693 -0.0135167 0.190201 0.0345901 0.0221723 -0.0968775 0.117217 -0.0330934 0.0444512 -0.0385877 -0.0393284 
