0.0863531 0.0258659 -0.130333 -0.0192687 0.0392532 0.18384 0.00839105 -0.0566642 -0.174501 0.0581885 0.0771324 0.103346 0.0986765 -0.0435616 -0.010902 -0.0251672 -0.0954325 0.00991584 0.00247865 0.112612 0.0444255 -0.0475463 0.0776894 0.176404 0.0162165 0.0494274 0.0511396 -0.181932 0.0338746 0.0995139 -0.0425113 0.000718143 -0.118872 0.0268389 -0.100348 0.0531895 -0.172809 0.00837698 -0.0156492 0.0902079 -0.0309534 -0.0936662 -0.117962 0.159257 -0.153305 0.00940559 0.161368 0.0375852 -0.127469 0.0698454 0.131348 0.0374725 -0.0927523 -0.0386936 0.0772277 0.022081 -0.023383 0.251193 0.0740276 -0.0264455 -0.0725505 0.00695404 0.253208 -0.0633626 0.0193229 -0.112869 0.0204811 0.0428374 -0.0585556 0.136282 -0.0138812 0.174165 -0.0496968 0.0535242 0.0332085 -0.0319103 -0.0468547 0.0555963 0.00670781 0.146163 -0.0068493 -0.0354733 -0.0014598 -0.076856 -0.126472 -0.0255755 0.0883861 -0.0605973 0.00926946 -0.0287324 0.0134849 -0.0657824 -0.0380212 0.011549 -0.0541025 -0.0788413 0.0199531 0.0424014 0.10733 -0.0848074 -0.0168178 0.0785675 -0.0163661 0.0947109 -0.150654 0.0685268 -0.153148 0.112097 0.00273301 -0.0818619 0.0962687 0.188619 -0.0142327 -0.0375562 0.0234584 0.0977991 -0.0399897 -0.0713599 0.0412896 0.167269 0.0349338 -0.110575 -0.00595763 0.0152891 -0.114655 0.102278 -0.0325322 0.0343049 
0.09965 0.0201853 -0.130852 -0.0206927 0.050326 0.187049 0.0200277 -0.0548604 -0.17333 0.0487615 0.07926 0.10437 0.105832 -0.0432128 -0.015033 -0.0276821 -0.0942685 0.0116141 -0.0198818 0.118026 0.0517074 -0.0466057 0.0715584 0.172282 0.0121617 0.0391806 0.0350734 -0.177218 0.0308801 0.101244 -0.0477477 0.00917782 -0.134784 0.033545 -0.101806 0.0509811 -0.177208 0.00480341 -0.012722 0.0874479 -0.024976 -0.0878779 -0.118343 0.155069 -0.152999 0.00598488 0.15238 0.0465072 -0.12384 0.0758362 0.126051 0.0356987 -0.102891 -0.0347569 0.0730859 0.00918011 -0.030984 0.252483 0.0683793 -0.0238661 -0.0677315 0.0153086 0.252011 -0.0587513 0.00631487 -0.113582 0.0224676 0.051905 -0.0568587 0.12679 -0.00430292 0.177004 -0.0395163 0.0558258 0.0238537 -0.0303904 -0.0460442 0.0435435 0.0084514 0.151168 0.00327 -0.033297 -0.00168187 -0.0797202 -0.129386 -0.0166397 0.0928026 -0.059286 0.00688265 -0.0278541 0.0241423 -0.0716676 -0.0420039 0.0114931 -0.0643856 -0.083567 0.0162851 0.0322741 0.0986662 -0.0841997 -0.0120872 0.0769769 -0.0148916 0.100709 -0.151523 0.0706892 -0.159043 0.126047 0.00147916 -0.0762068 0.101574 0.186433 -0.0241105 -0.0271158 0.0197774 0.099296 -0.0451947 -0.0608007 0.0370067 0.16445 0.0264477 -0.105679 -0.00268802 0.0243054 -0.113652 0.0931475 -0.0391982 0.0268039 
0.0996691 0.017622 -0.128116 -0.0325962 0.0602392 0.19528 0.0197715 -0.0438582 -0.157423 0.0138521 0.0614338 0.103846 0.0973199 -0.0693835 -0.0273589 -0.0313407 -0.121702 0.00422276 -0.0536596 0.121373 0.061273 -0.041967 0.0858339 0.150449 0.000206804 0.0293799 0.0261342 -0.188413 0.0115161 0.078493 -0.0399463 -0.00201456 -0.136286 0.0480847 -0.0927341 0.0438511 -0.168264 0.0178509 -0.0275519 0.0852336 -0.00548563 -0.0832798 -0.111898 0.165251 -0.164553 0.00516923 0.155504 0.0439724 -0.129273 0.105788 0.103125 0.00828923 -0.112563 -0.0200879 0.0745011 -0.00541883 -0.0259012 0.244202 0.0597697 -0.0415911 -0.064105 0.0225794 0.256765 -0.0529183 0.0117199 -0.132946 0.0188984 0.0576304 -0.0442037 0.135867 0.00337703 0.170992 -0.0255321 0.0610018 0.0205481 -0.0292546 -0.0647367 0.0369904 0.00140262 0.145641 0.00215638 -0.0213549 -0.00134002 -0.0706129 -0.139936 -0.000574356 0.0996888 -0.0439831 0.000932214 -0.0229132 0.0445736 -0.0904468 -0.055359 -0.0137929 -0.0642382 -0.0806624 0.0097175 0.0425123 0.082303 -0.0773785 -0.0232882 0.0620085 -0.0140125 0.104783 -0.144822 0.0579582 -0.171184 0.148453 -0.0158973 -0.0720056 0.10645 0.188807 -0.0320338 -0.0166984 0.015933 0.0997151 -0.0500483 -0.063882 0.0398755 0.161952 0.0329476 -0.0762529 0.00711149 0.0362419 -0.107625 0.0640315 -0.0393171 0.0261448 
0.122995 0.0285677 -0.13553 -0.0369645 0.081251 0.211072 0.0232058 -0.0714587 -0.165927 -0.00864961 0.0552637 0.0907919 0.100429 -0.0406481 -0.0179944 -0.0405122 -0.11914 0.0107789 -0.0497496 0.115426 0.0679935 -0.0254893 0.0846059 0.124082 0.0142793 0.00439925 0.0046216 -0.172415 -0.00150019 0.107571 -0.0451364 -0.000855561 -0.152774 0.0487815 -0.0627069 0.0524549 -0.161439 -0.00797009 -0.00546509 0.0622724 -0.0202806 -0.0714032 -0.0874457 0.15459 -0.165822 0.0276469 0.151366 0.0602272 -0.131674 0.121989 0.0970917 0.0148934 -0.100998 -0.00848361 0.0762162 -0.0207284 -0.0345103 0.246173 0.0449536 -0.0376604 -0.0545003 0.0461531 0.264762 -0.0707937 0.00637651 -0.125943 0.0156458 0.0736648 -0.0555875 0.139188 0.0225102 0.176991 -0.0270205 0.0396258 -0.00405674 -0.0161849 -0.0568687 -0.00320237 0.00296034 0.151381 0.0298479 -0.0175708 -0.00699451 -0.0654217 -0.140744 0.00179135 0.0765391 -0.0581322 -0.000812596 0.00740415 0.0667325 -0.103886 -0.058769 -0.00720568 -0.0753239 -0.0876131 0.00358945 0.0508374 0.0796723 -0.0768569 -0.00952939 0.0793487 -0.0139482 0.0910398 -0.157028 0.0732625 -0.16893 0.157048 -0.0240003 -0.043135 0.122647 0.158071 -0.0446028 0.00251302 0.00722309 0.108754 -0.0430491 -0.0413603 0.0330833 0.162913 0.0334953 -0.0839622 0.023549 0.0401526 -0.0980052 0.0527925 -0.0185501 0.0191955 
0.119859 0.0433774 -0.145266 -0.0374469 0.0882081 0.206386 0.0271098 -0.0728723 -0.176158 0.0152848 0.0603696 0.0872449 0.114109 -0.0394602 -0.0259792 -0.0324031 -0.106022 0.0367207 -0.0603312 0.123534 0.0649591 -0.0359401 0.0867066 0.120727 0.00877686 -0.00908792 -0.00799768 -0.159062 0.0141449 0.113946 -0.05481 0.0101835 -0.158579 0.0407718 -0.0664135 0.0446991 -0.172988 -0.0152275 -0.0030574 0.0629771 -0.0297017 -0.0705205 -0.0841647 0.154578 -0.170044 0.0178044 0.148495 0.0747192 -0.129311 0.123741 0.107787 0.0189501 -0.117994 -0.0169429 0.0521899 -0.0254953 -0.031421 0.238017 0.0591928 -0.0313052 -0.0555247 0.0520491 0.259959 -0.0672314 -0.00208898 -0.130529 0.00830878 0.0675068 -0.0689439 0.128281 0.0268202 0.180027 -0.0155518 0.0436125 -0.0176432 -0.0169301 -0.0504053 -0.00345487 0.00344748 0.138883 0.0362643 -0.025241 -0.00961907 -0.0554284 -0.13915 0.0111013 0.0670459 -0.0630907 0.0105878 0.00208448 0.0545639 -0.0974599 -0.0586936 -0.00834027 -0.0693616 -0.095731 -0.00395668 0.0608484 0.0623288 -0.0779169 -0.00167702 0.0851235 -0.00694594 0.102181 -0.14948 0.0763544 -0.163297 0.164716 -0.00796401 -0.0348853 0.116015 0.153406 -0.0377002 0.0162643 -0.00909447 0.100733 -0.0386975 -0.0238814 0.0317798 0.1592 0.0176927 -0.0953194 0.0163721 0.0377135 -0.106661 0.051005 -0.0373742 0.0145902 
0.106227 0.0403643 -0.12416 -0.0507495 0.0696572 0.225824 0.0266749 -0.0630047 -0.176069 0.0166377 0.0546892 0.0746388 0.0963622 -0.037299 0.0119649 -0.0508665 -0.124461 0.00360396 -0.0255915 0.0896617 0.0435432 -0.0218836 0.068863 0.123783 0.0215142 0.0107121 0.00465422 -0.161888 0.0158167 0.0851262 -0.0224961 -0.0107774 -0.168708 0.0315586 -0.059789 0.0650073 -0.168116 -0.0300749 0.00769757 0.0817635 -0.00384718 -0.081329 -0.101871 0.153288 -0.162488 0.0307818 0.142635 0.0672932 -0.138884 0.0933683 0.0841167 0.0227711 -0.10021 -0.0265315 0.0531848 -0.00383091 -0.0460265 0.269409 0.0429357 -0.0239217 -0.0674374 0.0605405 0.26873 -0.0781702 0.0117979 -0.0965732 0.027951 0.0644738 -0.059799 0.140986 0.0208162 0.191113 -0.0307579 0.0528729 0.0115458 -0.0238121 -0.0637575 1.97936e-05 0.013743 0.143676 0.0226757 -0.0267743 -0.00233006 -0.0643155 -0.144999 -0.00636532 0.0840222 -0.0656701 -0.00435222 -0.00315584 0.0706831 -0.0870438 -0.0388145 -0.00782326 -0.0663198 -0.090749 0.0128413 0.0438977 0.077503 -0.0684031 -0.0223261 0.0792309 -0.0189577 0.0757634 -0.160682 0.0908551 -0.160293 0.143791 -0.0222431 -0.0440253 0.130743 0.152166 -0.0349138 -0.00895233 0.0111642 0.101353 -0.0401735 -0.0357259 0.0446951 0.161072 0.0456714 -0.118968 0.0132409 0.0377003 -0.105345 0.0637778 -0.0340508 0.0279609 
0.129642 0.0332295 -0.134894 -0.0346489 0.0934524 0.206317 0.038243 -0.0622433 -0.17297 0.00426859 0.0587819 0.0986916 0.109324 -0.0541878 -0.0312166 -0.0265148 -0.0971399 0.0276414 -0.0892716 0.132682 0.0559324 -0.0273624 0.0829177 0.130727 -0.00617061 -0.0098017 -0.00949554 -0.147072 0.00802111 0.0950856 -0.0575648 0.0143038 -0.167062 0.0600163 -0.0789124 0.0360861 -0.16955 -0.00570683 -0.012819 0.0716398 -0.0172649 -0.0627454 -0.083141 0.143453 -0.162006 0.00376723 0.137794 0.0765058 -0.126975 0.144083 0.111166 0.000473818 -0.131111 -0.0162184 0.0516274 -0.0342126 -0.0447235 0.247396 0.0547808 -0.0237219 -0.0607292 0.0589291 0.253984 -0.0706492 -0.00701474 -0.127227 0.00466407 0.0642967 -0.0848369 0.118099 0.0245364 0.174321 -0.00137215 0.0678145 -0.0174103 -0.0203733 -0.0375757 -0.00878421 0.00715923 0.13272 0.046263 -0.029485 -0.00630533 -0.0641951 -0.139257 0.00597598 0.0724361 -0.0585473 0.00580585 0.00701637 0.0596966 -0.106942 -0.0624751 -0.00235125 -0.0613989 -0.076037 -5.79604e-05 0.0393186 0.0498895 -0.0677819 -0.0102148 0.0772369 -0.0181821 0.116148 -0.147999 0.0713147 -0.169865 0.160553 -0.0138984 -0.041301 0.12527 0.169823 -0.0256375 0.0334184 -0.0102652 0.0920373 -0.0421763 -0.00761244 0.0261749 0.157432 0.0104963 -0.0853398 0.0203973 0.0406418 -0.0973936 0.0442719 -0.0481589 -0.00936115 
0.121498 0.0456661 -0.12369 -0.0510802 0.0734054 0.226253 0.0369244 -0.0607035 -0.166253 0.00787139 0.0620934 0.0805724 0.103006 -0.0405209 0.00592245 -0.0531844 -0.111598 0.00729218 -0.0591293 0.0966401 0.0417781 -0.00230327 0.0572817 0.1335 0.00601407 -0.00459566 0.00487017 -0.145621 0.0103526 0.0963233 -0.0385743 -0.00662506 -0.168514 0.0509137 -0.062096 0.0551727 -0.156275 -0.0317409 -0.00569763 0.0845539 -0.00343619 -0.0775157 -0.0920473 0.152359 -0.159905 0.0257547 0.135483 0.0775996 -0.138666 0.114583 0.0986746 0.0144873 -0.111243 -0.0204537 0.0546299 -0.00941499 -0.0668221 0.262961 0.0444982 -0.0238461 -0.0718491 0.0584964 0.258086 -0.0787921 -0.00655446 -0.10596 0.0287788 0.0638274 -0.0751844 0.126995 0.0269315 0.17207 -0.0166566 0.0501178 0.0049113 -0.0181989 -0.0573503 -0.00892112 0.0140848 0.143349 0.0470599 -0.0264106 -0.00300116 -0.0680051 -0.139652 0.000178128 0.0821194 -0.0781872 -0.00584207 0.0208937 0.0679356 -0.108848 -0.0501162 -0.00341156 -0.0753731 -0.0807808 0.00479787 0.0236886 0.070905 -0.0701072 -0.0126278 0.0883202 -0.0159933 0.0863776 -0.168996 0.0826514 -0.172107 0.145992 -0.0350357 -0.039658 0.145954 0.153349 -0.0373309 0.00648319 -0.00467677 0.0960807 -0.0444445 -0.0249307 0.0348492 0.156169 0.0432299 -0.114089 0.0186617 0.0481871 -0.0891151 0.0507939 -0.0352396 0.00542994 
0.13715 0.03783 -0.138135 -0.0463299 0.0961123 0.210561 0.0375018 -0.061864 -0.184497 0.00215078 0.0537724 0.0772337 0.112431 -0.033746 -0.0169903 -0.0295338 -0.099088 0.0184949 -0.0710619 0.128324 0.0593035 -0.0249902 0.0867477 0.101175 0.00229628 -0.00416105 -0.0207198 -0.146972 0.0191761 0.0938168 -0.0544395 0.0209688 -0.176085 0.0523059 -0.0695296 0.0447523 -0.163215 0.0057699 0.00841228 0.0609529 -0.0209798 -0.0590427 -0.0827975 0.136151 -0.166089 0.0204076 0.138011 0.0789113 -0.130853 0.134056 0.0907564 0.0206387 -0.126865 -0.00392884 0.0519356 -0.0439794 -0.0311917 0.247147 0.0487056 -0.03292 -0.0576658 0.0617685 0.26227 -0.0760503 -0.00769214 -0.111177 0.0127021 0.0789606 -0.0639508 0.125335 0.0297746 0.185332 -0.00738552 0.0717972 -0.017445 -0.0293763 -0.0415638 -0.0148067 0.0114528 0.131461 0.0478259 -0.0210609 -0.00740358 -0.0685943 -0.130575 0.00305557 0.0676804 -0.0487292 0.0149568 0.00388594 0.082663 -0.101734 -0.059309 -0.00675346 -0.0617561 -0.0938197 0.0112276 0.057181 0.0532709 -0.0722058 -0.0148227 0.082162 -0.0141076 0.11244 -0.158499 0.082251 -0.165559 0.168054 0.00235435 -0.0409222 0.124746 0.1646 -0.0439572 0.0344426 0.00217745 0.091632 -0.0342378 -0.0224318 0.0311042 0.151501 0.0148985 -0.0830859 0.0367941 0.0474597 -0.101591 0.0339191 -0.0343139 0.00272959 
0.136214 0.0472572 -0.138594 -0.0425662 0.094715 0.196092 0.0334654 -0.0589498 -0.184798 -0.00328506 0.0526658 0.0921984 0.10842 -0.047717 -0.0444417 -0.00889644 -0.0834232 0.0166977 -0.0911883 0.142009 0.0607852 -0.0250603 0.0858718 0.109095 -0.00867587 0.00409881 -0.0107553 -0.133733 0.0252966 0.0931941 -0.0662115 0.0231482 -0.168235 0.0619061 -0.0862792 0.0258362 -0.162926 0.0271294 0.00164538 0.0704802 -0.0326309 -0.049544 -0.0684171 0.132047 -0.147424 0.00989712 0.144962 0.0672029 -0.135791 0.149474 0.108645 0.0148612 -0.140359 -0.00374449 0.0527399 -0.0497186 -0.0315714 0.24697 0.0534666 -0.0367626 -0.056529 0.0540854 0.259813 -0.0743775 -0.00929892 -0.124684 0.000676314 0.0703385 -0.0803635 0.114424 0.0274492 0.172188 0.000789926 0.0867706 -0.0153709 -0.02762 -0.0266103 -0.00897402 0.00688075 0.124007 0.0518457 -0.0206216 -0.000642955 -0.0656818 -0.128648 -0.00564877 0.0628197 -0.0449207 0.0234049 0.00296374 0.0588474 -0.110162 -0.0686921 0.00443454 -0.0411047 -0.0752907 0.0174328 0.0541925 0.040237 -0.0673918 -0.0262881 0.079926 -0.0253151 0.141143 -0.161816 0.0729748 -0.16898 0.166914 0.00359014 -0.0578641 0.125338 0.177045 -0.0385886 0.0566863 -0.00351283 0.0838698 -0.0438348 -0.0113031 0.025169 0.148204 -0.00268756 -0.0625306 0.0397225 0.0346999 -0.0949853 0.0341456 -0.0422631 -0.0203687 
0.135458 0.0348746 -0.139505 -0.0424496 0.101677 0.207144 0.0360461 -0.0627151 -0.177689 -0.0127619 0.0490472 0.0854885 0.11086 -0.0401604 -0.0314066 -0.0268552 -0.0975826 0.0180432 -0.0894781 0.136296 0.0608459 -0.0269723 0.0920429 0.106881 -0.003748 -0.013869 -0.0200751 -0.14089 0.00946217 0.0912134 -0.0556428 0.0173903 -0.172425 0.0595671 -0.0738381 0.0402529 -0.162716 0.00671638 -0.00576613 0.0612495 -0.0163423 -0.0529724 -0.0739018 0.136046 -0.164794 0.011345 0.137724 0.0796284 -0.125156 0.149544 0.0909056 0.00281912 -0.128109 -0.00364951 0.0548014 -0.0473621 -0.0342395 0.247688 0.0512144 -0.036701 -0.0589449 0.0699146 0.257632 -0.0735735 -0.0103782 -0.115277 0.00596903 0.0752573 -0.0732196 0.117554 0.0294484 0.177934 0.0028399 0.073899 -0.0179208 -0.0219489 -0.0367767 -0.0203671 0.00934802 0.128222 0.052133 -0.0234818 -0.00632605 -0.0655215 -0.134927 0.00893967 0.0653928 -0.045937 0.0110925 0.00724918 0.0798966 -0.109993 -0.0623053 -0.0101792 -0.0581362 -0.0838018 0.00407199 0.0557704 0.0438132 -0.0675695 -0.0160236 0.0771807 -0.0144797 0.119535 -0.156717 0.0774205 -0.171767 0.170193 -0.00802066 -0.0395726 0.127706 0.166777 -0.037258 0.0453899 -0.00999141 0.0925708 -0.037342 -0.00837918 0.0275758 0.152284 0.00715834 -0.0752393 0.0329769 0.0437576 -0.102995 0.0315896 -0.0447647 -0.00714281 
0.129068 0.0397246 -0.13808 -0.0518107 0.0898632 0.205896 0.0322785 -0.0624796 -0.17799 0.00351125 0.0520275 0.0865485 0.115903 -0.0313031 -0.0217337 -0.0353862 -0.101422 0.00940731 -0.0745015 0.126771 0.052423 -0.0189473 0.0845543 0.105549 -0.00482962 -0.0025242 -0.0085638 -0.141917 0.00844383 0.100257 -0.061031 0.00503069 -0.167068 0.0482996 -0.0738437 0.0430957 -0.164764 0.00640294 -0.0034613 0.0733021 -0.0268827 -0.059669 -0.0876039 0.139636 -0.166538 0.0271355 0.134727 0.0761082 -0.12472 0.137687 0.103669 0.0226563 -0.127082 -0.0048583 0.0579693 -0.0420897 -0.0364582 0.245553 0.0504354 -0.0294215 -0.0594885 0.0553753 0.255112 -0.067716 -0.00817354 -0.128494 0.0130371 0.0867685 -0.0650184 0.120516 0.0409488 0.179382 -0.00418637 0.0577364 -0.0117485 -0.00906051 -0.0500194 -0.0165883 0.0127682 0.142495 0.0485991 -0.0302092 0.000852239 -0.0544406 -0.137378 -0.00102425 0.0743886 -0.0522132 0.0140264 0.0038033 0.0563908 -0.108286 -0.0529508 -0.000637397 -0.0714491 -0.0969618 0.0118636 0.0449101 0.0562076 -0.0765696 -0.00947823 0.0917225 -0.0156538 0.109493 -0.163147 0.0733188 -0.174737 0.163801 -0.0098947 -0.0386991 0.132822 0.158136 -0.0432213 0.0370072 -0.0114306 0.101018 -0.0448743 -0.014568 0.0205622 0.152141 0.0107651 -0.0865508 0.0278321 0.0400918 -0.0944725 0.0424775 -0.0393851 0.00462423 
0.134612 0.0443308 -0.141889 -0.0456392 0.0873199 0.204237 0.0336264 -0.0646966 -0.176375 -0.00341485 0.0523203 0.0827512 0.115573 -0.0415407 -0.0281757 -0.0317068 -0.0980258 0.00790381 -0.0841863 0.135805 0.0503454 -0.0209814 0.0855167 0.106572 -0.00939576 -0.00611565 -0.012001 -0.141132 0.00773896 0.0987216 -0.0613993 0.0140508 -0.167225 0.0570237 -0.0738743 0.0386057 -0.157749 0.0135484 -0.00566674 0.0678601 -0.0268652 -0.0648578 -0.081588 0.138328 -0.161471 0.0241283 0.137172 0.0815877 -0.127521 0.149827 0.101881 0.0190678 -0.125973 -0.00196762 0.0582486 -0.0486787 -0.038618 0.238339 0.0535592 -0.036577 -0.0615942 0.0579303 0.255184 -0.0719947 -0.0134593 -0.125887 0.0136241 0.0773748 -0.0729984 0.111772 0.0311938 0.169121 -0.00229443 0.0692556 -0.0118135 -0.0190019 -0.0417112 -0.0184099 0.0132584 0.14433 0.055495 -0.0322645 -0.00554866 -0.0624444 -0.131501 0.0023557 0.0647442 -0.0550287 0.0163781 0.0102913 0.0639557 -0.112518 -0.057104 -0.00318468 -0.0688921 -0.0892878 0.0133768 0.0463658 0.0527257 -0.0771543 -0.00976344 0.0910763 -0.0166851 0.118828 -0.161923 0.0717734 -0.172258 0.170955 -0.00811467 -0.0353458 0.133315 0.16522 -0.0429411 0.0417204 -0.0151848 0.0944564 -0.042238 -0.0134897 0.0241661 0.150419 0.00786452 -0.0807913 0.0356357 0.0448983 -0.0918888 0.0330313 -0.0369176 -0.00546364 
0.141402 0.0176893 -0.129046 -0.0324426 0.0971255 0.184382 0.0354372 -0.0499914 -0.16013 -0.0395695 0.0455588 0.0886259 0.123733 -0.0666939 -0.0633935 -0.00836435 -0.109832 0.00827882 -0.127756 0.176704 0.100262 -0.0510374 0.109306 0.0804618 -0.0230065 -0.00272413 -0.0489062 -0.165735 0.00747267 0.0877822 -0.0587337 0.0485663 -0.154761 0.0794449 -0.0802338 0.0212357 -0.157181 0.0783222 -0.00731881 0.0325783 -0.0266813 -0.0602043 -0.0790578 0.123192 -0.157195 -0.0134223 0.136787 0.0656775 -0.118429 0.165427 0.0757512 3.66939e-05 -0.127782 0.0225568 0.0667488 -0.0758164 -0.0102652 0.203174 0.0375051 -0.0662342 -0.047188 0.0434931 0.249382 -0.0572801 -0.00484393 -0.132361 0.00467643 0.0775788 -0.0607333 0.0976817 0.0209071 0.15227 0.00182531 0.0854206 -0.0263136 -0.0335436 -0.0312219 -0.0291478 0.0100948 0.152409 0.043104 -0.0287465 -0.00598219 -0.0616161 -0.117544 0.00849161 0.0697302 -0.00775982 0.0311478 -0.000869521 0.0857488 -0.121034 -0.0726151 0.0020735 -0.0755819 -0.0877352 0.00326297 0.0698128 0.0346827 -0.0637508 -0.00275457 0.0683324 -0.030629 0.148208 -0.126849 0.0601722 -0.159381 0.193682 0.0279486 -0.0545926 0.0868494 0.184418 -0.0753194 0.0564236 0.00680256 0.0989745 -0.0438983 -0.0190065 0.0218295 0.15205 -0.0163452 -0.0282277 0.0458393 0.0472625 -0.0849159 0.01699 -0.0216911 -0.00699407 
0.137415 0.0342179 -0.147914 -0.0337209 0.0913523 0.198345 0.0376358 -0.057985 -0.178454 -0.00654786 0.052979 0.0883508 0.118563 -0.0648166 -0.0462455 -0.0102666 -0.098956 0.0194719 -0.0949314 0.145642 0.0794059 -0.0432302 0.089797 0.101027 -0.00746236 -0.00041576 -0.0246044 -0.166556 0.0133053 0.102429 -0.0626926 0.0430381 -0.163413 0.0657248 -0.0781734 0.0234838 -0.161357 0.0264896 0.00129247 0.0504265 -0.0259215 -0.0709178 -0.0716021 0.13963 -0.153173 0.00730938 0.149516 0.067538 -0.138021 0.140527 0.101348 0.00256415 -0.12548 -0.00123946 0.0535792 -0.0501518 -0.0247964 0.225174 0.0520619 -0.0460602 -0.0495178 0.0479419 0.255669 -0.0697684 -0.00385548 -0.127085 0.000525985 0.069517 -0.0694275 0.100739 0.0138985 0.162847 -0.0100187 0.0679186 -0.0222132 -0.0283717 -0.0316954 -0.0128515 0.00239772 0.143299 0.0432565 -0.0295749 -0.0130954 -0.0667345 -0.132604 0.0147703 0.0671568 -0.0481648 0.01742 0.00112382 0.0676915 -0.111652 -0.0770336 -0.000788244 -0.0664006 -0.0732344 0.00865226 0.061319 0.0460392 -0.0686484 -0.00939559 0.0713262 -0.0202261 0.140428 -0.144876 0.0638988 -0.166548 0.189179 -0.00221862 -0.0504606 0.105371 0.172419 -0.0524536 0.0322788 0.000932807 0.0911144 -0.0488346 -0.0206349 0.0311399 0.152103 0.00134294 -0.0622831 0.0409772 0.0461483 -0.0902931 0.0277223 -0.0386538 -0.0129244 
0.150767 0.0159504 -0.137375 -0.0332344 0.103797 0.182231 0.0419321 -0.0549003 -0.171369 -0.0280437 0.0489585 0.0968674 0.117988 -0.0540318 -0.0548919 -0.00505943 -0.0886077 0.0126126 -0.114145 0.164577 0.0895514 -0.0346103 0.100818 0.0884332 -0.0191092 0.00736892 -0.0328537 -0.162579 0.00972535 0.0965109 -0.0720701 0.04696 -0.159246 0.0727397 -0.0802288 0.01773 -0.157482 0.070912 -0.00323462 0.0418647 -0.0335754 -0.0438492 -0.0817497 0.126408 -0.156119 0.00720126 0.136231 0.0600306 -0.12164 0.153825 0.0928376 0.00474887 -0.133156 0.0134898 0.0671595 -0.07132 -0.0157758 0.223698 0.038634 -0.0461559 -0.0442848 0.0368609 0.252111 -0.061625 0.000563468 -0.139767 -0.000385707 0.0879215 -0.0616893 0.101756 0.0281117 0.159561 0.00268591 0.0753475 -0.0321415 -0.0252626 -0.0312511 -0.0230417 0.00564862 0.142505 0.0470507 -0.0220982 -0.0108205 -0.0703531 -0.122596 -0.00735398 0.0718039 -0.022968 0.0204997 -0.00153956 0.073045 -0.115984 -0.0779033 0.00460501 -0.0636369 -0.0796404 0.0165143 0.0523437 0.0430736 -0.0640317 -0.00954326 0.0729651 -0.0274078 0.146894 -0.14602 0.0532543 -0.165967 0.181621 0.0201678 -0.0582141 0.107002 0.182846 -0.0632609 0.0534781 0.00975743 0.0971082 -0.0530914 -0.0230695 0.0146941 0.1463 -0.0168529 -0.0308492 0.0451558 0.047731 -0.0773048 0.0216108 -0.0293026 -0.0226775 
0.136434 0.0353765 -0.131277 -0.0372002 0.0877051 0.182572 0.0376376 -0.0497923 -0.176417 0.00712984 0.0557571 0.108059 0.109817 -0.0515192 -0.0470553 -0.00138089 -0.0709911 0.00876521 -0.105776 0.148741 0.0548954 -0.0196222 0.0752954 0.128223 -0.0228489 0.0172349 0.00184911 -0.132548 0.0183755 0.0939196 -0.0798575 0.0294132 -0.160232 0.0700374 -0.099594 0.0219109 -0.163888 0.0415027 -0.0195534 0.0762149 -0.038587 -0.0491045 -0.0778533 0.130966 -0.133457 0.0148182 0.138826 0.063566 -0.136953 0.148379 0.129198 0.00960417 -0.146795 -0.0115953 0.0685798 -0.0448284 -0.0500322 0.2468 0.0587064 -0.0292731 -0.0550148 0.0369187 0.246358 -0.0661814 -0.00605624 -0.136281 -0.00457132 0.0789216 -0.086083 0.107653 0.0272225 0.159951 0.00461272 0.079931 -0.0170737 -0.0176938 -0.0201136 0.00301147 0.0100669 0.123487 0.0563737 -0.0273001 -0.00497016 -0.075619 -0.131246 -0.0223157 0.0730739 -0.04694 0.0241419 0.0110651 0.0351725 -0.112495 -0.0724148 0.0183926 -0.0448916 -0.0531321 0.0269356 0.0223098 0.0492765 -0.0700077 -0.0176784 0.0810673 -0.0341122 0.138295 -0.169038 0.0574975 -0.182213 0.149228 -0.000978995 -0.0685654 0.130023 0.192424 -0.0346298 0.0509116 0.00344579 0.0814928 -0.058439 -0.0156598 0.011163 0.145705 -0.00816419 -0.054699 0.0401356 0.0375335 -0.0786385 0.0431962 -0.041984 -0.0407648 
0.144438 0.0288529 -0.139607 -0.0368272 0.0926685 0.18694 0.0394145 -0.0523717 -0.181768 -0.0139373 0.0499493 0.0891793 0.118935 -0.0486864 -0.041669 -0.0232412 -0.0927006 0.00342236 -0.0938492 0.156865 0.0697643 -0.0359283 0.0935938 0.0868472 -0.00972569 0.0069303 -0.0251189 -0.150871 0.0123443 0.0932368 -0.0703572 0.0369677 -0.162934 0.0661957 -0.0848386 0.0234701 -0.158169 0.0500769 -0.00142838 0.0495395 -0.0264833 -0.0586675 -0.0805904 0.133165 -0.164561 0.0148774 0.139289 0.065366 -0.12279 0.15003 0.0972519 0.0215517 -0.134237 0.0109759 0.0644758 -0.0679052 -0.0247615 0.221688 0.0486143 -0.0465475 -0.0499492 0.0392226 0.250321 -0.0597986 -0.0103061 -0.130864 0.0113197 0.0814087 -0.0582696 0.103911 0.0280556 0.167047 0.00140178 0.0810303 -0.0186133 -0.0271326 -0.0371555 -0.0187065 0.00974659 0.149951 0.0433134 -0.028985 -0.00188781 -0.0661616 -0.118056 -0.00409986 0.0718596 -0.0306461 0.0266765 -0.0041637 0.0696288 -0.110792 -0.0686258 -0.00130938 -0.0732376 -0.0973962 0.0227707 0.0529441 0.0480522 -0.0799146 -0.0170229 0.0854099 -0.0142709 0.139725 -0.156763 0.0639405 -0.166807 0.191094 0.0155618 -0.0524176 0.115424 0.176933 -0.0657421 0.0475797 0.000632564 0.0878281 -0.0430073 -0.0291796 0.0253455 0.147241 -0.00732045 -0.0487092 0.0422442 0.04828 -0.0819861 0.019726 -0.024766 -0.00744935 
0.128 0.0304815 -0.136769 -0.0233851 0.0834412 0.205857 0.0336192 -0.0675294 -0.164733 -0.0159482 0.0648462 0.0883027 0.106586 -0.0729349 -0.0509435 -0.0281029 -0.122071 0.0253201 -0.0847809 0.144044 0.0835016 -0.0521351 0.0902662 0.113121 0.00158252 -0.00652542 -0.0240056 -0.165953 0.0202685 0.0933203 -0.0473521 0.0236086 -0.164234 0.0618898 -0.0687931 0.0334037 -0.167176 0.0148914 0.0020555 0.0447624 -0.0118801 -0.0804249 -0.0843191 0.143686 -0.164938 -0.0127669 0.147069 0.0737435 -0.128523 0.141041 0.0767819 0.0170529 -0.119065 0.000131514 0.0542428 -0.0460474 -0.0226852 0.221724 0.0359467 -0.0496059 -0.0546614 0.054317 0.274211 -0.0628041 -0.00689944 -0.115292 0.013008 0.0491777 -0.0679622 0.120435 0.00682524 0.166798 -0.0116678 0.0854217 -0.0111704 -0.0464082 -0.0374731 -0.0100079 0.00414724 0.146605 0.0303012 -0.0217602 -0.00683739 -0.0683916 -0.127253 0.0216126 0.0664458 -0.0366178 0.0139168 -0.00194518 0.094261 -0.105349 -0.0631729 -0.00709617 -0.0689722 -0.100791 -0.00519919 0.0684021 0.0537447 -0.0734554 -0.00483926 0.0690238 -0.0178431 0.121863 -0.123861 0.0809673 -0.143221 0.188688 0.00739619 -0.0424142 0.0989089 0.171477 -0.0457956 0.026843 0.00454241 0.0954105 -0.0318356 -0.0210299 0.047457 0.159492 0.00775046 -0.0737841 0.0259664 0.0417693 -0.109453 0.0406624 -0.025536 0.0130951 
0.136385 0.0310602 -0.131713 -0.0380491 0.0914613 0.179826 0.0402802 -0.0668696 -0.142342 -0.0541982 0.0499374 0.0778545 0.113154 -0.0770514 -0.0739617 -0.000202445 -0.127056 -0.000923016 -0.138583 0.170004 0.100817 -0.0438412 0.108993 0.0488762 -0.0295112 0.0128894 -0.0475001 -0.165479 0.0172279 0.0780775 -0.0536979 0.0571225 -0.150293 0.0820261 -0.0617828 0.0172171 -0.132738 0.109211 0.00681985 0.0261334 -0.0172176 -0.0629751 -0.0724281 0.122931 -0.159354 -0.00420695 0.140642 0.0658905 -0.126304 0.157744 0.0457919 0.007337 -0.1275 0.0377217 0.0700925 -0.0833134 -0.00334315 0.194166 0.0130966 -0.0785941 -0.0518965 0.0305665 0.268114 -0.0547016 0.00651497 -0.117996 0.00750899 0.0800505 -0.0457475 0.103828 0.0148084 0.139855 0.00481784 0.103305 -0.0139075 -0.0515138 -0.042321 -0.0278208 0.000488677 0.137975 0.0501831 -0.00943587 -0.011698 -0.0679355 -0.117972 0.00845183 0.063349 0.00357713 0.0265335 0.00482696 0.112719 -0.130969 -0.0759035 -0.0122143 -0.0697431 -0.0930808 0.00488062 0.0798204 0.0454624 -0.0614127 -0.0104817 0.0579845 -0.0297885 0.153874 -0.116134 0.0577991 -0.14863 0.211098 0.037295 -0.05669 0.0849482 0.189459 -0.0839143 0.0659055 0.0183434 0.0896777 -0.0500414 -0.0294179 0.0323066 0.138817 -0.00369004 -0.0091424 0.0610658 0.058113 -0.0785581 0.00312264 -0.0118049 -0.00701108 
0.145028 0.00511159 -0.127052 -0.0357187 0.0976415 0.183492 0.0419999 -0.0504919 -0.147376 -0.0559072 0.0329294 0.084027 0.120502 -0.064855 -0.0536515 -0.0159165 -0.118918 -0.00538644 -0.134814 0.178763 0.0939081 -0.0446584 0.125355 0.0608837 -0.0349261 -0.00067754 -0.0520737 -0.175724 -0.0141202 0.0755359 -0.0571907 0.054125 -0.145623 0.0900516 -0.0702261 0.023898 -0.134997 0.107624 -0.0207111 0.023554 -0.0207986 -0.0574805 -0.0828047 0.11735 -0.171048 -0.00251596 0.131921 0.0662653 -0.111508 0.179124 0.0619486 -0.0148316 -0.118318 0.0376367 0.082547 -0.0826654 -0.0023843 0.194933 0.0312582 -0.0742555 -0.0474424 0.0404842 0.242597 -0.0618067 0.0097788 -0.130662 0.00820857 0.0893894 -0.0510984 0.1061 0.0183688 0.143718 0.00552696 0.0908285 -0.0256378 -0.0331173 -0.0379872 -0.0405227 0.0124305 0.146409 0.0435861 -0.0260756 -0.0177927 -0.0692931 -0.11459 -0.000297349 0.0704072 0.00270744 0.0270206 0.0103257 0.103582 -0.129434 -0.0671562 -0.014505 -0.0826574 -0.0839693 0.00626197 0.0701403 0.0458498 -0.0584019 -0.000271642 0.0662193 -0.0284943 0.140888 -0.121554 0.0447747 -0.166234 0.189892 0.0233405 -0.0489279 0.0870738 0.193376 -0.0762726 0.0525799 0.011134 0.10031 -0.0385949 -0.0333575 0.0194513 0.150291 -0.00443081 -0.0118613 0.0556467 0.06046 -0.0715414 -0.000256439 -0.0112707 -0.00800413 
0.127173 0.0093364 -0.124845 -0.0274455 0.075118 0.182878 0.0316457 -0.0651878 -0.136987 -0.0551951 0.0558854 0.0815646 0.114314 -0.0626962 -0.064019 -0.031572 -0.147322 -0.0162857 -0.112707 0.169776 0.0921693 -0.0622307 0.109071 0.0805197 -0.0154617 0.00940855 -0.0343671 -0.164344 0.00309353 0.0724621 -0.0446604 0.0280799 -0.14949 0.0749207 -0.0744689 0.038448 -0.148477 0.0853401 -0.00907314 0.0288216 -0.00748744 -0.0745534 -0.0933401 0.123401 -0.166784 -0.0170391 0.133991 0.0696744 -0.106216 0.158561 0.0325974 0.0133177 -0.109455 0.036058 0.0860372 -0.0715836 -0.0131648 0.203146 0.0168939 -0.0786005 -0.0561372 0.0446796 0.271099 -0.0439434 -0.00923282 -0.0959735 0.0262218 0.0750615 -0.0388245 0.111814 0.00754612 0.149787 -0.00290129 0.104653 0.00901515 -0.0487368 -0.0437358 -0.031694 0.011268 0.158575 0.0335214 -0.0246064 -0.00535966 -0.0765843 -0.119959 0.0162575 0.0711948 0.00559954 0.0271572 -0.00541045 0.122531 -0.119932 -0.0471899 -0.0109468 -0.0873976 -0.114367 -0.00656383 0.0734018 0.0685702 -0.0757832 -0.00351334 0.058011 -0.0194028 0.122094 -0.114081 0.078457 -0.147826 0.198857 0.026197 -0.0542895 0.0888228 0.192046 -0.0709436 0.0414965 0.0166133 0.10683 -0.0325917 -0.0274361 0.0432264 0.151918 0.0027976 -0.037944 0.0419837 0.0514084 -0.102598 0.0283623 -0.00546717 0.0258683 
0.126978 0.0199514 -0.123034 -0.0280622 0.0814513 0.181149 0.0381489 -0.071389 -0.134116 -0.0628514 0.049843 0.0834429 0.11126 -0.0724951 -0.0708225 -0.0218231 -0.148832 -0.0117151 -0.128647 0.169934 0.0963921 -0.0609474 0.113202 0.0649791 -0.0194843 0.00364071 -0.0431917 -0.163743 0.00111953 0.0766073 -0.0465204 0.0396881 -0.145593 0.0831364 -0.0670415 0.0273194 -0.139859 0.0947803 -0.00725263 0.0243742 -0.00806247 -0.0766125 -0.0761484 0.121081 -0.166945 -0.0144091 0.137658 0.0665673 -0.114 0.166494 0.0378226 0.00353761 -0.115173 0.0387462 0.0849202 -0.0753234 -0.0126377 0.197579 0.0107082 -0.0774364 -0.0547793 0.0408238 0.2675 -0.0493387 0.00296078 -0.103117 0.0133074 0.0708885 -0.0515343 0.113056 0.00825379 0.143214 -0.000471782 0.106289 0.00221356 -0.0460715 -0.0394964 -0.0379919 0.00640051 0.150659 0.0381815 -0.0252915 -0.0070966 -0.0677145 -0.123135 0.0144181 0.0658663 0.00573876 0.0254993 0.00600033 0.119133 -0.132011 -0.0575208 -0.0150378 -0.0841098 -0.103067 -0.00776471 0.078674 0.061714 -0.0658643 -0.00631232 0.0579556 -0.0243162 0.134732 -0.106586 0.0691495 -0.148538 0.210232 0.0269271 -0.0553695 0.0824317 0.18888 -0.0764251 0.052461 0.0152567 0.101092 -0.0333873 -0.0194761 0.043177 0.15473 0.00438723 -0.0245824 0.0456016 0.053198 -0.0886115 0.0166731 -0.00197314 0.0133481 
0.130717 0.031714 -0.147201 -0.0260204 0.0754472 0.21004 0.0254413 -0.081536 -0.167555 -0.00874986 0.0634677 0.0801435 0.105138 -0.0469271 -0.0413855 -0.0411965 -0.120455 0.0183699 -0.0573124 0.131953 0.0661303 -0.0479178 0.0951603 0.105366 0.00924283 0.00280377 -0.0118018 -0.161569 0.0124938 0.0945867 -0.0455888 0.0229781 -0.164079 0.0491041 -0.065454 0.0452862 -0.163763 0.0166969 0.011854 0.0463021 -0.019044 -0.0780041 -0.094413 0.137212 -0.172582 0.000426647 0.141598 0.0777492 -0.120461 0.134122 0.0747774 0.0404549 -0.100374 0.00609978 0.0590857 -0.0465983 -0.00969088 0.224986 0.0417285 -0.0547531 -0.0578414 0.0578799 0.280401 -0.06818 -0.0121877 -0.0994716 0.0260114 0.065581 -0.0547977 0.136687 0.00951226 0.174322 -0.0175153 0.0847812 -0.00405384 -0.0472439 -0.0458213 -0.0199315 0.00400792 0.148849 0.0290356 -0.0165944 -0.00571993 -0.0773211 -0.122997 0.0104038 0.0616597 -0.0392028 0.0177882 -0.00620969 0.0958538 -0.0966295 -0.0438718 -0.0107006 -0.069459 -0.115431 0.00218615 0.0749503 0.0711794 -0.0846228 0.000529388 0.0796083 -0.0091126 0.111432 -0.132065 0.0842203 -0.144306 0.175384 0.00600863 -0.036545 0.109195 0.173525 -0.0402852 0.0206279 0.00506097 0.0967693 -0.0279301 -0.0320698 0.0542373 0.153948 0.0200761 -0.0881773 0.0332995 0.0345172 -0.112664 0.0437435 -0.0166292 0.0299999 
0.144121 0.00195459 -0.137785 -0.0185162 0.0811702 0.199694 0.0402512 -0.0682996 -0.15944 -0.0277979 0.0568733 0.0932229 0.113537 -0.0483066 -0.0470019 -0.0499256 -0.114108 0.00898759 -0.0796704 0.153435 0.076435 -0.0528631 0.0963536 0.107059 -0.00434566 0.00610234 -0.0262113 -0.168805 -0.00344526 0.0885401 -0.0512605 0.0372684 -0.164985 0.0658547 -0.0745988 0.0373835 -0.158605 0.0461338 -0.00197798 0.0325445 -0.0102182 -0.0676041 -0.102017 0.129359 -0.176573 -0.0134903 0.13061 0.0713656 -0.103826 0.14547 0.0697856 0.0224618 -0.102955 0.0189108 0.0753502 -0.0602168 -0.0146313 0.22026 0.0375027 -0.0606703 -0.0501985 0.0508462 0.266103 -0.0630687 -0.0137152 -0.105922 0.0330144 0.0716819 -0.0494143 0.121054 0.00963958 0.166414 -0.00832138 0.0923769 -0.0142519 -0.045532 -0.0398073 -0.0292799 0.0120858 0.157735 0.0243901 -0.0200936 -0.00527991 -0.0863611 -0.111332 -0.000899329 0.0764875 -0.0222877 0.0199634 -0.011391 0.103287 -0.104798 -0.0410069 -0.0107712 -0.0838374 -0.115061 0.00745343 0.060395 0.0681544 -0.0802423 0.00131106 0.0784034 -0.0113593 0.12326 -0.130909 0.0725595 -0.151024 0.178698 0.0081259 -0.0398737 0.104131 0.183701 -0.0562361 0.0246382 0.0087903 0.099346 -0.0279622 -0.0399551 0.0415762 0.152696 0.00671256 -0.0635549 0.0342488 0.0430365 -0.100887 0.032286 -0.0157938 0.0209373 
0.132357 0.00403856 -0.132575 -0.0217298 0.0776207 0.191776 0.0350374 -0.062578 -0.151557 -0.0376246 0.0501309 0.092765 0.114531 -0.0643975 -0.0575596 -0.0343553 -0.132865 -0.00470368 -0.101502 0.164603 0.0812269 -0.0569722 0.10251 0.0897473 -0.0147434 0.0149088 -0.0324459 -0.172972 -0.00651899 0.0775332 -0.0507298 0.0455601 -0.158001 0.0754469 -0.0804119 0.0354107 -0.153127 0.0668819 -0.00901649 0.0360434 -0.00605658 -0.0751134 -0.0923689 0.127558 -0.169624 -0.0169166 0.139563 0.0646758 -0.108064 0.155692 0.0621718 0.0054148 -0.112158 0.0286295 0.0817175 -0.0653562 -0.0140239 0.207999 0.0353737 -0.069394 -0.0510628 0.0450192 0.261547 -0.0540845 -0.00705203 -0.109029 0.0281819 0.0720579 -0.0428917 0.114054 0.00643391 0.158999 -0.00148219 0.102097 -0.00507108 -0.0457283 -0.042559 -0.027623 0.00646889 0.154902 0.0317102 -0.0217599 -0.00715287 -0.0788866 -0.120573 0.0097952 0.0788745 -0.00951191 0.022919 -0.0103798 0.103149 -0.113723 -0.0496828 -0.0137764 -0.0874161 -0.102154 0.00405317 0.0651707 0.0649068 -0.0740432 -0.00758849 0.0643398 -0.0172517 0.130293 -0.121741 0.0673752 -0.159027 0.19262 0.006945 -0.0472399 0.0904653 0.192053 -0.0648879 0.0293182 0.00991853 0.096547 -0.0311999 -0.0379588 0.040397 0.149916 0.00826056 -0.0434174 0.0459615 0.0468504 -0.0961142 0.0239355 -0.0152145 0.0187229 
0.139106 0.0152656 -0.13902 -0.033159 0.0907038 0.203403 0.0324241 -0.0703459 -0.176623 -0.00967031 0.0483492 0.0846216 0.118509 -0.0386439 -0.0337472 -0.0272616 -0.108434 0.0175314 -0.0800721 0.142624 0.0709763 -0.0433923 0.102064 0.106304 -0.00108859 0.00588442 -0.0243719 -0.160684 0.007005 0.0924672 -0.0544526 0.0436206 -0.170946 0.0637055 -0.0763175 0.039319 -0.161192 0.0325356 0.00878378 0.04595 -0.0197426 -0.065259 -0.0846201 0.123481 -0.166976 -0.00397459 0.137716 0.0782309 -0.115801 0.142472 0.086184 0.0112572 -0.106423 0.0103982 0.064034 -0.0546258 -0.00785163 0.230852 0.0510149 -0.0567564 -0.0517619 0.062561 0.2593 -0.0676749 -0.0145877 -0.097292 0.0175903 0.0826469 -0.0569364 0.119857 0.0101386 0.177062 -0.0111939 0.0841434 -0.0134598 -0.0382964 -0.037312 -0.0285558 0.0115703 0.143017 0.0455872 -0.017565 -0.0068864 -0.0804738 -0.123913 0.00320775 0.0685394 -0.0302444 0.0196481 -0.00460254 0.0918069 -0.0986132 -0.0485713 -0.00491482 -0.0756023 -0.0922383 0.0026771 0.0729876 0.0631246 -0.0764003 0.00113145 0.0700855 -0.0145728 0.128951 -0.138445 0.0712774 -0.167421 0.170638 0.00674044 -0.0444584 0.10738 0.186825 -0.0452157 0.0301045 0.00513747 0.098394 -0.0360112 -0.0248921 0.0312295 0.151435 0.0139734 -0.0718697 0.0432573 0.0367727 -0.11231 0.0345261 -0.0347627 0.00987834 
0.13945 0.0237074 -0.134727 -0.0258322 0.0843641 0.202949 0.0379692 -0.0691622 -0.182982 -0.00715928 0.0531253 0.0844039 0.111528 -0.0478962 -0.035977 -0.0277081 -0.109972 0.0187921 -0.0759118 0.13986 0.0681663 -0.0454447 0.0957557 0.106974 0.00188754 0.00451442 -0.0255929 -0.15743 0.0135913 0.0912899 -0.0594187 0.0430155 -0.1731 0.0640024 -0.0780299 0.0325074 -0.162823 0.0269635 0.0116159 0.0486818 -0.017785 -0.0705617 -0.0802985 0.124326 -0.165866 -0.00353057 0.141436 0.0716318 -0.124329 0.143211 0.0893494 0.0200578 -0.111542 0.00993738 0.0619862 -0.0547912 -0.00818606 0.227661 0.0500194 -0.0515674 -0.0514839 0.0613815 0.260523 -0.0684314 -0.0152073 -0.0951219 0.0175921 0.0687479 -0.0622371 0.121401 0.00682121 0.17731 -0.0104291 0.0966248 -0.00891309 -0.0445964 -0.0336263 -0.0250997 0.0099228 0.142041 0.0426777 -0.0202101 -0.00523491 -0.0821484 -0.121572 0.00681204 0.0649763 -0.0364981 0.0187895 -0.00397128 0.0926121 -0.0985983 -0.0533546 -0.00619769 -0.0723998 -0.0927981 0.00712079 0.0715348 0.0638888 -0.075784 -0.0053556 0.0734248 -0.0119897 0.132771 -0.137132 0.0746539 -0.158658 0.180426 0.0091654 -0.0483964 0.107657 0.18598 -0.042727 0.0264875 0.00819374 0.0913772 -0.0288882 -0.0242319 0.0416469 0.151115 0.0140678 -0.0748022 0.043049 0.036072 -0.108674 0.0347454 -0.0264967 0.00916254 
0.139803 0.0125658 -0.137151 -0.021645 0.0811464 0.198974 0.0423572 -0.0730376 -0.159315 -0.035611 0.0528975 0.0897631 0.111466 -0.0686624 -0.052903 -0.0348811 -0.12934 0.000544874 -0.0954662 0.152059 0.0804987 -0.0503521 0.089988 0.0912346 -0.00701594 0.00722333 -0.0340276 -0.17201 -0.00381302 0.0922194 -0.0520002 0.0429576 -0.168524 0.0702997 -0.0669202 0.0308959 -0.15782 0.0414231 0.00290144 0.0325739 -0.0100176 -0.0786064 -0.0872766 0.134269 -0.162501 -0.00296888 0.137621 0.0726024 -0.117095 0.146971 0.0697275 0.0106673 -0.106244 0.015581 0.0720095 -0.0651737 -0.0252567 0.214802 0.0311732 -0.0572284 -0.0474226 0.0506746 0.264199 -0.0557549 -0.00785255 -0.111449 0.0228138 0.0672172 -0.0542852 0.105334 0.00778711 0.15867 -0.00502854 0.0875694 -0.0144597 -0.0423101 -0.0408368 -0.0356175 0.00704186 0.167659 0.0419554 -0.0290349 -0.0104551 -0.0775353 -0.124595 0.00683887 0.0720186 -0.0289067 0.0130079 -0.00220123 0.100572 -0.109877 -0.057472 -0.0060413 -0.0914837 -0.095964 0.00710099 0.0565486 0.0641743 -0.0743435 -0.000385572 0.0729394 -0.0186206 0.125115 -0.127506 0.0679819 -0.152788 0.200259 0.00264714 -0.0362632 0.104891 0.177218 -0.0654602 0.0258093 0.0065725 0.101303 -0.0397178 -0.0222968 0.0389478 0.151179 0.00605014 -0.0570068 0.042698 0.0455928 -0.0911226 0.0263267 -0.0176961 0.00765874 
0.140674 0.0407087 -0.140923 -0.0282021 0.0832774 0.19858 0.0484272 -0.0774974 -0.173184 -0.0202424 0.0602406 0.0867997 0.109938 -0.0665589 -0.0555401 -0.0203075 -0.111701 0.0112463 -0.0944588 0.146817 0.0740442 -0.0413467 0.0802935 0.0917547 -0.0072643 0.00843402 -0.030823 -0.152277 0.0254134 0.100326 -0.0630825 0.0508526 -0.171085 0.0701654 -0.0708198 0.0207367 -0.148482 0.0407312 0.022365 0.0436656 -0.0139598 -0.077326 -0.067709 0.125017 -0.157744 -0.000411848 0.145778 0.0702824 -0.133534 0.141596 0.0779695 0.0242043 -0.11926 0.0163609 0.0596086 -0.0622978 -0.0211683 0.221058 0.0265847 -0.0511981 -0.0531159 0.0503536 0.272894 -0.0693211 -0.011619 -0.100562 0.0154637 0.0576159 -0.0699368 0.102985 0.00611525 0.15863 -0.00849796 0.105466 -0.00671099 -0.0475158 -0.0273065 -0.025252 0.00472954 0.14272 0.0491138 -0.0179039 -0.00415399 -0.0737805 -0.119426 0.0102386 0.0613991 -0.0370661 0.0185253 0.00260787 0.0967544 -0.115658 -0.0641424 -0.00132441 -0.0692545 -0.0929887 0.0112538 0.0658803 0.0577397 -0.0719146 -0.0101865 0.074706 -0.0202936 0.150249 -0.135377 0.0763611 -0.147104 0.202475 0.00887807 -0.0479497 0.106478 0.176041 -0.0589097 0.0434072 0.00398201 0.085459 -0.0369512 -0.0186453 0.0431034 0.146606 0.00625112 -0.0623741 0.0489054 0.0428833 -0.0965859 0.0280883 -0.0254021 -0.00524855 
0.131939 0.0392118 -0.143666 -0.0339405 0.0840098 0.20599 0.0369457 -0.0733244 -0.191928 0.00550967 0.0511462 0.0783027 0.10997 -0.0486658 -0.0311873 -0.0231309 -0.11033 0.0135758 -0.0618185 0.126509 0.0629568 -0.0448141 0.0838462 0.0975427 0.0115386 0.00925408 -0.0217038 -0.156186 0.0214352 0.0977437 -0.0558394 0.0369978 -0.178825 0.0506912 -0.0716989 0.034025 -0.166338 0.00852373 0.0228548 0.0520625 -0.0198467 -0.0765148 -0.0732367 0.134978 -0.15725 0.0151136 0.147288 0.07344 -0.134295 0.123305 0.0942299 0.0250756 -0.113018 -0.00336865 0.0543567 -0.0470204 -0.0189686 0.236839 0.0512364 -0.0440374 -0.0495846 0.060061 0.264694 -0.0678861 -0.00764488 -0.0964688 0.0125234 0.0679583 -0.0607185 0.115637 0.0096569 0.183297 -0.0140186 0.0824103 -0.00797743 -0.0376196 -0.0374532 -0.017254 0.00822344 0.145664 0.0446009 -0.0259001 -0.00568018 -0.0721465 -0.130987 0.00355687 0.063942 -0.0469016 0.0166694 -0.0062442 0.0801644 -0.0929927 -0.056619 -0.0035277 -0.0708063 -0.089998 0.0159606 0.0686328 0.0644531 -0.0763906 -0.0109849 0.0776777 -0.0117501 0.126694 -0.147234 0.0780265 -0.158839 0.18772 0.00371924 -0.0449162 0.116065 0.171645 -0.0468001 0.0230794 0.00667197 0.0903479 -0.0386496 -0.0180056 0.0413459 0.149185 0.0151327 -0.0840521 0.0416135 0.0340472 -0.107005 0.0388755 -0.034772 0.00559033 
0.137959 0.0315469 -0.144178 -0.0298844 0.0811359 0.203712 0.0331604 -0.0722069 -0.189516 0.000972586 0.0525873 0.0810741 0.111881 -0.0460778 -0.0342985 -0.0235329 -0.105371 0.0151501 -0.0622841 0.135728 0.064948 -0.0419133 0.0924479 0.103812 0.00469883 0.0105971 -0.0169345 -0.160253 0.018258 0.0988565 -0.0620928 0.040031 -0.171166 0.0551227 -0.0749248 0.0332319 -0.16164 0.0211301 0.0161383 0.0495087 -0.0267292 -0.0739001 -0.0792525 0.13072 -0.162213 0.0107487 0.147815 0.0721029 -0.129439 0.133834 0.0978227 0.0272937 -0.107716 0.00464687 0.060951 -0.0510883 -0.00860053 0.228374 0.0550311 -0.0501698 -0.050459 0.057401 0.263028 -0.0694451 -0.011808 -0.100209 0.0161876 0.0688274 -0.0592739 0.119221 0.00560154 0.176699 -0.0157392 0.0850763 -0.00812237 -0.0403329 -0.0353378 -0.0190179 0.00922248 0.147911 0.0462095 -0.0239449 -0.00774604 -0.0795233 -0.120881 0.00282622 0.0607531 -0.0437328 0.0186861 -0.00352164 0.0825052 -0.0934687 -0.0566197 -0.00129848 -0.0714139 -0.0918164 0.0149085 0.0731554 0.067938 -0.0801181 -0.0034501 0.07967 -0.0108739 0.128837 -0.145546 0.0737071 -0.157698 0.179449 0.00681696 -0.0462285 0.112705 0.180204 -0.0431068 0.021453 0.00673642 0.0925169 -0.0350352 -0.0261279 0.0389079 0.149571 0.0136139 -0.080842 0.0455853 0.0324729 -0.106241 0.0389205 -0.0267534 0.00822615 
0.140487 0.0406023 -0.143128 -0.0331438 0.0662087 0.213056 0.0423325 -0.0736977 -0.194703 0.00642929 0.0642869 0.0751817 0.103016 -0.0197271 -0.0259396 -0.0420478 -0.0931202 0.0181474 -0.0411217 0.106908 0.0453735 -0.0253441 0.0594353 0.11546 0.00973727 0.0138778 -0.00294092 -0.135825 0.0291268 0.10057 -0.0647786 0.0358167 -0.186733 0.040698 -0.0763807 0.0417463 -0.165335 -0.00589524 0.023166 0.0671849 -0.0190636 -0.0668022 -0.0877827 0.129046 -0.154444 0.0200943 0.139721 0.0689698 -0.141114 0.105739 0.0916604 0.0474283 -0.102553 -0.00220273 0.0502256 -0.0344465 -0.0258516 0.255943 0.0522257 -0.0381726 -0.0533683 0.0705318 0.273444 -0.0760819 -0.0261011 -0.0723758 0.0354556 0.0610749 -0.0616105 0.124684 0.0117317 0.175045 -0.0112457 0.0909408 0.000865272 -0.0453103 -0.0360467 -0.0225382 0.00695867 0.129978 0.047764 -0.0130875 -0.00876139 -0.100295 -0.12298 0.00100833 0.0616217 -0.0688632 0.00848234 -0.0027041 0.0867469 -0.0910496 -0.0457498 -0.00408445 -0.0569727 -0.0909332 0.0251753 0.0524274 0.0785929 -0.0756302 -0.0123587 0.0910241 -0.00468359 0.12158 -0.167946 0.0917962 -0.154944 0.163473 -0.0137184 -0.0517563 0.138571 0.167924 -0.0363265 0.0105932 0.00504224 0.0831106 -0.0325529 -0.0315813 0.0537142 0.133829 0.0195181 -0.111886 0.0412535 0.0282082 -0.103196 0.0497486 -0.0333198 0.00432939 
0.135507 0.0393783 -0.142168 -0.0312912 0.0695362 0.215258 0.0331676 -0.0754937 -0.189672 0.0108351 0.0631671 0.0697843 0.102713 -0.0341274 -0.0185479 -0.0391143 -0.105301 0.015608 -0.0342295 0.11468 0.0512313 -0.0336586 0.0735348 0.111049 0.0171484 0.0167737 -0.00878297 -0.153448 0.0303536 0.0935284 -0.0501362 0.0332695 -0.181638 0.040999 -0.068847 0.0486774 -0.160454 0.000785637 0.0291936 0.0579683 -0.0151302 -0.0769048 -0.0913667 0.132771 -0.163027 0.0140492 0.144928 0.0753695 -0.133242 0.108272 0.0851512 0.049453 -0.100521 -0.00106047 0.0556401 -0.0389295 -0.0153384 0.241134 0.0501986 -0.0463811 -0.0566622 0.0614328 0.276009 -0.0755798 -0.0175173 -0.0781807 0.0356516 0.0611865 -0.0504452 0.132088 0.0057731 0.185506 -0.0195715 0.0916252 0.00343747 -0.0542873 -0.0444272 -0.00972281 0.00954111 0.141006 0.0406166 -0.0105085 -0.00570253 -0.0909071 -0.116385 0.00113626 0.0632313 -0.0525715 0.0145267 -0.00887069 0.0938559 -0.0820965 -0.0450304 -0.00730162 -0.0653117 -0.105816 0.0216786 0.0656658 0.0774225 -0.0836137 -0.0102231 0.0844648 -0.00496218 0.112461 -0.154501 0.0909973 -0.147083 0.167186 0.00395124 -0.0430782 0.123375 0.173128 -0.0406963 0.00732171 0.0126791 0.0847186 -0.0298189 -0.0416236 0.0516652 0.141107 0.027017 -0.103091 0.0435352 0.0331697 -0.113666 0.0466156 -0.0229514 0.0224324 
0.138821 0.0303221 -0.144255 -0.0285139 0.0729931 0.210584 0.0345812 -0.0742132 -0.187106 0.00282128 0.060359 0.0798449 0.104788 -0.0360214 -0.0288297 -0.0411948 -0.105443 0.0162621 -0.0451156 0.124772 0.0531163 -0.0354135 0.0814746 0.111005 0.00833436 0.0139545 -0.00703665 -0.153345 0.0187262 0.0942759 -0.0588907 0.0305797 -0.176624 0.0474534 -0.0729322 0.0424108 -0.161281 0.0100021 0.017761 0.0558908 -0.0182879 -0.0715002 -0.0912195 0.132172 -0.16825 0.0085392 0.142452 0.0731415 -0.126312 0.125221 0.088904 0.0396039 -0.1034 0.00561289 0.0606093 -0.0447864 -0.0138435 0.237723 0.0506255 -0.0478051 -0.0538564 0.0605527 0.273556 -0.0723856 -0.0175701 -0.0893294 0.0316783 0.0638792 -0.0543622 0.129688 0.00708811 0.180121 -0.0133841 0.0925865 -0.00245705 -0.0479858 -0.0409825 -0.0176669 0.00919044 0.141429 0.0398583 -0.0152456 -0.00589772 -0.0891492 -0.118018 -0.000296422 0.0637828 -0.0484008 0.0172377 -0.0066623 0.0908636 -0.0897715 -0.0449666 -0.00772377 -0.0671243 -0.1041 0.0182059 0.0639079 0.0750996 -0.0820355 -0.00724926 0.0860833 -0.00574288 0.116543 -0.150804 0.0839078 -0.151626 0.167718 -0.00217201 -0.0424928 0.123226 0.177042 -0.0366966 0.0143882 0.00609937 0.0887009 -0.0269124 -0.0365587 0.0482085 0.142505 0.0201943 -0.0958697 0.0424957 0.0314293 -0.109217 0.0440602 -0.0237627 0.0176875 
0.139724 0.0282356 -0.136403 -0.0309969 0.0728865 0.204655 0.0413852 -0.0622459 -0.182436 -0.0192099 0.0502787 0.0824355 0.107756 -0.05391 -0.0434284 -0.0353856 -0.110652 0.0039425 -0.0784162 0.140458 0.058204 -0.0421087 0.0847965 0.104256 -0.0077211 0.0089845 -0.0191334 -0.151138 0.0133304 0.0820605 -0.0604446 0.0382485 -0.173434 0.0660971 -0.0796991 0.0289247 -0.154856 0.0349057 0.00532682 0.0514535 -0.0117648 -0.0750117 -0.0800493 0.125023 -0.160775 0.00263303 0.142212 0.0689947 -0.133708 0.146967 0.0780412 0.0201191 -0.107639 0.0146193 0.0632829 -0.0573582 -0.0175502 0.231614 0.0443881 -0.0583268 -0.0539023 0.0665109 0.266546 -0.0707537 -0.0185298 -0.0892401 0.0251269 0.0604938 -0.066165 0.110308 0.00284187 0.161755 -0.0073457 0.108575 0.00189661 -0.0465332 -0.0321944 -0.0274542 0.0136534 0.143547 0.0412766 -0.0245034 -0.00724135 -0.0895251 -0.120176 0.00633974 0.0637165 -0.0393947 0.0192893 -0.00048565 0.097668 -0.106588 -0.0511033 -0.00924518 -0.0672332 -0.0883111 0.0189921 0.0642216 0.0614833 -0.0749451 -0.0125448 0.0769745 -0.0166153 0.137835 -0.145987 0.0775989 -0.15806 0.185947 -0.00415071 -0.0521989 0.118489 0.186255 -0.0451079 0.0275473 0.00300041 0.087161 -0.0313402 -0.0269162 0.0498499 0.14663 0.0101183 -0.0779601 0.0480248 0.0374001 -0.100621 0.029889 -0.0277579 -9.33922e-05 
0.145866 -0.00823942 -0.124516 -0.0137009 0.0988171 0.196466 0.0517024 -0.0552952 -0.151763 -0.0396401 0.055399 0.105488 0.0961326 -0.0385727 -0.0215965 -0.0522116 -0.0905638 -0.00258499 -0.085942 0.142105 0.0651878 -0.0324363 0.0895523 0.122179 0.0143161 0.00401527 -0.016408 -0.157222 0.00211965 0.0708512 -0.0299059 0.0409454 -0.167252 0.071513 -0.0881623 0.0412078 -0.157237 0.0439518 -0.011602 0.0520364 0.0193395 -0.0404102 -0.104591 0.132062 -0.180461 -0.0100513 0.124737 0.0567078 -0.0922111 0.126911 0.0737181 0.0111494 -0.111871 -0.00111857 0.0739428 -0.0507055 -0.04063 0.252605 0.0373211 -0.0446312 -0.0678076 0.0436487 0.251263 -0.0707081 -0.00928919 -0.0992768 0.0402787 0.0739981 -0.0529732 0.129053 0.0246663 0.183299 0.00198245 0.0954219 -0.00677573 -0.0431859 -0.0474174 -0.0218875 0.000790054 0.150827 0.0177148 -0.00494686 0.00376937 -0.097014 -0.106304 -0.0184021 0.0954385 -0.0221974 -0.00913478 -0.02561 0.0990431 -0.10312 -0.0501911 -0.0183006 -0.0644752 -0.101916 0.018333 0.0316248 0.0600134 -0.0743121 -0.0346097 0.0637164 -0.00554629 0.13221 -0.161534 0.0701579 -0.166161 0.166203 0.0119201 -0.0608219 0.119915 0.194708 -0.0626581 0.0317432 0.0172007 0.083881 -0.0414009 -0.0520765 0.0399811 0.16043 0.015087 -0.0433633 0.0167915 0.0550966 -0.0893055 0.0244039 -0.0269077 0.00832536 
0.132232 0.00622434 -0.121161 -0.0248184 0.0752795 0.20197 0.0432539 -0.0567353 -0.157744 -0.0495763 0.051599 0.0905704 0.0981219 -0.0533445 -0.0423736 -0.055509 -0.128519 -0.000603049 -0.0863937 0.135984 0.0727652 -0.0454934 0.0869092 0.111748 0.00140054 0.00222613 -0.0142952 -0.16244 -0.000734176 0.0723099 -0.0398497 0.0199557 -0.164726 0.0666822 -0.0716655 0.0361323 -0.162738 0.0367297 -0.0156499 0.0432942 0.00945306 -0.0686017 -0.0955329 0.143363 -0.173134 -0.0040906 0.13501 0.059721 -0.12414 0.137087 0.0539391 0.00601857 -0.0979584 0.00944477 0.0711295 -0.0482254 -0.0348313 0.240183 0.0307223 -0.0620861 -0.0573278 0.0602367 0.269153 -0.0578335 -0.00831034 -0.0932054 0.0319755 0.0590785 -0.0575274 0.123086 0.0105377 0.158223 -0.00329766 0.0904929 0.00112352 -0.0448809 -0.0495788 -0.0322198 0.00930256 0.154444 0.0209987 -0.022563 -0.00668515 -0.0952641 -0.126103 0.0012144 0.0820651 -0.0309355 0.00163479 -0.00534861 0.112431 -0.111679 -0.0507437 -0.0230723 -0.074139 -0.0947974 0.00890561 0.0532786 0.0668492 -0.0734108 -0.018786 0.0678844 -0.0125305 0.118298 -0.142487 0.0777762 -0.158113 0.185162 -0.0062218 -0.0596783 0.119957 0.183371 -0.0596301 0.0168201 0.013006 0.0975088 -0.0361761 -0.037655 0.0577371 0.156551 0.0148202 -0.0677879 0.022766 0.0455395 -0.0924827 0.0309819 -0.0178688 0.0116964 
