0.0824992 0.028389 -0.100805 0.0120858 0.110083 0.102231 0.0909814 -0.0207817 0.034843 -0.0804345 0.0909478 0.154106 0.082601 -0.153116 -0.163717 0.0041787 -0.0862731 0.0281957 -0.267133 0.187672 0.142306 -0.100598 0.0351791 0.102428 -0.0522917 -0.0421413 -0.0483724 -0.139078 0.038233 0.071772 -0.0326425 0.102987 -0.0559329 0.103497 -0.102611 -0.0384731 -0.112413 0.154348 -0.0982065 -0.00297488 0.0654726 -0.0613286 -0.0776188 0.0951586 -0.105058 -0.0554045 0.0749075 0.0148549 -0.113045 0.0739267 -0.00224833 -0.00525929 -0.128529 -0.0230032 0.0744146 -0.0105921 -0.0969855 0.15271 -0.068133 -0.0494964 -0.0798571 -0.0436001 0.23353 -0.0393652 0.0318323 -0.106919 -0.0315218 0.0498262 -0.103599 0.0615296 0.0172046 0.0379866 -0.00646083 0.0589958 0.00397121 0.0141357 -0.00624567 0.0370887 -0.0538435 0.0628261 -0.0670785 0.0227774 -0.0095176 -0.0430864 -0.103674 0.0626792 0.107338 0.0299184 -0.00800834 0.0164211 0.0682571 -0.205483 -0.108205 0.0078286 -0.0258274 -0.0588872 -0.0404966 -0.0480139 0.0423245 -0.0358153 0.00981429 -0.0265889 -0.060963 0.179637 -0.073039 0.0386032 -0.106691 0.194537 0.0251119 -0.117981 0.0211039 0.168806 -0.104233 0.0697109 0.0643815 0.0528433 -0.143272 -0.0269661 0.0740663 0.173767 -0.0249837 0.0817868 -0.0401439 0.101433 0.000739592 0.0478896 -0.033835 -0.0739435 
0.0824992 0.028389 -0.100805 0.0120858 0.110083 0.102231 0.0909814 -0.0207817 0.034843 -0.0804345 0.0909478 0.154106 0.082601 -0.153116 -0.163717 0.0041787 -0.0862731 0.0281957 -0.267133 0.187672 0.142306 -0.100598 0.0351791 0.102428 -0.0522917 -0.0421413 -0.0483724 -0.139078 0.038233 0.071772 -0.0326425 0.102987 -0.0559329 0.103497 -0.102611 -0.0384731 -0.112413 0.154348 -0.0982065 -0.00297488 0.0654726 -0.0613286 -0.0776188 0.0951586 -0.105058 -0.0554045 0.0749075 0.0148549 -0.113045 0.0739267 -0.00224833 -0.00525929 -0.128529 -0.0230032 0.0744146 -0.0105921 -0.0969855 0.15271 -0.068133 -0.0494964 -0.0798571 -0.0436001 0.23353 -0.0393652 0.0318323 -0.106919 -0.0315218 0.0498262 -0.103599 0.0615296 0.0172046 0.0379866 -0.00646083 0.0589958 0.00397121 0.0141357 -0.00624567 0.0370887 -0.0538435 0.0628261 -0.0670785 0.0227774 -0.0095176 -0.0430864 -0.103674 0.0626792 0.107338 0.0299184 -0.00800834 0.0164211 0.0682571 -0.205483 -0.108205 0.0078286 -0.0258274 -0.0588872 -0.0404966 -0.0480139 0.0423245 -0.0358153 0.00981429 -0.0265889 -0.060963 0.179637 -0.073039 0.0386032 -0.106691 0.194537 0.0251119 -0.117981 0.0211039 0.168806 -0.104233 0.0697109 0.0643815 0.0528433 -0.143272 -0.0269661 0.0740663 0.173767 -0.0249837 0.0817868 -0.0401439 0.101433 0.000739592 0.0478896 -0.033835 -0.0739435 
0.0760679 -0.034059 -0.0854875 0.0273449 0.117692 0.111476 0.0457642 -0.0335647 0.030114 -0.0979271 0.0531941 0.147144 0.0583487 -0.164105 -0.138585 -0.00192581 -0.168256 0.0255492 -0.191494 0.177776 0.186358 -0.104975 0.104984 0.155703 -0.00482649 -0.0412195 -0.0240177 -0.225474 0.0247031 0.0811876 -0.00918756 0.0392294 -0.0501833 0.0784271 -0.0578738 -0.0237909 -0.141276 0.120304 -0.0918646 -0.0326717 0.0483056 -0.0691242 -0.113903 0.131203 -0.132775 -0.0552684 0.0972207 0.0221867 -0.0721839 0.0860438 -0.0142732 -0.00786195 -0.0509688 -0.0278865 0.107215 -0.0084803 -0.00567806 0.150491 -0.0594429 -0.0739306 -0.051116 -0.0326738 0.239091 0.00990954 0.0276179 -0.133885 -0.0316387 0.0414769 -0.0463235 0.0978115 -0.0246832 0.0804039 -0.0516147 0.0227318 -0.00319851 -0.00432184 -0.0437608 0.0315932 -0.0241266 0.152346 -0.0594718 0.0208598 -0.0176549 -0.0444659 -0.0820834 0.0415115 0.0985715 0.0678106 -0.0263713 -0.00999278 0.105987 -0.126934 -0.0977126 0.00114176 -0.070033 -0.0861016 -0.0715182 0.0222802 0.0895845 -0.0655662 0.0636362 -0.0449384 -0.040803 0.102922 -0.0457002 0.0229083 -0.0925926 0.168893 0.0524527 -0.0792991 0.0243555 0.184265 -0.0951787 0.00433201 0.0760558 0.131892 -0.114548 -0.0439284 0.0597266 0.2014 -0.00194661 0.068262 -0.0644689 0.0526586 -0.0803118 0.0874039 -0.00511747 -0.00231576 
0.0760679 -0.034059 -0.0854875 0.0273449 0.117692 0.111476 0.0457642 -0.0335647 0.030114 -0.0979271 0.0531941 0.147144 0.0583487 -0.164105 -0.138585 -0.00192581 -0.168256 0.0255492 -0.191494 0.177776 0.186358 -0.104975 0.104984 0.155703 -0.00482649 -0.0412195 -0.0240177 -0.225474 0.0247031 0.0811876 -0.00918756 0.0392294 -0.0501833 0.0784271 -0.0578738 -0.0237909 -0.141276 0.120304 -0.0918646 -0.0326717 0.0483056 -0.0691242 -0.113903 0.131203 -0.132775 -0.0552684 0.0972207 0.0221867 -0.0721839 0.0860438 -0.0142732 -0.00786195 -0.0509688 -0.0278865 0.107215 -0.0084803 -0.00567806 0.150491 -0.0594429 -0.0739306 -0.051116 -0.0326738 0.239091 0.00990954 0.0276179 -0.133885 -0.0316387 0.0414769 -0.0463235 0.0978115 -0.0246832 0.0804039 -0.0516147 0.0227318 -0.00319851 -0.00432184 -0.0437608 0.0315932 -0.0241266 0.152346 -0.0594718 0.0208598 -0.0176549 -0.0444659 -0.0820834 0.0415115 0.0985715 0.0678106 -0.0263713 -0.00999278 0.105987 -0.126934 -0.0977126 0.00114176 -0.070033 -0.0861016 -0.0715182 0.0222802 0.0895845 -0.0655662 0.0636362 -0.0449384 -0.040803 0.102922 -0.0457002 0.0229083 -0.0925926 0.168893 0.0524527 -0.0792991 0.0243555 0.184265 -0.0951787 0.00433201 0.0760558 0.131892 -0.114548 -0.0439284 0.0597266 0.2014 -0.00194661 0.068262 -0.0644689 0.0526586 -0.0803118 0.0874039 -0.00511747 -0.00231576 
0.0760679 -0.034059 -0.0854875 0.0273449 0.117692 0.111476 0.0457642 -0.0335647 0.030114 -0.0979271 0.0531941 0.147144 0.0583487 -0.164105 -0.138585 -0.00192581 -0.168256 0.0255492 -0.191494 0.177776 0.186358 -0.104975 0.104984 0.155703 -0.00482649 -0.0412195 -0.0240177 -0.225474 0.0247031 0.0811876 -0.00918756 0.0392294 -0.0501833 0.0784271 -0.0578738 -0.0237909 -0.141276 0.120304 -0.0918646 -0.0326717 0.0483056 -0.0691242 -0.113903 0.131203 -0.132775 -0.0552684 0.0972207 0.0221867 -0.0721839 0.0860438 -0.0142732 -0.00786195 -0.0509688 -0.0278865 0.107215 -0.0084803 -0.00567806 0.150491 -0.0594429 -0.0739306 -0.051116 -0.0326738 0.239091 0.00990954 0.0276179 -0.133885 -0.0316387 0.0414769 -0.0463235 0.0978115 -0.0246832 0.0804039 -0.0516147 0.0227318 -0.00319851 -0.00432184 -0.0437608 0.0315932 -0.0241266 0.152346 -0.0594718 0.0208598 -0.0176549 -0.0444659 -0.0820834 0.0415115 0.0985715 0.0678106 -0.0263713 -0.00999278 0.105987 -0.126934 -0.0977126 0.00114176 -0.070033 -0.0861016 -0.0715182 0.0222802 0.0895845 -0.0655662 0.0636362 -0.0449384 -0.040803 0.102922 -0.0457002 0.0229083 -0.0925926 0.168893 0.0524527 -0.0792991 0.0243555 0.184265 -0.0951787 0.00433201 0.0760558 0.131892 -0.114548 -0.0439284 0.0597266 0.2014 -0.00194661 0.068262 -0.0644689 0.0526586 -0.0803118 0.0874039 -0.00511747 -0.00231576 
0.0781455 -0.0227083 -0.0972339 0.0185358 0.105763 0.0904939 0.0858071 -0.0176661 0.024133 -0.0597574 0.0446946 0.127198 0.103065 -0.163832 -0.143923 -0.0272648 -0.143445 0.0299593 -0.19666 0.198345 0.181285 -0.151889 0.0842859 0.152038 -0.024608 -0.0711626 -0.0533643 -0.213161 0.04351 0.0984258 -0.0233899 0.0379708 -0.0658683 0.0665606 -0.048341 -0.0525112 -0.136618 0.136746 -0.101776 -0.0791464 0.028082 -0.0968593 -0.114724 0.137425 -0.133469 -0.0595793 0.062128 0.0634209 -0.0617701 0.0734517 -0.0148368 -0.0203516 -0.0480603 -0.0503898 0.0882421 -0.0162309 -0.0352514 0.130882 -0.0410314 -0.0843127 -0.0273188 -0.0369776 0.221297 0.0149575 0.0267701 -0.13677 -0.0349836 0.0198308 -0.0719597 0.0328889 -0.042308 0.056062 -0.0495959 -0.000118813 -0.0358626 0.0075038 -0.0144708 0.0389911 0.0206674 0.166515 -0.0673914 -0.0420815 -0.0336025 -0.0317139 -0.0527875 0.0141452 0.0916991 0.0652924 0.0122601 -0.00559698 0.0881622 -0.129574 -0.0707766 -0.000524536 -0.0939255 -0.110585 -0.0617621 0.00685663 0.0853069 -0.0703033 0.100657 -0.01406 -0.0457596 0.108989 -0.0398678 0.00394989 -0.0695476 0.189141 0.0758302 -0.059459 0.0175984 0.159746 -0.105416 0.0116067 0.0546102 0.141061 -0.122111 -0.00179918 0.0290037 0.195472 -0.0605074 0.0454297 -0.0941188 0.0758546 -0.079719 0.0725152 -0.0444982 -0.0318102 
0.0781455 -0.0227083 -0.0972339 0.0185358 0.105763 0.0904939 0.0858071 -0.0176661 0.024133 -0.0597574 0.0446946 0.127198 0.103065 -0.163832 -0.143923 -0.0272648 -0.143445 0.0299593 -0.19666 0.198345 0.181285 -0.151889 0.0842859 0.152038 -0.024608 -0.0711626 -0.0533643 -0.213161 0.04351 0.0984258 -0.0233899 0.0379708 -0.0658683 0.0665606 -0.048341 -0.0525112 -0.136618 0.136746 -0.101776 -0.0791464 0.028082 -0.0968593 -0.114724 0.137425 -0.133469 -0.0595793 0.062128 0.0634209 -0.0617701 0.0734517 -0.0148368 -0.0203516 -0.0480603 -0.0503898 0.0882421 -0.0162309 -0.0352514 0.130882 -0.0410314 -0.0843127 -0.0273188 -0.0369776 0.221297 0.0149575 0.0267701 -0.13677 -0.0349836 0.0198308 -0.0719597 0.0328889 -0.042308 0.056062 -0.0495959 -0.000118813 -0.0358626 0.0075038 -0.0144708 0.0389911 0.0206674 0.166515 -0.0673914 -0.0420815 -0.0336025 -0.0317139 -0.0527875 0.0141452 0.0916991 0.0652924 0.0122601 -0.00559698 0.0881622 -0.129574 -0.0707766 -0.000524536 -0.0939255 -0.110585 -0.0617621 0.00685663 0.0853069 -0.0703033 0.100657 -0.01406 -0.0457596 0.108989 -0.0398678 0.00394989 -0.0695476 0.189141 0.0758302 -0.059459 0.0175984 0.159746 -0.105416 0.0116067 0.0546102 0.141061 -0.122111 -0.00179918 0.0290037 0.195472 -0.0605074 0.0454297 -0.0941188 0.0758546 -0.079719 0.0725152 -0.0444982 -0.0318102 
0.106348 -0.0104337 -0.124511 0.00392934 0.112842 0.101877 0.0737118 -0.0184989 0.0170044 -0.093404 0.0481801 0.127116 0.103716 -0.16088 -0.134001 -0.0214426 -0.0836211 0.033691 -0.240938 0.226791 0.128491 -0.0794819 0.0970284 0.116078 -0.0813265 -0.0404801 -0.0599783 -0.202731 0.0228786 0.0610593 -0.0278687 0.102662 -0.0495956 0.0983027 -0.0702136 -0.0362783 -0.090037 0.196162 -0.113995 -0.0297622 0.0409124 -0.0489235 -0.116438 0.120857 -0.156883 -0.0446483 0.0811107 0.0564783 -0.0748211 0.123602 -0.0152638 -0.0226722 -0.0720938 -0.00727551 0.0787595 -0.0503705 -0.0192465 0.118579 -0.0275787 -0.102579 -0.0764173 -0.0233112 0.21564 -0.027731 0.00281012 -0.150758 0.00682995 0.0434792 -0.0632041 0.0270301 -0.00714689 0.0270677 -0.004048 0.0720933 -0.0250826 -0.0196292 -0.0509421 0.0207485 -0.0104354 0.11441 -0.0350426 0.0307186 -0.0525356 -0.0668671 -0.0412349 0.0441131 0.0856186 0.0507474 0.000434701 -0.00172449 0.104533 -0.155071 -0.0863101 -0.0269535 -0.0482448 -0.084576 -0.0330124 0.00638729 0.0346234 -0.069083 0.0442437 -0.0166706 -0.0340782 0.174628 -0.0858432 -0.00423725 -0.110905 0.178684 0.0661777 -0.0477201 0.0431896 0.202666 -0.108148 0.0488043 0.0166359 0.0811331 -0.128374 -0.0849411 0.0412503 0.153038 -0.0329858 0.0855621 -0.027127 0.100591 -0.0479957 -0.000343821 -0.0470346 -0.0582815 
0.106348 -0.0104337 -0.124511 0.00392934 0.112842 0.101877 0.0737118 -0.0184989 0.0170044 -0.093404 0.0481801 0.127116 0.103716 -0.16088 -0.134001 -0.0214426 -0.0836211 0.033691 -0.240938 0.226791 0.128491 -0.0794819 0.0970284 0.116078 -0.0813265 -0.0404801 -0.0599783 -0.202731 0.0228786 0.0610593 -0.0278687 0.102662 -0.0495956 0.0983027 -0.0702136 -0.0362783 -0.090037 0.196162 -0.113995 -0.0297622 0.0409124 -0.0489235 -0.116438 0.120857 -0.156883 -0.0446483 0.0811107 0.0564783 -0.0748211 0.123602 -0.0152638 -0.0226722 -0.0720938 -0.00727551 0.0787595 -0.0503705 -0.0192465 0.118579 -0.0275787 -0.102579 -0.0764173 -0.0233112 0.21564 -0.027731 0.00281012 -0.150758 0.00682995 0.0434792 -0.0632041 0.0270301 -0.00714689 0.0270677 -0.004048 0.0720933 -0.0250826 -0.0196292 -0.0509421 0.0207485 -0.0104354 0.11441 -0.0350426 0.0307186 -0.0525356 -0.0668671 -0.0412349 0.0441131 0.0856186 0.0507474 0.000434701 -0.00172449 0.104533 -0.155071 -0.0863101 -0.0269535 -0.0482448 -0.084576 -0.0330124 0.00638729 0.0346234 -0.069083 0.0442437 -0.0166706 -0.0340782 0.174628 -0.0858432 -0.00423725 -0.110905 0.178684 0.0661777 -0.0477201 0.0431896 0.202666 -0.108148 0.0488043 0.0166359 0.0811331 -0.128374 -0.0849411 0.0412503 0.153038 -0.0329858 0.0855621 -0.027127 0.100591 -0.0479957 -0.000343821 -0.0470346 -0.0582815 
0.106348 -0.0104337 -0.124511 0.00392934 0.112842 0.101877 0.0737118 -0.0184989 0.0170044 -0.093404 0.0481801 0.127116 0.103716 -0.16088 -0.134001 -0.0214426 -0.0836211 0.033691 -0.240938 0.226791 0.128491 -0.0794819 0.0970284 0.116078 -0.0813265 -0.0404801 -0.0599783 -0.202731 0.0228786 0.0610593 -0.0278687 0.102662 -0.0495956 0.0983027 -0.0702136 -0.0362783 -0.090037 0.196162 -0.113995 -0.0297622 0.0409124 -0.0489235 -0.116438 0.120857 -0.156883 -0.0446483 0.0811107 0.0564783 -0.0748211 0.123602 -0.0152638 -0.0226722 -0.0720938 -0.00727551 0.0787595 -0.0503705 -0.0192465 0.118579 -0.0275787 -0.102579 -0.0764173 -0.0233112 0.21564 -0.027731 0.00281012 -0.150758 0.00682995 0.0434792 -0.0632041 0.0270301 -0.00714689 0.0270677 -0.004048 0.0720933 -0.0250826 -0.0196292 -0.0509421 0.0207485 -0.0104354 0.11441 -0.0350426 0.0307186 -0.0525356 -0.0668671 -0.0412349 0.0441131 0.0856186 0.0507474 0.000434701 -0.00172449 0.104533 -0.155071 -0.0863101 -0.0269535 -0.0482448 -0.084576 -0.0330124 0.00638729 0.0346234 -0.069083 0.0442437 -0.0166706 -0.0340782 0.174628 -0.0858432 -0.00423725 -0.110905 0.178684 0.0661777 -0.0477201 0.0431896 0.202666 -0.108148 0.0488043 0.0166359 0.0811331 -0.128374 -0.0849411 0.0412503 0.153038 -0.0329858 0.0855621 -0.027127 0.100591 -0.0479957 -0.000343821 -0.0470346 -0.0582815 
0.0585405 -0.0223215 -0.111839 -0.0342874 0.102676 0.106106 0.0146003 -0.0485709 0.0113069 -0.117604 0.00757434 0.104646 0.0725732 -0.111388 -0.114862 -0.0175404 -0.155087 0.00986256 -0.188535 0.175776 0.140189 -0.070811 0.100878 0.120203 -0.0286449 0.00910778 -0.0101486 -0.215787 0.00343554 0.0490896 0.00165276 0.0545751 -0.0598216 0.0771053 -0.0389622 0.0144315 -0.0996272 0.169805 -0.0997924 -0.024607 0.0527833 -0.0345249 -0.0902528 0.161985 -0.131259 -0.00423817 0.13598 0.0490209 -0.0897461 0.0913332 -0.0493965 -0.0564029 -0.0357372 -0.00512753 0.124706 -0.0205547 -0.0142413 0.17499 -0.00923353 -0.163667 -0.0492844 0.00284419 0.241483 0.0156594 0.00989826 -0.110595 0.0102209 0.0814998 0.00608381 0.0759177 -0.0106375 0.062316 -0.0061778 0.0300546 0.00971545 -0.023201 -0.102714 0.0256954 -0.003474 0.0995473 -0.0159124 0.0901425 -0.0585479 -0.0894589 -0.0952513 0.023437 0.0884733 0.0746364 -0.00426887 -0.0063966 0.125662 -0.131195 -0.0659246 -0.0680888 -0.0538286 -0.05843 -0.0399114 0.0553409 0.0821548 -0.0875219 0.0128 -0.0492505 -0.0159784 0.122435 -0.128527 0.0135342 -0.169624 0.155828 0.00946942 -0.0598078 0.0865732 0.210982 -0.11988 0.0204549 0.028205 0.0990957 -0.143043 -0.121054 0.0389214 0.128518 0.0233384 0.0917791 -0.00286008 0.0661988 -0.111096 0.0159637 -0.0577081 -0.0319209 
0.0585405 -0.0223215 -0.111839 -0.0342874 0.102676 0.106106 0.0146003 -0.0485709 0.0113069 -0.117604 0.00757434 0.104646 0.0725732 -0.111388 -0.114862 -0.0175404 -0.155087 0.00986256 -0.188535 0.175776 0.140189 -0.070811 0.100878 0.120203 -0.0286449 0.00910778 -0.0101486 -0.215787 0.00343554 0.0490896 0.00165276 0.0545751 -0.0598216 0.0771053 -0.0389622 0.0144315 -0.0996272 0.169805 -0.0997924 -0.024607 0.0527833 -0.0345249 -0.0902528 0.161985 -0.131259 -0.00423817 0.13598 0.0490209 -0.0897461 0.0913332 -0.0493965 -0.0564029 -0.0357372 -0.00512753 0.124706 -0.0205547 -0.0142413 0.17499 -0.00923353 -0.163667 -0.0492844 0.00284419 0.241483 0.0156594 0.00989826 -0.110595 0.0102209 0.0814998 0.00608381 0.0759177 -0.0106375 0.062316 -0.0061778 0.0300546 0.00971545 -0.023201 -0.102714 0.0256954 -0.003474 0.0995473 -0.0159124 0.0901425 -0.0585479 -0.0894589 -0.0952513 0.023437 0.0884733 0.0746364 -0.00426887 -0.0063966 0.125662 -0.131195 -0.0659246 -0.0680888 -0.0538286 -0.05843 -0.0399114 0.0553409 0.0821548 -0.0875219 0.0128 -0.0492505 -0.0159784 0.122435 -0.128527 0.0135342 -0.169624 0.155828 0.00946942 -0.0598078 0.0865732 0.210982 -0.11988 0.0204549 0.028205 0.0990957 -0.143043 -0.121054 0.0389214 0.128518 0.0233384 0.0917791 -0.00286008 0.0661988 -0.111096 0.0159637 -0.0577081 -0.0319209 
0.0522141 -0.0155471 -0.0896523 -0.0512511 0.10262 0.164803 0.0216586 -0.0372671 -0.0582816 -0.071473 -0.0450084 0.058848 0.0765224 -0.145452 -0.0262547 -0.0259324 -0.221195 -0.0269199 -0.0990005 0.153205 0.135861 -0.0912044 0.129485 0.0893725 0.0036982 -0.0123784 -0.0614161 -0.263726 -0.00851723 0.0491229 0.0340722 -0.0047807 -0.0833989 0.0754862 0.0221487 0.0218647 -0.101452 0.0991103 -0.0625438 -0.0652136 0.0399567 -0.101034 -0.0474708 0.170472 -0.14519 0.0088293 0.150927 0.0890693 -0.105172 0.125278 -0.0408189 -0.0867203 0.00116741 -0.0152516 0.134769 -0.0198244 -0.00116378 0.164506 -0.00807046 -0.160893 -0.0370948 0.0405262 0.224841 -0.00552439 0.0571161 -0.0923377 -0.0225519 0.0487436 -0.0220458 0.0600157 -0.0516152 0.11026 -0.0565077 0.0139686 -0.00161261 -0.0241291 -0.0874328 -0.00264 0.068363 0.182719 0.000926435 -0.0071092 -0.0507029 -0.0368298 -0.0889787 -0.0189373 0.0683983 0.0752146 0.03255 0.0281959 0.142292 -0.081622 -0.0579792 -0.0474946 -0.118418 -0.0647908 -0.0258243 0.118421 0.0665166 -0.0769924 0.0547542 -0.0146306 -0.0262309 0.0373066 -0.111549 0.0262292 -0.143196 0.165274 0.0321765 -0.00276867 0.0855931 0.176977 -0.116351 -0.0324257 0.0446763 0.141412 -0.0844706 -0.0626167 0.0167998 0.177966 0.0518389 0.0193828 0.0114213 0.0529214 -0.137938 0.0214605 -0.00378447 0.00850643 
0.0522141 -0.0155471 -0.0896523 -0.0512511 0.10262 0.164803 0.0216586 -0.0372671 -0.0582816 -0.071473 -0.0450084 0.058848 0.0765224 -0.145452 -0.0262547 -0.0259324 -0.221195 -0.0269199 -0.0990005 0.153205 0.135861 -0.0912044 0.129485 0.0893725 0.0036982 -0.0123784 -0.0614161 -0.263726 -0.00851723 0.0491229 0.0340722 -0.0047807 -0.0833989 0.0754862 0.0221487 0.0218647 -0.101452 0.0991103 -0.0625438 -0.0652136 0.0399567 -0.101034 -0.0474708 0.170472 -0.14519 0.0088293 0.150927 0.0890693 -0.105172 0.125278 -0.0408189 -0.0867203 0.00116741 -0.0152516 0.134769 -0.0198244 -0.00116378 0.164506 -0.00807046 -0.160893 -0.0370948 0.0405262 0.224841 -0.00552439 0.0571161 -0.0923377 -0.0225519 0.0487436 -0.0220458 0.0600157 -0.0516152 0.11026 -0.0565077 0.0139686 -0.00161261 -0.0241291 -0.0874328 -0.00264 0.068363 0.182719 0.000926435 -0.0071092 -0.0507029 -0.0368298 -0.0889787 -0.0189373 0.0683983 0.0752146 0.03255 0.0281959 0.142292 -0.081622 -0.0579792 -0.0474946 -0.118418 -0.0647908 -0.0258243 0.118421 0.0665166 -0.0769924 0.0547542 -0.0146306 -0.0262309 0.0373066 -0.111549 0.0262292 -0.143196 0.165274 0.0321765 -0.00276867 0.0855931 0.176977 -0.116351 -0.0324257 0.0446763 0.141412 -0.0844706 -0.0626167 0.0167998 0.177966 0.0518389 0.0193828 0.0114213 0.0529214 -0.137938 0.0214605 -0.00378447 0.00850643 
0.0522141 -0.0155471 -0.0896523 -0.0512511 0.10262 0.164803 0.0216586 -0.0372671 -0.0582816 -0.071473 -0.0450084 0.058848 0.0765224 -0.145452 -0.0262547 -0.0259324 -0.221195 -0.0269199 -0.0990005 0.153205 0.135861 -0.0912044 0.129485 0.0893725 0.0036982 -0.0123784 -0.0614161 -0.263726 -0.00851723 0.0491229 0.0340722 -0.0047807 -0.0833989 0.0754862 0.0221487 0.0218647 -0.101452 0.0991103 -0.0625438 -0.0652136 0.0399567 -0.101034 -0.0474708 0.170472 -0.14519 0.0088293 0.150927 0.0890693 -0.105172 0.125278 -0.0408189 -0.0867203 0.00116741 -0.0152516 0.134769 -0.0198244 -0.00116378 0.164506 -0.00807046 -0.160893 -0.0370948 0.0405262 0.224841 -0.00552439 0.0571161 -0.0923377 -0.0225519 0.0487436 -0.0220458 0.0600157 -0.0516152 0.11026 -0.0565077 0.0139686 -0.00161261 -0.0241291 -0.0874328 -0.00264 0.068363 0.182719 0.000926435 -0.0071092 -0.0507029 -0.0368298 -0.0889787 -0.0189373 0.0683983 0.0752146 0.03255 0.0281959 0.142292 -0.081622 -0.0579792 -0.0474946 -0.118418 -0.0647908 -0.0258243 0.118421 0.0665166 -0.0769924 0.0547542 -0.0146306 -0.0262309 0.0373066 -0.111549 0.0262292 -0.143196 0.165274 0.0321765 -0.00276867 0.0855931 0.176977 -0.116351 -0.0324257 0.0446763 0.141412 -0.0844706 -0.0626167 0.0167998 0.177966 0.0518389 0.0193828 0.0114213 0.0529214 -0.137938 0.0214605 -0.00378447 0.00850643 
0.0279312 -0.0175019 -0.0694125 -0.0759656 0.0548002 0.132281 -0.0171255 -0.0269052 -0.0551002 -0.0986174 -0.0729529 0.0466315 0.0567217 -0.1361 -0.0220933 -0.0354585 -0.25372 -0.083093 -0.0790723 0.147251 0.102504 -0.0844067 0.150204 0.0339815 -0.0159646 0.0389229 -0.0249678 -0.258044 -0.0474462 0.00948394 0.023495 -0.0228882 -0.0447781 0.0823141 0.0197323 0.0223345 -0.0694261 0.163378 -0.069156 -0.0543266 0.0248083 -0.118153 -0.0422264 0.153491 -0.129372 0.0406008 0.157648 0.0598363 -0.116874 0.157818 -0.0650788 -0.093128 0.0210364 0.0294358 0.153953 -0.0292605 0.0186706 0.133568 -0.0183813 -0.178559 -0.0265538 0.0300773 0.209255 0.0094103 0.0728184 -0.0818022 -0.0200423 0.0613298 0.00200455 0.0622133 -0.0680825 0.0695975 -0.0542313 0.0381837 0.0347008 -0.0326669 -0.0970121 -0.0354311 0.0753517 0.187131 -0.0114626 -0.0277315 -0.0576334 -0.0379096 -0.0970847 -0.0463964 0.0600461 0.0914652 0.0558862 0.0356537 0.135659 -0.0857466 -0.0287016 -0.0563631 -0.114018 -0.039593 -0.00505898 0.131862 0.0894039 -0.0799079 0.0230184 -0.0177288 -0.0399966 0.0279716 -0.100278 0.00948166 -0.152701 0.161713 0.00907058 -0.0290155 0.0912749 0.190404 -0.11572 -0.0389686 0.0472152 0.131015 -0.0656649 -0.0849156 0.0332003 0.163687 0.0665969 0.040967 0.0410781 0.0440228 -0.10363 -0.00351251 0.0341797 0.0148981 
0.0279312 -0.0175019 -0.0694125 -0.0759656 0.0548002 0.132281 -0.0171255 -0.0269052 -0.0551002 -0.0986174 -0.0729529 0.0466315 0.0567217 -0.1361 -0.0220933 -0.0354585 -0.25372 -0.083093 -0.0790723 0.147251 0.102504 -0.0844067 0.150204 0.0339815 -0.0159646 0.0389229 -0.0249678 -0.258044 -0.0474462 0.00948394 0.023495 -0.0228882 -0.0447781 0.0823141 0.0197323 0.0223345 -0.0694261 0.163378 -0.069156 -0.0543266 0.0248083 -0.118153 -0.0422264 0.153491 -0.129372 0.0406008 0.157648 0.0598363 -0.116874 0.157818 -0.0650788 -0.093128 0.0210364 0.0294358 0.153953 -0.0292605 0.0186706 0.133568 -0.0183813 -0.178559 -0.0265538 0.0300773 0.209255 0.0094103 0.0728184 -0.0818022 -0.0200423 0.0613298 0.00200455 0.0622133 -0.0680825 0.0695975 -0.0542313 0.0381837 0.0347008 -0.0326669 -0.0970121 -0.0354311 0.0753517 0.187131 -0.0114626 -0.0277315 -0.0576334 -0.0379096 -0.0970847 -0.0463964 0.0600461 0.0914652 0.0558862 0.0356537 0.135659 -0.0857466 -0.0287016 -0.0563631 -0.114018 -0.039593 -0.00505898 0.131862 0.0894039 -0.0799079 0.0230184 -0.0177288 -0.0399966 0.0279716 -0.100278 0.00948166 -0.152701 0.161713 0.00907058 -0.0290155 0.0912749 0.190404 -0.11572 -0.0389686 0.0472152 0.131015 -0.0656649 -0.0849156 0.0332003 0.163687 0.0665969 0.040967 0.0410781 0.0440228 -0.10363 -0.00351251 0.0341797 0.0148981 
-0.00267291 -0.0334446 -0.00874216 -0.104087 0.0633447 0.142803 -0.0234997 -0.00799688 -0.0563545 -0.100164 -0.0808527 0.0186622 0.0530182 -0.0668555 0.0610629 -0.0727673 -0.239244 -0.0959134 -0.0410156 0.103394 0.09096 -0.0681968 0.1445 0.0301177 0.0188907 0.0426407 -0.0458625 -0.228776 -0.0185232 -0.0423643 0.0981601 -0.0542791 -0.0506138 0.0560624 0.0364928 0.0640594 -0.0806764 0.160415 -0.0519587 -0.0453366 0.0579473 -0.0728297 -0.0757621 0.135322 -0.141585 0.0226732 0.125971 0.0579127 -0.0917372 0.110069 -0.12471 -0.0884001 0.0452808 0.0074376 0.125683 -0.00710479 -0.00558994 0.189964 -0.0349565 -0.186623 -0.0630347 0.0580237 0.199381 0.000799599 0.0682932 0.00205535 0.0144912 0.0740185 0.00388771 0.0767786 -0.0379957 0.104968 -0.0492322 0.0363693 0.0506927 -0.0452011 -0.129402 -0.0687804 0.106162 0.178072 -0.0362973 -0.0126055 -0.0362524 -0.0504901 -0.0747472 -0.0962283 0.0864275 0.119682 0.0551455 0.0087113 0.168806 -0.0481385 0.018629 -0.0608262 -0.0965125 -0.0689896 -0.00208281 0.141937 0.063163 -0.0651344 -0.0121689 -0.0297596 -0.0365361 -0.0191341 -0.129782 0.0581478 -0.139846 0.095999 0.060178 -0.0418266 0.107786 0.18399 -0.1383 -0.0424721 0.0791912 0.123475 -0.0628117 -0.0971466 0.0410472 0.162169 0.0835271 0.00976424 0.0034194 0.0405907 -0.128248 0.00318111 0.0387309 0.0539095 
-0.00267291 -0.0334446 -0.00874216 -0.104087 0.0633447 0.142803 -0.0234997 -0.00799688 -0.0563545 -0.100164 -0.0808527 0.0186622 0.0530182 -0.0668555 0.0610629 -0.0727673 -0.239244 -0.0959134 -0.0410156 0.103394 0.09096 -0.0681968 0.1445 0.0301177 0.0188907 0.0426407 -0.0458625 -0.228776 -0.0185232 -0.0423643 0.0981601 -0.0542791 -0.0506138 0.0560624 0.0364928 0.0640594 -0.0806764 0.160415 -0.0519587 -0.0453366 0.0579473 -0.0728297 -0.0757621 0.135322 -0.141585 0.0226732 0.125971 0.0579127 -0.0917372 0.110069 -0.12471 -0.0884001 0.0452808 0.0074376 0.125683 -0.00710479 -0.00558994 0.189964 -0.0349565 -0.186623 -0.0630347 0.0580237 0.199381 0.000799599 0.0682932 0.00205535 0.0144912 0.0740185 0.00388771 0.0767786 -0.0379957 0.104968 -0.0492322 0.0363693 0.0506927 -0.0452011 -0.129402 -0.0687804 0.106162 0.178072 -0.0362973 -0.0126055 -0.0362524 -0.0504901 -0.0747472 -0.0962283 0.0864275 0.119682 0.0551455 0.0087113 0.168806 -0.0481385 0.018629 -0.0608262 -0.0965125 -0.0689896 -0.00208281 0.141937 0.063163 -0.0651344 -0.0121689 -0.0297596 -0.0365361 -0.0191341 -0.129782 0.0581478 -0.139846 0.095999 0.060178 -0.0418266 0.107786 0.18399 -0.1383 -0.0424721 0.0791912 0.123475 -0.0628117 -0.0971466 0.0410472 0.162169 0.0835271 0.00976424 0.0034194 0.0405907 -0.128248 0.00318111 0.0387309 0.0539095 
-0.00267291 -0.0334446 -0.00874216 -0.104087 0.0633447 0.142803 -0.0234997 -0.00799688 -0.0563545 -0.100164 -0.0808527 0.0186622 0.0530182 -0.0668555 0.0610629 -0.0727673 -0.239244 -0.0959134 -0.0410156 0.103394 0.09096 -0.0681968 0.1445 0.0301177 0.0188907 0.0426407 -0.0458625 -0.228776 -0.0185232 -0.0423643 0.0981601 -0.0542791 -0.0506138 0.0560624 0.0364928 0.0640594 -0.0806764 0.160415 -0.0519587 -0.0453366 0.0579473 -0.0728297 -0.0757621 0.135322 -0.141585 0.0226732 0.125971 0.0579127 -0.0917372 0.110069 -0.12471 -0.0884001 0.0452808 0.0074376 0.125683 -0.00710479 -0.00558994 0.189964 -0.0349565 -0.186623 -0.0630347 0.0580237 0.199381 0.000799599 0.0682932 0.00205535 0.0144912 0.0740185 0.00388771 0.0767786 -0.0379957 0.104968 -0.0492322 0.0363693 0.0506927 -0.0452011 -0.129402 -0.0687804 0.106162 0.178072 -0.0362973 -0.0126055 -0.0362524 -0.0504901 -0.0747472 -0.0962283 0.0864275 0.119682 0.0551455 0.0087113 0.168806 -0.0481385 0.018629 -0.0608262 -0.0965125 -0.0689896 -0.00208281 0.141937 0.063163 -0.0651344 -0.0121689 -0.0297596 -0.0365361 -0.0191341 -0.129782 0.0581478 -0.139846 0.095999 0.060178 -0.0418266 0.107786 0.18399 -0.1383 -0.0424721 0.0791912 0.123475 -0.0628117 -0.0971466 0.0410472 0.162169 0.0835271 0.00976424 0.0034194 0.0405907 -0.128248 0.00318111 0.0387309 0.0539095 
0.0413143 0.0349699 -0.0639039 -0.0868205 0.0782734 0.109017 0.00682448 -0.000976387 -0.0239216 -0.072801 -0.039786 -0.00252157 0.0896264 -0.097936 0.00281291 -0.022387 -0.188164 -0.07362 -0.127766 0.154043 0.12097 -0.0926351 0.136454 0.0174048 0.00405595 0.0190039 -0.0574834 -0.207815 0.033004 -0.00144751 0.063431 0.0159031 -0.0382719 0.0780616 0.00672338 0.00833219 -0.0544351 0.233301 -0.0390135 -0.0697802 0.0305661 -0.0833375 -0.0590775 0.138974 -0.13577 0.0179755 0.117739 0.0776327 -0.096699 0.109379 -0.0907428 -0.0235776 -0.0108003 0.0126065 0.120362 -0.0455374 0.00761409 0.12661 -0.0171415 -0.225934 -0.0769658 -0.0172605 0.202571 0.00243788 0.0220851 -0.0293587 0.00146878 0.0918679 0.00044421 0.0376563 -0.0265222 0.0770699 -0.0499555 0.0392468 0.0449175 -0.0585351 -0.103263 -0.0203234 0.0774944 0.183187 -0.0173695 -0.0043569 -0.0264664 -0.0374863 -0.0350192 -0.0526271 0.0621242 0.124668 0.101377 0.00949653 0.137146 -0.0891652 -0.0439524 -0.0585928 -0.0901917 -0.100546 -0.000387463 0.140777 0.0370757 -0.101996 0.010051 -0.0215108 -0.0157357 0.0753476 -0.13849 0.0329962 -0.135834 0.161001 0.13215 -0.0650621 0.0775583 0.209501 -0.185972 0.0261483 0.0825331 0.0961568 -0.0991241 -0.104568 0.0433246 0.14918 0.0502055 0.074268 0.0323089 0.0839177 -0.0941788 -0.0380582 0.044864 0.0243313 
0.0413143 0.0349699 -0.0639039 -0.0868205 0.0782734 0.109017 0.00682448 -0.000976387 -0.0239216 -0.072801 -0.039786 -0.00252157 0.0896264 -0.097936 0.00281291 -0.022387 -0.188164 -0.07362 -0.127766 0.154043 0.12097 -0.0926351 0.136454 0.0174048 0.00405595 0.0190039 -0.0574834 -0.207815 0.033004 -0.00144751 0.063431 0.0159031 -0.0382719 0.0780616 0.00672338 0.00833219 -0.0544351 0.233301 -0.0390135 -0.0697802 0.0305661 -0.0833375 -0.0590775 0.138974 -0.13577 0.0179755 0.117739 0.0776327 -0.096699 0.109379 -0.0907428 -0.0235776 -0.0108003 0.0126065 0.120362 -0.0455374 0.00761409 0.12661 -0.0171415 -0.225934 -0.0769658 -0.0172605 0.202571 0.00243788 0.0220851 -0.0293587 0.00146878 0.0918679 0.00044421 0.0376563 -0.0265222 0.0770699 -0.0499555 0.0392468 0.0449175 -0.0585351 -0.103263 -0.0203234 0.0774944 0.183187 -0.0173695 -0.0043569 -0.0264664 -0.0374863 -0.0350192 -0.0526271 0.0621242 0.124668 0.101377 0.00949653 0.137146 -0.0891652 -0.0439524 -0.0585928 -0.0901917 -0.100546 -0.000387463 0.140777 0.0370757 -0.101996 0.010051 -0.0215108 -0.0157357 0.0753476 -0.13849 0.0329962 -0.135834 0.161001 0.13215 -0.0650621 0.0775583 0.209501 -0.185972 0.0261483 0.0825331 0.0961568 -0.0991241 -0.104568 0.0433246 0.14918 0.0502055 0.074268 0.0323089 0.0839177 -0.0941788 -0.0380582 0.044864 0.0243313 
0.0878399 -0.0384698 -0.0942718 -0.0661716 0.127436 0.149131 0.0628242 0.00660127 0.0143703 -0.0951212 -0.0365483 0.0775695 0.0842781 -0.14373 -0.0514132 -0.0581723 -0.144411 0.0196059 -0.170611 0.171609 0.123867 -0.035532 0.110632 0.135149 -0.0707493 -0.0393794 -0.0444032 -0.235253 -0.0052023 0.0321669 0.000162915 -0.00938149 -0.0679667 0.0883297 0.029037 -0.00730276 -0.0341165 0.168127 -0.128589 -0.0793387 0.0602804 -0.0318755 -0.0875932 0.153775 -0.184254 -0.0136387 0.0930739 0.0988223 -0.0673119 0.146193 -0.0535926 -0.106555 -0.0161736 0.0111985 0.151639 -0.028342 -0.0124017 0.152517 -0.0288307 -0.186222 -0.0444778 0.00816621 0.218808 -0.0338512 0.0389685 -0.133896 0.00554613 0.0614765 -0.0221349 0.0412612 -0.0187796 0.0550739 -0.0167964 0.0136888 -0.0275857 -0.000959843 -0.0939035 0.0385599 0.0804917 0.0892476 0.000737521 0.0695935 -0.0547569 -0.0603805 -0.0209048 -0.0281309 0.0897304 0.108379 0.0382145 0.0554734 0.16099 -0.135168 -0.0587119 -0.0730649 -0.0782669 -0.0802008 -0.0249537 0.0471736 0.0471383 -0.0679377 0.0759006 -0.0184391 -0.0282092 0.0636364 -0.126555 -0.0176813 -0.139887 0.0877594 0.0140734 0.00994719 0.108743 0.197737 -0.0882998 0.0139966 0.0241981 0.119229 -0.118937 -0.113687 -0.0257815 0.116951 0.0185118 0.0684398 0.014529 0.0887294 -0.0944676 -0.000823133 -0.0485415 -0.0536359 
0.0878399 -0.0384698 -0.0942718 -0.0661716 0.127436 0.149131 0.0628242 0.00660127 0.0143703 -0.0951212 -0.0365483 0.0775695 0.0842781 -0.14373 -0.0514132 -0.0581723 -0.144411 0.0196059 -0.170611 0.171609 0.123867 -0.035532 0.110632 0.135149 -0.0707493 -0.0393794 -0.0444032 -0.235253 -0.0052023 0.0321669 0.000162915 -0.00938149 -0.0679667 0.0883297 0.029037 -0.00730276 -0.0341165 0.168127 -0.128589 -0.0793387 0.0602804 -0.0318755 -0.0875932 0.153775 -0.184254 -0.0136387 0.0930739 0.0988223 -0.0673119 0.146193 -0.0535926 -0.106555 -0.0161736 0.0111985 0.151639 -0.028342 -0.0124017 0.152517 -0.0288307 -0.186222 -0.0444778 0.00816621 0.218808 -0.0338512 0.0389685 -0.133896 0.00554613 0.0614765 -0.0221349 0.0412612 -0.0187796 0.0550739 -0.0167964 0.0136888 -0.0275857 -0.000959843 -0.0939035 0.0385599 0.0804917 0.0892476 0.000737521 0.0695935 -0.0547569 -0.0603805 -0.0209048 -0.0281309 0.0897304 0.108379 0.0382145 0.0554734 0.16099 -0.135168 -0.0587119 -0.0730649 -0.0782669 -0.0802008 -0.0249537 0.0471736 0.0471383 -0.0679377 0.0759006 -0.0184391 -0.0282092 0.0636364 -0.126555 -0.0176813 -0.139887 0.0877594 0.0140734 0.00994719 0.108743 0.197737 -0.0882998 0.0139966 0.0241981 0.119229 -0.118937 -0.113687 -0.0257815 0.116951 0.0185118 0.0684398 0.014529 0.0887294 -0.0944676 -0.000823133 -0.0485415 -0.0536359 
0.0878399 -0.0384698 -0.0942718 -0.0661716 0.127436 0.149131 0.0628242 0.00660127 0.0143703 -0.0951212 -0.0365483 0.0775695 0.0842781 -0.14373 -0.0514132 -0.0581723 -0.144411 0.0196059 -0.170611 0.171609 0.123867 -0.035532 0.110632 0.135149 -0.0707493 -0.0393794 -0.0444032 -0.235253 -0.0052023 0.0321669 0.000162915 -0.00938149 -0.0679667 0.0883297 0.029037 -0.00730276 -0.0341165 0.168127 -0.128589 -0.0793387 0.0602804 -0.0318755 -0.0875932 0.153775 -0.184254 -0.0136387 0.0930739 0.0988223 -0.0673119 0.146193 -0.0535926 -0.106555 -0.0161736 0.0111985 0.151639 -0.028342 -0.0124017 0.152517 -0.0288307 -0.186222 -0.0444778 0.00816621 0.218808 -0.0338512 0.0389685 -0.133896 0.00554613 0.0614765 -0.0221349 0.0412612 -0.0187796 0.0550739 -0.0167964 0.0136888 -0.0275857 -0.000959843 -0.0939035 0.0385599 0.0804917 0.0892476 0.000737521 0.0695935 -0.0547569 -0.0603805 -0.0209048 -0.0281309 0.0897304 0.108379 0.0382145 0.0554734 0.16099 -0.135168 -0.0587119 -0.0730649 -0.0782669 -0.0802008 -0.0249537 0.0471736 0.0471383 -0.0679377 0.0759006 -0.0184391 -0.0282092 0.0636364 -0.126555 -0.0176813 -0.139887 0.0877594 0.0140734 0.00994719 0.108743 0.197737 -0.0882998 0.0139966 0.0241981 0.119229 -0.118937 -0.113687 -0.0257815 0.116951 0.0185118 0.0684398 0.014529 0.0887294 -0.0944676 -0.000823133 -0.0485415 -0.0536359 
0.0878399 -0.0384698 -0.0942718 -0.0661716 0.127436 0.149131 0.0628242 0.00660127 0.0143703 -0.0951212 -0.0365483 0.0775695 0.0842781 -0.14373 -0.0514132 -0.0581723 -0.144411 0.0196059 -0.170611 0.171609 0.123867 -0.035532 0.110632 0.135149 -0.0707493 -0.0393794 -0.0444032 -0.235253 -0.0052023 0.0321669 0.000162915 -0.00938149 -0.0679667 0.0883297 0.029037 -0.00730276 -0.0341165 0.168127 -0.128589 -0.0793387 0.0602804 -0.0318755 -0.0875932 0.153775 -0.184254 -0.0136387 0.0930739 0.0988223 -0.0673119 0.146193 -0.0535926 -0.106555 -0.0161736 0.0111985 0.151639 -0.028342 -0.0124017 0.152517 -0.0288307 -0.186222 -0.0444778 0.00816621 0.218808 -0.0338512 0.0389685 -0.133896 0.00554613 0.0614765 -0.0221349 0.0412612 -0.0187796 0.0550739 -0.0167964 0.0136888 -0.0275857 -0.000959843 -0.0939035 0.0385599 0.0804917 0.0892476 0.000737521 0.0695935 -0.0547569 -0.0603805 -0.0209048 -0.0281309 0.0897304 0.108379 0.0382145 0.0554734 0.16099 -0.135168 -0.0587119 -0.0730649 -0.0782669 -0.0802008 -0.0249537 0.0471736 0.0471383 -0.0679377 0.0759006 -0.0184391 -0.0282092 0.0636364 -0.126555 -0.0176813 -0.139887 0.0877594 0.0140734 0.00994719 0.108743 0.197737 -0.0882998 0.0139966 0.0241981 0.119229 -0.118937 -0.113687 -0.0257815 0.116951 0.0185118 0.0684398 0.014529 0.0887294 -0.0944676 -0.000823133 -0.0485415 -0.0536359 
0.0878399 -0.0384698 -0.0942718 -0.0661716 0.127436 0.149131 0.0628242 0.00660127 0.0143703 -0.0951212 -0.0365483 0.0775695 0.0842781 -0.14373 -0.0514132 -0.0581723 -0.144411 0.0196059 -0.170611 0.171609 0.123867 -0.035532 0.110632 0.135149 -0.0707493 -0.0393794 -0.0444032 -0.235253 -0.0052023 0.0321669 0.000162915 -0.00938149 -0.0679667 0.0883297 0.029037 -0.00730276 -0.0341165 0.168127 -0.128589 -0.0793387 0.0602804 -0.0318755 -0.0875932 0.153775 -0.184254 -0.0136387 0.0930739 0.0988223 -0.0673119 0.146193 -0.0535926 -0.106555 -0.0161736 0.0111985 0.151639 -0.028342 -0.0124017 0.152517 -0.0288307 -0.186222 -0.0444778 0.00816621 0.218808 -0.0338512 0.0389685 -0.133896 0.00554613 0.0614765 -0.0221349 0.0412612 -0.0187796 0.0550739 -0.0167964 0.0136888 -0.0275857 -0.000959843 -0.0939035 0.0385599 0.0804917 0.0892476 0.000737521 0.0695935 -0.0547569 -0.0603805 -0.0209048 -0.0281309 0.0897304 0.108379 0.0382145 0.0554734 0.16099 -0.135168 -0.0587119 -0.0730649 -0.0782669 -0.0802008 -0.0249537 0.0471736 0.0471383 -0.0679377 0.0759006 -0.0184391 -0.0282092 0.0636364 -0.126555 -0.0176813 -0.139887 0.0877594 0.0140734 0.00994719 0.108743 0.197737 -0.0882998 0.0139966 0.0241981 0.119229 -0.118937 -0.113687 -0.0257815 0.116951 0.0185118 0.0684398 0.014529 0.0887294 -0.0944676 -0.000823133 -0.0485415 -0.0536359 
0.0878399 -0.0384698 -0.0942718 -0.0661716 0.127436 0.149131 0.0628242 0.00660127 0.0143703 -0.0951212 -0.0365483 0.0775695 0.0842781 -0.14373 -0.0514132 -0.0581723 -0.144411 0.0196059 -0.170611 0.171609 0.123867 -0.035532 0.110632 0.135149 -0.0707493 -0.0393794 -0.0444032 -0.235253 -0.0052023 0.0321669 0.000162915 -0.00938149 -0.0679667 0.0883297 0.029037 -0.00730276 -0.0341165 0.168127 -0.128589 -0.0793387 0.0602804 -0.0318755 -0.0875932 0.153775 -0.184254 -0.0136387 0.0930739 0.0988223 -0.0673119 0.146193 -0.0535926 -0.106555 -0.0161736 0.0111985 0.151639 -0.028342 -0.0124017 0.152517 -0.0288307 -0.186222 -0.0444778 0.00816621 0.218808 -0.0338512 0.0389685 -0.133896 0.00554613 0.0614765 -0.0221349 0.0412612 -0.0187796 0.0550739 -0.0167964 0.0136888 -0.0275857 -0.000959843 -0.0939035 0.0385599 0.0804917 0.0892476 0.000737521 0.0695935 -0.0547569 -0.0603805 -0.0209048 -0.0281309 0.0897304 0.108379 0.0382145 0.0554734 0.16099 -0.135168 -0.0587119 -0.0730649 -0.0782669 -0.0802008 -0.0249537 0.0471736 0.0471383 -0.0679377 0.0759006 -0.0184391 -0.0282092 0.0636364 -0.126555 -0.0176813 -0.139887 0.0877594 0.0140734 0.00994719 0.108743 0.197737 -0.0882998 0.0139966 0.0241981 0.119229 -0.118937 -0.113687 -0.0257815 0.116951 0.0185118 0.0684398 0.014529 0.0887294 -0.0944676 -0.000823133 -0.0485415 -0.0536359 
0.0878399 -0.0384698 -0.0942718 -0.0661716 0.127436 0.149131 0.0628242 0.00660127 0.0143703 -0.0951212 -0.0365483 0.0775695 0.0842781 -0.14373 -0.0514132 -0.0581723 -0.144411 0.0196059 -0.170611 0.171609 0.123867 -0.035532 0.110632 0.135149 -0.0707493 -0.0393794 -0.0444032 -0.235253 -0.0052023 0.0321669 0.000162915 -0.00938149 -0.0679667 0.0883297 0.029037 -0.00730276 -0.0341165 0.168127 -0.128589 -0.0793387 0.0602804 -0.0318755 -0.0875932 0.153775 -0.184254 -0.0136387 0.0930739 0.0988223 -0.0673119 0.146193 -0.0535926 -0.106555 -0.0161736 0.0111985 0.151639 -0.028342 -0.0124017 0.152517 -0.0288307 -0.186222 -0.0444778 0.00816621 0.218808 -0.0338512 0.0389685 -0.133896 0.00554613 0.0614765 -0.0221349 0.0412612 -0.0187796 0.0550739 -0.0167964 0.0136888 -0.0275857 -0.000959843 -0.0939035 0.0385599 0.0804917 0.0892476 0.000737521 0.0695935 -0.0547569 -0.0603805 -0.0209048 -0.0281309 0.0897304 0.108379 0.0382145 0.0554734 0.16099 -0.135168 -0.0587119 -0.0730649 -0.0782669 -0.0802008 -0.0249537 0.0471736 0.0471383 -0.0679377 0.0759006 -0.0184391 -0.0282092 0.0636364 -0.126555 -0.0176813 -0.139887 0.0877594 0.0140734 0.00994719 0.108743 0.197737 -0.0882998 0.0139966 0.0241981 0.119229 -0.118937 -0.113687 -0.0257815 0.116951 0.0185118 0.0684398 0.014529 0.0887294 -0.0944676 -0.000823133 -0.0485415 -0.0536359 
0.0878399 -0.0384698 -0.0942718 -0.0661716 0.127436 0.149131 0.0628242 0.00660127 0.0143703 -0.0951212 -0.0365483 0.0775695 0.0842781 -0.14373 -0.0514132 -0.0581723 -0.144411 0.0196059 -0.170611 0.171609 0.123867 -0.035532 0.110632 0.135149 -0.0707493 -0.0393794 -0.0444032 -0.235253 -0.0052023 0.0321669 0.000162915 -0.00938149 -0.0679667 0.0883297 0.029037 -0.00730276 -0.0341165 0.168127 -0.128589 -0.0793387 0.0602804 -0.0318755 -0.0875932 0.153775 -0.184254 -0.0136387 0.0930739 0.0988223 -0.0673119 0.146193 -0.0535926 -0.106555 -0.0161736 0.0111985 0.151639 -0.028342 -0.0124017 0.152517 -0.0288307 -0.186222 -0.0444778 0.00816621 0.218808 -0.0338512 0.0389685 -0.133896 0.00554613 0.0614765 -0.0221349 0.0412612 -0.0187796 0.0550739 -0.0167964 0.0136888 -0.0275857 -0.000959843 -0.0939035 0.0385599 0.0804917 0.0892476 0.000737521 0.0695935 -0.0547569 -0.0603805 -0.0209048 -0.0281309 0.0897304 0.108379 0.0382145 0.0554734 0.16099 -0.135168 -0.0587119 -0.0730649 -0.0782669 -0.0802008 -0.0249537 0.0471736 0.0471383 -0.0679377 0.0759006 -0.0184391 -0.0282092 0.0636364 -0.126555 -0.0176813 -0.139887 0.0877594 0.0140734 0.00994719 0.108743 0.197737 -0.0882998 0.0139966 0.0241981 0.119229 -0.118937 -0.113687 -0.0257815 0.116951 0.0185118 0.0684398 0.014529 0.0887294 -0.0944676 -0.000823133 -0.0485415 -0.0536359 
0.0878399 -0.0384698 -0.0942718 -0.0661716 0.127436 0.149131 0.0628242 0.00660127 0.0143703 -0.0951212 -0.0365483 0.0775695 0.0842781 -0.14373 -0.0514132 -0.0581723 -0.144411 0.0196059 -0.170611 0.171609 0.123867 -0.035532 0.110632 0.135149 -0.0707493 -0.0393794 -0.0444032 -0.235253 -0.0052023 0.0321669 0.000162915 -0.00938149 -0.0679667 0.0883297 0.029037 -0.00730276 -0.0341165 0.168127 -0.128589 -0.0793387 0.0602804 -0.0318755 -0.0875932 0.153775 -0.184254 -0.0136387 0.0930739 0.0988223 -0.0673119 0.146193 -0.0535926 -0.106555 -0.0161736 0.0111985 0.151639 -0.028342 -0.0124017 0.152517 -0.0288307 -0.186222 -0.0444778 0.00816621 0.218808 -0.0338512 0.0389685 -0.133896 0.00554613 0.0614765 -0.0221349 0.0412612 -0.0187796 0.0550739 -0.0167964 0.0136888 -0.0275857 -0.000959843 -0.0939035 0.0385599 0.0804917 0.0892476 0.000737521 0.0695935 -0.0547569 -0.0603805 -0.0209048 -0.0281309 0.0897304 0.108379 0.0382145 0.0554734 0.16099 -0.135168 -0.0587119 -0.0730649 -0.0782669 -0.0802008 -0.0249537 0.0471736 0.0471383 -0.0679377 0.0759006 -0.0184391 -0.0282092 0.0636364 -0.126555 -0.0176813 -0.139887 0.0877594 0.0140734 0.00994719 0.108743 0.197737 -0.0882998 0.0139966 0.0241981 0.119229 -0.118937 -0.113687 -0.0257815 0.116951 0.0185118 0.0684398 0.014529 0.0887294 -0.0944676 -0.000823133 -0.0485415 -0.0536359 
0.0878399 -0.0384698 -0.0942718 -0.0661716 0.127436 0.149131 0.0628242 0.00660127 0.0143703 -0.0951212 -0.0365483 0.0775695 0.0842781 -0.14373 -0.0514132 -0.0581723 -0.144411 0.0196059 -0.170611 0.171609 0.123867 -0.035532 0.110632 0.135149 -0.0707493 -0.0393794 -0.0444032 -0.235253 -0.0052023 0.0321669 0.000162915 -0.00938149 -0.0679667 0.0883297 0.029037 -0.00730276 -0.0341165 0.168127 -0.128589 -0.0793387 0.0602804 -0.0318755 -0.0875932 0.153775 -0.184254 -0.0136387 0.0930739 0.0988223 -0.0673119 0.146193 -0.0535926 -0.106555 -0.0161736 0.0111985 0.151639 -0.028342 -0.0124017 0.152517 -0.0288307 -0.186222 -0.0444778 0.00816621 0.218808 -0.0338512 0.0389685 -0.133896 0.00554613 0.0614765 -0.0221349 0.0412612 -0.0187796 0.0550739 -0.0167964 0.0136888 -0.0275857 -0.000959843 -0.0939035 0.0385599 0.0804917 0.0892476 0.000737521 0.0695935 -0.0547569 -0.0603805 -0.0209048 -0.0281309 0.0897304 0.108379 0.0382145 0.0554734 0.16099 -0.135168 -0.0587119 -0.0730649 -0.0782669 -0.0802008 -0.0249537 0.0471736 0.0471383 -0.0679377 0.0759006 -0.0184391 -0.0282092 0.0636364 -0.126555 -0.0176813 -0.139887 0.0877594 0.0140734 0.00994719 0.108743 0.197737 -0.0882998 0.0139966 0.0241981 0.119229 -0.118937 -0.113687 -0.0257815 0.116951 0.0185118 0.0684398 0.014529 0.0887294 -0.0944676 -0.000823133 -0.0485415 -0.0536359 
0.0878399 -0.0384698 -0.0942718 -0.0661716 0.127436 0.149131 0.0628242 0.00660127 0.0143703 -0.0951212 -0.0365483 0.0775695 0.0842781 -0.14373 -0.0514132 -0.0581723 -0.144411 0.0196059 -0.170611 0.171609 0.123867 -0.035532 0.110632 0.135149 -0.0707493 -0.0393794 -0.0444032 -0.235253 -0.0052023 0.0321669 0.000162915 -0.00938149 -0.0679667 0.0883297 0.029037 -0.00730276 -0.0341165 0.168127 -0.128589 -0.0793387 0.0602804 -0.0318755 -0.0875932 0.153775 -0.184254 -0.0136387 0.0930739 0.0988223 -0.0673119 0.146193 -0.0535926 -0.106555 -0.0161736 0.0111985 0.151639 -0.028342 -0.0124017 0.152517 -0.0288307 -0.186222 -0.0444778 0.00816621 0.218808 -0.0338512 0.0389685 -0.133896 0.00554613 0.0614765 -0.0221349 0.0412612 -0.0187796 0.0550739 -0.0167964 0.0136888 -0.0275857 -0.000959843 -0.0939035 0.0385599 0.0804917 0.0892476 0.000737521 0.0695935 -0.0547569 -0.0603805 -0.0209048 -0.0281309 0.0897304 0.108379 0.0382145 0.0554734 0.16099 -0.135168 -0.0587119 -0.0730649 -0.0782669 -0.0802008 -0.0249537 0.0471736 0.0471383 -0.0679377 0.0759006 -0.0184391 -0.0282092 0.0636364 -0.126555 -0.0176813 -0.139887 0.0877594 0.0140734 0.00994719 0.108743 0.197737 -0.0882998 0.0139966 0.0241981 0.119229 -0.118937 -0.113687 -0.0257815 0.116951 0.0185118 0.0684398 0.014529 0.0887294 -0.0944676 -0.000823133 -0.0485415 -0.0536359 
0.0878399 -0.0384698 -0.0942718 -0.0661716 0.127436 0.149131 0.0628242 0.00660127 0.0143703 -0.0951212 -0.0365483 0.0775695 0.0842781 -0.14373 -0.0514132 -0.0581723 -0.144411 0.0196059 -0.170611 0.171609 0.123867 -0.035532 0.110632 0.135149 -0.0707493 -0.0393794 -0.0444032 -0.235253 -0.0052023 0.0321669 0.000162915 -0.00938149 -0.0679667 0.0883297 0.029037 -0.00730276 -0.0341165 0.168127 -0.128589 -0.0793387 0.0602804 -0.0318755 -0.0875932 0.153775 -0.184254 -0.0136387 0.0930739 0.0988223 -0.0673119 0.146193 -0.0535926 -0.106555 -0.0161736 0.0111985 0.151639 -0.028342 -0.0124017 0.152517 -0.0288307 -0.186222 -0.0444778 0.00816621 0.218808 -0.0338512 0.0389685 -0.133896 0.00554613 0.0614765 -0.0221349 0.0412612 -0.0187796 0.0550739 -0.0167964 0.0136888 -0.0275857 -0.000959843 -0.0939035 0.0385599 0.0804917 0.0892476 0.000737521 0.0695935 -0.0547569 -0.0603805 -0.0209048 -0.0281309 0.0897304 0.108379 0.0382145 0.0554734 0.16099 -0.135168 -0.0587119 -0.0730649 -0.0782669 -0.0802008 -0.0249537 0.0471736 0.0471383 -0.0679377 0.0759006 -0.0184391 -0.0282092 0.0636364 -0.126555 -0.0176813 -0.139887 0.0877594 0.0140734 0.00994719 0.108743 0.197737 -0.0882998 0.0139966 0.0241981 0.119229 -0.118937 -0.113687 -0.0257815 0.116951 0.0185118 0.0684398 0.014529 0.0887294 -0.0944676 -0.000823133 -0.0485415 -0.0536359 
0.0878399 -0.0384698 -0.0942718 -0.0661716 0.127436 0.149131 0.0628242 0.00660127 0.0143703 -0.0951212 -0.0365483 0.0775695 0.0842781 -0.14373 -0.0514132 -0.0581723 -0.144411 0.0196059 -0.170611 0.171609 0.123867 -0.035532 0.110632 0.135149 -0.0707493 -0.0393794 -0.0444032 -0.235253 -0.0052023 0.0321669 0.000162915 -0.00938149 -0.0679667 0.0883297 0.029037 -0.00730276 -0.0341165 0.168127 -0.128589 -0.0793387 0.0602804 -0.0318755 -0.0875932 0.153775 -0.184254 -0.0136387 0.0930739 0.0988223 -0.0673119 0.146193 -0.0535926 -0.106555 -0.0161736 0.0111985 0.151639 -0.028342 -0.0124017 0.152517 -0.0288307 -0.186222 -0.0444778 0.00816621 0.218808 -0.0338512 0.0389685 -0.133896 0.00554613 0.0614765 -0.0221349 0.0412612 -0.0187796 0.0550739 -0.0167964 0.0136888 -0.0275857 -0.000959843 -0.0939035 0.0385599 0.0804917 0.0892476 0.000737521 0.0695935 -0.0547569 -0.0603805 -0.0209048 -0.0281309 0.0897304 0.108379 0.0382145 0.0554734 0.16099 -0.135168 -0.0587119 -0.0730649 -0.0782669 -0.0802008 -0.0249537 0.0471736 0.0471383 -0.0679377 0.0759006 -0.0184391 -0.0282092 0.0636364 -0.126555 -0.0176813 -0.139887 0.0877594 0.0140734 0.00994719 0.108743 0.197737 -0.0882998 0.0139966 0.0241981 0.119229 -0.118937 -0.113687 -0.0257815 0.116951 0.0185118 0.0684398 0.014529 0.0887294 -0.0944676 -0.000823133 -0.0485415 -0.0536359 
0.0878399 -0.0384698 -0.0942718 -0.0661716 0.127436 0.149131 0.0628242 0.00660127 0.0143703 -0.0951212 -0.0365483 0.0775695 0.0842781 -0.14373 -0.0514132 -0.0581723 -0.144411 0.0196059 -0.170611 0.171609 0.123867 -0.035532 0.110632 0.135149 -0.0707493 -0.0393794 -0.0444032 -0.235253 -0.0052023 0.0321669 0.000162915 -0.00938149 -0.0679667 0.0883297 0.029037 -0.00730276 -0.0341165 0.168127 -0.128589 -0.0793387 0.0602804 -0.0318755 -0.0875932 0.153775 -0.184254 -0.0136387 0.0930739 0.0988223 -0.0673119 0.146193 -0.0535926 -0.106555 -0.0161736 0.0111985 0.151639 -0.028342 -0.0124017 0.152517 -0.0288307 -0.186222 -0.0444778 0.00816621 0.218808 -0.0338512 0.0389685 -0.133896 0.00554613 0.0614765 -0.0221349 0.0412612 -0.0187796 0.0550739 -0.0167964 0.0136888 -0.0275857 -0.000959843 -0.0939035 0.0385599 0.0804917 0.0892476 0.000737521 0.0695935 -0.0547569 -0.0603805 -0.0209048 -0.0281309 0.0897304 0.108379 0.0382145 0.0554734 0.16099 -0.135168 -0.0587119 -0.0730649 -0.0782669 -0.0802008 -0.0249537 0.0471736 0.0471383 -0.0679377 0.0759006 -0.0184391 -0.0282092 0.0636364 -0.126555 -0.0176813 -0.139887 0.0877594 0.0140734 0.00994719 0.108743 0.197737 -0.0882998 0.0139966 0.0241981 0.119229 -0.118937 -0.113687 -0.0257815 0.116951 0.0185118 0.0684398 0.014529 0.0887294 -0.0944676 -0.000823133 -0.0485415 -0.0536359 
0.0878399 -0.0384698 -0.0942718 -0.0661716 0.127436 0.149131 0.0628242 0.00660127 0.0143703 -0.0951212 -0.0365483 0.0775695 0.0842781 -0.14373 -0.0514132 -0.0581723 -0.144411 0.0196059 -0.170611 0.171609 0.123867 -0.035532 0.110632 0.135149 -0.0707493 -0.0393794 -0.0444032 -0.235253 -0.0052023 0.0321669 0.000162915 -0.00938149 -0.0679667 0.0883297 0.029037 -0.00730276 -0.0341165 0.168127 -0.128589 -0.0793387 0.0602804 -0.0318755 -0.0875932 0.153775 -0.184254 -0.0136387 0.0930739 0.0988223 -0.0673119 0.146193 -0.0535926 -0.106555 -0.0161736 0.0111985 0.151639 -0.028342 -0.0124017 0.152517 -0.0288307 -0.186222 -0.0444778 0.00816621 0.218808 -0.0338512 0.0389685 -0.133896 0.00554613 0.0614765 -0.0221349 0.0412612 -0.0187796 0.0550739 -0.0167964 0.0136888 -0.0275857 -0.000959843 -0.0939035 0.0385599 0.0804917 0.0892476 0.000737521 0.0695935 -0.0547569 -0.0603805 -0.0209048 -0.0281309 0.0897304 0.108379 0.0382145 0.0554734 0.16099 -0.135168 -0.0587119 -0.0730649 -0.0782669 -0.0802008 -0.0249537 0.0471736 0.0471383 -0.0679377 0.0759006 -0.0184391 -0.0282092 0.0636364 -0.126555 -0.0176813 -0.139887 0.0877594 0.0140734 0.00994719 0.108743 0.197737 -0.0882998 0.0139966 0.0241981 0.119229 -0.118937 -0.113687 -0.0257815 0.116951 0.0185118 0.0684398 0.014529 0.0887294 -0.0944676 -0.000823133 -0.0485415 -0.0536359 
0.0878399 -0.0384698 -0.0942718 -0.0661716 0.127436 0.149131 0.0628242 0.00660127 0.0143703 -0.0951212 -0.0365483 0.0775695 0.0842781 -0.14373 -0.0514132 -0.0581723 -0.144411 0.0196059 -0.170611 0.171609 0.123867 -0.035532 0.110632 0.135149 -0.0707493 -0.0393794 -0.0444032 -0.235253 -0.0052023 0.0321669 0.000162915 -0.00938149 -0.0679667 0.0883297 0.029037 -0.00730276 -0.0341165 0.168127 -0.128589 -0.0793387 0.0602804 -0.0318755 -0.0875932 0.153775 -0.184254 -0.0136387 0.0930739 0.0988223 -0.0673119 0.146193 -0.0535926 -0.106555 -0.0161736 0.0111985 0.151639 -0.028342 -0.0124017 0.152517 -0.0288307 -0.186222 -0.0444778 0.00816621 0.218808 -0.0338512 0.0389685 -0.133896 0.00554613 0.0614765 -0.0221349 0.0412612 -0.0187796 0.0550739 -0.0167964 0.0136888 -0.0275857 -0.000959843 -0.0939035 0.0385599 0.0804917 0.0892476 0.000737521 0.0695935 -0.0547569 -0.0603805 -0.0209048 -0.0281309 0.0897304 0.108379 0.0382145 0.0554734 0.16099 -0.135168 -0.0587119 -0.0730649 -0.0782669 -0.0802008 -0.0249537 0.0471736 0.0471383 -0.0679377 0.0759006 -0.0184391 -0.0282092 0.0636364 -0.126555 -0.0176813 -0.139887 0.0877594 0.0140734 0.00994719 0.108743 0.197737 -0.0882998 0.0139966 0.0241981 0.119229 -0.118937 -0.113687 -0.0257815 0.116951 0.0185118 0.0684398 0.014529 0.0887294 -0.0944676 -0.000823133 -0.0485415 -0.0536359 
0.0878399 -0.0384698 -0.0942718 -0.0661716 0.127436 0.149131 0.0628242 0.00660127 0.0143703 -0.0951212 -0.0365483 0.0775695 0.0842781 -0.14373 -0.0514132 -0.0581723 -0.144411 0.0196059 -0.170611 0.171609 0.123867 -0.035532 0.110632 0.135149 -0.0707493 -0.0393794 -0.0444032 -0.235253 -0.0052023 0.0321669 0.000162915 -0.00938149 -0.0679667 0.0883297 0.029037 -0.00730276 -0.0341165 0.168127 -0.128589 -0.0793387 0.0602804 -0.0318755 -0.0875932 0.153775 -0.184254 -0.0136387 0.0930739 0.0988223 -0.0673119 0.146193 -0.0535926 -0.106555 -0.0161736 0.0111985 0.151639 -0.028342 -0.0124017 0.152517 -0.0288307 -0.186222 -0.0444778 0.00816621 0.218808 -0.0338512 0.0389685 -0.133896 0.00554613 0.0614765 -0.0221349 0.0412612 -0.0187796 0.0550739 -0.0167964 0.0136888 -0.0275857 -0.000959843 -0.0939035 0.0385599 0.0804917 0.0892476 0.000737521 0.0695935 -0.0547569 -0.0603805 -0.0209048 -0.0281309 0.0897304 0.108379 0.0382145 0.0554734 0.16099 -0.135168 -0.0587119 -0.0730649 -0.0782669 -0.0802008 -0.0249537 0.0471736 0.0471383 -0.0679377 0.0759006 -0.0184391 -0.0282092 0.0636364 -0.126555 -0.0176813 -0.139887 0.0877594 0.0140734 0.00994719 0.108743 0.197737 -0.0882998 0.0139966 0.0241981 0.119229 -0.118937 -0.113687 -0.0257815 0.116951 0.0185118 0.0684398 0.014529 0.0887294 -0.0944676 -0.000823133 -0.0485415 -0.0536359 
0.0878399 -0.0384698 -0.0942718 -0.0661716 0.127436 0.149131 0.0628242 0.00660127 0.0143703 -0.0951212 -0.0365483 0.0775695 0.0842781 -0.14373 -0.0514132 -0.0581723 -0.144411 0.0196059 -0.170611 0.171609 0.123867 -0.035532 0.110632 0.135149 -0.0707493 -0.0393794 -0.0444032 -0.235253 -0.0052023 0.0321669 0.000162915 -0.00938149 -0.0679667 0.0883297 0.029037 -0.00730276 -0.0341165 0.168127 -0.128589 -0.0793387 0.0602804 -0.0318755 -0.0875932 0.153775 -0.184254 -0.0136387 0.0930739 0.0988223 -0.0673119 0.146193 -0.0535926 -0.106555 -0.0161736 0.0111985 0.151639 -0.028342 -0.0124017 0.152517 -0.0288307 -0.186222 -0.0444778 0.00816621 0.218808 -0.0338512 0.0389685 -0.133896 0.00554613 0.0614765 -0.0221349 0.0412612 -0.0187796 0.0550739 -0.0167964 0.0136888 -0.0275857 -0.000959843 -0.0939035 0.0385599 0.0804917 0.0892476 0.000737521 0.0695935 -0.0547569 -0.0603805 -0.0209048 -0.0281309 0.0897304 0.108379 0.0382145 0.0554734 0.16099 -0.135168 -0.0587119 -0.0730649 -0.0782669 -0.0802008 -0.0249537 0.0471736 0.0471383 -0.0679377 0.0759006 -0.0184391 -0.0282092 0.0636364 -0.126555 -0.0176813 -0.139887 0.0877594 0.0140734 0.00994719 0.108743 0.197737 -0.0882998 0.0139966 0.0241981 0.119229 -0.118937 -0.113687 -0.0257815 0.116951 0.0185118 0.0684398 0.014529 0.0887294 -0.0944676 -0.000823133 -0.0485415 -0.0536359 
0.0878399 -0.0384698 -0.0942718 -0.0661716 0.127436 0.149131 0.0628242 0.00660127 0.0143703 -0.0951212 -0.0365483 0.0775695 0.0842781 -0.14373 -0.0514132 -0.0581723 -0.144411 0.0196059 -0.170611 0.171609 0.123867 -0.035532 0.110632 0.135149 -0.0707493 -0.0393794 -0.0444032 -0.235253 -0.0052023 0.0321669 0.000162915 -0.00938149 -0.0679667 0.0883297 0.029037 -0.00730276 -0.0341165 0.168127 -0.128589 -0.0793387 0.0602804 -0.0318755 -0.0875932 0.153775 -0.184254 -0.0136387 0.0930739 0.0988223 -0.0673119 0.146193 -0.0535926 -0.106555 -0.0161736 0.0111985 0.151639 -0.028342 -0.0124017 0.152517 -0.0288307 -0.186222 -0.0444778 0.00816621 0.218808 -0.0338512 0.0389685 -0.133896 0.00554613 0.0614765 -0.0221349 0.0412612 -0.0187796 0.0550739 -0.0167964 0.0136888 -0.0275857 -0.000959843 -0.0939035 0.0385599 0.0804917 0.0892476 0.000737521 0.0695935 -0.0547569 -0.0603805 -0.0209048 -0.0281309 0.0897304 0.108379 0.0382145 0.0554734 0.16099 -0.135168 -0.0587119 -0.0730649 -0.0782669 -0.0802008 -0.0249537 0.0471736 0.0471383 -0.0679377 0.0759006 -0.0184391 -0.0282092 0.0636364 -0.126555 -0.0176813 -0.139887 0.0877594 0.0140734 0.00994719 0.108743 0.197737 -0.0882998 0.0139966 0.0241981 0.119229 -0.118937 -0.113687 -0.0257815 0.116951 0.0185118 0.0684398 0.014529 0.0887294 -0.0944676 -0.000823133 -0.0485415 -0.0536359 
