{
  "descriptor": [
    -0.1114383116364479,
    0.10940099507570267,
    0.08848460018634796,
    0.00320801162160933,
    -0.14684779942035675,
    -0.02908679097890854,
    -0.034845877438783646,
    -0.13669580221176147,
    0.15484777092933655,
    -0.1051216647028923,
    0.1257687509059906,
    -0.0058453269302845,
    -0.1507280170917511,
    -0.02086063288152218,
    -0.021225539967417717,
    0.10891028493642807,
    -0.14931374788284302,
    -0.10009252279996872,
    -0.1234850212931633,
    -0.030417149886488914,
    -0.018234461545944214,
    0.031881652772426605,
    0.023197976872324944,
    -0.07232914865016937,
    -0.057319559156894684,
    -0.37738165259361267,
    -0.06772912293672562,
    -0.041709356009960175,
    0.07473643124103546,
    -0.04565569758415222,
    -0.053317442536354065,
    0.013295311480760574,
    -0.2202165126800537,
    -0.10219057649374008,
    0.034140825271606445,
    0.033264417201280594,
    -0.10560662299394608,
    -0.046782657504081726,
    0.19207078218460083,
    0.043012313544750214,
    -0.23111283779144287,
    0.03913138806819916,
    0.011726602911949158,
    0.24612148106098175,
    0.23290769755840302,
    -0.004907029215246439,
    -0.022565798833966255,
    -0.13089917600154877,
    0.19168512523174286,
    -0.2417338788509369,
    0.017511555925011635,
    0.1755947321653366,
    0.08198902010917664,
    0.08947104215621948,
    0.021332627162337303,
    0.00978440884500742,
    0.032051343470811844,
    0.09268294274806976,
    -0.1991276741027832,
    0.015719396993517876,
    0.15476660430431366,
    -0.09527182579040527,
    -0.08564261347055435,
    -0.052912015467882156,
    0.18749897181987762,
    0.16717031598091125,
    -0.09054012596607208,
    -0.17286506295204163,
    0.06838037073612213,
    -0.158573180437088,
    -0.07275907695293427,
    -0.0025856627617031336,
    -0.06679674237966537,
    -0.13230200111865997,
    -0.2676835060119629,
    0.008288891986012459,
    0.4292105436325073,
    0.09721339493989944,
    -0.1526571810245514,
    -0.02326914668083191,
    -0.14238493144512177,
    -0.054454904049634933,
    0.09637517482042313,
    0.10709720104932785,
    -0.07876790314912796,
    -0.007148257456719875,
    0.022019920870661736,
    0.03470743075013161,
    0.23419229686260223,
    -0.04323601722717285,
    -0.04048854857683182,
    0.19779027998447418,
    0.016880905255675316,
    0.05438414588570595,
    -0.0008411929593421519,
    0.03372058644890785,
    -0.10756970942020416,
    -0.026843037456274033,
    -0.13701921701431274,
    -0.057670027017593384,
    0.05085240676999092,
    -0.043859660625457764,
    0.05548298358917236,
    0.1276646852493286,
    -0.20488056540489197,
    0.24176235496997833,
    0.0034559965133666992,
    0.04284864291548729,
    0.11795628070831299,
    -0.08862772583961487,
    -0.04311332851648331,
    -0.024197950959205627,
    0.09978330880403519,
    -0.1892516016960144,
    0.25313112139701843,
    0.12731167674064636,
    0.006414808798581362,
    0.09986737370491028,
    0.07574626058340073,
    -0.006182550452649593,
    -0.013664024882018566,
    0.03496354818344116,
    -0.1307293325662613,
    -0.07533648610115051,
    0.05575023964047432,
    0.008726811036467552,
    0.036359477788209915,
    -0.025696128606796265
  ]
}