-0.0531791 0.0672887 -0.109055 0.0220777 0.0588098 0.140958 0.0108655 -0.182258 -0.0468276 0.0268379 0.0293582 0.0136138 0.0629601 0.0630374 -0.00215054 0.0232035 -0.101341 0.0597846 0.0589721 0.0300909 0.0957757 -0.131882 0.0705345 0.108926 0.0699199 0.0191718 -0.0967548 -0.19537 0.116105 0.126259 0.0921877 0.0618255 -0.0511232 -0.100168 0.0392245 0.143237 -0.147223 0.048811 -0.0194996 -0.0364242 -0.0260632 -0.00555566 -0.0709997 0.112814 -0.107929 0.045974 0.158965 0.0339458 -0.0904183 -0.117419 -0.0752314 0.00417979 0.0627483 -0.113151 0.0740017 0.107242 0.00843734 0.252648 0.0272648 -0.0676036 -0.101943 0.0714587 0.259922 -0.0928347 0.127415 0.0670966 0.004477 0.00950092 -0.0654047 0.123714 0.0252523 0.159707 -0.0612462 -0.028693 0.0364654 -0.000686697 -0.0909689 0.0195274 -0.0112533 -0.00132744 -0.0193636 0.0746556 -0.0962357 -0.0618437 -0.108376 -0.00999079 0.00135741 -0.0208893 -0.0371612 -0.039387 0.0789853 0.00584686 0.00978712 -0.0687108 0.0370618 -0.0669189 -0.0292882 0.154705 0.108962 0.000124027 0.0274497 -0.021285 0.00883011 -0.0494516 -0.162514 0.148984 -0.0407969 0.00834617 0.099139 -0.0073593 0.0247321 0.0909293 -0.0265691 -0.123274 0.0715964 0.127559 -0.0801445 -0.0587004 0.0372982 0.132131 0.0339323 -0.114941 -0.0449206 0.00403081 -0.203511 0.199635 -0.0531962 0.0717418 
-0.0528157 0.0643585 -0.0998829 0.0297847 0.0419896 0.153706 0.00860759 -0.175493 -0.0409586 0.00541374 0.0310372 0.0132762 0.0551924 0.0586181 -0.0172281 0.00204204 -0.117839 0.0635845 0.0530193 0.0282205 0.10156 -0.133736 0.0623811 0.129577 0.0657887 0.00184829 -0.0926337 -0.191269 0.100854 0.122008 0.0875628 0.0415795 -0.0580905 -0.0953549 0.0398076 0.142932 -0.15335 0.0316144 -0.0397396 -0.0356127 -0.0186407 -0.0116948 -0.071825 0.117126 -0.107015 0.0297307 0.159991 0.0316752 -0.0949708 -0.0990621 -0.0752329 0.000191216 0.0725636 -0.102678 0.0834718 0.114649 0.00463382 0.251053 0.0368556 -0.0834548 -0.0970206 0.0914624 0.26207 -0.0926227 0.112635 0.0694172 0.0170389 -0.0128087 -0.0712694 0.134299 0.019822 0.14556 -0.051587 -0.0233294 0.0410802 -0.00408877 -0.0918127 0.0118193 -0.00863459 0.00187772 -0.0211826 0.0747163 -0.0962037 -0.0716283 -0.107599 0.00509633 -0.0015291 -0.0298353 -0.0375951 -0.0260351 0.0903019 -0.00555997 0.0171893 -0.0803999 0.0301253 -0.0666884 -0.0347705 0.152087 0.112448 0.000949459 0.0359679 -0.009966 0.0132347 -0.0574506 -0.157385 0.152909 -0.0386115 0.00590207 0.0685458 -0.00586952 0.0335573 0.0907494 -0.0178833 -0.133827 0.0592569 0.130763 -0.0680064 -0.0591016 0.0489531 0.127161 0.0352531 -0.128689 -0.0489174 -0.00496633 -0.20516 0.205626 -0.0438219 0.0761641 
-0.0609782 0.0586671 -0.0734133 0.0291779 0.0215701 0.166227 0.00665329 -0.154089 -0.0357301 -0.021358 0.0112113 -0.00527375 0.062989 0.0492775 -0.0315882 -0.00896461 -0.150483 0.0461161 0.0210616 0.0275669 0.125041 -0.162045 0.0753764 0.134128 0.0651318 -0.0221957 -0.117628 -0.188019 0.0810169 0.0977071 0.0954099 0.0267619 -0.0754354 -0.0730926 0.03431 0.134619 -0.159405 0.0436965 -0.0541245 -0.047968 -0.0133624 -0.0290809 -0.0680697 0.0990511 -0.0846784 0.00173419 0.149647 0.040523 -0.0976343 -0.0688946 -0.0934281 -0.0191734 0.0873124 -0.081213 0.0907413 0.0998824 0.0160983 0.237893 0.043556 -0.131792 -0.0811646 0.128441 0.245683 -0.0824389 0.0908178 0.100471 0.0224315 -0.0064827 -0.0719978 0.126528 0.00292452 0.140685 -0.0473594 -0.0108799 0.0514525 -0.00932087 -0.0876615 -0.0147116 0.0165884 0.0310907 -0.024951 0.0501528 -0.0843183 -0.0810528 -0.118759 0.0182202 0.00183266 -0.011974 -0.0230337 -0.0236458 0.109338 -0.0195562 0.0464807 -0.0846548 0.00135944 -0.0619846 -0.0455727 0.165936 0.100862 0.00515924 0.0589946 -0.0134114 -0.00109678 -0.0463798 -0.131101 0.151283 -0.0495735 0.0226593 0.0521728 -0.0130692 0.0271447 0.110462 -0.0274453 -0.130625 0.0612927 0.147757 -0.0723236 -0.0283345 0.0521939 0.130561 0.0237221 -0.126175 -0.0488309 -0.0116963 -0.218828 0.202888 -0.0476193 0.0780306 
-0.0529099 0.0675499 -0.0997173 0.0242324 0.0164701 0.158405 0.0168204 -0.149424 -0.0309051 0.00475346 0.0254414 -0.0172676 0.0783006 0.0793288 -0.0144978 -0.00399962 -0.115642 0.0352647 0.0260042 0.0332812 0.100696 -0.160516 0.0783865 0.121454 0.0516074 -0.0150044 -0.123034 -0.175035 0.0976975 0.094543 0.1006 0.0451735 -0.0712991 -0.082041 0.0228161 0.150723 -0.141957 0.0820308 -0.054039 -0.0374704 -0.0308058 -0.00306941 -0.0909749 0.0898144 -0.0897558 0.00288251 0.137628 0.0506901 -0.0767313 -0.0770762 -0.104116 -2.32622e-06 0.0676907 -0.0832972 0.0821272 0.0965733 0.00819055 0.249019 0.0502219 -0.125924 -0.104005 0.112116 0.252619 -0.105501 0.0884574 0.114518 0.0382851 0.00972284 -0.0679398 0.11709 0.0171572 0.149457 -0.04047 0.0123201 0.0523036 -0.01992 -0.0835029 -0.0111521 0.0182023 0.00641417 -0.0205314 0.0500946 -0.0968134 -0.0977736 -0.102218 0.00569348 -0.0058964 -0.0167539 -0.00466234 -0.0417955 0.107249 -0.0212827 0.0589555 -0.0916418 0.0334177 -0.0780037 -0.030868 0.155633 0.0951273 0.0115501 0.039942 -0.0123803 0.00406084 -0.0408498 -0.160355 0.162998 -0.0509317 -0.00290493 0.083055 -0.0116609 0.0263619 0.122333 -0.019042 -0.114299 0.0634971 0.135979 -0.0581379 -0.0423598 0.0508737 0.117853 0.0158425 -0.126187 -0.0364083 0.0119492 -0.218908 0.190012 -0.0544071 0.0771973 
-0.0624875 0.0794683 -0.112796 0.0183202 0.0439365 0.182993 0.00394431 -0.15798 -0.0180426 0.00579093 0.0357253 0.0150905 0.0590211 0.0363244 -0.0379975 -0.00752051 -0.122041 0.0699573 0.0262997 0.0208499 0.115324 -0.143447 0.0466539 0.144673 0.0674592 -0.0288633 -0.0943165 -0.175934 0.0960279 0.116965 0.111205 0.0178668 -0.0671514 -0.0806499 0.0349618 0.147021 -0.157608 -0.00752476 -0.0410029 -0.0291636 -0.00807975 -0.0233159 -0.0663392 0.118518 -0.0858037 -0.01038 0.151529 0.049626 -0.0911166 -0.0872257 -0.085104 -0.0113055 0.0648401 -0.109683 0.0585975 0.131793 -0.0206418 0.251132 0.0299519 -0.0963603 -0.103527 0.109687 0.269617 -0.109004 0.0943674 0.0677802 0.0183736 -0.0204652 -0.0876532 0.128718 0.0154722 0.138752 -0.0584291 -0.0363709 0.0365757 0.00277162 -0.0789978 0.0147834 -0.00760088 0.000719649 -0.0366113 0.0704569 -0.0824574 -0.0501322 -0.11845 0.0332136 0.00170353 -0.0341807 -0.0212242 -0.0227838 0.0897599 -0.0322518 0.0257059 -0.068266 0.0378328 -0.0652878 -0.0586037 0.137727 0.0810839 0.0125154 0.0455983 -0.0178379 -0.0065623 -0.0508337 -0.139418 0.167332 -0.0434585 -0.00291201 0.0289762 0.00515622 0.0272569 0.0779914 -0.0123825 -0.110039 0.04264 0.129247 -0.0709295 -0.0332485 0.0615563 0.132869 0.03514 -0.142235 -0.0571625 -0.00430361 -0.215194 0.204254 -0.0657339 0.0681581 
-0.0626606 0.0823488 -0.0955166 0.0179902 0.0435476 0.188074 0.00479753 -0.169055 -0.0154388 -0.0100274 0.0244951 0.0106206 0.0560953 0.0372603 -0.0379532 -0.00611687 -0.134648 0.0785432 0.0116414 0.00843035 0.124373 -0.131557 0.0507022 0.14662 0.0664805 -0.0384411 -0.107569 -0.175329 0.0859629 0.120272 0.110563 0.0199895 -0.0742595 -0.072088 0.0496457 0.141707 -0.154224 -0.0083777 -0.0388398 -0.0293432 -0.0106341 -0.0194845 -0.0559607 0.111777 -0.079644 -0.00827833 0.151632 0.0518728 -0.0970291 -0.075596 -0.0815736 -0.0226259 0.0723909 -0.101301 0.0624234 0.127889 -0.00872878 0.249292 0.0311018 -0.104733 -0.0967281 0.126725 0.259408 -0.105623 0.0907651 0.0675547 0.0169327 -0.0173727 -0.0915809 0.138362 0.0187511 0.135534 -0.0538484 -0.036639 0.0297732 0.00277181 -0.0880276 -0.00375136 -0.00539059 0.00131717 -0.0204259 0.079291 -0.0833943 -0.0516708 -0.128286 0.0343581 -0.000697631 -0.0396887 -0.0330684 -0.0106693 0.0967417 -0.0351463 0.0303245 -0.075082 0.0281183 -0.0518031 -0.0675657 0.148765 0.0797185 0.0190263 0.05601 -0.0167092 -0.008722 -0.0471529 -0.13058 0.15528 -0.0497281 -0.00231223 0.0209808 0.0125539 0.0312611 0.0773692 -0.0161261 -0.109722 0.0384869 0.139097 -0.0721499 -0.0238583 0.054058 0.129875 0.0421757 -0.136822 -0.0539554 -0.0102038 -0.219203 0.200592 -0.0651487 0.0639329 
-0.0514419 0.0728251 -0.103782 0.0237496 0.0285807 0.173043 0.0160671 -0.149665 -0.0281888 0.00164407 0.0245135 -0.0150879 0.0739126 0.0525676 -0.0256781 -0.00387362 -0.128578 0.0478428 0.0220106 0.0255407 0.12327 -0.160063 0.0575203 0.129634 0.0680951 -0.0293994 -0.127388 -0.180441 0.0999404 0.10929 0.103826 0.0367368 -0.0845789 -0.0811724 0.0302793 0.140755 -0.15395 0.0335746 -0.0382947 -0.0425478 -0.0165238 -0.0202489 -0.0729556 0.102955 -0.0787864 -0.0079269 0.14264 0.0553519 -0.0839141 -0.0861338 -0.0964666 -0.00482539 0.0724668 -0.0938689 0.0722941 0.103359 0.000744013 0.243917 0.0455498 -0.127248 -0.0931385 0.11986 0.254616 -0.0961313 0.0754257 0.103287 0.0318764 -0.00380103 -0.0663154 0.110067 0.0123876 0.151423 -0.0483673 -0.0115051 0.0436301 -0.0133019 -0.0837079 -0.00600987 0.0122814 0.0238546 -0.0164484 0.0577304 -0.0854909 -0.077479 -0.105629 0.027127 -0.00215286 -0.0220165 -0.00945774 -0.0363953 0.106487 -0.0209029 0.038144 -0.0809798 0.0155919 -0.0752047 -0.0434064 0.153384 0.0853242 0.00747113 0.0564817 -0.0155057 0.00686716 -0.042823 -0.153388 0.164509 -0.0489405 0.0151418 0.06152 -0.000142267 0.0312643 0.0997708 -0.0322245 -0.119913 0.0570784 0.140201 -0.0707626 -0.0279338 0.0515066 0.118919 0.0209114 -0.130731 -0.0422585 0.0034385 -0.225984 0.193737 -0.0611441 0.0759352 
-0.0553441 0.063897 -0.0924137 0.0445931 0.0213545 0.166786 0.0186879 -0.156604 -0.0270634 -0.0154524 0.0154742 -0.00336822 0.0670135 0.0425542 -0.0451624 -0.00891403 -0.139517 0.0463237 0.0207374 0.0395416 0.124199 -0.166847 0.0676639 0.14119 0.059165 -0.0274759 -0.137056 -0.189516 0.0884337 0.106929 0.0939902 0.0446581 -0.084467 -0.0751888 0.0286188 0.132001 -0.147995 0.0491832 -0.0499721 -0.0445731 -0.00508148 -0.0216661 -0.0686883 0.0897369 -0.0877952 -0.015216 0.150903 0.0451851 -0.0730489 -0.068771 -0.0881529 -0.00620688 0.0825987 -0.0733406 0.097803 0.0941402 0.0260604 0.22805 0.0533694 -0.136044 -0.0880484 0.126697 0.243171 -0.0964513 0.0758573 0.094726 0.0404405 -0.0218847 -0.0643302 0.114089 0.000791416 0.150263 -0.0411807 0.0151907 0.0543633 -0.0129426 -0.0854561 -0.00336257 0.0148301 0.0307412 -0.0209314 0.0617105 -0.0768506 -0.0765047 -0.100076 0.030773 0.00152431 -0.0102768 -0.0176224 -0.0432328 0.106375 -0.0179292 0.0541572 -0.0937554 0.00157095 -0.0828474 -0.0384833 0.165178 0.0963083 0.00332115 0.0646695 -0.00909407 0.0128713 -0.0275304 -0.136219 0.151414 -0.0431051 0.025818 0.0559651 0.0077072 0.0212266 0.108573 -0.0298907 -0.128257 0.0463545 0.145267 -0.0614224 -0.034126 0.0450754 0.120269 0.0176708 -0.118728 -0.0421778 -0.0118184 -0.236334 0.202128 -0.0605238 0.0865035 
-0.0535126 0.0720687 -0.120271 0.0446602 0.0143523 0.165191 0.0103147 -0.169748 -0.0359708 -0.0072136 0.0254098 -0.00141234 0.0666039 0.0580191 -0.0484673 0.00521493 -0.126846 0.0382369 0.0441851 0.0371902 0.111657 -0.163097 0.0719354 0.113872 0.0538667 -0.0135175 -0.12595 -0.188566 0.0901312 0.118674 0.0840358 0.0515118 -0.0730053 -0.0936287 0.0278634 0.141958 -0.149758 0.0535923 -0.0385907 -0.0356697 -0.0309991 -0.0103696 -0.0737437 0.0882889 -0.0860302 0.00387775 0.156314 0.0341656 -0.0805991 -0.0760325 -0.0886139 0.00691249 0.0793157 -0.0734952 0.0866592 0.0952832 0.0266557 0.23227 0.0465798 -0.113026 -0.092279 0.118421 0.262399 -0.110584 0.0941682 0.0911142 0.0348289 -0.0137862 -0.0629423 0.114288 0.0107872 0.149821 -0.0451542 0.0127334 0.0501561 -0.00887773 -0.0794994 -0.0119926 -0.000235 0.0200942 -0.0210085 0.0510464 -0.0910984 -0.0788458 -0.10979 0.029127 -0.0134219 -0.0300981 -0.0173704 -0.0492367 0.0935416 -0.0183508 0.0461375 -0.0818764 0.0265192 -0.0791525 -0.0272064 0.163565 0.0974384 0.0135512 0.050499 -0.00685133 0.00601974 -0.0358574 -0.147049 0.16302 -0.0339187 0.0186633 0.0546202 0.00535908 0.0172431 0.0961871 -0.0139787 -0.128446 0.0483032 0.141902 -0.0557845 -0.029963 0.0551983 0.115235 0.00984665 -0.130666 -0.0284639 -0.0139198 -0.219179 0.204587 -0.0534961 0.0866931 
-0.0606025 0.0720263 -0.106446 0.0411314 0.0177802 0.166317 0.0112788 -0.16752 -0.0353755 -0.0106945 0.0197052 0.00490135 0.0613128 0.0491174 -0.0479291 0.00879629 -0.135222 0.0412314 0.0387675 0.0305637 0.116331 -0.15443 0.0626069 0.127867 0.054711 -0.00863537 -0.122182 -0.189714 0.0938454 0.120053 0.0814314 0.0535639 -0.0719621 -0.0859561 0.0241154 0.135544 -0.147691 0.0408648 -0.0405078 -0.0300299 -0.0181555 -0.0164622 -0.0615586 0.0862434 -0.0789899 0.00123659 0.16365 0.0272995 -0.0896572 -0.0830486 -0.0835011 -0.00704632 0.0851918 -0.0739902 0.0928671 0.105924 0.0278502 0.234792 0.0465049 -0.114225 -0.0899958 0.123917 0.254742 -0.104051 0.090941 0.097574 0.0316656 -0.0215886 -0.0638729 0.111351 0.0018826 0.145347 -0.0469904 0.00955209 0.0605584 -0.00239624 -0.0818577 -0.00657374 -0.00273174 0.0149578 -0.014625 0.0655078 -0.0850831 -0.0730696 -0.111124 0.0368839 -0.00512845 -0.0271252 -0.0278833 -0.0400159 0.0943429 -0.0177831 0.037556 -0.0777909 0.0185733 -0.0623 -0.0351336 0.163187 0.104964 0.0157016 0.0526266 -0.0170582 0.00630623 -0.031315 -0.147958 0.158283 -0.0415196 0.0180368 0.0380777 0.000267818 0.021773 0.0989963 -0.015848 -0.137534 0.0473275 0.142547 -0.0656644 -0.0307839 0.0493192 0.113088 0.0205268 -0.128156 -0.0283467 -0.0219362 -0.226719 0.21491 -0.0623893 0.0805139 
-0.0681106 0.0807975 -0.106768 0.0525448 0.0194125 0.165245 0.0136733 -0.17502 -0.0378401 0.00563317 0.00789335 0.010185 0.047994 0.037373 -0.0456536 -0.00110176 -0.127165 0.0541177 0.0585563 0.0285549 0.0966831 -0.150297 0.0699211 0.139527 0.0549001 -0.00871159 -0.126701 -0.189405 0.0931793 0.118984 0.0797308 0.0519513 -0.0720807 -0.0897984 0.0358587 0.125619 -0.135965 0.038057 -0.0421532 -0.0311924 -0.0103238 -0.0133629 -0.0524825 0.0899614 -0.100422 -0.00249623 0.170943 0.0326406 -0.0720472 -0.0687316 -0.0600007 0.00294483 0.0839085 -0.0725851 0.108567 0.100731 0.0447079 0.224353 0.0586398 -0.118791 -0.0935347 0.118315 0.246831 -0.111714 0.0961249 0.0781792 0.034432 -0.0421183 -0.0702745 0.126842 -0.000916184 0.15946 -0.0434112 0.0351218 0.0585089 -0.00821288 -0.0873769 0.0107374 0.00506541 0.00449026 -0.0188965 0.0803831 -0.0717493 -0.0621788 -0.0930125 0.0176211 -0.00860365 -0.018512 -0.0190563 -0.0465106 0.0813424 -0.00410295 0.0505831 -0.100097 0.0267492 -0.0805406 -0.0229593 0.176532 0.098827 0.00357026 0.0533381 -0.000362169 0.0209237 -0.0276028 -0.144153 0.144265 -0.0340553 0.00921527 0.0467339 0.024869 0.0270801 0.102502 -0.00200888 -0.137838 0.0340791 0.129773 -0.0395839 -0.0475344 0.0456269 0.11174 0.0314603 -0.124158 -0.0262282 -0.0347628 -0.240013 0.212093 -0.0583539 0.0920258 
-0.0693497 0.0811905 -0.100427 0.0470994 0.0102584 0.177425 0.0123268 -0.171293 -0.0231244 -0.00253843 0.010414 0.00599161 0.0464584 0.031859 -0.0432318 -0.01504 -0.137829 0.0436683 0.0524284 0.0186171 0.0944303 -0.147551 0.0575254 0.141497 0.0561751 -0.00962607 -0.123735 -0.18793 0.0877896 0.110979 0.0946097 0.0454978 -0.0779597 -0.0864713 0.0378321 0.131526 -0.135952 0.0336871 -0.0419995 -0.0265548 0.00049962 -0.024286 -0.065602 0.090466 -0.0932475 -0.00891677 0.159351 0.036909 -0.0728484 -0.073768 -0.0692766 0.00783067 0.0921055 -0.075399 0.103576 0.106937 0.0297761 0.227678 0.0500702 -0.124181 -0.0987648 0.121075 0.251327 -0.11473 0.0933164 0.0832435 0.0492473 -0.0428791 -0.0727802 0.128558 -0.00254143 0.151438 -0.0462911 0.0332122 0.0636679 -0.0103189 -0.0927117 0.00396889 0.0060483 0.0174525 -0.0227402 0.0761715 -0.0667187 -0.0646414 -0.0932853 0.0165757 0.000348738 -0.0213728 -0.0216261 -0.0429623 0.0883415 -0.0124442 0.0603699 -0.0942266 0.0194 -0.0818405 -0.0216895 0.15996 0.100656 0.00520163 0.0561458 0.00163602 0.0112914 -0.0309666 -0.141316 0.146707 -0.0330556 0.00620982 0.0364118 0.0250311 0.0320926 0.100543 -0.00999304 -0.140655 0.0376345 0.130285 -0.0501018 -0.0457705 0.0558083 0.112637 0.038878 -0.131161 -0.0312588 -0.0310241 -0.229575 0.211581 -0.0566451 0.0924345 
-0.0652977 0.0974561 -0.101689 0.0316996 0.00396578 0.180344 0.0210347 -0.182141 -0.0379988 0.0218357 -0.00626291 -0.0156894 0.0514008 0.0429156 -0.023335 -0.030552 -0.13171 0.0511944 0.0644056 0.0110059 0.0660719 -0.13926 0.0546385 0.123776 0.043988 -0.0113311 -0.142781 -0.169276 0.0835832 0.114595 0.078804 0.0529908 -0.0866756 -0.0858033 0.0634186 0.129638 -0.123171 0.0366942 -0.0326907 -0.0458859 -0.0168312 -0.0362524 -0.0603194 0.0771562 -0.0963193 0.0156153 0.146744 0.0725125 -0.0835641 -0.0577701 -0.0682686 0.0238713 0.102918 -0.074662 0.104346 0.0917243 0.0307955 0.214757 0.0432047 -0.130756 -0.0906292 0.14179 0.246844 -0.118425 0.0897292 0.103256 0.0425532 -0.0341326 -0.0923167 0.122204 -0.000196999 0.1449 -0.0478516 0.0483541 0.0499708 -0.0119464 -0.0883777 -0.0247161 0.0385025 0.00607926 -0.00445394 0.0675122 -0.0792132 -0.0675975 -0.0845016 -0.00727979 -0.0215282 -0.0277294 0.00786724 -0.0147504 0.0961854 -0.003435 0.0848617 -0.0955741 0.0126224 -0.0854515 -0.00644209 0.164763 0.0996926 -0.0047332 0.0836651 0.0261714 0.00853936 -0.0475852 -0.146975 0.145639 -0.0306283 -0.00358058 0.0463723 0.0550716 0.0579084 0.0989648 -0.0025786 -0.142132 0.0290158 0.123121 -0.0354518 -0.036507 0.0545772 0.105686 0.0443446 -0.156441 -0.0125101 -0.0313279 -0.229422 0.200257 -0.0443902 0.0759373 
-0.063494 0.0869823 -0.0984995 0.0501996 0.0115394 0.176023 0.0169872 -0.188065 -0.0280428 0.0159295 0.00258439 -0.0130137 0.0418007 0.0455384 -0.0176787 -0.0193539 -0.121791 0.0533952 0.0687764 0.014206 0.0699238 -0.140358 0.0626853 0.122378 0.0530015 -0.0113806 -0.145333 -0.176465 0.086035 0.108914 0.0951967 0.0613087 -0.0793572 -0.0900018 0.0638355 0.141202 -0.124148 0.0418553 -0.0349326 -0.0497992 -0.0137959 -0.0198889 -0.0703574 0.0717643 -0.0975021 0.0102733 0.14315 0.0627118 -0.0690118 -0.0688985 -0.07279 0.0249267 0.104022 -0.0829273 0.102897 0.0925135 0.0305228 0.213656 0.0415106 -0.117315 -0.100739 0.130175 0.245669 -0.125553 0.104112 0.103086 0.043485 -0.0354402 -0.0902415 0.132874 0.0049347 0.15234 -0.0457286 0.0443772 0.044495 -0.0188123 -0.0872387 -0.0188731 0.0233566 0.00357691 -0.0102436 0.0729772 -0.0830871 -0.0748168 -0.0796111 -0.0120106 -0.0231948 -0.0229774 -0.0069927 -0.0235726 0.0998155 0.00627797 0.0754147 -0.0939438 0.0263261 -0.0843414 -0.00761297 0.160534 0.0965713 0.00233262 0.0732709 0.0153133 0.00859277 -0.0579063 -0.141838 0.15073 -0.0152308 -0.0180079 0.0661664 0.0538144 0.0413202 0.0999482 0.00129841 -0.143544 0.0443545 0.117839 -0.034348 -0.0420654 0.0543521 0.106243 0.0419551 -0.144648 -0.0139313 -0.0276387 -0.21922 0.204817 -0.0319553 0.0830031 
-0.0236296 0.0709215 -0.081516 0.012596 0.0565137 0.167812 0.0773745 -0.13561 -0.105437 0.0696312 -0.0194102 -0.00525125 0.0954569 0.0458979 0.0316838 -0.0308753 -0.0883715 0.0733265 0.0476565 0.046376 0.0766232 -0.148883 0.0573996 0.133339 0.0370327 -0.00569962 -0.180237 -0.180088 0.100879 0.11399 0.0382858 0.101391 -0.110651 -0.0398472 0.0525926 0.102599 -0.100908 0.0647324 -0.0199409 -0.0879792 0.0110848 -0.0470662 -0.0364149 0.0553596 -0.128591 0.0330664 0.144954 0.0887641 -0.105211 -0.0624025 -0.0487839 -0.00411825 0.0615573 -0.067526 0.127829 0.0702289 0.0260082 0.222491 0.0371861 -0.119002 -0.0669628 0.128614 0.211282 -0.123362 0.0971595 0.119688 0.0100259 0.00293103 -0.0986787 0.0896644 -0.0114023 0.167999 -0.064716 0.0547044 0.031302 0.00146733 -0.0608223 0.00108011 0.0912 -0.0149528 -0.016987 0.0586552 -0.0747123 -0.0764416 -0.0682134 -0.0300483 0.0120661 0.00577596 0.0361229 0.000521356 0.122553 -0.0012745 0.0736103 -0.091367 -0.0254443 -0.0900313 0.0138112 0.163457 0.100396 -0.0220136 0.0877197 0.0313363 0.0163125 -0.00684718 -0.155755 0.130863 -0.065983 0.0306706 0.0820892 0.0312583 0.0463307 0.121847 -0.0342408 -0.133482 0.0621459 0.111115 -0.0409928 -0.0671068 0.0183748 0.12823 0.0422978 -0.138033 -0.00993017 0.0134354 -0.234051 0.176929 -0.0589629 0.0326223 
-0.0348291 0.0842724 -0.0912838 0.0120996 0.0561768 0.183185 0.0679046 -0.149088 -0.0565899 0.036006 -0.0162718 -0.00603439 0.0755813 0.0534631 0.0183929 -0.0370142 -0.088062 0.0665435 0.033249 0.0172459 0.07754 -0.127407 0.0490582 0.153814 0.0448606 -0.0359408 -0.161479 -0.162764 0.0997036 0.116399 0.0794 0.0799939 -0.108499 -0.0447968 0.0509031 0.12205 -0.104043 0.0357305 -0.0375491 -0.0558201 0.014855 -0.0230505 -0.0462725 0.0657152 -0.111381 0.0203046 0.133318 0.0904813 -0.0827093 -0.061107 -0.0634777 -0.0003348 0.0727254 -0.0861491 0.109307 0.0957984 0.00877516 0.250158 0.0366024 -0.113301 -0.0929159 0.14101 0.224562 -0.143819 0.0869435 0.103143 0.0277189 -0.013815 -0.112103 0.115909 0.000451096 0.161559 -0.0613324 0.0465828 0.0295417 0.00687108 -0.0660045 -0.00318907 0.0581765 -0.0257715 -0.0132144 0.0773364 -0.0772434 -0.0712238 -0.0746203 -0.0166463 0.00308178 -0.0195818 0.00497135 -0.00291808 0.123167 -0.0162003 0.0733829 -0.102818 0.0173087 -0.0757932 -0.00557532 0.14808 0.092266 -0.00116152 0.0758378 0.0203129 0.00932958 -0.0112549 -0.168349 0.135615 -0.0690656 -0.00417936 0.0560568 0.0413007 0.0565404 0.10853 -0.0233396 -0.122239 0.0445131 0.119717 -0.0344643 -0.0571092 0.0345774 0.134569 0.0535091 -0.136388 -0.0259471 0.0146393 -0.243814 0.179038 -0.0741987 0.0359821 
-0.0430162 0.100989 -0.133499 -0.00545571 0.0283954 0.171549 0.0375582 -0.151795 -0.0590568 0.0527137 0.00370745 -0.0240496 0.107728 0.0556598 -0.030998 -0.00434235 -0.110793 0.049554 0.0258992 0.0332756 0.108005 -0.171716 0.0490005 0.087815 0.0385164 0.00361309 -0.164205 -0.17753 0.109934 0.127167 0.0659476 0.0956144 -0.0978015 -0.0687363 0.0430275 0.116072 -0.120292 0.0777106 -0.000781624 -0.0747105 -0.0270812 -0.0466114 -0.048998 0.0795587 -0.0781518 0.015282 0.143724 0.0835811 -0.108649 -0.0837566 -0.0866718 0.016228 0.0636619 -0.0710614 0.086958 0.0806278 0.0197548 0.223334 0.0319567 -0.149899 -0.0727703 0.118244 0.256732 -0.105936 0.0767846 0.11834 0.0186744 0.0263764 -0.0642126 0.0788519 -0.00290011 0.143278 -0.0661514 0.0179837 0.0355382 -0.00987111 -0.0722902 -0.0143851 0.0498842 0.00445833 -0.0148777 0.0542497 -0.0843125 -0.0680928 -0.0988703 0.0024295 -0.00166204 -0.00907126 0.0500213 -0.02734 0.10309 -0.0282888 0.0620571 -0.0739948 -0.00156402 -0.0889759 -0.00514353 0.172579 0.0849563 -0.0072779 0.0862256 0.0128454 -0.00071736 -0.00469363 -0.154448 0.150625 -0.0643941 0.0436849 0.0707614 0.0154591 0.0315823 0.102432 -0.0532278 -0.111179 0.06246 0.125784 -0.07014 -0.0434003 0.048702 0.1098 0.0258198 -0.135047 -0.00127988 0.00447032 -0.231574 0.170824 -0.0694023 0.0534807 
-0.0566107 0.0832185 -0.134906 0.0378708 0.0184329 0.173786 0.0084158 -0.166983 -0.0179305 0.0107292 0.0291367 -0.00727992 0.0555546 0.0589163 -0.048135 0.00759185 -0.11774 0.0476525 0.0449308 0.0215737 0.0989585 -0.154456 0.0494347 0.123098 0.0608187 -0.0257709 -0.115359 -0.164971 0.0988616 0.120388 0.0944336 0.0470707 -0.0784727 -0.0985693 0.0190191 0.151829 -0.159639 0.0125444 -0.0404749 -0.0273684 -0.0339825 -0.010559 -0.0720037 0.08997 -0.06338 -0.00840852 0.142122 0.0503829 -0.0740652 -0.0825819 -0.0854817 0.0134285 0.0781895 -0.0983503 0.0694037 0.111546 0.00400981 0.239463 0.0506413 -0.103311 -0.100382 0.126632 0.267755 -0.114568 0.0756581 0.0999836 0.0312143 -0.02161 -0.0746755 0.116549 0.0140465 0.151825 -0.0441506 0.0066494 0.0392945 -0.00818817 -0.0631507 -0.00871236 -0.0113368 -0.00356243 -0.00833464 0.0620858 -0.0953632 -0.0738089 -0.105025 0.0373643 -0.0250102 -0.0392879 -0.00687963 -0.0381523 0.089367 -0.0134777 0.0348039 -0.0714437 0.0527574 -0.0600795 -0.0361733 0.142183 0.090346 0.0206335 0.0556794 -0.0174534 0.00247707 -0.0537209 -0.159753 0.175532 -0.0351933 -0.0130939 0.0404506 0.0185081 0.0304041 0.0906576 0.00390903 -0.124718 0.0448176 0.129528 -0.0467957 -0.0156407 0.0651946 0.106801 0.0172447 -0.14626 -0.0213854 -0.015986 -0.22872 0.209335 -0.0603394 0.0744849 
-0.01288 0.0407487 -0.108713 0.0273039 0.0928694 0.183445 0.00295527 -0.144262 -0.0142178 -0.055593 0.0432832 0.0590765 0.0645749 -0.00976634 -0.0679596 -0.0226449 -0.12364 0.0878134 -0.0221203 0.0658313 0.172349 -0.135171 0.0729967 0.163457 0.0875482 -0.0436457 -0.0808194 -0.207493 0.0791832 0.127027 0.121893 0.0219836 -0.0777792 -0.0474761 0.0328808 0.102726 -0.167071 -0.000156697 -0.0213308 -0.0470735 0.0239613 -0.0209905 -0.0709545 0.152649 -0.123434 -0.0505127 0.154528 0.0404557 -0.072675 -0.0564875 -0.065021 -0.0137936 0.0539537 -0.0899016 0.059155 0.0913028 -0.00927696 0.243455 0.014179 -0.121412 -0.0953237 0.0787346 0.273644 -0.0803199 0.0665921 -0.00243977 0.0229505 -0.0157938 -0.0709245 0.133196 0.00838902 0.138127 -0.059893 -0.0500292 0.00512358 -0.0161157 -0.0929854 0.0161629 -0.0192888 0.0832906 -0.0581232 0.0842118 -0.0434308 -0.0445484 -0.0896714 0.0277649 0.0370248 -0.00138574 -0.0384444 -0.0429023 0.106846 -0.0502498 -0.0115938 -0.060148 0.00105952 -0.109015 -0.0727711 0.150937 0.0561704 -0.0173153 0.0414896 -0.0132488 0.00524496 0.0139845 -0.114925 0.135106 -0.0481176 0.0624026 0.0544863 -0.0144531 0.0183674 0.0883392 -0.0785206 -0.0663308 0.0424847 0.132788 -0.0973699 -0.0570049 0.0616306 0.16308 0.0305909 -0.0820165 -0.0853082 -0.00269672 -0.197265 0.155892 -0.0524239 0.0779135 
-0.0413805 0.0734714 -0.0901294 0.0488368 0.0768681 0.185141 0.00945604 -0.177955 -0.0123901 -0.0285297 0.0356324 0.036831 0.046265 -0.002244 -0.0349313 -0.0235361 -0.117405 0.0833717 0.00726576 0.0392546 0.133698 -0.140231 0.05524 0.14724 0.10263 -0.0398467 -0.115291 -0.193315 0.0934074 0.123381 0.142207 0.0512044 -0.0772291 -0.0660332 0.0549629 0.119879 -0.15644 -0.00981817 -0.0118751 -0.057434 0.0335313 -0.0344244 -0.0597044 0.121338 -0.111276 -0.0284424 0.150721 0.0454459 -0.0770098 -0.0910083 -0.0702928 0.00248581 0.0830387 -0.113961 0.0550848 0.108393 -0.019532 0.234191 0.0145653 -0.106327 -0.113212 0.0974841 0.255562 -0.103434 0.0932472 0.053857 0.0293572 -0.0426448 -0.102036 0.132866 0.00578798 0.140767 -0.0598524 -0.0323349 0.0243359 -0.0163097 -0.0906482 -0.000851039 -0.0144668 0.0648328 -0.0497384 0.0837369 -0.0530577 -0.0427104 -0.0786574 0.0101827 0.0149952 -0.0149755 -0.0467545 -0.0273806 0.102426 -0.0255089 0.0126861 -0.058667 0.00645076 -0.100633 -0.0555562 0.147838 0.0654064 -0.00835574 0.0448475 -0.00843701 0.00380018 -0.0133647 -0.11691 0.154275 -0.0136869 0.0421992 0.072111 0.0102023 0.0155814 0.0772534 -0.0646042 -0.0928167 0.0476942 0.110885 -0.096831 -0.042223 0.0706428 0.155945 0.0462531 -0.10914 -0.0823882 -0.00832411 -0.187658 0.181579 -0.0391567 0.0745543 
-0.058577 0.0697154 -0.119663 0.0495405 0.0221673 0.1598 0.0187837 -0.157487 -0.0278236 0.0114653 0.0181735 -0.00484609 0.0656862 0.0508026 -0.0514936 0.00215143 -0.122275 0.0534294 0.0412215 0.0343899 0.117253 -0.175975 0.0653145 0.130811 0.0621025 -0.0253995 -0.135346 -0.188292 0.0973595 0.118354 0.0905646 0.055022 -0.081642 -0.0922321 0.019889 0.134368 -0.156931 0.0409664 -0.047479 -0.0406667 -0.0207315 -0.0125888 -0.0700069 0.096057 -0.0824496 -0.0150835 0.14927 0.0431447 -0.0626768 -0.0820085 -0.0764408 0.0073159 0.0737993 -0.0866144 0.0911997 0.0985328 0.0308738 0.226438 0.0664395 -0.12199 -0.0874901 0.115062 0.246192 -0.100178 0.0806287 0.0823121 0.033365 -0.0226869 -0.0575447 0.115762 0.00612176 0.164077 -0.0419099 0.0131463 0.0394348 -0.011968 -0.0762246 0.0105978 -0.000215825 0.0127561 -0.0264544 0.0617634 -0.0830831 -0.0700655 -0.0985459 0.0286393 -0.00533918 -0.0175172 -0.00462997 -0.0592657 0.0844341 -0.00503856 0.0446615 -0.0993301 0.0260399 -0.0813171 -0.0322108 0.163497 0.0904672 0.00908794 0.0617465 -0.00755176 0.0194979 -0.0325938 -0.144363 0.152165 -0.0421282 0.0127265 0.0630667 0.0151703 0.0146879 0.101227 -0.0197145 -0.132435 0.0464201 0.139492 -0.0436996 -0.0376069 0.0500227 0.111435 0.0107537 -0.120986 -0.0349452 -0.0152605 -0.240599 0.202375 -0.0656579 0.0918928 
-0.0632163 0.0883574 -0.105002 0.0400937 0.0228186 0.184517 0.0151738 -0.173708 -0.0285159 0.00315725 0.0104159 0.00337841 0.0557169 0.0262711 -0.0423945 -0.0109777 -0.136625 0.0572365 0.0387697 0.0194796 0.106102 -0.150295 0.0601649 0.143127 0.0612149 -0.0293515 -0.130789 -0.186898 0.0860459 0.12163 0.0939189 0.0431682 -0.0832442 -0.0750099 0.0427954 0.128909 -0.139215 0.016618 -0.0354133 -0.0342377 -0.00367281 -0.0360146 -0.0531205 0.092313 -0.0913594 -0.00591709 0.157822 0.0534741 -0.0820989 -0.0659019 -0.0645983 0.0044794 0.0863564 -0.0808472 0.0937325 0.105074 0.0267979 0.22545 0.0464521 -0.119846 -0.0946478 0.128446 0.248671 -0.116317 0.088166 0.0761916 0.0326078 -0.034164 -0.0841121 0.128201 -0.000980256 0.152438 -0.0549655 0.0163978 0.0520497 -0.00387842 -0.0856523 0.00306976 0.00917385 0.0220889 -0.0202753 0.06746 -0.0678519 -0.0554543 -0.107102 0.0287213 -0.0049269 -0.0284402 -0.0199019 -0.0295554 0.0895491 -0.0206168 0.0539411 -0.0887477 0.0100106 -0.078093 -0.0354858 0.162575 0.0934952 0.00189591 0.0713742 0.00405796 0.00692701 -0.0265621 -0.130577 0.144696 -0.04014 0.0189991 0.0348908 0.0296662 0.0288766 0.0937226 -0.013486 -0.130662 0.0347253 0.13731 -0.0535444 -0.0300152 0.0538306 0.126734 0.0387261 -0.136302 -0.0363645 -0.0224963 -0.234768 0.205287 -0.0619865 0.0823091 
-0.0665327 0.0944019 -0.0990574 0.0392818 0.024336 0.181956 0.0208113 -0.183869 -0.0240329 0.0162983 0.00278942 -0.00447634 0.0506802 0.0334301 -0.0198189 -0.0167216 -0.129908 0.0597312 0.0469915 0.0124851 0.0829952 -0.137077 0.0595334 0.137626 0.0578225 -0.0249387 -0.141615 -0.178167 0.0901724 0.117578 0.100513 0.0539217 -0.0856987 -0.0793247 0.0568834 0.135901 -0.128372 0.0238249 -0.0334173 -0.0353528 -0.00283534 -0.0284582 -0.0599842 0.0852988 -0.0988619 0.00308648 0.148633 0.0680872 -0.0690342 -0.0673068 -0.065391 0.0140209 0.0893113 -0.0883586 0.0949892 0.101478 0.0238628 0.22467 0.0441777 -0.115246 -0.104402 0.128366 0.242781 -0.122416 0.0934687 0.0841259 0.0389801 -0.0344468 -0.0924434 0.13306 0.00570443 0.159219 -0.0498566 0.0325299 0.0466383 -0.0103511 -0.092753 -0.00436657 0.017688 0.0102635 -0.00716663 0.075343 -0.0726276 -0.0585673 -0.0931298 0.00561857 -0.0107181 -0.0265906 -0.015609 -0.0245567 0.0931164 -0.00711254 0.0669792 -0.0973818 0.0165201 -0.0830439 -0.0257303 0.158995 0.0935236 0.000752223 0.071402 0.00875459 0.00896306 -0.0380931 -0.137915 0.142709 -0.034597 -0.00102859 0.054702 0.0503655 0.0393722 0.0974886 -0.00949612 -0.131055 0.0332531 0.127878 -0.0425568 -0.034515 0.0492941 0.120932 0.0494075 -0.139032 -0.030391 -0.0183708 -0.234958 0.200458 -0.0562702 0.0800134 
-0.0692499 0.0906842 -0.101372 0.0393685 0.0280928 0.17271 0.0192455 -0.174532 -0.0315293 0.0114107 0.00530407 0.00226095 0.055669 0.0363807 -0.0378433 -0.00834083 -0.122609 0.0616615 0.0408385 0.0156082 0.101213 -0.147561 0.0587735 0.137064 0.0594066 -0.0215501 -0.142925 -0.183193 0.103232 0.11928 0.103628 0.0537859 -0.089931 -0.0899712 0.044156 0.128606 -0.146624 0.0307938 -0.0324802 -0.0255645 -0.0104185 -0.0108139 -0.0661445 0.0928447 -0.0874069 -0.00436833 0.154152 0.0480064 -0.0712601 -0.0851508 -0.0675619 0.00819962 0.080147 -0.0953283 0.0793016 0.104836 0.027166 0.238979 0.0536382 -0.112939 -0.0973485 0.127799 0.242621 -0.1122 0.0932048 0.0705155 0.0415547 -0.0351738 -0.0814287 0.123518 0.0104885 0.161873 -0.042944 0.0232524 0.0392097 -0.00926853 -0.092924 0.00289827 0.00723556 0.0123688 -0.0186039 0.0763981 -0.0733217 -0.0543832 -0.0949552 0.00636411 -0.00231413 -0.0270989 -0.0220529 -0.0498162 0.0807688 -0.00419762 0.0575902 -0.0936734 0.02917 -0.0801189 -0.0259712 0.162785 0.0824736 0.0131612 0.0547637 0.00335106 0.00616838 -0.0192487 -0.144073 0.145174 -0.0339944 0.00681 0.0595708 0.0320375 0.0295376 0.0935028 -0.0204701 -0.122873 0.0331079 0.134086 -0.0559199 -0.0374458 0.0446344 0.114878 0.0252114 -0.126454 -0.0446334 -0.0257812 -0.236917 0.203468 -0.0772279 0.0781538 
-0.0778299 0.107072 -0.129173 0.0300886 0.024756 0.16117 0.0339315 -0.174763 0.0081266 0.0272248 0.00747438 -0.0102299 0.0380459 0.0605533 -0.0328417 -0.0111763 -0.116588 0.044687 0.0455347 -0.00886864 0.0691813 -0.136942 0.0332547 0.104572 0.055673 -0.0286681 -0.136887 -0.146968 0.112758 0.121622 0.112901 0.0525111 -0.0807787 -0.117155 0.0380602 0.143426 -0.15297 0.021719 -0.0457146 -0.0155128 -0.0263875 0.0111469 -0.0809143 0.0923163 -0.0651468 0.0119244 0.122049 0.05215 -0.0513031 -0.100584 -0.0917514 0.0362213 0.0774305 -0.12061 0.0637332 0.119246 -0.00904818 0.252976 0.0385895 -0.0870348 -0.113456 0.119377 0.258249 -0.115129 0.0915503 0.0873734 0.0405826 -0.028893 -0.0874123 0.123514 0.0393113 0.161663 -0.0307608 0.0236936 0.0239059 0.00140332 -0.0792067 -0.0182956 -0.012575 -0.0300404 -0.00695675 0.076775 -0.097313 -0.0525993 -0.0881356 -0.00549397 -0.0219687 -0.0417493 -0.00421409 -0.0447124 0.0743454 -0.00618403 0.0490515 -0.0954664 0.0785156 -0.0664872 -0.0185147 0.121871 0.0856964 0.0378031 0.0463845 -0.00743627 0.00510675 -0.0600486 -0.18312 0.165286 -0.0283257 -0.0346492 0.0603711 0.0458591 0.0531665 0.0789574 -0.00637005 -0.121502 0.039447 0.122916 -0.0341211 -0.0190858 0.0682541 0.0985362 0.0258901 -0.137442 -0.0314737 -0.0167636 -0.221119 0.201065 -0.0690762 0.0661245 
-0.0769302 0.0851305 -0.111403 0.0292495 0.0389977 0.167659 0.00721087 -0.191427 -0.0219849 0.00737769 0.00807084 0.00326676 0.0501012 0.0482991 -0.0298238 0.0109545 -0.129156 0.0521163 0.0461031 0.0100209 0.0974127 -0.132904 0.0603002 0.106591 0.0615316 -0.00820137 -0.13783 -0.181335 0.098391 0.121681 0.109213 0.0483155 -0.0744291 -0.1047 0.0534642 0.144979 -0.148812 0.0240321 -0.0207517 -0.0241755 -0.0236886 0.00325047 -0.0653694 0.092226 -0.0775442 0.0141998 0.150626 0.0473395 -0.0683735 -0.0941853 -0.088434 -0.00296373 0.0838003 -0.101791 0.069161 0.105292 0.0159826 0.243089 0.0334906 -0.0926003 -0.102084 0.123991 0.253645 -0.105586 0.106003 0.0778374 0.0269711 -0.0112453 -0.0734854 0.112665 0.0292364 0.164052 -0.0426188 -0.00134533 0.036431 0.00244566 -0.101679 -0.0148067 -0.00511543 0.00784912 -0.00028117 0.076658 -0.0841194 -0.0460754 -0.11165 0.00799216 -0.00818457 -0.0291606 -0.0311667 -0.0485363 0.080284 0.000781813 0.0455933 -0.0769618 0.0373312 -0.0659194 -0.0363813 0.15596 0.0804774 0.0232169 0.0488613 -0.0164034 -0.00214735 -0.0517428 -0.151038 0.155497 -0.0293692 -0.00597236 0.058395 0.0402329 0.0326151 0.076028 -0.0137567 -0.121812 0.0399905 0.139256 -0.068992 -0.0168933 0.0375569 0.109535 0.0291252 -0.128507 -0.0344848 -0.0243055 -0.230279 0.207628 -0.0740172 0.0782206 
-0.0785534 0.0948321 -0.135893 0.0355579 0.0248133 0.15807 0.010819 -0.204837 -0.0261324 0.0274819 0.0098338 0.00636001 0.0400224 0.0567529 -0.0332648 0.00926216 -0.124077 0.0507189 0.0805776 0.00279562 0.0650081 -0.127767 0.0633668 0.0850079 0.052236 0.0104341 -0.123202 -0.181546 0.0980768 0.132318 0.0859338 0.0632335 -0.0599242 -0.120174 0.0541544 0.137469 -0.132065 0.0375204 -0.0124763 -0.0134167 -0.0307701 0.0038825 -0.0634744 0.0887058 -0.097513 0.0285661 0.158143 0.0342703 -0.0625451 -0.0958835 -0.0749184 0.0232461 0.0863519 -0.0879998 0.0763587 0.105405 0.0425904 0.229127 0.0348813 -0.079084 -0.103783 0.10633 0.263715 -0.115033 0.11703 0.0739328 0.0305398 -0.0201019 -0.0646594 0.12367 0.0270275 0.16527 -0.0424463 0.0252978 0.0442474 0.000868344 -0.103185 -0.0140084 -0.0173077 -0.0172655 -0.00420678 0.0854872 -0.086501 -0.0423612 -0.102894 0.00441608 -0.0190182 -0.0381199 -0.0241834 -0.0578462 0.0653603 0.00502489 0.051253 -0.0904475 0.0535329 -0.0775359 -0.0184713 0.163325 0.100064 0.0207556 0.0403445 -0.00816084 0.0145965 -0.0494724 -0.157091 0.147501 -0.0197168 -0.00818264 0.0547641 0.0480747 0.0345777 0.0734525 0.00761241 -0.134427 0.0314003 0.125193 -0.0436348 -0.0325965 0.0512898 0.0959497 0.0410553 -0.135547 -0.0173803 -0.0347326 -0.223572 0.205586 -0.0648715 0.0928279 
-0.073554 0.0660767 -0.0995296 0.0239351 0.0259774 0.168417 0.028776 -0.173669 -0.0207488 0.00210049 -0.00056709 0.0160347 0.038873 0.0427638 -0.0298828 -0.0204867 -0.160884 0.0397947 0.0562144 0.00700987 0.0813581 -0.130531 0.0539637 0.122166 0.0552387 0.000271867 -0.111799 -0.182197 0.0837305 0.116762 0.0820076 0.0277741 -0.0743412 -0.0906548 0.0402415 0.123309 -0.141083 0.026028 -0.0385325 -0.0214519 0.00460363 -0.0147178 -0.0569253 0.0994824 -0.105265 -0.00165683 0.147862 0.0331347 -0.0632966 -0.0736494 -0.0830001 -0.0119243 0.091313 -0.0746926 0.106576 0.11089 0.0202906 0.252594 0.0294072 -0.105649 -0.095542 0.11536 0.26254 -0.093814 0.0963477 0.0936466 0.033033 -0.0298598 -0.0666579 0.119577 0.0107519 0.16253 -0.0390964 0.0274213 0.0597377 0.0039874 -0.0985012 -0.020776 0.00529771 -0.0006785 -0.00500213 0.0790536 -0.0653512 -0.0514265 -0.103169 0.00396597 0.00940419 -0.0130625 -0.0174685 -0.0373357 0.0927126 -0.0123193 0.0545252 -0.0971614 0.0169534 -0.0733757 -0.0344368 0.149543 0.118823 0.0149108 0.0491 -0.0136487 0.0176302 -0.0558088 -0.158322 0.143546 -0.0429394 -0.000710846 0.0246469 0.028513 0.0589426 0.0966969 -0.00474146 -0.139334 0.0374628 0.140019 -0.0434235 -0.0247394 0.0465261 0.106245 0.0511247 -0.136751 -0.0306228 -0.0334881 -0.238426 0.213252 -0.0664814 0.0905314 
-0.0942703 0.0556463 -0.0566488 0.00379092 0.051049 0.141991 0.0538895 -0.15102 -0.0485477 0.050395 -0.0367247 0.0274439 0.0571987 0.0143323 0.00626138 -0.0428099 -0.191029 0.0593952 0.0512226 0.0236861 0.0799311 -0.15197 0.0482928 0.0950292 0.0533081 0.0259705 -0.147609 -0.205252 0.0848905 0.115553 0.0544801 0.0505462 -0.0644992 -0.0767849 0.0650347 0.0934798 -0.127815 0.041204 -0.0341536 -0.0762215 0.0459756 -0.063143 -0.024131 0.1052 -0.140986 0.0211262 0.156869 0.0394093 -0.0836395 -0.0949843 -0.0756329 -0.0392803 0.0853224 -0.0751415 0.138105 0.105569 0.0182026 0.215889 0.0125696 -0.116751 -0.0659033 0.0894224 0.220197 -0.0460259 0.124833 0.10607 -0.00537794 -0.015721 -0.0602928 0.089314 -0.00387158 0.162242 -0.0474988 0.00549991 0.0594523 0.0233701 -0.116267 -0.0107944 0.0539677 -0.00348861 -0.0259724 0.0768507 -0.0547495 -0.0168442 -0.0923766 -0.0270907 0.0436743 0.0420184 0.0176541 -0.00890295 0.086633 0.00449891 0.0522103 -0.101822 -0.0606385 -0.0862727 -0.0323654 0.162405 0.130461 -0.0100901 0.0700394 -0.00973672 0.0324196 -0.0680923 -0.140598 0.117683 -0.0567521 0.0434014 0.0520264 0.0328826 0.0500346 0.0963544 -0.0538438 -0.160464 0.0533923 0.126841 -0.0601794 -0.0489622 0.0268827 0.111926 0.0741965 -0.122827 -0.0398438 -0.0284238 -0.225817 0.203166 -0.0531981 0.0815038 
-0.094888 0.102953 -0.0628851 -0.0278511 -0.0367063 0.159207 0.0510927 -0.068121 -0.0428793 0.100603 0.0313735 -0.000585427 0.027978 -0.0510581 -0.00357401 -0.0907854 -0.217435 0.00655999 0.0720473 -0.0083132 0.0179932 -0.13697 -0.0166728 0.0643447 0.0358531 0.075739 -0.0592338 -0.170106 0.145308 0.0321299 0.0711548 -0.00630123 -0.0972602 -0.0932503 0.0199276 0.0795006 -0.15098 0.0461678 -0.00825188 0.0087072 0.055657 -0.111761 -0.128462 0.142192 -0.117076 -0.0246744 0.12226 0.0211518 -0.105503 -0.126676 -0.0909328 0.0696525 0.0230001 -0.0853724 0.0553375 0.118901 -0.0225659 0.220367 -0.0111195 -0.106445 -0.101823 0.0278324 0.291488 -0.0257308 0.0884551 0.0945997 0.0773018 -0.0701288 -0.0261725 0.109364 -0.0364262 0.144058 -0.0308723 0.0897221 0.0891115 -0.0699512 -0.116158 0.0372091 0.02354 0.0184428 -0.0725629 0.0369174 -0.0328676 -0.033326 -0.060363 -0.0458981 0.0683578 0.0243513 0.066196 -0.0493884 0.0915907 -0.00361019 0.0478928 -0.0747952 -0.0108035 -0.139589 0.0144888 0.0787586 0.133232 -0.00114476 -0.00738912 0.00975046 0.000887374 -0.0552288 -0.130445 0.15292 -0.00428478 0.0481996 0.0702772 -0.0195987 0.0693881 0.123224 -0.0513078 -0.144288 0.0783548 0.0763849 -0.0343631 -0.0798093 0.125674 0.0641741 0.0746941 -0.164439 -0.0397777 -0.0171467 -0.158306 0.167505 -0.0258797 0.103005 
0.00345627 0.032335 -0.0842336 -0.014262 0.0346405 0.180496 0.0378089 -0.0490951 -0.0621027 0.0590176 0.0425177 0.0011371 0.0724435 -0.0139289 0.00838096 -0.0656695 -0.14339 0.0637643 0.0145141 0.0765024 0.0727116 -0.120016 0.0761315 0.117278 0.0362377 0.0218132 -0.0634548 -0.196671 0.116421 0.024339 0.0740228 0.016152 -0.111132 -0.0397705 0.00376352 0.0897443 -0.154544 0.10585 -0.0390385 -0.026214 0.0158854 -0.0490314 -0.153235 0.151174 -0.159248 -0.0745558 0.121992 0.0699424 -0.0839034 -0.0248801 -0.0631991 0.0324234 -0.0113361 -0.0614926 0.0689199 0.0557399 -0.000695747 0.237784 0.0357479 -0.147335 -0.103483 0.0387853 0.295078 -0.0597747 0.0558737 0.0473077 0.0673102 -0.0139891 -0.0342421 0.144399 -0.0231109 0.173605 -0.0210207 0.0883482 0.0105355 -0.1229 -0.0891391 0.0314567 0.0375304 0.0342008 -0.0527853 0.0588247 -0.0611476 -0.113209 -0.042452 -0.0554304 0.0502021 0.0455425 0.0725621 -0.0461817 0.147882 -0.0127435 0.0115252 -0.0870344 0.0152032 -0.142769 -0.00237556 0.127416 0.0832425 -0.0259021 0.00412147 0.00942307 0.0143659 -0.0165131 -0.143181 0.139812 -0.0465311 0.0196644 0.136417 -0.0300255 0.0628897 0.191505 -0.04236 -0.0842055 0.0931384 0.0741163 -0.0128706 -0.121498 0.0911922 0.0958827 0.0443303 -0.105808 -0.0143885 0.0263172 -0.178778 0.106211 -0.00163121 0.084615 
0.0181403 -0.0280163 -0.0825478 -0.0331589 0.0557681 0.143321 0.00540724 -0.0398005 -0.0883555 0.0128109 0.00641835 0.0520825 0.0804544 0.00796304 0.0245288 -0.0918203 -0.117536 0.0310314 0.0362943 0.157876 0.0350099 -0.075936 0.117947 0.163175 -0.00246485 0.0373881 0.0057448 -0.19907 0.0575949 0.0277973 0.0320317 -0.0424878 -0.0599564 -0.0143669 0.00471652 0.0931929 -0.106289 0.131072 -0.105074 -0.0351425 0.00173678 -0.024006 -0.126787 0.173099 -0.207334 -0.0338257 0.153302 0.0774889 -0.0599746 0.0700866 -0.044086 -0.043739 0.00856485 -0.0318438 0.141335 0.0305088 -0.0290579 0.235018 0.056018 -0.16535 -0.092385 0.0337064 0.266582 -0.0560892 0.05926 -0.0159776 0.0604244 -0.00447153 -0.0363879 0.119153 -0.0280812 0.140778 -0.0120913 0.0688324 0.0163201 -0.0868224 -0.0881152 0.0447716 0.088577 0.0559185 -0.0243344 0.0512182 -0.0759668 -0.125561 -0.0143336 -0.101378 0.0429796 0.0692406 0.0819561 -0.00569593 0.141321 -0.0187684 0.0218461 -0.0786885 -0.00850157 -0.12776 0.00602323 0.128674 0.0975462 -0.0795812 -0.00547085 0.0293063 0.0208796 -0.0375334 -0.187543 0.105053 -0.0917517 -0.00813038 0.0908838 -0.0118233 0.104759 0.213556 -0.0187367 -0.0657798 0.0311719 0.079773 -0.00858756 -0.15893 0.0241207 0.108501 0.0338789 -0.0684892 -0.012211 0.0297184 -0.185176 0.0863664 0.000411755 0.0488221 
0.0388981 -0.029122 -0.0781851 -0.0360898 0.06442 0.16957 0.00185037 -0.0257225 -0.116421 -0.0174659 -0.0197118 0.0488486 0.091896 -0.0154666 0.0217638 -0.0870595 -0.0759909 0.0478585 0.0224575 0.176662 0.0568867 -0.045702 0.0991428 0.19005 -0.0246627 0.0340269 -0.0311836 -0.215521 0.0532766 0.0335777 0.0282513 -0.0140106 -0.0706673 0.0169645 0.0283093 0.0876544 -0.0648777 0.12032 -0.102622 -0.0583628 0.0127247 -0.0155282 -0.097635 0.156161 -0.188799 -0.0252421 0.180249 0.0803112 -0.0966033 0.0848398 -0.0398712 -0.0818393 0.030164 -0.0146304 0.145125 0.0263848 -0.02065 0.216754 0.0638096 -0.201418 -0.0743363 0.0792336 0.240297 -0.0925023 0.0535813 -0.0239454 0.0701203 -0.0215298 -0.0498193 0.086919 -0.0423229 0.0978769 -0.0176312 0.0650801 0.00311102 -0.0810051 -0.0844299 0.0535123 0.114252 0.0453985 -0.0121057 0.0848379 -0.0827345 -0.136375 0.0100892 -0.0887818 0.035895 0.0563243 0.067467 0.0257229 0.164059 -0.0292832 0.0139133 -0.0662431 -0.0128365 -0.0933233 0.0227253 0.147905 0.0541878 -0.0694253 0.0100826 0.0433382 0.00833546 0.00105367 -0.20078 0.0929802 -0.0946729 -0.0169656 0.0455324 0.00917479 0.106948 0.199958 -0.0352719 -0.0702477 0.00986113 0.0675067 -0.0330708 -0.198141 -0.00473981 0.091438 0.0272088 -0.0591223 0.0159008 0.0270602 -0.179636 0.070881 -0.00956523 0.00236266 
0.0104243 -0.00356562 -0.0678769 -0.0388677 0.0450717 0.173579 -0.0205876 -0.0201717 -0.122566 -0.00289585 -0.0130499 0.0437552 0.0758642 -0.0311901 0.00933191 -0.0984795 -0.0856993 0.0573463 0.0501576 0.165198 0.0406092 -0.0414153 0.0961934 0.18027 -0.0273031 0.0499419 -0.0152157 -0.199405 0.0842641 0.00796446 0.0376209 -0.0342661 -0.0646235 -0.00460945 0.0289325 0.085299 -0.0704018 0.112059 -0.0913015 -0.0349142 0.0236019 -0.0226748 -0.108342 0.160463 -0.19969 -0.0417249 0.189628 0.0701991 -0.0969524 0.0739969 -0.0407436 -0.0442473 0.019814 -0.0154789 0.119494 0.0352571 0.00530005 0.202091 0.0624191 -0.197149 -0.0861596 0.0793768 0.251179 -0.0825654 0.054098 -0.0301856 0.0885118 -0.059775 -0.044627 0.110264 -0.0506507 0.0948509 -0.0136412 0.0971369 0.0248677 -0.104879 -0.0999803 0.0740275 0.105168 0.0335393 -0.0289093 0.0961389 -0.057297 -0.112177 0.0268388 -0.0839044 0.0359442 0.066733 0.0732941 0.00585711 0.156575 -0.00895065 0.024085 -0.0683026 0.00798587 -0.124774 0.0274123 0.170719 0.0404214 -0.0707998 -0.00850191 0.0543728 0.013428 0.00552326 -0.179301 0.107797 -0.0600002 -0.0184819 0.0629736 0.00938955 0.0986614 0.18977 -0.0244478 -0.0670075 -0.000394147 0.0497492 -0.0132695 -0.207604 0.0196876 0.0819759 0.0322399 -0.0808323 0.00424625 -0.00621577 -0.188087 0.0817781 -0.00458527 0.0332173 
0.00434476 0.0121443 -0.0771872 -0.0232491 0.0253946 0.159909 -0.0160973 -0.0430952 -0.120253 0.00283347 -0.00984344 0.0239909 0.082898 0.0160827 0.0199538 -0.0919126 -0.0660251 0.0338377 0.0756887 0.15608 0.0287443 -0.0534185 0.079874 0.16144 -0.0197454 0.0631659 -0.0362276 -0.188582 0.0952921 0.0292079 0.0424287 0.0062692 -0.059569 -0.0239669 0.030247 0.106882 -0.06021 0.133812 -0.0828176 -0.044632 0.00660852 -0.0157244 -0.107401 0.132466 -0.177589 -0.0150389 0.190266 0.0674562 -0.093225 0.0361699 -0.0539459 -0.0166536 0.0462015 -0.0191515 0.130963 0.0425128 -0.000642614 0.203544 0.0705208 -0.197331 -0.0916289 0.0804797 0.247695 -0.101101 0.0574991 0.0160884 0.106362 -0.0550178 -0.0417826 0.0984478 -0.0485792 0.0919239 -0.0206374 0.101586 0.0373191 -0.101346 -0.0898786 0.0559499 0.10252 0.030415 -0.0202523 0.0935215 -0.0766756 -0.131801 0.0393882 -0.0968403 0.0175551 0.0496718 0.0732595 0.00285833 0.15271 -0.000297368 0.0415759 -0.0686743 0.0168784 -0.123984 0.0505747 0.170043 0.0656689 -0.0686458 -0.00864876 0.0631912 0.0208634 -0.00556356 -0.208184 0.123788 -0.0505113 -0.0286286 0.0816169 0.00877803 0.0940561 0.175764 -0.0411459 -0.0883222 0.00959675 0.0485143 -0.0100488 -0.218228 0.0250435 0.0720619 0.0303355 -0.0861828 0.0153832 0.00135003 -0.18409 0.0937276 0.00824717 0.0387279 
0.0105166 -0.00906322 -0.0701226 -0.0308314 0.0265471 0.13531 -0.0157176 -0.0391638 -0.122425 -0.00191784 -0.0156016 0.0376962 0.0889268 0.00560552 0.0151679 -0.102179 -0.0747617 0.0394741 0.0616358 0.158281 0.0334898 -0.0544291 0.0892804 0.184153 -0.0192263 0.0704452 -0.00701869 -0.205801 0.0694955 0.0352873 0.0333488 -0.0197486 -0.0562093 -0.018651 0.0255695 0.0796352 -0.0756855 0.14423 -0.0992351 -0.035756 0.00158297 -0.0159956 -0.108891 0.177191 -0.18604 -0.0128489 0.188602 0.0604802 -0.08153 0.0466701 -0.0201957 -0.0453557 0.0363715 -0.0232192 0.139114 0.0333192 -0.00586173 0.211943 0.0980812 -0.206548 -0.0731039 0.0517953 0.223974 -0.0597371 0.052018 -0.0378186 0.0994638 -0.050504 -0.0275567 0.0843191 -0.0485199 0.0899621 -0.00783197 0.0735213 0.0218322 -0.103073 -0.108396 0.0675145 0.10487 0.0682289 -0.0194355 0.0777877 -0.0741572 -0.132383 0.0269151 -0.118212 0.0382488 0.0460203 0.0713959 -0.0130593 0.117044 0.000270377 0.0397367 -0.0909603 -0.0126732 -0.115378 0.0466089 0.160215 0.0739451 -0.0848667 -0.0153333 0.0758329 0.0325726 0.0137517 -0.204895 0.0789522 -0.0797208 -0.0050934 0.0793272 -0.000980486 0.107625 0.190416 -0.0559571 -0.0800966 -0.00945041 0.0619713 -0.0250757 -0.22423 0.00144446 0.0727354 0.0232049 -0.0589735 -0.0108949 0.000560685 -0.179957 0.0705822 -0.0136337 0.0319288 
-0.0245134 0.00188546 -0.0671173 -0.0222275 0.00198203 0.123555 -0.0314984 -0.0660254 -0.102029 0.0239652 0.00183956 0.0241497 0.0582397 0.0561569 0.0585192 -0.0976196 -0.0744202 0.0243679 0.136242 0.114652 -0.0205462 -0.0266909 0.0941599 0.144365 -0.0123588 0.0881317 0.0176716 -0.190246 0.0780095 0.0317528 0.0516424 -0.0383632 -0.0227687 -0.0705588 0.0443064 0.119214 -0.0624365 0.142119 -0.0872139 0.00549151 -0.0172654 0.0172268 -0.137091 0.154841 -0.200613 0.011033 0.176902 0.0379079 -0.0432713 0.0112571 -0.0348782 -0.00566316 0.0541308 -0.0317944 0.123272 0.0610141 0.0114334 0.214825 0.0865179 -0.152004 -0.110684 0.0311846 0.233104 -0.0808081 0.0850007 -0.0154496 0.118887 -0.0582146 -0.0199381 0.115683 -0.0221777 0.111997 -0.00893496 0.0770735 0.0464508 -0.0998945 -0.129562 0.0561631 0.0800188 0.0379983 -0.0125348 0.0783698 -0.0765201 -0.11685 0.0328651 -0.131501 0.0198303 0.0277931 0.0496131 -0.0328993 0.0954539 0.0296189 0.0632895 -0.0946644 0.0284355 -0.134693 0.0519484 0.156496 0.101111 -0.0674179 -0.0468399 0.0724018 0.0420594 -0.0518108 -0.211299 0.0997061 -0.0395642 -0.069564 0.102938 0.0147343 0.100382 0.153216 -0.011888 -0.105433 -0.00735471 0.0630926 0.0124648 -0.218026 0.0111437 0.0565695 0.0485615 -0.0916307 -0.01887 -0.0105897 -0.170173 0.101463 0.00948063 0.0825061 
-0.0409007 0.03334 -0.0574153 0.00248124 -0.0331803 0.12017 -0.0201786 -0.0942643 -0.0813356 0.0535855 0.015558 0.0105749 0.0311745 0.0458132 0.0610192 -0.118167 -0.080772 0.0308697 0.165359 0.0814458 -0.054409 -0.0318863 0.0507164 0.147624 -0.00959363 0.0901441 0.00376 -0.172063 0.0897427 0.0411646 0.0483296 -0.022102 -0.0154458 -0.0917445 0.0565722 0.124588 -0.0569101 0.103141 -0.0762421 0.0022739 -0.0116015 -0.0142539 -0.132228 0.139855 -0.181247 0.0174967 0.168362 0.0380916 -0.0462452 -0.0261153 -0.0314228 0.0355784 0.0771752 -0.0444181 0.123875 0.0821857 0.00288337 0.193022 0.0857774 -0.130755 -0.118114 0.0338814 0.224522 -0.0755043 0.0793124 0.0170891 0.137255 -0.102731 -0.0305091 0.113869 -0.0323093 0.0886436 -0.00673653 0.0976367 0.0677736 -0.111958 -0.122095 0.0570894 0.0713885 0.0195794 -0.00840203 0.0874418 -0.084812 -0.112586 0.054243 -0.120234 0.00016471 -0.00333948 0.0447233 -0.00806688 0.0911624 0.0402566 0.0786556 -0.0977054 0.0278493 -0.135347 0.0535843 0.129498 0.127124 -0.0600382 -0.0310974 0.0878214 0.0546459 -0.0809152 -0.200333 0.114327 0.00114106 -0.0788914 0.100566 0.0406805 0.105964 0.132684 0.00624628 -0.139162 -0.0133023 0.0412435 0.0336603 -0.218499 0.0396063 0.030748 0.0721629 -0.129978 -0.0194577 -0.024617 -0.158067 0.121592 0.0284536 0.0888803 
