{
  "descriptor": [
    -0.07336380332708359,
    0.11744469404220581,
    0.11799556016921997,
    -0.10934366285800934,
    -0.13978926837444305,
    0.026064695790410042,
    -0.11131799221038818,
    -0.04739052429795265,
    0.13412994146347046,
    -0.12986771762371063,
    0.13920359313488007,
    -0.024082191288471222,
    -0.20599055290222168,
    0.09091395139694214,
    -0.0805973932147026,
    0.173103928565979,
    -0.19387701153755188,
    -0.20228393375873566,
    0.016036422923207283,
    -0.038303229957818985,
    0.05087864398956299,
    0.0709066241979599,
    -0.007021165452897549,
    0.08231151103973389,
    -0.16701197624206543,
    -0.29576048254966736,
    -0.06731733679771423,
    -0.028552532196044922,
    0.026748094707727432,
    -0.06805188208818436,
    -0.07043583691120148,
    0.054105762392282486,
    -0.16960665583610535,
    0.04629528895020485,
    0.08152154833078384,
    0.10349791496992111,
    -0.01283310353755951,
    -0.15016289055347443,
    0.20718759298324585,
    0.1277303695678711,
    -0.26060256361961365,
    -0.0004539764777291566,
    0.10919084399938583,
    0.2883532643318176,
    0.20253397524356842,
    -0.015479936264455318,
    0.040772758424282074,
    -0.060003891587257385,
    0.18502485752105713,
    -0.27209925651550293,
    0.05077338591217995,
    0.20371533930301666,
    0.08999714255332947,
    0.08246270567178726,
    0.025979595258831978,
    -0.14633968472480774,
    0.045565616339445114,
    0.12476686388254166,
    -0.1561129093170166,
    0.052965521812438965,
    0.09399227052927017,
    -0.06371432542800903,
    0.035136736929416656,
    -0.06706544011831284,
    0.22409778833389282,
    0.11123479157686234,
    -0.12100469321012497,
    -0.17064401507377625,
    0.20689238607883453,
    -0.11619573086500168,
    -0.11457370221614838,
    0.07104827463626862,
    -0.1397370845079422,
    -0.14052285254001617,
    -0.18168705701828003,
    0.02181665226817131,
    0.39902544021606445,
    0.1538938283920288,
    -0.10629471391439438,
    0.12453765422105789,
    -0.019521726295351982,
    -0.05556037649512291,
    -0.014336982741951942,
    0.2077852189540863,
    -0.07638588547706604,
    0.09762303531169891,
    -0.024616088718175888,
    0.04816913977265358,
    0.29307636618614197,
    0.013321480713784695,
    0.003933115396648645,
    0.2376764863729477,
    0.02258220687508583,
    0.030942285433411598,
    0.08168996870517731,
    0.0536145344376564,
    -0.12488202005624771,
    -0.027761822566390038,
    -0.17857734858989716,
    -0.0576135590672493,
    -0.06876274198293686,
    -0.054448049515485764,
    -0.012231094762682915,
    0.15711355209350586,
    -0.230620339512825,
    0.1666410118341446,
    -0.047671061009168625,
    -0.0608019158244133,
    -0.0684649720788002,
    0.022270692512392998,
    -0.03782368451356888,
    -0.017191177234053612,
    0.09871331602334976,
    -0.22104066610336304,
    0.11580344289541245,
    0.13923950493335724,
    0.11662553250789642,
    0.11354608833789825,
    0.11282754689455032,
    0.03568959981203079,
    0.08440989255905151,
    -0.05262710154056549,
    -0.1203007772564888,
    -0.10169854760169983,
    0.06107636168599129,
    -0.07312188297510147,
    0.04841385781764984,
    0.033611807972192764
  ]
}