0.055405 0.0569873 -0.0396395 -0.0354921 0.100317 0.135077 0.0199475 -0.15451 -0.208134 -0.0233555 -0.0462134 0.034465 0.129236 0.0710024 0.0218659 -0.0200189 0.00193165 0.0625102 0.0114852 0.140833 0.0688564 -0.0246973 0.122519 0.0805534 -0.0278483 0.0692697 -0.140886 -0.164656 0.082582 0.0996825 -0.0360647 0.130853 -0.0815237 0.0169738 0.0767286 0.0492783 -0.00498015 0.215958 0.0379604 -0.0814408 -0.0251848 0.0325729 -0.0126303 0.000812537 -0.174914 0.102866 0.194407 0.0549689 -0.156972 0.0198608 -0.0104144 -0.0146318 0.0403191 0.0408426 0.115866 -0.0310863 0.0943236 0.186522 0.0142263 -0.147295 -0.0371838 0.121391 0.175562 -0.129207 0.111596 0.0387925 0.0292991 0.0596579 -0.0868376 0.055943 0.0067021 0.0791241 -0.0288179 0.0673144 0.023065 -0.000294457 -0.0871902 -0.0487558 0.13039 0.0213706 0.0199153 0.0999285 -0.0505922 -0.0842065 -0.0164769 -0.101363 0.00801693 0.0360274 -0.00246116 0.0330583 0.123788 -0.0342072 0.0828672 -0.0182933 -0.0547263 -0.116875 0.0667074 0.231401 0.0612167 -0.0520921 0.031989 0.0860878 -0.00793545 0.141796 -0.160451 0.0710305 -0.0682122 0.081062 0.105508 -0.010759 0.0705655 0.13751 -0.0777482 0.00411479 0.00637384 0.07766 -0.134073 -0.135897 -0.0634325 0.0965205 -0.00011864 -0.0400273 0.0284389 -0.0186125 -0.123968 0.0930742 -0.039896 -0.0366317 
0.00906221 0.0549862 -0.0697421 -0.0506122 0.0692411 0.0899933 -0.020983 -0.13043 -0.19419 0.00170613 -0.0385777 0.0341038 0.127649 0.0842212 0.0166077 -0.0240062 0.00642496 0.0431728 0.0707982 0.12917 0.0638703 -0.045379 0.134928 0.0693798 -0.0207616 0.117121 -0.0797523 -0.186362 0.0940117 0.0856326 -0.0220848 0.0988981 -0.030115 -0.0198999 0.0531751 0.0513349 0.00347801 0.250893 0.0227928 -0.046125 -0.0328697 0.0506311 -0.0328247 0.0514296 -0.190372 0.0972882 0.220313 0.0118599 -0.130727 -0.0193906 -0.0129742 -0.0122012 0.027259 0.0350615 0.11147 0.00159297 0.120142 0.185114 0.0430436 -0.160883 -0.0340238 0.0593312 0.176879 -0.102202 0.127383 0.00505383 0.0471129 0.0514877 -0.0136896 0.0659535 -0.00236605 0.0831983 -0.0348426 0.0573863 0.0465124 -0.0179093 -0.124142 0.0129122 0.103968 0.00386898 -0.0366662 0.119538 -0.0436754 -0.0693961 -0.0111255 -0.107033 0.0292183 0.0470626 0.0136984 -0.0350348 0.0777642 -0.0181823 0.0875521 -0.0669392 -0.017063 -0.150802 0.0700854 0.251465 0.0654968 -0.0667282 -0.0221692 0.0737101 0.026739 0.13719 -0.168667 0.0544888 -0.0706147 0.0646889 0.112743 -0.0394494 0.0510447 0.128876 -0.0902973 -0.0134518 -0.00186003 0.0651985 -0.115694 -0.215685 -0.0505469 0.0700207 0.00856218 -0.00630068 -0.0024583 -0.0194088 -0.138597 0.0756342 -0.0533966 0.0178921 
0.0485974 0.0155834 -0.0795132 -0.0586184 0.0819248 0.0987166 -0.00580395 -0.115181 -0.180993 -0.0158459 -0.0360999 0.0479629 0.118298 0.0674649 0.0119017 -0.0227631 -0.0124934 0.0510583 0.0537806 0.120853 0.0950345 -0.0273445 0.136704 0.0881551 -0.0177885 0.108806 -0.0594995 -0.222195 0.0726304 0.103656 -0.0285219 0.0718934 -0.0574876 -0.0103133 0.056991 0.0424307 -0.0340441 0.235644 0.0178307 -0.0416586 -0.0551012 0.0592913 -0.0675686 0.0895307 -0.180422 0.0996872 0.196004 0.0146076 -0.126773 -0.000776197 -0.0039375 -0.0164117 0.0178954 0.0272622 0.117141 -0.0080815 0.108102 0.222524 0.034038 -0.143985 -0.0132308 0.0399813 0.201584 -0.0840167 0.124016 -0.0564784 0.0318352 0.0734111 0.0022536 0.0846737 0.00980919 0.105321 -0.0410075 0.0288579 -0.00569697 -0.0255813 -0.12221 0.0141242 0.0925117 0.0348305 -0.0302503 0.110656 -0.0589077 -0.0930525 -0.0345438 -0.129986 0.0441103 0.0335491 0.0104256 -0.0347899 0.084955 -0.0264908 0.0525695 -0.0678718 -0.0191336 -0.124607 0.0692415 0.214215 0.0823206 -0.0610031 -0.0102008 0.0737356 0.0108128 0.123154 -0.177105 0.0263646 -0.097968 0.0533794 0.100872 -0.0407356 0.0809545 0.142376 -0.0993475 -0.0199204 0.021716 0.0993573 -0.11049 -0.212986 -0.0575009 0.0814234 0.00090325 0.0087551 -0.000178249 -0.0021164 -0.129741 0.0640312 -0.0507083 -0.000245682 
0.0515591 0.0182504 -0.095519 -0.0316955 0.107184 0.0968559 -0.00349297 -0.13962 -0.199425 0.00917789 -0.0423805 0.0548616 0.107994 0.0860936 0.0273051 0.00278094 0.0285151 0.0652121 0.0957823 0.114653 0.0780225 -0.0196672 0.128838 0.086306 0.00460509 0.109278 -0.0635155 -0.22064 0.0662221 0.132001 -0.029542 0.0890144 -0.0494985 -0.0247879 0.0725622 0.0594686 -0.021831 0.189179 0.0241527 -0.0623825 -0.0647751 0.074484 -0.0244349 0.0819117 -0.174478 0.130975 0.213859 0.0135506 -0.119223 -0.0218058 0.029956 -0.0298458 0.0272755 0.00561643 0.140226 0.00478527 0.0995101 0.221173 0.059363 -0.113989 -0.0105085 0.0372609 0.182802 -0.110495 0.154332 -0.0588047 0.00408697 0.0681358 -0.0096846 0.0923187 0.0161274 0.12291 -0.0498146 -0.0050975 -0.0242819 -0.00151837 -0.098089 0.0380606 0.0813364 0.00443287 -0.0163979 0.11731 -0.0702149 -0.0820855 -0.0331515 -0.138314 0.0220234 0.0198674 -0.000962245 -0.0194048 0.062825 -0.000897607 0.0307567 -0.0607934 -0.00243669 -0.0934625 0.081394 0.215916 0.0869779 -0.0570991 -0.00905945 0.0829899 0.0280722 0.0903485 -0.197372 0.0278006 -0.0937266 0.0229751 0.0954566 -0.0151638 0.0725429 0.113054 -0.0714599 -0.0402828 0.0242276 0.0864619 -0.0967616 -0.21166 -0.0827106 0.078505 0.00724198 0.0063214 0.017575 -0.00968008 -0.131193 0.0850081 -0.0394289 -0.01209 
0.0539845 0.0190809 -0.0909968 -0.0220381 0.110533 0.113042 -0.00978763 -0.157095 -0.191216 -0.00773851 -0.0365113 0.0505693 0.103125 0.0888119 0.0276176 0.00236367 0.0354067 0.0713322 0.102722 0.104754 0.0882998 -0.00913334 0.118487 0.0950699 0.0159179 0.101817 -0.0720978 -0.219833 0.0715586 0.142743 -0.0149081 0.0888539 -0.0484476 -0.0266556 0.0906653 0.0714031 -0.0162979 0.164258 0.0331078 -0.0750993 -0.0605498 0.0764546 -0.016849 0.0751984 -0.167647 0.130706 0.217443 0.0181784 -0.120877 -0.0323841 0.0197566 -0.0277534 0.0512427 0.000297667 0.14066 0.0130366 0.0964697 0.219585 0.050832 -0.118422 -0.016061 0.0532296 0.186393 -0.123354 0.154901 -0.0440445 0.0108468 0.0564254 -0.0172583 0.0954384 0.0137547 0.113038 -0.0579472 -0.0208571 -0.0238959 -0.00184631 -0.0971165 0.0327141 0.0784849 0.0111485 -0.00592876 0.12838 -0.0702786 -0.0848961 -0.0232746 -0.131159 0.0127433 0.0109563 -0.0196183 -0.00528381 0.0798227 0.00467806 0.0268853 -0.0484299 -0.00243094 -0.0912563 0.0742735 0.22202 0.0839465 -0.0545789 0.00339827 0.0860449 0.025214 0.0743507 -0.197165 0.0409694 -0.0731237 0.0114504 0.0897226 -0.00167411 0.0721015 0.0956517 -0.0696442 -0.0491278 0.0253823 0.0903688 -0.104342 -0.205883 -0.0852401 0.079127 0.0115085 -0.00544017 0.0173221 -0.0173135 -0.132832 0.0996687 -0.0276714 -0.010763 
0.0139917 0.0436178 -0.0589646 -0.0289408 0.103713 0.109038 -0.0365347 -0.184819 -0.184343 -0.0163869 -0.0255842 0.0456601 0.094643 0.109998 0.0507754 0.00358029 0.0328135 0.0672382 0.111586 0.0896292 0.0739044 0.0170529 0.10133 0.0975512 0.014429 0.111677 -0.0772338 -0.194821 0.0881164 0.13939 0.0106076 0.084 -0.0298666 -0.0381822 0.107388 0.115001 9.16629e-05 0.140274 0.0396042 -0.0481107 -0.0517029 0.0862767 -0.00598834 0.0550299 -0.149926 0.149621 0.237763 0.0186224 -0.128257 -0.057262 -0.00940758 -0.0292201 0.0570055 -0.00890124 0.130149 0.0454186 0.0735763 0.229129 0.0301548 -0.0912494 -0.0377933 0.0748781 0.183004 -0.128392 0.168013 -0.0205345 0.0258914 0.0361661 -0.028714 0.102977 0.022865 0.0967362 -0.0570012 -0.0204371 0.00907855 0.00291398 -0.111947 0.0330002 0.0715705 -0.0163599 0.0112919 0.152296 -0.0779366 -0.0711863 -0.0377213 -0.112814 0.00385673 -0.00370712 -0.0543767 0.0124286 0.0905077 0.0110072 0.0450599 -0.0332339 0.0138087 -0.0831097 0.0522312 0.224548 0.0875051 -0.0424518 -0.0247212 0.07403 0.0134156 0.0522703 -0.191765 0.0781554 -0.0549173 -0.0113817 0.0864332 0.00551689 0.0622783 0.0697949 -0.0682663 -0.0520827 0.0119286 0.083581 -0.102435 -0.208134 -0.0846296 0.0773987 0.0301069 -0.0200566 0.00472945 -0.0165383 -0.14525 0.12445 -0.0297244 -0.00633762 
0.0430663 -0.00224157 -0.0710568 -0.0436127 0.123571 0.0994032 -0.0382948 -0.15046 -0.17585 -0.043325 -0.0378595 0.0740377 0.0877183 0.0830931 0.014562 0.00277675 0.0160167 0.0712362 0.0851721 0.120221 0.107605 0.023449 0.10989 0.121154 0.0108361 0.116204 -0.0294323 -0.20923 0.0616262 0.135137 -0.0214461 0.0461343 -0.0424475 -0.0109479 0.0933285 0.0775335 -0.00867941 0.149477 0.0271781 -0.0609669 -0.0483202 0.0918066 0.00116843 0.097562 -0.160932 0.111034 0.235728 0.0202221 -0.112937 -0.00760917 0.0114134 -0.0664359 0.0361076 0.0103378 0.163727 0.0170984 0.076031 0.23511 0.0324262 -0.128541 -0.00241242 0.0473077 0.196947 -0.0886916 0.138933 -0.0668461 0.00589149 0.0553114 0.00566371 0.0958552 0.0168761 0.105099 -0.0440762 -0.0320249 -0.0182892 -0.00515133 -0.105669 0.0521508 0.0787031 0.00397089 0.015548 0.166996 -0.0611922 -0.0788983 -0.0375279 -0.126155 0.0269537 0.0396845 -0.0203242 0.00583856 0.0897816 -0.00390556 0.0105728 -0.0441793 -0.0027023 -0.0776378 0.0436453 0.214138 0.0764025 -0.0690955 -0.0141586 0.0606819 0.017317 0.069111 -0.193498 0.0434395 -0.0980578 -0.00171601 0.0540369 -0.0102663 0.0896536 0.102452 -0.0787199 -0.022037 0.00801179 0.0890543 -0.104319 -0.217544 -0.108489 0.0674717 0.0168218 0.0267837 0.0151372 -0.019488 -0.151516 0.0931761 -0.0369177 -0.0179902 
0.0561427 -0.014507 -0.0828884 -0.0592092 0.155565 0.11724 -0.009697 -0.137492 -0.133985 -0.0374912 -0.0490874 0.0957949 0.0887284 0.0712304 -0.00656481 -0.00135958 -0.000958579 0.107779 0.0314821 0.115867 0.120779 0.0432292 0.0966355 0.147893 -0.0127031 0.077136 -0.0312092 -0.193319 0.0412014 0.153632 -0.0437867 0.0377347 -0.0508118 -0.000768494 0.0992026 0.0616924 -0.00921787 0.111816 -0.00602543 -0.0699075 -0.0326881 0.095992 0.0144691 0.110796 -0.173093 0.0869019 0.213178 0.0465493 -0.090939 0.0247357 0.0273932 -0.0928835 0.0210563 0.0146708 0.183428 0.0194691 0.0600558 0.232857 0.0297614 -0.136574 -0.0013614 0.0516286 0.195771 -0.0776263 0.109704 -0.0919221 -0.0178601 0.0686484 -0.00710587 0.0976432 0.0336035 0.107601 -0.027661 -0.0560325 -0.0432127 0.0313435 -0.103227 0.0497424 0.0788266 -0.0291296 0.0491228 0.192176 -0.0588228 -0.0571446 -0.0335372 -0.104864 0.0390716 0.0534055 -0.00766135 0.0411733 0.0880537 -0.0268341 -0.0164234 -0.0590662 -0.0129707 -0.0601135 0.0130954 0.195223 0.0746396 -0.0622382 0.0369979 0.0504693 0.029292 0.0534009 -0.198433 0.0256577 -0.137309 -0.0213648 0.0112365 0.0173093 0.111172 0.100651 -0.0600989 -0.0165501 -0.00835435 0.101579 -0.0968216 -0.190745 -0.1299 0.0671627 0.0306377 0.0226719 0.0295235 -0.0193907 -0.172096 0.0933141 -0.0589806 -0.0314947 
0.0947589 -0.0609731 -0.118154 -0.0463858 0.159327 0.112048 0.00694262 -0.104492 -0.118883 -0.07383 -0.0574474 0.126759 0.0863279 0.0321098 -0.0718246 0.00289129 -0.0328502 0.0900464 -0.0264937 0.145835 0.141648 0.00755807 0.119489 0.13929 -0.0212352 0.0561709 -0.00631397 -0.197684 0.00379259 0.14232 -0.0799759 0.0350554 -0.0751262 0.0215506 0.0478323 0.0163867 -0.0648342 0.132402 -0.0373061 -0.075159 -0.0406483 0.0896477 -0.0110539 0.130942 -0.172862 0.053659 0.176396 0.0393673 -0.0746801 0.0782734 0.0455734 -0.0945802 -0.00260539 0.0227686 0.187057 -0.0271608 0.0576469 0.230476 0.0288297 -0.147773 0.0223869 0.0378839 0.21519 -0.0375813 0.0764034 -0.130985 -0.0379923 0.100146 0.000950717 0.0857788 0.0279768 0.11493 -0.0084947 -0.0444958 -0.0775571 0.0361003 -0.0758792 0.015408 0.0617891 0.0210931 0.0444953 0.144775 -0.0507688 -0.0793571 -0.0513499 -0.106752 0.0549094 0.0763804 0.0146173 0.0220616 0.0762609 -0.0584233 -0.0468226 -0.0469283 -0.0274115 -0.0496286 0.0165486 0.149148 0.0734973 -0.0655285 0.0491795 0.0352382 0.0129678 0.0879147 -0.18891 -0.00531568 -0.16988 0.0274542 -0.00726816 -0.00918228 0.129107 0.144119 -0.0646385 0.0183392 -0.00189767 0.117682 -0.103783 -0.143015 -0.101136 0.0820674 -0.0113626 0.0507304 0.0355651 -0.025967 -0.138838 0.0674398 -0.064701 -0.0545244 
0.0675372 -0.0394927 -0.0708941 -0.0512186 0.1546 0.136316 -0.00932225 -0.133605 -0.135017 -0.063842 -0.060396 0.10168 0.0851291 0.0453807 -2.29286e-05 -0.0132958 -0.0348015 0.0850355 0.0160597 0.126581 0.123764 0.0302056 0.104197 0.175585 -0.0023251 0.0602332 -0.043247 -0.202912 0.0227118 0.139251 -0.0324051 0.0342586 -0.0738238 0.0137879 0.0785713 0.0600644 -0.0406676 0.0892531 -0.0149138 -0.0702358 -0.0145302 0.0694966 0.00360886 0.104815 -0.166496 0.065071 0.202178 0.0580787 -0.0870102 0.0433195 0.028884 -0.111254 0.0448601 0.00645257 0.187023 0.00814293 0.0476377 0.244718 0.0297646 -0.147776 -4.24872e-05 0.0861532 0.190415 -0.0638612 0.0842525 -0.0671229 -0.00765033 0.0635575 -0.0188086 0.0802824 0.0126688 0.11832 -0.0279376 -0.0376026 -0.0330322 0.0279491 -0.0992492 0.0112904 0.0939571 0.0270349 0.0661159 0.165599 -0.0535199 -0.0767543 -0.0338468 -0.0995653 0.0465716 0.0567554 -0.0167909 0.0452562 0.10555 -0.0226382 -0.0118886 -0.0405608 -0.0498819 -0.0506195 0.00585677 0.178533 0.0780864 -0.0669699 0.0527777 0.0355373 0.0197305 0.0479977 -0.198414 0.0299978 -0.145816 -0.00415438 -0.00272618 0.0200056 0.131646 0.128184 -0.0639873 -0.0286411 -0.0133063 0.120695 -0.113855 -0.153618 -0.122406 0.0841582 0.0316031 0.0113897 0.023224 -0.0283733 -0.184341 0.102502 -0.0639852 -0.037093 
0.0842314 -0.0465505 -0.0938145 -0.0485225 0.175894 0.108641 0.00808032 -0.112886 -0.116274 -0.0640391 -0.0662793 0.116463 0.0842752 0.0616085 -0.0471714 0.00164674 -0.0111499 0.0973242 -0.00888932 0.12613 0.154443 0.0197296 0.111965 0.153432 0.000378846 0.0398953 -0.0265901 -0.180381 0.0289617 0.16139 -0.0591423 0.0278607 -0.0689985 0.00524656 0.0618824 0.0243741 -0.0570273 0.115753 -0.0293806 -0.0821386 -0.0468353 0.112093 0.00316024 0.115055 -0.165033 0.060949 0.174286 0.0370316 -0.0589962 0.0498137 0.0466854 -0.0839118 0.0131071 0.00666559 0.188518 -0.0100213 0.0596457 0.239153 0.0293566 -0.14737 0.021522 0.0440922 0.191351 -0.0430399 0.078227 -0.114239 -0.0338044 0.0962876 -0.00559944 0.0943451 0.0434082 0.129026 -0.0194839 -0.0610123 -0.0764817 0.0520807 -0.0776742 0.0173836 0.0730174 0.00814488 0.0501656 0.163264 -0.0403849 -0.0630043 -0.0228661 -0.120512 0.0505777 0.0815498 0.010439 0.0259988 0.072309 -0.0420115 -0.038529 -0.041804 -0.0215624 -0.0591545 0.0108592 0.165718 0.0687009 -0.0597126 0.0575979 0.0399067 0.0222355 0.0713569 -0.210887 0.00709899 -0.159523 -0.00487343 0.0181562 -0.00294553 0.128251 0.12491 -0.0746902 0.0153197 0.00533567 0.127043 -0.106231 -0.140483 -0.124316 0.0825167 -0.00793623 0.0516059 0.0212807 -0.0357749 -0.160465 0.0899687 -0.0624643 -0.0484323 
0.0841041 -0.0452099 -0.0963005 -0.0463013 0.183662 0.104915 0.0178903 -0.0988537 -0.132777 -0.0585763 -0.0713455 0.118986 0.0840101 0.041288 -0.0468461 -0.00355084 -0.00639525 0.0730736 -0.0164409 0.158416 0.140171 -0.00906982 0.107345 0.1159 0.00433882 0.0656117 -0.047886 -0.187309 0.025353 0.123748 -0.0490005 0.0434231 -0.0904242 0.0134188 0.048902 0.0281284 -0.0718748 0.150508 -0.0230583 -0.0930948 -0.0265425 0.102617 -0.00951954 0.118715 -0.16932 0.0647012 0.165576 0.0370545 -0.0612579 0.0434439 0.0383233 -0.0764764 -0.0211988 -0.000978141 0.181996 -0.0350199 0.0289025 0.245074 0.0254227 -0.140611 0.0217627 0.0267362 0.195857 -0.0474097 0.105135 -0.127797 -0.0356979 0.103633 -0.00179323 0.0864242 0.0482278 0.145929 -0.00299964 -0.0368828 -0.0842187 0.0404424 -0.0758431 0.0356184 0.0776878 0.0237802 0.0206844 0.135518 -0.0264808 -0.0599003 -0.0340872 -0.150364 0.074869 0.109519 0.0275796 0.000131394 0.0633755 -0.0403118 -0.0278765 -0.0366855 -0.0289768 -0.0769717 0.0466363 0.138427 0.048654 -0.0653301 0.0206944 0.0498815 0.000176869 0.0897676 -0.205337 0.0116697 -0.15263 0.0318621 0.0445559 -0.0097923 0.119013 0.138757 -0.100194 0.0405515 0.0193615 0.101719 -0.120198 -0.146562 -0.113771 0.0881783 -0.0289449 0.0715779 0.0201476 -0.0183289 -0.128593 0.0660022 -0.0656402 -0.0593698 
0.108435 -0.0563149 -0.131469 -0.0374011 0.203909 0.113268 0.0440262 -0.0914229 -0.105259 -0.0600066 -0.0712219 0.13832 0.081639 0.0135871 -0.0781245 0.0068193 -0.00165151 0.0614226 -0.0524594 0.168831 0.133831 -0.0130438 0.0898209 0.0926673 -0.0105962 0.0562777 -0.0517503 -0.181699 0.000789163 0.121699 -0.0661185 0.0629604 -0.104756 0.0180994 0.0330577 0.0141623 -0.0731111 0.141645 -0.0332371 -0.0990047 -0.00689657 0.104576 -0.0121264 0.113394 -0.167569 0.0614594 0.138094 0.0422969 -0.0472248 0.0517513 0.0489449 -0.0743086 -0.0364178 0.00140379 0.183705 -0.054873 0.0114099 0.228396 0.0196282 -0.129092 0.0261008 0.0142125 0.197013 -0.0505673 0.10022 -0.15012 -0.0431444 0.127905 0.00486443 0.0681156 0.0601054 0.146085 0.0154335 -0.0461444 -0.104284 0.071582 -0.0608052 0.0368539 0.0532866 0.0208481 0.0325252 0.132704 -0.0187601 -0.0443748 -0.0334781 -0.1375 0.0898514 0.117252 0.0255262 0.00205421 0.0478291 -0.0600473 -0.0525665 -0.0251136 -0.0379702 -0.0748704 0.0577174 0.0868636 0.0417116 -0.0589687 0.0357899 0.0430296 -0.00740811 0.0973255 -0.205683 -0.00275999 -0.162048 0.0477505 0.0106798 0.00957198 0.126307 0.128495 -0.0912771 0.0557106 0.0149929 0.0912117 -0.14512 -0.119075 -0.118791 0.0771957 -0.0450699 0.0856373 0.0378865 -0.0094755 -0.0915859 0.0547435 -0.0819274 -0.07932 
0.0939665 -0.0658237 -0.121901 -0.0432091 0.195805 0.104878 0.0223869 -0.0950329 -0.0958132 -0.0671296 -0.0743521 0.135776 0.0824645 0.0306563 -0.0754827 0.0125573 -0.0135378 0.0659793 -0.0418981 0.158059 0.148241 -0.0106577 0.0959222 0.116404 -0.000579632 0.0545731 -0.0334905 -0.180962 -0.000641131 0.13408 -0.0588322 0.0455016 -0.0914628 0.0109094 0.0360797 0.0218098 -0.0725772 0.133254 -0.0359026 -0.0947055 -0.0212093 0.111736 -0.00631986 0.116922 -0.15142 0.0510509 0.148991 0.0416882 -0.0378444 0.0483163 0.0457601 -0.0943883 -0.0136733 -0.000933233 0.193104 -0.0364232 0.0192471 0.23376 0.020085 -0.145691 0.0318238 0.0178009 0.193558 -0.0343353 0.0873952 -0.134409 -0.0422797 0.127953 0.0124059 0.0625041 0.0520436 0.144106 0.00580497 -0.0643391 -0.0936228 0.0714442 -0.0662031 0.0311022 0.0580683 0.0250393 0.0433731 0.145486 -0.0290001 -0.0510304 -0.0360418 -0.130363 0.079548 0.119743 0.0281912 -2.88391e-05 0.0482079 -0.0515214 -0.047194 -0.025613 -0.0355061 -0.0596179 0.0351562 0.104035 0.0523829 -0.0609669 0.0435557 0.0213405 -0.00216839 0.0794768 -0.209997 0.000501562 -0.173199 0.0203942 0.00159575 0.00415661 0.125157 0.13046 -0.090156 0.0440706 0.0106436 0.109299 -0.143999 -0.115735 -0.130664 0.0741263 -0.0388415 0.0870118 0.0322544 -0.0188442 -0.121191 0.0705054 -0.0870052 -0.0708214 
0.104625 -0.0592464 -0.133201 -0.0459466 0.200199 0.124017 0.0399591 -0.0907169 -0.11428 -0.0567905 -0.069739 0.138134 0.0873849 0.0180987 -0.0775603 0.00495019 -0.0110242 0.0729454 -0.0404551 0.154182 0.140371 -0.0116804 0.0932306 0.102399 -0.0086553 0.053976 -0.0401068 -0.182761 0.00412462 0.130386 -0.0681262 0.0455232 -0.103319 0.0116765 0.0380646 0.0125338 -0.0770545 0.123019 -0.0271174 -0.0947752 -0.0117508 0.104032 -0.00711344 0.121368 -0.172367 0.052408 0.145767 0.0415514 -0.0535209 0.0490863 0.047621 -0.0881733 -0.0280944 0.00272174 0.177942 -0.0416554 0.0196279 0.238355 0.0159788 -0.132177 0.0273783 0.0221461 0.207809 -0.0471393 0.0963189 -0.139201 -0.0476835 0.124503 0.00230606 0.0646652 0.0549476 0.148429 0.00918923 -0.056503 -0.102029 0.0743245 -0.0644834 0.0283753 0.0576205 0.0176487 0.032738 0.133486 -0.0210089 -0.0424334 -0.0420339 -0.128835 0.0867827 0.110792 0.0258584 0.00254619 0.0522142 -0.0583636 -0.0519585 -0.0254616 -0.035848 -0.0717974 0.045389 0.103183 0.0433384 -0.0551875 0.0402917 0.0386472 -0.00116141 0.0879684 -0.205852 0.00313356 -0.163869 0.0398321 -0.00223904 0.00575713 0.128758 0.122022 -0.0812391 0.0476954 0.0107717 0.101741 -0.141691 -0.109785 -0.120461 0.0780271 -0.0401043 0.0640823 0.033361 -0.0195565 -0.109828 0.0664668 -0.0893811 -0.0719052 
0.0943994 -0.0461938 -0.118398 -0.0419572 0.179347 0.11118 0.0250324 -0.112886 -0.107815 -0.064433 -0.0603395 0.139041 0.0782428 0.041588 -0.0722372 0.00798799 -0.0125613 0.0727292 -0.0173423 0.134441 0.144401 0.00888543 0.0979716 0.136701 0.001103 0.0541335 -0.0136177 -0.173523 0.0259958 0.160999 -0.0703707 0.0295688 -0.0800973 0.00499856 0.0435546 0.0125442 -0.0690054 0.123925 -0.0240468 -0.0789048 -0.0398008 0.107993 -0.000400697 0.117403 -0.162665 0.059358 0.162123 0.0298985 -0.0541376 0.0497632 0.06057 -0.0705719 -0.00667707 0.00136082 0.197508 -0.0196666 0.034971 0.252814 0.0126544 -0.130589 0.0192828 0.0186007 0.215053 -0.0473766 0.087765 -0.124807 -0.0426261 0.106304 -0.0116853 0.0845171 0.0470585 0.142094 -0.0149012 -0.0501671 -0.0788388 0.0627651 -0.0606939 0.021255 0.0599385 0.0229452 0.0467153 0.144953 -0.0218862 -0.0572333 -0.0315309 -0.140574 0.0641968 0.0929382 0.0186117 0.015901 0.0514285 -0.057718 -0.0475032 -0.0227151 -0.0205393 -0.0669961 0.0342281 0.124768 0.0735163 -0.0592762 0.0457283 0.0428054 0.0077152 0.0822993 -0.220594 0.00783858 -0.157925 0.0112108 0.0102123 -0.0102694 0.138955 0.12844 -0.0733454 0.0381929 0.0139191 0.117445 -0.121624 -0.114845 -0.119978 0.0909841 -0.0238699 0.0586673 0.0253314 -0.037827 -0.131944 0.0938062 -0.0649785 -0.0622455 
0.084875 -0.0171475 -0.108468 -0.0432074 0.161916 0.105845 0.02098 -0.135641 -0.122286 -0.0454293 -0.048072 0.127201 0.0833322 0.0652253 -0.0502919 0.0105217 0.0012266 0.0656566 0.0170174 0.112197 0.135371 0.0182977 0.091409 0.137633 0.0107631 0.0732279 -0.00949598 -0.171793 0.0508146 0.179777 -0.0661943 0.0329647 -0.0691832 -0.00924897 0.0515491 0.0189964 -0.0561479 0.135221 -0.00028101 -0.0638902 -0.0565171 0.105343 -2.50315e-05 0.104567 -0.154977 0.0870607 0.173871 0.0179153 -0.0688989 0.016701 0.0700064 -0.0424962 0.00229017 -0.00460747 0.195218 -0.00249265 0.0480074 0.262522 0.0133708 -0.116111 0.0121226 0.00977979 0.21341 -0.0615181 0.104653 -0.111526 -0.0329001 0.101138 -0.018236 0.0951376 0.0466199 0.142741 -0.033669 -0.0492792 -0.056708 0.0594193 -0.0653126 0.0291173 0.0633092 0.0224467 0.0412663 0.14482 -0.0171069 -0.0545024 -0.0317021 -0.156152 0.0573429 0.0699667 0.00926597 0.0102018 0.0361316 -0.0496948 -0.0266788 -0.0149748 -0.0161452 -0.0764007 0.0453379 0.139316 0.0937599 -0.0605243 0.0380076 0.0597491 0.00848434 0.0879984 -0.230214 0.0131245 -0.144296 0.00196478 0.0298697 -0.0211035 0.134436 0.117792 -0.0752165 0.0264993 0.0222793 0.120501 -0.126382 -0.126405 -0.12322 0.0949037 -0.0143009 0.0457578 0.0156437 -0.0427779 -0.133625 0.113595 -0.0566859 -0.0507853 
0.0973282 -0.0478807 -0.094275 -0.0680636 0.159691 0.12415 0.0416142 -0.0834891 -0.131577 -0.0546842 -0.0533362 0.134307 0.0843184 0.0354903 -0.0452461 -0.0161049 -0.021161 0.0555464 0.000789425 0.109387 0.144491 0.0317987 0.0696523 0.127346 -0.00775855 0.0779724 -0.00858286 -0.182345 0.0432066 0.155069 -0.08309 0.0127983 -0.0895685 0.000326755 0.0493867 -0.00269144 -0.0682456 0.128557 -0.00908683 -0.0655792 -0.0301938 0.0947253 -0.0211011 0.122809 -0.166615 0.0758698 0.155204 0.0100343 -0.0911889 0.0195702 0.0600173 -0.0621302 -0.00542893 0.00589835 0.186333 -0.00899165 0.0260169 0.271124 -0.0120562 -0.117545 0.0257503 0.00672981 0.222237 -0.0438815 0.0972489 -0.118158 -0.0299358 0.106259 -0.0026817 0.0728577 0.0480394 0.131237 -0.0245196 -0.0587363 -0.0649957 0.0684705 -0.0795554 0.0161451 0.0771845 0.0359431 0.0315593 0.131273 -0.00610799 -0.0567686 -0.0334878 -0.155675 0.0933518 0.0793533 0.0134353 0.0159581 0.0534963 -0.0633892 -0.0455871 -0.00637177 -0.0395562 -0.0780035 0.0548565 0.10704 0.080243 -0.0568409 0.0388015 0.0590005 -0.00523505 0.0775603 -0.231772 0.00612628 -0.148534 0.021963 0.000785267 -0.0334023 0.158718 0.113835 -0.0923461 0.0157377 0.032959 0.122554 -0.147045 -0.125374 -0.119052 0.0857322 -0.0174106 0.0336944 0.0169082 -0.0356874 -0.102457 0.102867 -0.0582543 -0.0619806 
0.0525699 -0.0148479 -0.0991161 -0.0348047 0.106482 0.108973 0.0539827 -0.156529 -0.139662 0.0351365 -0.00432211 0.0498965 0.123915 0.0828089 0.0132403 -0.0429496 -0.0236469 0.0856065 0.101272 0.0902599 0.0949016 -0.0144288 0.034278 0.127105 -0.00271815 0.104673 -0.0982969 -0.18445 0.107326 0.173563 -0.0400301 0.0430178 -0.0891988 -0.0722162 0.121081 0.0493864 -0.0374468 0.0941809 0.0445351 -0.107049 -0.0296477 0.0600908 -0.0358118 0.11812 -0.175865 0.0438585 0.156204 0.0809366 -0.0445196 -0.0760863 -0.0131875 -0.0367353 0.0565534 -0.0171312 0.157324 0.0239592 0.030647 0.237239 0.0194466 -0.120034 -0.00640704 0.0390976 0.228783 -0.0374151 0.0852289 0.0116537 0.0298112 0.0206441 0.0107541 0.000641855 0.0126912 0.127449 -0.019532 -0.0331537 -0.0395441 -0.00513801 -0.103062 0.00600539 0.118701 0.0225071 0.070896 0.123954 -0.0514333 -0.0642253 0.0164447 -0.135094 0.0448356 0.0410478 0.0385545 -0.00787034 0.104137 0.0261559 0.0380157 -0.0492448 -0.0702245 -0.15381 0.0357398 0.164552 0.102958 -0.0582575 0.0843646 0.0926289 0.0697903 -0.0208216 -0.205915 0.0687373 -0.0325172 -0.00485327 0.0808294 0.0637345 0.128949 0.0630048 -0.0786527 -0.0674703 0.00311126 0.117496 -0.0884435 -0.128267 -0.132986 0.0139844 -0.00565481 -0.0813119 0.00224176 -0.0350018 -0.2004 0.146507 -0.0656449 0.0246399 
0.061232 -0.0391862 -0.108326 -0.0715547 0.0669125 0.12113 0.0543726 -0.128022 -0.169303 0.0324894 -0.0206311 0.0689367 0.13509 0.0371887 -0.00805817 -0.0692451 -0.0549424 0.0341422 0.104246 0.105427 0.0564051 0.000442076 0.000698093 0.087089 -0.0628492 0.172866 -0.0745608 -0.195391 0.0736597 0.136897 -0.08655 0.0577796 -0.113707 -0.0524851 0.119411 0.0194893 -0.0154189 0.112491 0.0694262 -0.0983136 -0.00330818 0.00513327 -0.0503818 0.102491 -0.170295 0.0507705 0.155413 0.081279 -0.0847129 -0.0587129 -0.0239468 -0.0601508 0.0637905 0.0295867 0.151278 0.00192625 0.0295242 0.215321 -0.0234196 -0.126449 0.0270252 0.0450776 0.243753 -0.0243346 0.07969 0.0197968 0.0523622 0.0295178 0.0381546 -0.0562712 -0.0258751 0.0839644 -0.0146674 0.00762138 -0.0228357 -0.00552203 -0.104174 -0.0187941 0.151459 0.0441597 0.070962 0.103022 -0.0424433 -0.0714445 0.00440426 -0.134645 0.0786747 0.0569994 0.0595916 -0.00296988 0.119735 0.0130463 0.0636708 -0.013548 -0.118546 -0.147413 0.0759886 0.128824 0.109643 -0.0659631 0.0893715 0.0964335 0.027561 0.00177431 -0.172073 0.0529478 -0.0343396 0.0364555 -0.00429419 0.0727327 0.147788 0.0702574 -0.0815609 -0.074654 -0.0157502 0.100292 -0.127241 -0.129755 -0.126711 -0.0199013 -0.00757952 -0.0983604 0.0464988 -0.0473663 -0.165088 0.123617 -0.0885236 -0.00107656 
0.04825 -0.0267526 -0.0940589 -0.0742611 0.0628113 0.125916 0.0307463 -0.160332 -0.156119 0.0477353 -0.00594765 0.0561534 0.126844 0.0398405 0.0110259 -0.0562682 -0.0544349 0.0428263 0.117952 0.10118 0.0483599 0.00464503 0.0104416 0.0668411 -0.068142 0.175151 -0.104581 -0.185916 0.0873971 0.133476 -0.0749741 0.0681859 -0.0794621 -0.0622355 0.13823 0.0372663 0.00201563 0.107542 0.107425 -0.105424 -0.0236711 -0.00229917 -0.0560482 0.0412774 -0.158697 0.0530173 0.145036 0.0961474 -0.0886235 -0.0693365 -0.0580328 -0.0333311 0.0941526 0.0372522 0.120965 0.00134619 0.0619774 0.175852 -0.0713694 -0.106813 0.0139976 0.0821873 0.243805 -0.0373123 0.0788196 0.0721865 0.0476138 0.037428 0.0147287 -0.0618684 -0.0262456 0.0613623 -0.0380935 0.0168253 0.00633007 -0.000859566 -0.115368 -0.0555275 0.162483 0.0330233 0.0727846 0.114568 -0.0446645 -0.0522376 0.0198117 -0.105951 0.0470729 0.0565913 0.0533076 0.0180904 0.139569 0.026728 0.0937347 0.0344316 -0.114771 -0.167661 0.047288 0.144764 0.10358 -0.059277 0.120784 0.0723156 0.00576709 -0.0288851 -0.134495 0.0864571 0.0159523 0.00974348 0.0223066 0.0890377 0.124995 0.0448751 -0.0477309 -0.0858601 -0.00804714 0.103869 -0.141544 -0.0977659 -0.121549 -0.0140827 0.00984493 -0.133955 0.048071 -0.0610585 -0.17594 0.155175 -0.069017 0.0118051 
0.0398601 -0.0208175 -0.0752145 -0.0453379 0.0743243 0.109746 0.0252938 -0.167751 -0.183216 0.0663414 -0.00766529 0.0580957 0.117149 0.0370458 0.01978 -0.0449913 -0.044229 0.0501716 0.141774 0.109948 0.0475844 -0.027311 0.018881 0.0585225 -0.0278011 0.173601 -0.121533 -0.174916 0.0934709 0.133355 -0.0728893 0.0656512 -0.0771355 -0.0671769 0.137148 0.0279524 -0.00975212 0.0964497 0.136072 -0.126184 -0.0245695 -0.00612353 -0.0261398 0.0232951 -0.156002 0.0428236 0.153759 0.0857408 -0.0830785 -0.0770807 -0.0467444 -0.0280688 0.0927297 0.0283505 0.124279 -0.00599751 0.0702612 0.163062 -0.0688732 -0.0966066 0.0217954 0.078461 0.230606 -0.0381234 0.0914119 0.0972416 0.0250893 0.0230649 -0.00130948 -0.0722859 -0.0286512 0.0889243 -0.040541 0.0226563 0.00807534 -0.0059971 -0.0915946 -0.0563596 0.171375 0.0493867 0.0543974 0.0985451 -0.0269327 -0.0339472 0.0205793 -0.116008 0.0352745 0.0706927 0.0741474 0.00198527 0.123122 0.0532419 0.102789 0.0516412 -0.116956 -0.181237 0.0510136 0.158762 0.0933575 -0.0689768 0.103872 0.0696379 0.00979469 -0.034429 -0.118658 0.0995048 0.0444935 0.0211989 0.0619169 0.0899059 0.106099 0.0395568 -0.0439389 -0.0744867 0.00243186 0.0903606 -0.129729 -0.0691296 -0.122673 -0.00740211 -0.00374274 -0.132489 0.0361175 -0.0796026 -0.183848 0.168816 -0.0515379 0.0167845 
0.0465618 -0.032963 -0.128791 -0.0350347 0.0629108 0.103499 0.00629351 -0.165285 -0.145196 0.036241 0.012198 0.0303428 0.13378 0.0790794 -0.00317821 -0.0175895 -0.0263706 0.0313267 0.137889 0.120443 0.0786965 -0.0578704 0.0478904 0.0597884 -0.0178879 0.157052 -0.104248 -0.200852 0.0946258 0.134847 -0.0389279 0.0624512 -0.0643465 -0.0859199 0.108033 0.0648021 -0.0311421 0.136699 0.103603 -0.116309 -0.0710818 0.0348022 -0.0690834 0.0492907 -0.128605 0.0383606 0.154592 0.0786685 -0.0655345 -0.0833193 -0.0828258 -0.0341611 0.09908 0.0112948 0.107185 -0.00209141 0.0689684 0.193458 -0.0329094 -0.124247 0.0115821 0.0697342 0.25972 -0.0480836 0.0813469 0.0920964 0.0405575 0.0535259 0.033888 -0.0622398 -0.0190103 0.09598 -0.0398163 -0.00309466 -0.00597501 -0.0252037 -0.089624 -0.0427211 0.132622 0.0515338 0.0483778 0.0989647 -0.0769241 -0.0836965 0.00674122 -0.0966157 0.0129724 0.0538961 0.0650357 -0.0406766 0.130121 0.0457617 0.0859398 0.0273527 -0.062791 -0.163594 0.0409986 0.165516 0.0955643 -0.0541235 0.0854899 0.0398357 0.0151547 -0.0385401 -0.157843 0.109405 0.0235343 -0.0030991 0.075406 0.0677283 0.0932753 0.0607179 -0.0428642 -0.0804101 0.0134235 0.112802 -0.133133 -0.0901402 -0.110147 -0.0121413 -0.0355039 -0.102635 0.0379975 -0.0437507 -0.198594 0.156074 -0.0630126 0.0249466 
0.0234443 -0.0531725 -0.125306 -0.0442021 0.0778682 0.109037 0.0018773 -0.146699 -0.188994 0.0469257 -0.0143759 0.073952 0.13163 0.0645549 0.0174623 -0.0422274 -0.0559325 0.0029276 0.155105 0.122563 0.0509864 -0.0633036 0.0670267 0.0854185 0.00567148 0.148834 -0.0641064 -0.191773 0.0589583 0.124372 -0.04138 0.000190603 -0.0755854 -0.087741 0.0761256 0.0477933 -0.0691507 0.0883758 0.0766096 -0.0759283 -0.0402587 0.0194827 -0.0507214 0.0841138 -0.167992 0.0175462 0.155517 0.0677663 -0.0369241 -0.0559783 -0.0301725 -0.0751739 0.0847403 -0.00355036 0.115905 0.000467347 0.0422139 0.228314 -0.0072893 -0.103144 -0.000877226 0.0677016 0.239009 -0.0340919 0.093878 0.0561346 0.0326221 0.0385361 0.0150157 -0.077751 -0.0200763 0.148767 -0.0268748 -0.00938066 0.0140959 0.0127667 -0.0944589 -0.050181 0.1403 0.107827 0.0440414 0.0344317 -0.0235686 -0.0394474 -0.02621 -0.112926 0.0499107 0.0624351 0.0616401 -0.0705848 0.0707776 0.0514099 0.0942851 0.0276936 -0.0997603 -0.168671 0.0404457 0.154383 0.0900364 -0.0667228 0.0563329 0.0484799 0.0272674 -0.0319592 -0.168674 0.0955224 -0.0160001 0.0230405 0.0375318 0.062251 0.11608 0.0679565 -0.0276238 -0.0687854 -0.027402 0.132974 -0.125655 -0.0371634 -0.122937 0.0294931 -0.0384875 -0.129429 -0.00228029 -0.0747215 -0.213765 0.170795 -0.112226 0.0438423 
0.0316357 -0.0269123 -0.134319 -0.0424753 0.0747647 0.120929 0.00467284 -0.153264 -0.186548 0.0569283 0.00585049 0.0622009 0.138227 0.0711603 0.00799097 -0.039303 -0.0345819 0.0352406 0.145924 0.117634 0.064385 -0.063642 0.0599117 0.097152 0.000882442 0.133227 -0.0715732 -0.190592 0.0827734 0.143154 -0.0449875 0.0116089 -0.0731586 -0.0908077 0.0773324 0.0514313 -0.0709924 0.0910036 0.0770708 -0.0734853 -0.0563358 0.0251859 -0.0603786 0.0831709 -0.165222 0.0224838 0.163444 0.0688064 -0.0576732 -0.0681699 -0.0270615 -0.0473782 0.0774353 -0.00767671 0.099918 0.0127303 0.0499811 0.228206 -0.00499645 -0.108193 -0.0058991 0.0745699 0.251626 -0.0489634 0.0882133 0.0551722 0.0372363 0.0362743 0.00160716 -0.0585464 -0.0103295 0.134459 -0.0333175 -0.0143147 0.00992548 0.00742805 -0.0925574 -0.0388967 0.132812 0.0823214 0.0359819 0.0573296 -0.0359301 -0.0504912 -0.0197586 -0.096434 0.0361853 0.041963 0.0584172 -0.0583982 0.0735695 0.03742 0.0869744 0.0274136 -0.0802453 -0.175408 0.035309 0.162113 0.0862897 -0.0609072 0.0680396 0.0598395 0.0278483 -0.0181409 -0.173087 0.108168 -0.00890553 0.0147567 0.0483113 0.0530562 0.114597 0.0649593 -0.0243085 -0.0678543 -0.0234331 0.12951 -0.13241 -0.0560702 -0.109843 0.0299537 -0.0393638 -0.141127 -0.00505661 -0.0708115 -0.207121 0.179171 -0.106465 0.0361627 
0.0518402 -0.0359138 -0.167258 -0.0465485 0.0760688 0.117731 0.0101252 -0.152263 -0.150285 0.040388 0.0192526 0.0547244 0.15552 0.10309 -0.0267743 -0.0193648 -0.0253332 0.0402326 0.123022 0.120487 0.0969542 -0.0749065 0.0572014 0.0696299 -0.01639 0.133027 -0.0808017 -0.195433 0.0811043 0.15881 -0.0496694 0.0476224 -0.0669828 -0.0899013 0.0669488 0.0649922 -0.0695614 0.124908 0.0738302 -0.0885556 -0.0814564 0.0493341 -0.0755751 0.0764349 -0.143094 0.0167951 0.149821 0.0633012 -0.0578901 -0.0766515 -0.0584065 -0.0423963 0.0701776 0.00725733 0.098488 0.0114291 0.0549417 0.22815 -0.017313 -0.119122 0.00230722 0.0633553 0.276242 -0.0563382 0.0810038 0.0622087 0.0352225 0.074703 0.0264257 -0.052468 0.00471261 0.12113 -0.0370796 -0.0296642 -0.016244 0.0097732 -0.0809301 -0.0480137 0.108722 0.0475804 0.0335057 0.077615 -0.0653259 -0.0703081 -0.0289184 -0.0780691 0.031107 0.0403446 0.0718185 -0.0619264 0.0900439 0.0127815 0.0711875 0.0230734 -0.0509481 -0.161214 0.0270474 0.158614 0.0912332 -0.0408501 0.0818429 0.0400505 0.0211099 -0.0157298 -0.182961 0.114605 -0.0243074 0.000514454 0.0402621 0.0384205 0.0959198 0.0600783 -0.0371038 -0.0647644 0.00204457 0.136157 -0.130386 -0.0700981 -0.100522 0.0143361 -0.0506441 -0.118956 0.0242191 -0.0477412 -0.198105 0.166616 -0.0986003 0.0335503 
0.00429708 -0.0151032 -0.143816 -0.0727093 0.0852478 0.0999459 0.0450967 -0.157327 -0.150787 0.0878086 -0.00703206 0.0669674 0.121155 0.0711479 0.0187674 -0.0551148 -0.0623606 0.0179778 0.152977 0.0966209 0.0139372 -0.0427739 0.0177798 0.0472659 -0.0243979 0.158269 -0.0829984 -0.158651 0.100856 0.145499 -0.0569511 0.0253785 -0.0571169 -0.10354 0.0942519 0.0436773 -0.0363026 0.0789706 0.0897354 -0.0866964 -0.0246927 0.0131347 -0.0402397 0.0777438 -0.17084 0.0382486 0.131945 0.0855865 -0.0401259 -0.0943014 -0.0772274 -0.0473582 0.0745975 -0.00656095 0.107402 0.0325585 0.0181044 0.233147 -0.0594746 -0.0682247 -0.0160045 0.0604943 0.270549 -0.0324236 0.0918889 0.100047 0.0181816 0.0295131 0.0077238 -0.0971105 -0.0109098 0.120417 -0.024691 0.00766434 0.0221806 0.0244245 -0.0846395 -0.0552982 0.138215 0.0175138 0.0578767 0.0724521 -0.0410516 -0.0139091 -0.00975355 -0.104736 0.0418888 0.0548303 0.0861493 -0.0304346 0.0973363 0.0345382 0.0889981 0.0230673 -0.0728072 -0.174661 0.0274462 0.122151 0.113042 -0.0434186 0.0695319 0.0389117 0.0379698 -0.0671604 -0.184 0.119248 0.00570864 -0.00172298 0.0364757 0.0865524 0.142752 0.0397742 -0.0233971 -0.0690228 -0.0270047 0.105335 -0.101511 -0.0383218 -0.101516 0.000244342 -0.00648141 -0.154822 0.0107573 -0.0590617 -0.219069 0.179884 -0.115498 0.026641 
0.0627946 -0.06865 -0.131161 -0.0608947 0.1156 0.104885 0.0338222 -0.110744 -0.136638 0.0332933 0.00947686 0.111881 0.133589 0.0798374 -0.0294834 -0.0354492 -0.0159613 0.0738574 0.0844648 0.125226 0.121811 -0.0434585 0.0717835 0.139488 -0.011901 0.113471 -0.0122904 -0.196232 0.083569 0.16037 -0.056427 -0.00202368 -0.0693027 -0.059219 0.0534876 0.0262814 -0.0842059 0.131247 0.0313995 -0.0785151 -0.0633809 0.0690694 -0.0840374 0.130068 -0.185203 -0.00641521 0.132004 0.0480727 -0.0408047 -0.045196 -0.00311286 -0.0546544 0.0229772 -0.0127382 0.131765 0.0169405 0.0329239 0.277263 -0.0247048 -0.109457 0.00189296 0.00254403 0.277391 -0.0341994 0.0955773 -0.0272269 0.000277859 0.0710653 0.0105893 0.00358361 0.0133762 0.141934 -0.0350569 -0.0536351 -0.0532065 0.0111892 -0.0725629 0.00856573 0.107176 0.0403626 0.00491687 0.0929739 -0.0342916 -0.0690834 -0.0199307 -0.148374 0.0742051 0.0756942 0.0691436 -0.0487314 0.0654038 -0.0085889 0.027592 0.0119002 -0.0337357 -0.158363 0.0186315 0.126616 0.0928365 -0.0534646 0.0667292 0.0460737 0.0140153 0.0118531 -0.187298 0.0682692 -0.0630569 -0.0241197 0.0579034 -0.00413763 0.119014 0.107574 -0.0475179 -0.0146106 0.0197591 0.133614 -0.1157 -0.101482 -0.117264 0.0550732 -0.045513 -0.0689698 -0.0206951 -0.0446662 -0.179566 0.157415 -0.0957185 0.00545569 
0.0883528 -0.0739601 -0.149927 -0.076565 0.140109 0.129638 0.0595386 -0.0831037 -0.122517 0.0232642 -0.0131534 0.135835 0.129991 0.0329999 -0.0869522 -0.0474301 -0.0296472 0.0974794 0.0234078 0.119153 0.130688 -0.021907 0.0481161 0.125754 -0.0535356 0.0987396 -0.0171676 -0.190923 0.0564911 0.151134 -0.0862562 0.00681061 -0.114592 -0.0438552 0.0467313 -0.00644299 -0.104069 0.0998058 0.013346 -0.0686885 -0.0418558 0.0740613 -0.0967223 0.149674 -0.186674 -0.00384902 0.11287 0.0568104 -0.0473253 -0.017986 0.0226347 -0.0543828 -0.0136989 -0.00647394 0.118552 -0.00310183 0.0347468 0.265446 -0.0239378 -0.103821 0.0321757 0.00659348 0.276994 -0.0159599 0.0721895 -0.108507 -0.00375129 0.0949034 0.0252051 0.0137661 0.0345185 0.138153 -0.00756257 -0.0553111 -0.105559 0.0397778 -0.0797997 0.0175914 0.0897901 0.0230807 0.00638115 0.108378 -0.0225134 -0.0455833 -0.0365209 -0.13173 0.110098 0.0837243 0.0648207 -0.0474425 0.0536067 -0.0283568 0.000295841 0.000883106 -0.0420784 -0.145243 0.0300331 0.0916897 0.0673554 -0.044014 0.0863256 0.0604165 0.00108539 0.0484276 -0.170948 0.0277543 -0.100177 0.00446694 -0.000848137 0.0216058 0.142414 0.0945243 -0.0565128 0.00481172 0.000264945 0.133206 -0.131634 -0.0986792 -0.119439 0.0407681 -0.0596008 -0.0447646 -0.00595111 -0.0489818 -0.155942 0.121427 -0.133077 -0.0232231 
0.0617727 -0.0643206 -0.140135 -0.0896232 0.133062 0.136902 0.0571751 -0.0854434 -0.0986716 0.0326217 -0.00897416 0.12935 0.121629 0.0213713 -0.0623575 -0.051906 -0.0510855 0.0822854 0.0311398 0.110067 0.111593 -0.0105903 0.0405904 0.123269 -0.0566501 0.113341 -0.0227788 -0.197421 0.0690728 0.133348 -0.050368 -0.0120359 -0.106604 -0.0573811 0.0646773 0.0141933 -0.088936 0.100282 0.0187356 -0.0536513 -0.0277328 0.0756167 -0.107143 0.157463 -0.1904 -0.0158195 0.116721 0.0625013 -0.0393709 -0.0279427 -0.0123274 -0.0720308 -0.0135687 -0.01523 0.112681 0.0140634 0.0102093 0.281427 -0.0428177 -0.101267 0.00741808 0.00228556 0.294584 -0.0271184 0.0873281 -0.089966 0.0147908 0.0808838 0.0269311 0.00637534 0.0376636 0.148163 -0.00476123 -0.0404481 -0.0861998 0.0276416 -0.103575 0.0252421 0.0953561 0.00968876 0.012825 0.124287 -0.0287595 -0.0393824 -0.0325069 -0.137786 0.112146 0.0882625 0.0659456 -0.0516409 0.0708944 -0.0238198 0.0107174 -0.00718886 -0.0288696 -0.151038 0.0254772 0.0837869 0.0644572 -0.0331587 0.0633481 0.0375035 -0.00276227 0.0112127 -0.182353 0.0478341 -0.0837718 -0.0226113 0.00517341 0.0390017 0.144888 0.0954368 -0.0482976 -0.00414114 0.00219306 0.12735 -0.129924 -0.104261 -0.123695 0.0303575 -0.0375935 -0.0521207 -0.0055883 -0.0356367 -0.172364 0.126056 -0.139766 -0.0113052 
0.0658748 -0.0710963 -0.12729 -0.0933351 0.12521 0.153589 0.0797226 -0.0630847 -0.121076 0.0380409 -0.0117708 0.133616 0.119243 0.0155291 -0.0565947 -0.0746637 -0.0668964 0.083557 0.0403903 0.0887011 0.110411 -0.0156711 0.0395847 0.111165 -0.0603585 0.106422 -0.0279539 -0.191915 0.0717823 0.123416 -0.0607147 -0.0268149 -0.121103 -0.0584749 0.0601424 -0.00516068 -0.112301 0.0882702 0.020475 -0.0479392 -0.0208817 0.0683926 -0.120488 0.155061 -0.206853 -0.0266652 0.0968497 0.0499139 -0.0466567 -0.0288033 -0.00594674 -0.0554477 -0.0193157 -0.0120384 0.099748 0.0139999 0.0194992 0.291852 -0.0583673 -0.0814575 0.0086293 0.0127375 0.299182 -0.0247108 0.0957657 -0.0869472 0.0115032 0.0729309 0.0105765 0.0176603 0.0376921 0.154478 -0.00570164 -0.0275862 -0.0902498 0.032024 -0.0967565 -0.00279541 0.102001 0.0175462 -0.00972734 0.0880346 -0.00763461 -0.0282172 -0.0385008 -0.149837 0.12738 0.0844465 0.0685109 -0.0543171 0.0697337 -0.0248014 0.0172952 -0.000494635 -0.0350679 -0.162744 0.0333364 0.0808487 0.0590007 -0.0149828 0.0662741 0.0589633 -0.00994729 0.0105406 -0.168195 0.0494679 -0.0712122 -0.0114592 0.00585642 0.0239892 0.150231 0.0875468 -0.0391739 -0.0138581 0.0162622 0.140818 -0.111059 -0.0791801 -0.101301 0.0465028 -0.0403796 -0.0882495 -0.0179556 -0.0554451 -0.156861 0.137174 -0.130651 -0.000865508 
-0.0178056 -0.0117267 -0.12252 -0.113697 0.0798322 0.0915783 0.0184081 -0.178229 -0.104709 0.0477448 -0.0209957 0.0734531 0.0922918 0.0604124 0.0409154 -0.0631705 -0.0699018 -0.0330606 0.136983 0.0830899 -0.0359246 0.0360492 -0.0169674 0.0305966 -0.0657978 0.184431 -0.0637585 -0.14143 0.057827 0.113161 -0.0412969 -0.00649898 -0.0470548 -0.104702 0.117272 0.0804615 0.0214754 0.0603129 0.100765 -0.0297982 -0.00494328 0.0396079 -0.0577966 0.0372606 -0.134114 0.104413 0.125867 0.082701 -0.0452704 -0.0856534 -0.120229 -0.0877976 0.0849528 0.0110607 0.0994131 0.03794 -0.0236428 0.234167 -0.115049 -0.0207883 -0.0133044 0.0791455 0.254855 -0.0396193 0.0900057 0.0749339 0.0459196 0.0632266 0.0377979 -0.121964 0.0234436 0.0816206 -0.0227264 0.00232093 0.0540629 0.0632119 -0.133377 -0.0484047 0.137025 -0.00954168 0.0805916 0.116907 -0.0561789 0.00165066 -0.0257854 -0.0827013 0.0559221 0.0368311 0.0226512 -0.0180498 0.110453 0.0129262 0.119663 0.0428972 -0.0722474 -0.143861 0.0301656 0.0475823 0.113162 -0.0311402 0.0314406 0.0092899 -0.00882992 -0.0954524 -0.183577 0.122506 -0.00643426 -0.0397758 -0.0499884 0.126067 0.168518 -0.00551134 -0.011459 -0.0628901 -0.0638524 0.101392 -0.151253 -0.0524798 -0.143528 -0.0323407 0.0171155 -0.122625 0.0174396 -0.0309468 -0.188506 0.168568 -0.149578 -0.00452672 
-0.0194204 -0.013542 -0.134099 -0.128032 0.0917621 0.0845532 0.00775822 -0.176469 -0.10434 0.0301239 -0.0266117 0.0815694 0.0988071 0.0671258 0.0331538 -0.0518997 -0.0711048 -0.0476055 0.126927 0.0929395 -0.023324 0.0359432 -7.16386e-05 0.0317605 -0.0598978 0.184698 -0.0425155 -0.143447 0.0554071 0.117622 -0.0375534 -0.0144261 -0.0405245 -0.0966758 0.103869 0.0808553 0.0190852 0.0725472 0.0963525 -0.0209641 -0.0124771 0.0431379 -0.046733 0.0546278 -0.130911 0.108022 0.135337 0.0796218 -0.046036 -0.0702742 -0.123155 -0.105171 0.072482 0.011431 0.102239 0.0343472 -0.0298426 0.251068 -0.115031 -0.023578 -0.010195 0.068659 0.262937 -0.035919 0.0914924 0.0547729 0.0339093 0.0774143 0.0437469 -0.12157 0.0217251 0.0880372 -0.0275272 -0.00737492 0.0540315 0.0674557 -0.128647 -0.040635 0.129328 0.000619173 0.0798438 0.113679 -0.0572893 0.00463128 -0.043035 -0.0839591 0.0581542 0.0404297 0.0231032 -0.0257832 0.104905 -0.0001315 0.106565 0.0418796 -0.0618854 -0.133761 0.0214689 0.0545708 0.113009 -0.0372491 0.0135975 -0.00630143 -0.0149073 -0.0781009 -0.194556 0.116378 -0.033254 -0.0254268 -0.0552715 0.109935 0.169548 0.00461287 -0.0216912 -0.0435263 -0.069297 0.108706 -0.153981 -0.0537478 -0.144172 -0.0140003 0.0126405 -0.0967891 0.0146803 -0.0190488 -0.201635 0.155082 -0.164601 -0.010708 
-0.00479394 -0.0316785 -0.136615 -0.114741 0.0966247 0.0800435 0.0225152 -0.16816 -0.111422 0.0507947 -0.0227716 0.0709106 0.110679 0.0741834 0.0524948 -0.0312806 -0.0651789 -0.0276644 0.14069 0.0851954 -0.00745796 0.0309149 0.0119032 -0.00146221 -0.0565156 0.195295 -0.0755437 -0.167701 0.0687912 0.125701 -0.0337835 0.0207413 -0.0330308 -0.104079 0.117588 0.0722396 0.0139851 0.0916842 0.113793 -0.0464906 -0.0244652 0.0533476 -0.0553377 0.0558606 -0.144786 0.088668 0.122028 0.0743905 -0.0338289 -0.0910508 -0.125741 -0.102319 0.0774205 0.0119564 0.0893635 0.022351 1.94324e-05 0.232098 -0.11068 -0.0237267 -0.0135895 0.0472062 0.255257 -0.0329145 0.101878 0.0690957 0.0318193 0.0832599 0.056456 -0.133253 0.0244279 0.10437 -0.0272571 -0.011458 0.0263305 0.0484193 -0.135984 -0.063108 0.124845 0.00729099 0.0881078 0.107716 -0.0599764 0.000394752 -0.028017 -0.0953328 0.0575409 0.0427304 0.0347322 -0.0409195 0.107059 0.0281616 0.0895173 0.035032 -0.0633836 -0.140905 0.0240415 0.0782221 0.0988365 -0.0278107 0.0262337 -0.00940667 0.00426419 -0.0919511 -0.193302 0.107999 -0.0101508 -0.0294927 -0.00508621 0.116949 0.149378 -0.00201653 -0.0321625 -0.0639336 -0.0404567 0.108075 -0.136311 -0.0571242 -0.147257 -0.0259748 0.015295 -0.103216 0.0286531 -0.0191942 -0.198966 0.144719 -0.138517 0.0119183 
0.0389278 -0.0609912 -0.147806 -0.0854496 0.0940857 0.0935211 0.0630232 -0.13461 -0.145798 0.0445944 -0.0191136 0.0932235 0.142549 0.0830395 -0.00461629 -0.0583879 -0.0712044 0.0205142 0.10759 0.106909 0.056063 -0.0331509 0.0480214 0.0418157 -0.0471692 0.159935 -0.0640028 -0.185536 0.0711629 0.155245 -0.0729263 0.0447391 -0.0678385 -0.0820636 0.0823266 0.0134447 -0.0506119 0.143359 0.069936 -0.0837908 -0.0398041 0.0357669 -0.0697502 0.102807 -0.192647 0.0175699 0.113352 0.0616485 -0.0303888 -0.0589282 -0.0621096 -0.0651918 0.0571034 0.0227795 0.115329 0.00213722 0.0327909 0.256317 -0.0690101 -0.0842596 -0.000674251 0.0248101 0.278657 -0.0226157 0.0978024 0.0454358 0.021465 0.0646346 0.0231783 -0.0830576 -0.0012452 0.121673 -0.0148713 -0.00281926 -0.0235998 0.0229393 -0.0898959 -0.0838173 0.127078 0.0426572 0.050495 0.0602804 -0.044979 -0.0426261 -0.0228588 -0.139118 0.0704955 0.0654813 0.0840906 -0.0485857 0.093391 0.00151606 0.0677777 0.004796 -0.0769933 -0.168375 0.0343762 0.121564 0.119165 -0.0331954 0.0687975 0.0406585 0.0282994 -0.019248 -0.184189 0.0756019 -0.0367628 0.0178052 0.0334881 0.0478655 0.139841 0.0706654 -0.056295 -0.0474939 -0.00730805 0.13139 -0.101951 -0.0549945 -0.1054 0.0196426 -0.0238224 -0.113692 0.0161851 -0.0475214 -0.188691 0.143664 -0.115238 0.0172435 
0.0569409 -0.0774957 -0.154091 -0.0915803 0.103327 0.11318 0.0424683 -0.122948 -0.157972 0.0124246 -0.0313154 0.100837 0.14626 0.0581352 -0.0205755 -0.043772 -0.075603 0.0209455 0.083061 0.123751 0.0800572 -0.0301632 0.0646375 0.0583032 -0.0498658 0.151307 -0.0496464 -0.203352 0.042597 0.145766 -0.0795307 0.0430423 -0.0812184 -0.0541416 0.0769365 0.0142069 -0.0518731 0.129701 0.0610708 -0.0893391 -0.0352034 0.0253064 -0.0518965 0.111943 -0.184515 0.0191766 0.135927 0.0678293 -0.0560674 -0.0222595 -0.0493894 -0.1004 0.0556579 0.0333536 0.124122 -0.0120364 0.0375988 0.249317 -0.0549992 -0.110233 0.0159767 0.0433619 0.275863 -0.0250774 0.0874487 0.0222819 0.00838873 0.0782008 0.0288443 -0.0769125 -0.0159894 0.114088 -0.0199864 -0.0186871 -0.0311994 0.0265092 -0.0881381 -0.0746113 0.128617 0.0615449 0.056366 0.0658814 -0.05081 -0.0558224 -0.0436053 -0.115147 0.0716928 0.0710847 0.0727672 -0.0339637 0.104906 -0.00921681 0.043502 0.0103831 -0.0884633 -0.136449 0.0303887 0.135272 0.104342 -0.0456938 0.0740421 0.0284615 0.0154162 0.00483001 -0.175533 0.0613674 -0.0717713 0.0406581 -0.00681301 0.0414061 0.140018 0.0867754 -0.0584174 -0.042823 -0.0130885 0.134758 -0.122748 -0.062426 -0.109247 0.030738 -0.024022 -0.0938816 0.0345212 -0.0418776 -0.186253 0.123365 -0.120231 -0.00140397 
0.0399483 -0.0788586 -0.15075 -0.0953743 0.112995 0.104239 0.055165 -0.132159 -0.146249 0.0223069 -0.0322489 0.10494 0.132292 0.0616685 -0.00936778 -0.0513648 -0.10019 0.011444 0.0902285 0.111336 0.0565395 -0.0197706 0.0597879 0.0424241 -0.0494715 0.155315 -0.0525427 -0.185007 0.052914 0.142753 -0.0725107 0.0318304 -0.0800749 -0.0703892 0.0810438 0.0172271 -0.0575891 0.111836 0.064008 -0.0799495 -0.0228844 0.0298024 -0.0556379 0.114133 -0.194811 0.0161579 0.116247 0.0771879 -0.0271319 -0.0289561 -0.0674577 -0.0946637 0.0507579 0.0250621 0.120525 -0.00716231 0.0260905 0.260271 -0.0714543 -0.0776951 0.00441407 0.0407383 0.283622 -0.0080812 0.0888738 0.0333652 0.00522971 0.0700539 0.0295941 -0.0824574 -0.00985693 0.131852 -0.00764918 0.000678379 -0.0264333 0.0269151 -0.0895907 -0.0871947 0.122855 0.0488647 0.0748108 0.0582718 -0.0448973 -0.0349243 -0.0422812 -0.12379 0.0734521 0.0760044 0.0725865 -0.0388319 0.112465 0.00298581 0.0464867 0.00473075 -0.0834511 -0.145093 0.0190069 0.120289 0.116289 -0.0363089 0.0668625 0.0200682 0.0255148 -0.027315 -0.17762 0.070886 -0.0579731 0.0318969 0.00717284 0.0607059 0.153107 0.07796 -0.0485737 -0.0418434 -0.018797 0.134803 -0.095061 -0.0346022 -0.107856 0.0271585 -0.0138766 -0.106235 0.0284074 -0.0469985 -0.208556 0.132865 -0.127068 0.0132425 
0.014042 -0.0211447 -0.168408 -0.0711648 0.0831012 0.0998491 0.0666833 -0.14833 -0.137842 0.0721243 -0.00887792 0.070891 0.113055 0.102336 0.069204 -0.0637114 -0.0411594 -0.0187275 0.185807 0.0679025 -0.0116208 -0.00525832 0.0257702 -0.0248399 -0.029411 0.154832 -0.0858971 -0.175967 0.0737211 0.153405 -0.0424258 0.0412772 -0.0232296 -0.12457 0.113072 0.0590144 -0.00342371 0.0961768 0.0917441 -0.0665178 -0.0223305 0.0460594 -0.0553067 0.073058 -0.203063 0.0860257 0.118755 0.0427139 -0.0381334 -0.113052 -0.0938709 -0.0513348 0.0810681 0.00328134 0.0971366 0.0389656 0.00727865 0.238173 -0.0886758 -0.0109474 -0.0462246 0.0257546 0.264708 -0.0841106 0.149072 0.0843406 0.0280924 0.0515645 0.0151109 -0.100483 0.0348821 0.123035 -0.033908 -0.0139191 0.00936047 0.0566364 -0.104405 -0.0894602 0.105583 0.00432331 0.0378409 0.0532752 -0.0594332 -0.00680125 -0.0164087 -0.111737 0.04724 0.00862016 0.0484244 -0.0429282 0.083336 0.0147676 0.0650698 0.00511174 -0.0429158 -0.169116 0.0567176 0.0988491 0.105302 -0.0106517 0.0225858 0.0378464 0.0488391 -0.0941066 -0.223522 0.114629 0.0125462 -0.0121001 0.0266185 0.0904498 0.13409 -0.0114322 -0.0300309 -0.0943634 -0.0133885 0.0982608 -0.0822519 -0.0661093 -0.0879028 0.00951364 0.0155558 -0.153398 0.0207659 -0.0193112 -0.14566 0.146052 -0.0805856 0.0431343 
