{
  "descriptor": [
    -0.06932225078344345,
    0.07496420294046402,
    0.10713408887386322,
    -0.02763434872031212,
    -0.14640919864177704,
    0.030986998230218887,
    -0.07030855119228363,
    -0.041344162076711655,
    0.1206817775964737,
    -0.1525907814502716,
    0.14422334730625153,
    -0.028911292552947998,
    -0.2482149749994278,
    0.1066984087228775,
    -0.020724233239889145,
    0.16545826196670532,
    -0.1616828739643097,
    -0.1778569221496582,
    -0.08095669001340866,
    -0.04169776290655136,
    0.0031411568634212017,
    0.07745040953159332,
    0.025765089318156242,
    0.07665976881980896,
    -0.15715327858924866,
    -0.3782227337360382,
    -0.07652585208415985,
    -0.045152392238378525,
    0.07353238761425018,
    -0.08314386755228043,
    -0.08095315098762512,
    0.03861624374985695,
    -0.12945441901683807,
    0.06613370776176453,
    0.07988563925027847,
    0.09675408154726028,
    -0.08355751633644104,
    -0.1636919528245926,
    0.2538689374923706,
    0.09854808449745178,
    -0.28583699464797974,
    0.029654182493686676,
    0.05636129528284073,
    0.24506494402885437,
    0.21798595786094666,
    0.02052188664674759,
    0.06106841564178467,
    -0.08363451808691025,
    0.15914587676525116,
    -0.2955719828605652,
    0.0691615492105484,
    0.2263537049293518,
    0.02385168895125389,
    0.07555258274078369,
    0.07507100701332092,
    -0.18310321867465973,
    -0.020425233989953995,
    0.14253762364387512,
    -0.13495942950248718,
    0.04641503840684891,
    0.061870019882917404,
    -0.03465672954916954,
    0.007709076162427664,
    -0.0591781847178936,
    0.1662859320640564,
    0.11430759727954865,
    -0.1286872774362564,
    -0.13010232150554657,
    0.23985958099365234,
    -0.1730329394340515,
    -0.053858865052461624,
    0.07795734703540802,
    -0.14543455839157104,
    -0.19770534336566925,
    -0.183944433927536,
    0.043813809752464294,
    0.3960450291633606,
    0.1580917090177536,
    -0.08913680911064148,
    0.05465080961585045,
    0.018494661897420883,
    -0.01509097684174776,
    0.022425534203648567,
    0.17745979130268097,
    -0.10655874758958817,
    -0.004727036226540804,
    -0.03115791082382202,
    0.06393055617809296,
    0.24710719287395477,
    0.0241302028298378,
    0.005775996018201113,
    0.232648566365242,
    0.022935329005122185,
    0.014823425561189651,
    0.08722350746393204,
    0.09040936082601547,
    -0.13100530207157135,
    -0.07784441113471985,
    -0.1861586719751358,
    -0.04650812968611717,
    0.007380335591733456,
    -0.058090027421712875,
    -0.012106092646718025,
    0.1563650518655777,
    -0.18950285017490387,
    0.1544276773929596,
    -0.07035008072853088,
    -0.07288513332605362,
    -0.01240268163383007,
    0.025433475151658058,
    -0.08413298428058624,
    -0.011210481636226177,
    0.12747956812381744,
    -0.21601027250289917,
    0.13326884806156158,
    0.1787380576133728,
    0.05626323074102402,
    0.11666593700647354,
    0.11524531245231628,
    0.04489511996507645,
    0.04976798966526985,
    -0.051519881933927536,
    -0.18389998376369476,
    -0.10678092390298843,
    0.05613529309630394,
    -0.022000791504979134,
    -0.005973562132567167,
    -0.0008622510940767825
  ]
}