{
  "descriptor": [
    -0.08468908816576004,
    0.007855718024075031,
    0.0737135112285614,
    -0.08771003037691116,
    -0.16885697841644287,
    0.05211220681667328,
    -0.06341829895973206,
    -0.034899696707725525,
    0.19919651746749878,
    -0.16965998709201813,
    0.19536009430885315,
    -0.03783073648810387,
    -0.2501240372657776,
    0.06832864880561829,
    -0.04895821586251259,
    0.15349282324314117,
    -0.13092315196990967,
    -0.18435047566890717,
    -0.03131137788295746,
    -0.0588892437517643,
    -0.015858128666877747,
    0.09773004055023193,
    0.0288271252065897,
    0.09642327576875687,
    -0.13833913207054138,
    -0.39839625358581543,
    -0.07146244496107101,
    -0.09316933155059814,
    0.047777481377124786,
    -0.08627523481845856,
    -0.0768449679017067,
    0.1043262705206871,
    -0.16314589977264404,
    -0.003170296549797058,
    0.09714093059301376,
    0.09976907819509506,
    -0.05546695366501808,
    -0.14915163815021515,
    0.24146831035614014,
    0.0779174342751503,
    -0.25379708409309387,
    -0.01957571879029274,
    0.0737413838505745,
    0.2266356348991394,
    0.12084609270095825,
    0.032150644809007645,
    0.027884341776371002,
    -0.0975431352853775,
    0.1552448570728302,
    -0.27221816778182983,
    0.027721339836716652,
    0.20767873525619507,
    0.03918544575572014,
    0.04525736719369888,
    0.07567078620195389,
    -0.15227124094963074,
    0.032740913331508636,
    0.0842125341296196,
    -0.15740735828876495,
    0.006164979189634323,
    0.05994005501270294,
    -0.026491504162549973,
    -0.0004848864336963743,
    -0.10026136785745621,
    0.2063409686088562,
    0.11225993931293488,
    -0.09158801287412643,
    -0.11409840732812881,
    0.23412539064884186,
    -0.15118803083896637,
    -0.07439527660608292,
    0.07992121577262878,
    -0.12313737720251083,
    -0.17129486799240112,
    -0.14186076819896698,
    -0.000032089454180095345,
    0.3862980008125305,
    0.1595628559589386,
    -0.08334620296955109,
    0.09199845790863037,
    0.0025953026488423347,
    -0.04714510217308998,
    -0.016253843903541565,
    0.14007198810577393,
    -0.11048318445682526,
    0.051113031804561615,
    -0.0016845598584041,
    0.05274132639169693,
    0.24200181663036346,
    0.04430869221687317,
    0.043465811759233475,
    0.2183922529220581,
    0.01138374675065279,
    0.06332442909479141,
    0.12446087598800659,
    0.06677422672510147,
    -0.1292845457792282,
    -0.05948655307292938,
    -0.18023835122585297,
    -0.005792201030999422,
    -0.008307659067213535,
    -0.04373517259955406,
    0.011210025288164616,
    0.12329728901386261,
    -0.22324399650096893,
    0.1582857370376587,
    -0.08762067556381226,
    -0.11241993308067322,
    -0.016961559653282166,
    0.024307312443852425,
    -0.02643740177154541,
    0.006733122747391462,
    0.11361151188611984,
    -0.22680367529392242,
    0.13084201514720917,
    0.11669538915157318,
    0.07860708236694336,
    0.16806861758232117,
    0.08290094882249832,
    0.031072670593857765,
    0.004529526457190514,
    -0.07630467414855957,
    -0.2035352736711502,
    -0.14681778848171234,
    0.07189586013555527,
    -0.07894162088632584,
    0.019829386845231056,
    -0.007210914045572281
  ]
}