{
  "descriptor": [
    -0.08488365262746811,
    0.06467816978693008,
    0.09042563289403915,
    -0.06385453045368195,
    -0.16909627616405487,
    0.04505457356572151,
    -0.08587814122438431,
    -0.04167332500219345,
    0.18293559551239014,
    -0.1454811543226242,
    0.17749960720539093,
    -0.0390581376850605,
    -0.24840094149112701,
    0.12151369452476501,
    -0.04596881940960884,
    0.17659905552864075,
    -0.12501218914985657,
    -0.2106664627790451,
    -0.04118373617529869,
    -0.09205188602209091,
    -0.005185423884540796,
    0.10794804990291595,
    -0.007995455525815487,
    0.08784732967615128,
    -0.150881826877594,
    -0.3936294913291931,
    -0.08280911296606064,
    -0.10489960759878159,
    0.07668851315975189,
    -0.1253061145544052,
    -0.0684577226638794,
    0.08622707426548004,
    -0.16388261318206787,
    0.02069951593875885,
    0.09623835235834122,
    0.05083728954195976,
    -0.04127400740981102,
    -0.13802000880241394,
    0.24639807641506195,
    0.09462163597345352,
    -0.25941917300224304,
    -0.02216287888586521,
    0.10815063118934631,
    0.23774129152297974,
    0.14612726867198944,
    0.016233406960964203,
    0.05013006180524826,
    -0.08977138251066208,
    0.14878492057323456,
    -0.2455623596906662,
    0.0454968586564064,
    0.19366726279258728,
    0.06856571137905121,
    0.10447826236486435,
    0.04720674455165863,
    -0.1477472186088562,
    0.006750074680894613,
    0.08791019767522812,
    -0.17283427715301514,
    0.07615296542644501,
    0.08071690797805786,
    -0.0508691743016243,
    -0.03568005561828613,
    -0.049466993659734726,
    0.21048486232757568,
    0.09652362763881683,
    -0.08788083493709564,
    -0.15172220766544342,
    0.25284436345100403,
    -0.17255599796772003,
    -0.08892494440078735,
    0.10212123394012451,
    -0.1306966245174408,
    -0.15431636571884155,
    -0.17735378444194794,
    0.01922120526432991,
    0.3907444477081299,
    0.12150696665048599,
    -0.09872844070196152,
    0.0729345977306366,
    0.020042745396494865,
    -0.06392696499824524,
    -0.036054208874702454,
    0.15039843320846558,
    -0.11327916383743286,
    0.01871502213180065,
    0.005586734041571617,
    0.0673910528421402,
    0.29872849583625793,
    0.04089081287384033,
    0.03630585968494415,
    0.23463279008865356,
    0.016223957762122154,
    0.05118447542190552,
    0.09459558874368668,
    0.1337951123714447,
    -0.12630030512809753,
    -0.11434832215309143,
    -0.1598571538925171,
    -0.05510717257857323,
    -0.02147703617811203,
    -0.021785035729408264,
    -0.02416265569627285,
    0.16337738931179047,
    -0.22102169692516327,
    0.1678410768508911,
    -0.08250923454761505,
    -0.10036309063434601,
    -0.04684699699282646,
    0.0643886849284172,
    -0.02168748714029789,
    -0.04487159475684166,
    0.12790420651435852,
    -0.1884213089942932,
    0.1131649911403656,
    0.1507185697555542,
    0.08350525051355362,
    0.10608796030282974,
    0.046500612050294876,
    0.02124689891934395,
    0.0303927194327116,
    -0.08061999082565308,
    -0.1970289945602417,
    -0.13400164246559143,
    0.07263181358575821,
    -0.07348513603210449,
    -0.03778965398669243,
    0.002387162297964096
  ]
}