{
  "descriptor": [
    -0.10761988908052444,
    0.023174332454800606,
    0.029180431738495827,
    -0.057892635464668274,
    -0.10898540914058685,
    -0.02857220731675625,
    0.07040007412433624,
    -0.050292305648326874,
    0.15346555411815643,
    -0.11141271144151688,
    0.24438942968845367,
    -0.04705946519970894,
    -0.2327178418636322,
    -0.09653934836387634,
    -0.0345427542924881,
    0.10676250606775284,
    -0.1081702932715416,
    -0.16033095121383667,
    -0.0906829833984375,
    -0.05550685524940491,
    0.083069808781147,
    0.003552985144779086,
    -0.06678339093923569,
    0.017085621133446693,
    -0.19014857709407806,
    -0.2792236804962158,
    -0.023790249601006508,
    -0.14054334163665771,
    0.01735447533428669,
    -0.12484049797058105,
    0.014630218967795372,
    0.07005871832370758,
    -0.10797625035047531,
    -0.06585583835840225,
    0.0008611087687313557,
    0.0781092643737793,
    -0.0638006404042244,
    -0.04393528029322624,
    0.21301206946372986,
    0.03211956471204758,
    -0.23872625827789307,
    0.009096031077206135,
    0.010546877048909664,
    0.3169362246990204,
    0.17744123935699463,
    -0.0027709209825843573,
    0.02880265563726425,
    -0.018774427473545074,
    0.15706805884838104,
    -0.31255224347114563,
    0.029640957713127136,
    0.129569411277771,
    0.14259740710258484,
    0.027990790084004402,
    0.17555294930934906,
    -0.10553395003080368,
    -0.004039132036268711,
    0.13647392392158508,
    -0.2019188553094864,
    0.061281975358724594,
    0.04040324315428734,
    -0.009428947232663631,
    -0.008417966775596142,
    -0.1069929376244545,
    0.15543697774410248,
    0.04404914751648903,
    -0.10664873570203781,
    -0.038450513035058975,
    0.19879238307476044,
    -0.1519891321659088,
    -0.09802737087011337,
    0.07643540948629379,
    -0.10538730025291443,
    -0.2189117670059204,
    -0.21059241890907288,
    0.07144545763731003,
    0.3952953517436981,
    0.1918979287147522,
    -0.14411063492298126,
    0.05151817202568054,
    0.014612186700105667,
    -0.01454140804708004,
    0.10249819606542587,
    0.03099294751882553,
    -0.05065608397126198,
    0.03849819302558899,
    -0.038900766521692276,
    0.007731152232736349,
    0.17165036499500275,
    -0.008006456308066845,
    -0.00818302109837532,
    0.20450374484062195,
    -0.022174207493662834,
    -0.033868029713630676,
    0.05583377182483673,
    -0.03935280442237854,
    -0.06114499270915985,
    0.03341153264045715,
    -0.09959734231233597,
    -0.0009385363082401454,
    0.09320984780788422,
    -0.14664338529109955,
    0.049277856945991516,
    0.07091335952281952,
    -0.17846684157848358,
    0.13635320961475372,
    -0.05665536969900131,
    0.02186012640595436,
    -0.03044261410832405,
    -0.006086788140237331,
    -0.0827236995100975,
    0.07213380932807922,
    0.1461099237203598,
    -0.24154509603977203,
    0.18616080284118652,
    0.16100847721099854,
    -0.013342772610485554,
    0.09162759780883789,
    0.08820442110300064,
    -0.0520901121199131,
    0.03280872106552124,
    -0.01675315387547016,
    -0.18397797644138336,
    -0.10379374027252197,
    0.07366317510604858,
    -0.06554437428712845,
    0.061533838510513306,
    -0.005986417643725872
  ]
}