0.0211063 0.0517841 -0.157725 0.00140756 0.0797627 0.228825 0.0251878 -0.15465 -0.106536 0.103917 0.00288383 0.0553344 0.0933364 0.0154671 -0.0405675 -0.0732472 0.0389092 0.175651 0.121928 0.0117069 0.0775292 -0.0352406 -0.06256 0.170455 0.00628315 0.010824 -0.118743 -0.165417 0.0706499 0.199829 0.0194549 0.0885514 -0.121007 -0.0563346 0.092261 0.0790994 -0.0770175 -0.131897 0.0329639 -0.059421 0.00898952 -0.0354458 -0.0236668 0.0844527 -0.101639 0.00174279 0.142351 0.0978644 -0.0779106 -0.10334 0.0916016 0.0262863 0.0762802 -0.0808345 0.0665114 0.110454 0.0291418 0.148657 0.0696167 -0.0572671 -0.0105159 0.123366 0.162662 -0.145921 0.0616846 -0.080595 0.0552225 -0.0580876 -0.0807774 0.0789894 0.00472834 0.0938235 -0.0796043 -0.0706095 -0.0876127 0.0550204 -0.0503788 0.0654821 0.0454924 -0.0183564 -0.021361 0.144697 -0.0129719 0.0287779 -0.00968656 -0.0265995 0.0402694 -0.0748316 0.0101168 0.00973072 0.00309686 0.0219306 0.0512878 -0.00957643 -0.0384306 -0.0963159 0.0322454 0.111088 0.0274519 -0.0145708 0.157387 0.143213 0.0199667 0.0122887 -0.12212 0.0672252 -0.033333 -0.0541128 -0.0781137 0.165774 0.0580283 -0.0495064 -0.0201743 -0.127233 -0.071918 0.076584 -0.0535568 -0.130551 -0.0599605 0.0507527 0.0358957 -0.178663 -0.0168613 -0.0941907 -0.182949 0.170197 -0.101063 0.0235804 
0.0330211 0.0594242 -0.137681 0.00279581 0.100965 0.201965 0.0252934 -0.16054 -0.106191 0.0933357 0.00283659 0.0579626 0.0794919 0.0312627 -0.00673066 -0.085341 0.0809144 0.204987 0.129625 0.0160058 0.063422 0.005954 -0.053894 0.189971 0.00520254 -0.0153846 -0.0985693 -0.143039 0.0622559 0.21277 0.0132914 0.0729655 -0.0925293 -0.0480855 0.11124 0.0742745 -0.0398552 -0.143531 0.0179686 -0.0568084 0.00519805 -0.00801526 0.00111318 0.0890575 -0.122474 0.028446 0.149949 0.0972358 -0.0658157 -0.0787015 0.115007 0.021572 0.0626642 -0.0764287 0.0760833 0.109616 0.0232671 0.137675 0.0718033 -0.0393957 -0.0093207 0.109524 0.128382 -0.152864 0.0608979 -0.11703 0.0473945 -0.0762992 -0.0977894 0.0967317 0.0178901 0.0787805 -0.0750629 -0.0830009 -0.0995892 0.0569563 -0.0490811 0.083861 0.0473264 -0.0472032 -0.0176828 0.17356 -0.0229322 0.0349896 0.0171633 -0.0366873 0.0225342 -0.0865452 -0.00568868 0.0368989 -0.00215006 0.0191909 0.0399534 -0.0314134 -0.0206477 -0.0937063 0.022051 0.113665 0.0214369 -0.0252829 0.139508 0.156815 0.0424989 0.0150761 -0.127914 0.052893 -0.0392528 -0.0755635 -0.0733001 0.172711 0.064611 -0.0648599 -0.0148759 -0.110988 -0.0914901 0.0607869 -0.0225865 -0.163467 -0.0771589 0.0597747 0.0495354 -0.152567 -0.0291852 -0.0772119 -0.170665 0.144378 -0.0813922 0.00935025 
0.0416767 0.0250183 -0.117254 0.0162441 0.0831418 0.24465 0.0381134 -0.149056 -0.138672 0.0854749 -0.0035184 0.0612657 0.0817355 -0.0206445 -0.00737704 -0.0836655 0.0082772 0.203097 0.111162 0.00394559 0.0812914 -0.0269 -0.0251353 0.19771 0.0254493 -0.009582 -0.115108 -0.196705 0.0370105 0.1728 0.0163357 0.0653686 -0.148223 -0.0281 0.103614 0.0477826 -0.0824403 -0.142043 0.0479657 -0.0526728 0.0310512 -0.0539065 -0.0124687 0.0953692 -0.140797 -0.0332935 0.145573 0.088192 -0.0795458 -0.0607362 0.121018 -0.0227224 0.0690608 -0.0593481 0.0612955 0.0902201 0.0546056 0.158915 0.0782681 -0.0630929 -0.000990225 0.130873 0.147374 -0.142479 0.0651913 -0.081581 0.0482844 -0.0766884 -0.091087 0.0951163 -0.0161115 0.117516 -0.0694982 -0.0508688 -0.0871922 0.0193604 -0.0645834 0.045745 0.0575956 0.0153923 -0.0200665 0.130215 0.00221071 0.00902001 -0.0239847 -0.0267893 0.0517417 -0.0758392 -0.0178478 0.00886632 0.0207981 0.0197852 0.0492209 -0.0342501 -0.0755496 -0.092636 0.0119162 0.132161 0.0269556 -0.0151724 0.142262 0.133558 0.0288077 0.0357773 -0.0772627 0.0360873 -0.0354465 -0.0218188 -0.0859264 0.153548 0.0582367 -0.0171287 0.00215201 -0.129104 -0.0683105 0.0810242 -0.0428846 -0.114191 -0.0647698 0.0634059 0.0532867 -0.180378 -0.0314479 -0.0915221 -0.179521 0.149061 -0.10083 0.0324628 
0.0378384 0.0242106 -0.156167 -0.00122208 0.0952445 0.227605 0.0164155 -0.156753 -0.142063 0.0717286 -0.00618016 0.0608015 0.10051 0.0192405 -0.0347043 -0.0575169 0.00777308 0.175205 0.113002 0.0402839 0.0916275 -0.034381 0.00359372 0.162227 0.000413176 0.0157915 -0.113299 -0.204858 0.0564192 0.183419 0.00067693 0.0805378 -0.127602 -0.0538182 0.0900235 0.0764271 -0.0796244 -0.0858054 0.034634 -0.0489031 0.00485913 -0.0179857 -0.0314822 0.0919436 -0.149127 0.0116144 0.167039 0.0850659 -0.080363 -0.0633982 0.0763549 -0.00326209 0.0630382 -0.0461082 0.0750539 0.0781278 0.0801923 0.161883 0.0793456 -0.0699404 -0.00648899 0.13505 0.178446 -0.136815 0.0744937 -0.0929054 0.0445317 -0.0326573 -0.0480244 0.0936677 0.00644418 0.118858 -0.0669823 -0.0505349 -0.0736794 0.0369799 -0.0799685 0.0563533 0.0490475 -0.00504926 -0.00934943 0.140973 -0.0200536 0.0103955 -0.0275256 -0.00993359 0.0452428 -0.0542249 -0.0144525 -0.00971179 0.0361213 0.0194098 0.0427934 -0.0378756 -0.0515564 -0.110521 0.0212496 0.165284 0.0385516 -0.0221348 0.135375 0.126194 0.0335757 0.0343634 -0.111001 0.0548175 -0.0471432 -0.0135899 -0.0638345 0.144458 0.0501737 -0.0147281 -0.0103193 -0.118593 -0.0726535 0.0992674 -0.0542048 -0.137366 -0.0710972 0.0598008 0.0291445 -0.160539 -0.0129765 -0.0838136 -0.204774 0.154992 -0.10794 0.0472003 
0.0836842 -0.00599608 -0.0920389 -0.0200012 0.142398 0.206 0.0495046 -0.110201 -0.224198 0.0425176 -0.0427458 0.0573146 0.113853 -0.0119202 0.0265476 -0.055539 0.00807787 0.17661 0.0603165 0.108656 0.082739 -0.00531522 0.0724412 0.152397 -0.0245557 0.0152711 -0.128458 -0.212056 0.0501205 0.12046 -0.0497677 0.0804202 -0.143571 0.00474656 0.0943994 0.033668 -0.040644 -0.0133498 0.0159812 -0.0746739 0.0419007 -0.00507555 -0.000880565 0.0860556 -0.226623 0.0327522 0.186477 0.0939364 -0.104369 0.0144327 0.0742364 -0.0807663 0.0205919 0.00354607 0.0997681 0.00591958 0.102837 0.155277 0.0808736 -0.102234 0.00634778 0.144605 0.149878 -0.112557 0.0864168 -0.0769429 0.0121685 -0.0233862 -0.0549363 0.0599446 -0.00962407 0.125459 -0.0234638 0.00152785 -0.0625124 0.0137157 -0.0919688 0.0443642 0.107755 -0.0069522 0.0234984 0.127342 -0.0234731 -0.0212945 -0.00885989 -0.0251 0.0563796 0.00792299 -0.0246735 0.0217787 0.103143 0.0184325 0.0165999 -0.0646319 -0.100564 -0.111025 0.0299617 0.20793 0.0218074 -0.0439975 0.102386 0.117147 0.0542948 0.0822608 -0.111832 0.0238546 -0.0737963 0.0557586 -0.0164243 0.108127 0.072342 0.0599429 -0.0164276 -0.0750433 -0.0685005 0.0772639 -0.0640086 -0.144671 -0.112235 0.0652319 0.0197456 -0.109166 -5.87001e-05 -0.0434687 -0.19204 0.0971805 -0.108105 -0.00570891 
0.0334689 0.0535976 -0.074062 -0.0087184 0.125708 0.240485 0.0303143 -0.167878 -0.10575 0.086714 -0.0245032 0.0491844 0.0600658 0.0151444 0.0621347 -0.0770502 0.0416269 0.175457 0.11908 0.00732508 0.0568977 0.0482702 -0.0238723 0.11879 0.0135764 0.0282864 -0.153229 -0.156263 0.103644 0.159099 0.0529291 0.134379 -0.106102 -0.0363326 0.147181 0.0839489 -0.0269478 -0.070406 0.0684402 -0.0881101 0.0517072 -0.0155897 -0.0602165 0.0214033 -0.155682 0.0447855 0.109628 0.108983 -0.0737833 -0.116877 0.0544592 0.0664983 0.100033 -0.07609 0.0643552 0.0834777 0.0575238 0.13727 -0.0119119 -0.0411815 -0.0464296 0.121125 0.14389 -0.157589 0.114854 -0.0258919 0.0618657 -0.0307732 -0.104087 0.116923 0.0253968 0.0944761 -0.0891065 -0.0393884 -0.0671718 0.0402384 -0.0900617 0.009721 0.0722753 -0.0264532 -0.00114137 0.186926 0.013162 0.0267488 0.0560626 -0.0967302 0.0514549 -0.0222336 -0.0317313 0.0594299 0.0741119 0.0422821 0.0502325 0.0304633 -0.0514435 -0.131041 0.0457532 0.119778 0.0187916 -0.0189518 0.154576 0.133371 -0.00920754 -0.00283241 -0.116178 0.0766707 0.0200712 -0.0891676 0.0182769 0.167526 0.0651732 -0.0313633 -0.0455195 -0.100714 -0.0183272 0.0472628 -0.0889864 -0.151116 -0.0627275 0.069055 0.0876838 -0.153103 -0.015854 -0.0842974 -0.111986 0.166626 -0.0261529 0.0146753 
0.0500004 0.0511152 -0.0492474 -0.0427032 0.139852 0.261066 0.00962122 -0.129731 -0.156573 0.0689618 -0.000681013 0.0729321 0.0840631 0.0112963 0.0319194 -0.0775521 0.0381523 0.170151 0.0947975 0.0173468 0.100749 0.0724864 -0.0356572 0.111465 0.00741378 0.054393 -0.11408 -0.139185 0.119008 0.151772 0.0187448 0.0779559 -0.121428 -0.0190224 0.120718 0.0596865 -0.0380243 -0.0689675 0.107849 -0.0553777 0.0558136 -0.00796692 -0.0615597 0.0253628 -0.16616 0.0198038 0.12567 0.0745225 -0.0995045 -0.124421 0.076393 0.0741885 0.0479591 -0.0340887 0.0523529 0.0739654 0.0662607 0.153726 -0.0459832 -0.042069 -0.0256816 0.107054 0.164901 -0.129196 0.102657 -0.0604516 0.0597405 0.00328025 -0.0755731 0.109521 0.0435974 0.0939222 -0.0822447 -0.0670785 -0.0471331 0.0590611 -0.0989389 0.0303205 0.0715843 0.00525389 -0.0109878 0.177332 0.0885222 0.0569245 0.0322536 -0.0830761 0.106947 0.00918533 -0.0384406 0.0406607 0.0616064 -0.000581194 0.0429693 0.0916452 -0.0927754 -0.171536 0.0381968 0.113705 -0.00230961 -0.0121995 0.131917 0.163245 -0.0368764 0.0579633 -0.0936568 0.0897163 0.0107207 -0.0466069 -0.00597243 0.105447 0.0667558 -0.0446031 -0.0741931 -0.0319899 -0.0142986 0.0617286 -0.135753 -0.132215 -0.0915496 0.0665123 0.0614317 -0.152381 -0.0368663 -0.119491 -0.0859384 0.183585 -0.0451506 0.0238864 
0.0443936 0.0495459 -0.049939 -0.0521489 0.129394 0.240709 0.0135266 -0.123922 -0.152005 0.0818561 0.00177015 0.0886765 0.0944317 -0.00902899 0.0258814 -0.0737301 0.0218771 0.177354 0.0823658 0.053653 0.0981391 0.0692142 -0.0324437 0.13528 -0.0259337 0.0655837 -0.103136 -0.162298 0.109991 0.165703 -0.0149102 0.0635568 -0.0968813 -0.0188226 0.127656 0.054069 -0.0278303 -0.0440542 0.0751867 -0.0547491 0.0425962 -0.02353 -0.0552996 0.0460158 -0.179733 0.0385235 0.144847 0.069562 -0.114752 -0.0974386 0.0892506 0.0489901 0.0298658 -0.0223788 0.0830895 0.0798496 0.0559694 0.14299 -0.0401766 -0.0465277 -0.0215322 0.0802177 0.170836 -0.123065 0.113651 -0.0996125 0.0395273 -0.00684659 -0.0848696 0.0933962 0.0426177 0.0758219 -0.0818687 -0.0780499 -0.040887 0.0688912 -0.104594 0.0577476 0.0913274 -0.00469035 -0.013563 0.17471 0.0638163 0.0634232 0.0273792 -0.0787397 0.106977 0.0133807 -0.0194914 0.0614242 0.0396396 -0.0144648 0.0398257 0.0757649 -0.107165 -0.164062 0.0354724 0.117597 0.0208421 -0.0267514 0.138596 0.16681 -0.0365625 0.0509121 -0.0970763 0.073851 -0.00337566 -0.0404841 -0.0193283 0.102789 0.0615339 -0.0355701 -0.0639998 -0.0464362 -0.0259257 0.070923 -0.132112 -0.151885 -0.112005 0.0736563 0.0600513 -0.151278 -0.0352688 -0.102664 -0.0915851 0.185879 -0.045514 0.0134362 
0.0621051 0.0211086 -0.0689546 -0.0741952 0.145517 0.257643 0.0282872 -0.110674 -0.144857 0.0182266 -0.00591549 0.105731 0.0988862 -0.0119897 -0.00661324 -0.10537 -0.0300404 0.13501 0.0457468 0.0412387 0.109765 0.0808147 -0.0294709 0.113033 -0.0294429 0.0618657 -0.0824547 -0.167322 0.0853948 0.148019 -0.0128218 0.0361388 -0.141018 -0.00884736 0.107278 0.0399897 -0.0534776 -0.0465756 0.0705427 -0.0272478 0.0748963 -0.00188857 -0.0768009 0.0862404 -0.194307 0.0169692 0.128236 0.0689984 -0.0932104 -0.0823024 0.0572905 0.0222055 0.0178266 -0.0127911 0.0735178 0.0610905 0.0341288 0.195337 -0.051649 -0.0598483 -0.00832729 0.09208 0.206405 -0.0882878 0.0975535 -0.117808 0.058306 0.0165899 -0.0369827 0.0822907 0.0500813 0.0946071 -0.0434581 -0.0669871 -0.0520827 0.0656371 -0.127255 0.0179721 0.0754363 0.0338332 0.00426261 0.157709 0.0825076 0.0550873 0.00115306 -0.0836712 0.146274 0.0253027 -0.0378252 0.0272453 0.0749912 -0.0454453 0.032931 0.0586858 -0.123444 -0.17463 0.0286903 0.0926488 0.0217084 -0.0107234 0.110387 0.160143 -0.0335758 0.0744748 -0.115666 0.0635286 -0.0380154 0.00889506 -0.0623075 0.100858 0.114232 -0.0223314 -0.0960936 -0.0132143 -0.0474801 0.0914734 -0.145173 -0.12409 -0.103422 0.0591218 0.0443966 -0.130382 -0.0417017 -0.0982873 -0.0943057 0.152928 -0.0919162 0.0197372 
0.0834031 0.0176782 -0.112882 -0.0487798 0.154728 0.230143 0.0359687 -0.106779 -0.202848 0.0446158 -0.0432771 0.0747183 0.10474 -0.0445821 -0.00367267 -0.0267931 -0.00896888 0.138493 0.0289173 0.100233 0.0929579 0.0204862 0.0641052 0.0811828 -0.0419669 0.0838544 -0.120639 -0.229027 0.0765601 0.0997641 -0.0282444 0.116078 -0.154281 0.00654482 0.0909142 0.0324545 -0.0479019 0.0538799 0.0580868 -0.0628909 0.0364711 0.00335618 -0.0518916 0.0929527 -0.21376 0.0483864 0.177821 0.085245 -0.128179 -0.026659 0.0613696 -0.033824 -0.0100996 -0.00924753 0.0825959 -0.00111931 0.0907744 0.188006 0.0256606 -0.107662 -0.00357587 0.0951968 0.206555 -0.116361 0.131767 -0.107259 0.00957593 0.0452913 -0.0296342 0.080078 0.00846857 0.132493 -0.0286771 0.00564746 -0.0750406 0.00185828 -0.113455 0.0510855 0.084217 0.00340896 0.0135803 0.137599 0.000982419 -0.0225848 -0.0223387 -0.0900897 0.0943369 0.0474244 -0.0108016 0.00609141 0.0966577 -0.00926295 -0.00352269 -0.019828 -0.076377 -0.116123 0.0757062 0.17442 0.00377868 -0.0253798 0.0754117 0.117898 -0.0117605 0.114387 -0.120794 0.0244714 -0.0738263 0.0585926 0.0105165 0.0839759 0.0852196 0.0771519 -0.0585816 -0.022545 -0.0108377 0.058277 -0.132081 -0.159812 -0.0924679 0.0598761 0.0232704 -0.0713217 0.035509 -0.0467358 -0.122478 0.082204 -0.10358 -0.0237073 
0.0938208 0.00497328 -0.0860592 -0.0410174 0.154312 0.227864 0.041339 -0.0983478 -0.220302 0.0459363 -0.0488188 0.0599503 0.115272 -0.0418656 0.0206636 -0.0313346 0.00605458 0.160778 0.0307135 0.101647 0.102208 0.0174073 0.066775 0.0942535 -0.0428058 0.0639046 -0.141184 -0.233218 0.06422 0.095366 -0.02891 0.121811 -0.155698 0.0229525 0.106735 0.0292175 -0.0296628 0.0392455 0.0575427 -0.0814197 0.0424123 -0.00126063 -0.032594 0.0826299 -0.216281 0.0427608 0.178652 0.0902441 -0.129993 -0.0161542 0.0649424 -0.058803 -0.000505707 0.0039361 0.0804688 -0.00724645 0.104659 0.159155 0.0404993 -0.114208 0.00499192 0.112543 0.166776 -0.118223 0.120613 -0.0968021 0.012108 0.0288602 -0.0341473 0.069368 -0.00261909 0.118764 -0.0306903 -0.00622036 -0.0848623 -0.00395152 -0.110155 0.0477539 0.101717 0.00531656 0.0173155 0.136881 -0.00771009 -0.0240351 -0.0132871 -0.0712079 0.0872516 0.0374859 -0.0188893 0.0203753 0.108998 0.0029293 0.00222911 -0.0291197 -0.100763 -0.108108 0.0615241 0.193489 -0.00580237 -0.0262892 0.0892973 0.120096 0.00408263 0.114081 -0.101515 0.014947 -0.0706407 0.0603451 0.00955282 0.0931356 0.0661577 0.0693246 -0.0577435 -0.0384998 -0.0167832 0.0596751 -0.116071 -0.168533 -0.106719 0.05493 0.0271416 -0.0741478 0.0325768 -0.0400408 -0.129176 0.0709345 -0.0947989 -0.0256342 
0.116577 -0.0138891 -0.0681851 -0.0224078 0.179829 0.216672 0.0786443 -0.112264 -0.19714 0.00346682 -0.0601502 0.0866555 0.10047 -0.0356303 0.0381094 -0.044009 0.0162168 0.157105 0.00708129 0.105914 0.0886841 0.0470034 0.0705523 0.129731 -0.0463809 0.0249237 -0.137699 -0.232051 0.029383 0.1167 -0.0465074 0.118311 -0.144282 0.0406488 0.111058 0.0158102 -0.00622859 0.0372997 0.0240927 -0.0775509 0.0593596 0.0179777 -0.0116897 0.0589281 -0.230646 0.0658966 0.163859 0.0698722 -0.112386 0.0143568 0.0797771 -0.0957183 0.0161112 0.0134597 0.108594 -0.0116148 0.0888067 0.172671 0.0357829 -0.0825964 0.00515577 0.115025 0.140633 -0.144538 0.131594 -0.112056 0.00331206 0.0181822 -0.0686752 0.0657046 0.00796437 0.112395 -0.0242823 -0.00991921 -0.0868926 0.0359865 -0.0937052 0.025965 0.097124 -0.00574949 0.030287 0.138143 -0.018426 -0.0266541 -0.003834 -0.0730853 0.0841528 0.0162229 -0.0644737 0.0524876 0.108061 -0.0240346 -0.00283694 -0.0409239 -0.105006 -0.0792375 0.0510239 0.163413 0.0247287 -0.0142115 0.0894385 0.110703 0.0104654 0.11941 -0.116281 -0.0134358 -0.0828131 0.0509347 -0.025853 0.096682 0.0785022 0.0654946 -0.0359863 -0.0441956 -0.032654 0.0750813 -0.114352 -0.147599 -0.132203 0.0739501 0.0332494 -0.0551019 0.0183811 -0.0235431 -0.108736 0.0719846 -0.100146 -0.0561317 
0.109596 -0.00434958 -0.0876206 -0.0337055 0.162359 0.218802 0.0669804 -0.110859 -0.204988 0.00478382 -0.0516544 0.07189 0.102113 -0.0406386 0.0147853 -0.0559311 0.0222107 0.156801 0.0270814 0.0999361 0.0893688 0.0487532 0.0484654 0.112727 -0.0561 0.0465266 -0.131157 -0.225274 0.0523327 0.112083 -0.0400483 0.120861 -0.149354 0.0334063 0.121129 0.0134383 -0.00493431 0.0256701 0.0321822 -0.0888972 0.0566667 0.00937744 -0.0215432 0.0866855 -0.221147 0.0683311 0.172192 0.0870988 -0.127319 -0.00153373 0.0600295 -0.0698541 0.0226573 0.0026438 0.0908799 -0.00513953 0.0868461 0.16543 0.0365793 -0.0966954 0.0112088 0.121475 0.160644 -0.124451 0.11705 -0.112851 0.0202761 0.00147529 -0.0451685 0.0639976 -0.00908533 0.0834084 -0.0244614 -0.00272789 -0.0959715 0.00703628 -0.0976954 0.0394636 0.0936691 -0.00726615 0.0293555 0.147443 -0.0265653 -0.0346625 0.00859129 -0.0765204 0.0796211 0.0112221 -0.0544308 0.0489666 0.131942 -0.00779163 -0.00824829 -0.0444842 -0.0928565 -0.088331 0.0636561 0.172193 0.0124622 -0.0233537 0.0927878 0.129983 0.0151751 0.113405 -0.119913 -0.00613427 -0.0663152 0.0595715 -0.0230387 0.109437 0.0937463 0.0542527 -0.0563818 -0.0471802 -0.0408094 0.0607723 -0.106787 -0.176036 -0.109614 0.0534387 0.0266266 -0.0626992 0.0230319 -0.0283089 -0.119925 0.0580228 -0.0964939 -0.0538568 
0.0970067 0.0117801 -0.0581864 -0.0225027 0.168055 0.234011 0.0688048 -0.14102 -0.189412 0.015126 -0.0579668 0.0682238 0.0888682 -0.00627691 0.0471119 -0.0645798 0.025686 0.170155 0.0443954 0.0674477 0.0697928 0.0680912 0.0448777 0.117832 -0.0405766 0.0365062 -0.145913 -0.196327 0.0582107 0.119155 -0.0195231 0.140942 -0.148732 0.0252357 0.135522 0.0331255 0.00255599 0.00726494 0.0466039 -0.0858174 0.0646692 0.0127512 -0.0230991 0.0470941 -0.221316 0.0684389 0.152396 0.0924128 -0.110746 -0.0213362 0.065239 -0.0436907 0.0472835 -0.00673608 0.0891134 0.0168613 0.0911041 0.170869 0.0268895 -0.0735161 -0.00528394 0.140399 0.143149 -0.146851 0.125281 -0.0716502 0.0330975 -0.00303029 -0.0721443 0.102252 0.00185262 0.0963234 -0.0319087 0.00735974 -0.0880021 0.0159942 -0.0953822 0.0127784 0.0931415 -0.0319817 0.0367671 0.168479 -0.0165533 -0.0290463 0.0237762 -0.0951709 0.0707354 0.00143201 -0.0710502 0.065997 0.136926 0.00399756 0.0207599 -0.0328602 -0.0866126 -0.0931063 0.0563491 0.172214 0.0267609 -0.0140537 0.106941 0.133389 0.0123096 0.0923675 -0.115127 0.00725884 -0.0483546 0.0134745 -0.010724 0.123061 0.0856869 0.0430524 -0.0419182 -0.0535869 -0.03096 0.0538512 -0.0973118 -0.16296 -0.10571 0.0588329 0.0577448 -0.0826746 0.0127167 -0.0447379 -0.118407 0.0855631 -0.0808646 -0.0400746 
0.0790405 0.0297671 -0.0276048 -0.00892976 0.174228 0.225671 0.0654411 -0.163182 -0.167223 0.0231629 -0.0547331 0.0828663 0.0611868 -0.0312363 0.0723659 -0.0672218 -0.00148964 0.177726 0.0488552 0.0732354 0.0485464 0.0829816 0.036637 0.133968 -0.023503 0.0222795 -0.148632 -0.187444 0.0510063 0.12808 -0.0175534 0.116274 -0.126146 0.0160443 0.151066 0.0389269 0.0134563 -0.0294776 0.0411501 -0.0819386 0.0852254 -0.00296112 0.00315 0.0341965 -0.236955 0.0764124 0.159329 0.0790244 -0.0984194 -0.0086982 0.0781954 -0.0505518 0.0550908 -0.00616627 0.112348 0.0244085 0.0762749 0.151016 0.0140522 -0.0518051 -0.024111 0.128517 0.131487 -0.145491 0.130979 -0.0660795 0.0278843 -0.0324626 -0.0956838 0.104884 0.0181967 0.104275 -0.0342196 0.00406741 -0.0501443 0.0394846 -0.110744 0.0148559 0.0929732 -0.0364786 0.0490908 0.186561 0.00153695 0.0108277 0.0368407 -0.074971 0.0660422 0.00920951 -0.0791992 0.0948716 0.119076 0.00232617 0.0194267 -0.0287907 -0.106538 -0.102963 0.0333418 0.163927 0.042935 -0.0282516 0.107345 0.121436 0.0234781 0.0563094 -0.112868 0.0176582 -0.0288108 0.00459084 -0.0148871 0.142621 0.085551 0.0276946 -0.0216928 -0.0674606 -0.0437258 0.0518805 -0.0959888 -0.144762 -0.120943 0.0662668 0.0883853 -0.0904945 0.0034206 -0.051247 -0.113256 0.115799 -0.05482 -0.022962 
0.0819047 0.014502 -0.076717 -0.0343207 0.133934 0.236314 0.0562279 -0.129354 -0.185454 0.0515671 -0.0330907 0.089936 0.0772381 -0.0421915 0.0416115 -0.0701106 -0.0035134 0.154411 0.0893764 0.0643103 0.0597144 0.0642413 0.022785 0.0992714 -0.0442465 0.0909018 -0.11983 -0.221622 0.0863855 0.125194 -0.0207315 0.136859 -0.132892 -0.00164128 0.136042 0.0342804 -0.015656 0.0176555 0.0748154 -0.0812428 0.0557653 -0.0224852 -0.07233 0.0629124 -0.218725 0.0654033 0.155318 0.0774345 -0.132002 -0.0502589 0.0527449 0.00602625 0.0473782 -0.017787 0.0849263 0.0287389 0.0822096 0.166258 -0.0279218 -0.053572 -0.0159811 0.094219 0.197932 -0.138876 0.144837 -0.0763687 0.0427305 -0.00954028 -0.0682849 0.0988246 -0.00380919 0.0938453 -0.0612261 0.0173781 -0.0735704 0.000484026 -0.105096 0.0190435 0.0969628 -0.00695267 0.00217561 0.158319 -0.00529176 -0.0185202 0.0267155 -0.12281 0.0841017 0.00881962 -0.0298939 0.0542645 0.124387 0.013931 0.0121578 0.0109268 -0.0760157 -0.124328 0.0785593 0.143969 0.0368955 -0.0247076 0.101472 0.129408 -0.0216935 0.059605 -0.109801 0.0355552 -0.0107359 -0.000167513 0.00576396 0.116836 0.0844854 0.0428104 -0.0495601 -0.0781165 0.000519978 0.0478283 -0.10127 -0.18568 -0.0664841 0.064754 0.069134 -0.117672 0.0215885 -0.0588893 -0.0911271 0.112425 -0.0415053 -0.0194375 
0.0661255 0.018643 -0.0865958 -0.0172934 0.153257 0.197457 0.0586518 -0.150796 -0.164641 0.0348457 -0.0142614 0.11743 0.0509736 -0.0412986 0.0185304 -0.0765257 0.0114206 0.156676 0.11007 0.0923292 0.0601334 0.0659196 -0.000336612 0.112773 -0.0360838 0.0883314 -0.103474 -0.210968 0.0946082 0.159319 -0.0298126 0.104682 -0.10167 -0.0242313 0.144326 0.0435046 -0.012504 -0.0101077 0.0605844 -0.0837941 0.0602809 -0.00138886 -0.0532238 0.0788493 -0.21613 0.101588 0.173614 0.0507603 -0.119239 -0.0583681 0.0334634 0.0135575 0.0368447 -0.0318075 0.109023 0.0445557 0.0473633 0.170394 -0.0531985 -0.0120087 -0.01122 0.0685011 0.214332 -0.128716 0.159828 -0.113437 0.0305139 -0.0427786 -0.0627156 0.0958081 0.019209 0.0838636 -0.0589006 -0.00226076 -0.0676439 0.0232831 -0.0929513 0.0607808 0.0757912 -0.0333049 -0.0144629 0.185709 -0.0143643 0.00991755 0.0361445 -0.106837 0.0740296 0.008252 -0.0442831 0.0572441 0.115783 0.00943334 -0.0091758 0.0126566 -0.0481208 -0.135683 0.067716 0.118532 0.0543634 -0.0321278 0.0744149 0.127138 -0.00817806 0.0328448 -0.12884 0.0603561 0.0154483 -0.000487449 -0.00221034 0.126673 0.0864965 0.00510257 -0.0514063 -0.0797895 -0.014627 0.0460524 -0.0879966 -0.202652 -0.0701477 0.0686063 0.0560197 -0.092354 -0.00103999 -0.0498357 -0.0975536 0.137524 -0.0296644 -0.0231732 
0.0612654 0.0178619 -0.105853 -0.0348717 0.141575 0.184825 0.0446316 -0.123955 -0.174908 0.0450263 -0.00536136 0.102192 0.0691412 -0.0378702 0.00921906 -0.0721485 0.00996761 0.15151 0.114791 0.114114 0.0691177 0.042972 0.015864 0.100022 -0.0490002 0.10174 -0.0901682 -0.22359 0.109594 0.143569 -0.033863 0.0902726 -0.0880111 -0.0321741 0.129528 0.0462441 -0.0179455 0.0269983 0.0501608 -0.0823315 0.0427794 0.00354441 -0.0693634 0.103537 -0.223564 0.0955613 0.184511 0.0555022 -0.128966 -0.0559394 0.0101503 0.014896 0.0171934 -0.0253127 0.102885 0.0399206 0.0533989 0.172993 -0.0473215 -0.036405 -0.0127572 0.0550382 0.238176 -0.115821 0.155924 -0.118187 0.0261415 -0.034497 -0.0396818 0.0820199 0.0133216 0.0798149 -0.0556653 0.000966514 -0.0633583 0.00461298 -0.0974831 0.0840089 0.0833312 -0.0370646 -0.030942 0.174274 -0.0261271 0.00117068 0.0312149 -0.0996501 0.0733984 0.0241705 -0.0106034 0.0372914 0.122124 0.0084504 -0.0130005 -0.000928929 -0.0320796 -0.153581 0.0691122 0.13818 0.0438922 -0.0416877 0.0608747 0.120687 -0.00268446 0.0322693 -0.136017 0.0713266 0.00892978 0.00773776 0.0239272 0.103828 0.0829174 0.0204842 -0.0614421 -0.0729494 -0.00861396 0.0435691 -0.0805089 -0.227806 -0.0583795 0.0624543 0.0422101 -0.0923035 0.00312282 -0.0367661 -0.110142 0.125542 -0.0318179 -0.0124795 
0.0570709 -0.00335711 -0.0910939 -0.0198117 0.136276 0.198971 0.0504623 -0.128761 -0.125778 0.0141559 -0.00333073 0.106322 0.0501447 -0.0676651 0.00415253 -0.080893 -0.0283138 0.155906 0.0787097 0.11378 0.0784752 0.0413837 0.0256075 0.119042 -0.0529865 0.079951 -0.101319 -0.243069 0.0924689 0.12104 -0.00242273 0.0942653 -0.0956934 -0.0211424 0.142322 0.0534907 -0.0278794 0.0337371 0.0294186 -0.0905968 0.0591515 -0.00306752 -0.102036 0.106501 -0.222031 0.0604855 0.165077 0.068696 -0.116464 -0.035317 -0.0207478 0.00670221 0.035029 -0.031117 0.103143 0.0380277 0.0455258 0.173791 -0.0609204 -0.0546175 -0.0271585 0.0646891 0.255088 -0.11484 0.147857 -0.107538 0.0429401 -0.0453905 -0.0490235 0.102718 0.00425887 0.0771182 -0.0489187 0.0247029 -0.07331 -0.0222214 -0.11065 0.0624475 0.0796545 -0.0273163 -0.0294008 0.186682 -0.0447773 -0.0303305 0.033607 -0.0986625 0.0700413 0.0326057 -0.0190369 0.0435023 0.1616 0.00440647 -0.0100589 -0.0128283 -0.0295644 -0.143398 0.0505384 0.123498 0.0507333 -0.031142 0.0743899 0.0920366 -0.017696 0.0123521 -0.117143 0.0703887 0.0174842 -0.0095572 0.0312676 0.121944 0.0811379 0.0516281 -0.0540945 -0.0847204 0.0055051 0.0486987 -0.0794972 -0.223251 -0.0337645 0.0661688 0.0563358 -0.0834224 0.00226561 -0.0254409 -0.113752 0.11927 -0.0188183 -0.0127525 
0.0616327 0.0248771 -0.113018 -0.0372735 0.124813 0.220843 0.0405786 -0.122609 -0.163999 0.0761058 -0.0182308 0.0730139 0.0747484 -0.0352827 0.0367675 -0.0680136 0.00353174 0.154348 0.12279 0.0794901 0.0545773 0.0307981 0.042015 0.104132 -0.0412498 0.0783076 -0.105615 -0.229608 0.1034 0.126571 0.000304664 0.103029 -0.104546 -0.0363125 0.132188 0.0528093 -0.0292309 0.0290487 0.0547626 -0.0771058 0.0256323 -0.0130384 -0.0959408 0.0870699 -0.224099 0.0602917 0.154229 0.089419 -0.111314 -0.0474749 0.0260958 0.0254188 0.0437079 -0.035884 0.0790951 0.0389487 0.0839956 0.170424 -0.0233267 -0.0542038 -0.0364871 0.0783492 0.23009 -0.145524 0.150719 -0.0893292 0.0372955 -0.023994 -0.0649493 0.0975119 -0.001661 0.104517 -0.0720757 0.0168004 -0.0698381 -0.0105862 -0.0993838 0.0463876 0.0937367 -0.0162724 -0.0216097 0.144425 -0.0277764 -0.0118845 0.0362323 -0.113626 0.0566237 0.0117314 0.00451609 0.0311694 0.115372 0.0260912 0.0132698 -0.00736342 -0.0277494 -0.151138 0.0716512 0.156764 0.0312501 -0.0277649 0.0981245 0.118853 -0.0123628 0.0209355 -0.120439 0.0602345 0.00688089 -0.0275999 0.0453991 0.123072 0.0753399 0.0410871 -0.0328721 -0.0854774 -0.00117167 0.0558295 -0.0674458 -0.19672 -0.0464725 0.0755976 0.0585358 -0.132552 0.0117116 -0.0485599 -0.121932 0.121352 -0.0363716 0.00785596 
0.0859113 0.0164816 -0.0884262 -0.032768 0.151025 0.204582 0.0421257 -0.138834 -0.170536 0.0159032 -0.0110163 0.110315 0.0677297 -0.0266665 0.0136151 -0.0898614 0.0291892 0.162853 0.0947162 0.0933519 0.0728538 0.0898208 0.0010062 0.136939 -0.0422169 0.0675235 -0.0802543 -0.197181 0.0798901 0.163997 -0.0431539 0.0741847 -0.10208 -0.00857021 0.137853 0.0372457 -0.00449476 -0.0189739 0.0470649 -0.0713775 0.0491223 0.0104594 -0.0508331 0.0954638 -0.216958 0.0997636 0.175021 0.0599693 -0.11948 -0.0348941 0.0562597 0.00796197 0.0290281 -0.0178921 0.107152 0.0362729 0.0500069 0.167996 -0.0292543 -0.0369594 0.00288457 0.0785516 0.198065 -0.117482 0.124858 -0.144211 0.0399059 -0.0283838 -0.051778 0.0969232 0.0259657 0.0695197 -0.0510497 -0.0242655 -0.0733799 0.0285765 -0.101759 0.067713 0.0816278 -0.0193596 -0.000613864 0.193067 -0.00333902 0.00300197 0.037789 -0.096161 0.0779536 -0.00293984 -0.0469585 0.063551 0.109898 -0.00827587 -0.0100987 0.0080874 -0.0616997 -0.1397 0.0568941 0.119939 0.0425145 -0.0454623 0.083187 0.150279 0.00260586 0.0545175 -0.139404 0.0437503 -0.0148122 -0.000177931 -0.0267068 0.12351 0.110941 0.00211776 -0.0587842 -0.0577811 -0.0433367 0.0538671 -0.0957676 -0.213013 -0.0910985 0.0603573 0.0482836 -0.0867705 -0.00746691 -0.050917 -0.0986862 0.117452 -0.0420671 -0.0283476 
0.0976791 -0.00961134 -0.102857 -0.0264264 0.159132 0.218863 0.0567624 -0.131452 -0.155571 0.00826697 -0.0141885 0.113417 0.0773497 -0.0299547 0.0140125 -0.0889478 0.0161998 0.157838 0.0775263 0.0954799 0.0854512 0.0709767 0.00634279 0.140868 -0.0358562 0.0556422 -0.0929225 -0.215589 0.0602519 0.161243 -0.0289346 0.0842836 -0.117972 -0.00444082 0.132033 0.0380997 -0.0229945 -0.0158525 0.040408 -0.0852419 0.0560029 0.0123834 -0.0603072 0.100258 -0.218965 0.0713322 0.158212 0.071335 -0.107746 -0.0337395 0.0466242 -0.0171524 0.0413538 -0.0247436 0.110449 0.0333764 0.0349203 0.185408 -0.0273098 -0.0517488 -0.00318447 0.0832435 0.207736 -0.125099 0.120207 -0.122309 0.0378642 -0.0110694 -0.0541316 0.0791272 0.0250202 0.0864262 -0.051187 -0.0320144 -0.0906792 0.0312087 -0.0990435 0.0402188 0.0842402 0.000379596 0.00353928 0.176924 -0.010264 -0.0152637 0.0267645 -0.0961557 0.0876823 0.00264741 -0.0394765 0.0542431 0.119344 -0.0128185 -0.0119117 0.0076917 -0.0716238 -0.130111 0.051474 0.10934 0.0405728 -0.0407746 0.0968301 0.131618 0.001539 0.0444292 -0.146184 0.0441969 -0.027769 -0.00172854 -0.0319744 0.129738 0.114538 0.0154321 -0.0617673 -0.0647078 -0.03121 0.0646763 -0.104729 -0.193045 -0.089502 0.0656847 0.0444028 -0.0903251 -0.0023748 -0.0410604 -0.103824 0.115844 -0.0502584 -0.0306957 
0.105082 -0.00144723 -0.13313 -0.0338362 0.152233 0.221516 0.0503471 -0.129033 -0.149699 0.0286767 -0.00762663 0.0922927 0.10172 0.00584884 0.00237243 -0.0748398 0.0328039 0.149948 0.0800656 0.0901638 0.0969182 0.0557066 0.0111475 0.12729 -0.0361727 0.0588596 -0.0988139 -0.207777 0.0805302 0.172976 -0.0247244 0.0988108 -0.123205 -0.0231518 0.11232 0.0468068 -0.0355735 0.0035775 0.0468445 -0.0755851 0.0236518 0.027745 -0.0828892 0.0995484 -0.204128 0.0575642 0.147443 0.0865214 -0.0884244 -0.0523492 0.0498777 0.0199239 0.0361779 -0.0258948 0.0989455 0.0277055 0.051212 0.190875 -0.00496022 -0.0688251 -0.010234 0.0785514 0.213164 -0.125521 0.0961535 -0.117369 0.0491745 0.0140283 -0.0354576 0.0730794 0.0324299 0.0993306 -0.0499902 -0.0376028 -0.100045 0.0253184 -0.0952752 0.039664 0.079864 0.0138497 0.0180844 0.164361 -0.00791738 -0.0221168 0.0332625 -0.0960401 0.0825488 0.000459698 -0.0168959 0.0249545 0.101132 -0.0061621 -0.00604808 0.0119751 -0.0616908 -0.151224 0.0607402 0.120235 0.0358482 -0.03701 0.110722 0.141883 0.00896287 0.0564914 -0.164238 0.0501082 -0.0379129 -0.0102071 -0.00125435 0.125442 0.110591 0.0189649 -0.0729509 -0.0550511 -0.0276678 0.0757625 -0.103672 -0.186605 -0.0925517 0.0588089 0.0246438 -0.0986669 0.00622962 -0.0465153 -0.118856 0.114671 -0.0625707 -0.0122736 
-0.00827131 0.0987249 0.00119688 -0.0721057 0.140902 0.216468 0.00762297 -0.109871 -0.141301 0.0424465 0.00410956 0.0586281 0.0408139 -0.0251533 0.0549627 -0.11105 0.0424668 0.127889 0.077402 0.0401565 0.0421514 0.121588 -0.0520215 0.0396933 -0.0322216 0.0840469 -0.102 -0.099313 0.180747 0.0772391 0.0506479 0.0577859 -0.0747585 -0.0153804 0.143159 0.0814018 0.0240855 -0.0354595 0.0764546 -0.0310165 0.113575 -0.00752066 -0.0807968 0.0521649 -0.197658 0.11339 0.130387 0.0638449 -0.129182 -0.148204 -0.0155387 0.112834 -0.00993326 -0.0419499 0.016325 0.0729784 0.017262 0.122045 -0.106625 0.0163105 -0.0510009 0.0737956 0.164817 -0.0984399 0.156282 -0.11541 0.0806827 -0.0388364 -0.0523516 0.135877 0.0586057 0.0349175 -0.0505252 -0.0226025 -0.000137252 0.0317377 -0.131677 0.11652 0.052747 -0.0640843 -0.0520184 0.197834 0.0793317 0.0977899 0.0568863 -0.0926178 0.116188 0.0378953 -0.0846308 0.0564377 0.116393 -0.0106005 0.030615 0.0608512 -0.0506121 -0.197635 0.060302 0.0824571 -0.0168664 -0.0132113 0.0315596 0.173855 -0.0538168 0.0542832 -0.0850725 0.10351 0.0612522 0.00203006 0.0446539 0.0879778 0.0580477 -0.0610601 -0.117991 0.0113383 -0.0209862 -0.00765702 -0.127587 -0.205795 -0.0502492 0.0652535 0.0669703 -0.103288 -0.0690965 -0.0575109 -0.031832 0.1271 -0.0327562 0.000339348 
0.0431595 0.0843566 -0.0308112 -0.0294104 0.136077 0.290773 0.0108865 -0.102607 -0.114906 0.0430513 0.0186339 0.0415501 0.059189 -0.0842316 0.03671 -0.128012 0.0184623 0.197922 0.0049738 0.058402 0.0718013 0.0496003 0.00600941 0.101926 -0.00104288 -0.0120689 -0.120682 -0.15813 0.120974 0.0578456 0.0958749 0.088036 -0.120297 0.0335791 0.129754 0.0611823 -0.0216201 -0.0313789 0.0565048 -0.0804131 0.104406 -0.0594196 -0.117816 0.0767746 -0.214343 -0.0146324 0.110008 0.127027 -0.137609 -0.0725803 0.0158946 0.0755532 0.0091799 -0.0656314 -0.0222635 0.055837 0.0099177 0.134004 -0.0546016 -0.0818736 -0.0686877 0.10237 0.19549 -0.148689 0.118016 -0.0735308 0.0856568 -0.0441981 -0.117491 0.169765 0.00525715 0.0636709 -0.0473273 0.00143654 -0.0678434 -0.0531584 -0.107686 0.0651454 0.0667224 -0.0109517 -0.0731832 0.174305 0.030624 -0.00170187 0.0490162 -0.0856877 0.078464 0.0293837 -0.0270449 0.0656755 0.157433 -0.0346173 0.03378 0.026544 -0.0483307 -0.179219 0.0215089 0.0957896 -0.0456359 -0.0231295 0.08308 0.140592 -0.0587809 0.0676435 -0.0446542 0.0905857 0.0383569 -0.00680197 0.0548385 0.103562 0.0556461 0.0401067 -0.0774589 0.0108627 0.000105958 -0.0244372 -0.129169 -0.171359 0.0119437 0.0857672 0.0755568 -0.121944 -0.057819 -0.0258915 -0.0317653 0.0801626 -0.028645 -0.0259165 
0.0659375 0.0807065 0.0253413 0.0182958 0.14842 0.308206 0.0468557 -0.149025 -0.0625562 -0.00505242 -0.0157172 0.0715452 0.0377256 -0.0968414 0.0631916 -0.153541 0.00298578 0.184603 -0.0492277 0.0377096 0.0418646 0.0828077 -0.00807647 0.137009 0.0191562 -0.0748057 -0.14249 -0.127796 0.0248045 0.0674389 0.101829 0.100056 -0.144719 0.0863325 0.139137 0.0401131 0.0181222 -0.0675765 0.0276719 -0.0842895 0.153101 -0.0718736 -0.0572333 0.0230937 -0.214233 -0.0393284 0.0710662 0.120472 -0.0910676 -0.0140979 0.077031 0.000303881 0.0337742 -0.0465849 0.00769162 0.0488263 -0.03808 0.120265 -0.0370614 -0.0673114 -0.0603072 0.117661 0.117398 -0.192501 0.12341 -0.0533884 0.0953604 -0.0609656 -0.180049 0.175329 0.00717209 0.0722473 -0.0201044 0.00725062 -0.0772961 -0.0130324 -0.0829287 -0.00456094 0.0693706 0.00774845 -0.0369737 0.166274 0.051253 0.00326894 0.0521832 -0.105554 0.0828247 0.0064591 -0.0753741 0.1151 0.13214 -0.0808131 0.069099 0.0141393 -0.108771 -0.136898 0.00361163 0.0410534 -0.0151434 -0.00684543 0.101439 0.136244 -0.0594519 0.0841876 -0.0274127 0.0396076 0.0151823 -0.0130029 -0.0318069 0.148358 0.0712092 0.0314189 -0.0492476 0.0233841 -0.032777 -0.0397934 -0.132667 -0.092276 -0.0358899 0.0903302 0.102302 -0.0819711 -0.0634817 -0.0176114 0.0276548 0.0626474 -0.0337385 -0.0574755 
0.0724195 0.0145282 -0.0523673 -0.0702449 0.135455 0.248511 0.0378925 -0.0599829 -0.131131 0.0126902 0.0208647 0.0694308 0.0988185 -0.0645213 0.0122276 -0.126999 -0.00809514 0.148883 0.0211976 0.0923975 0.123086 0.0630676 -0.040936 0.138345 -0.0389767 0.0376372 -0.0992109 -0.185538 0.111768 0.105442 0.0188086 0.018844 -0.127384 0.0202525 0.131602 0.0463775 -0.0289229 -0.0328462 0.0431967 -0.0869981 0.0875609 -0.0293178 -0.100033 0.127118 -0.201552 0.0144184 0.127389 0.11134 -0.127637 -0.0633698 -0.00400081 0.0218649 0.00498878 -0.0272059 0.0665474 0.04464 -0.0113023 0.162394 -0.0590451 -0.099564 -0.0196836 0.0760955 0.214948 -0.0764209 0.0718498 -0.11128 0.0730778 -0.0138719 -0.0348145 0.0685765 0.0236881 0.0554548 -0.0505188 -0.0568538 -0.0625554 -0.00151918 -0.129744 0.077252 0.113309 0.0403893 -0.0258288 0.165577 0.0411225 0.00698191 0.0359542 -0.0734173 0.127216 0.0471842 -0.00218212 0.0560868 0.151913 -0.0367288 0.00653759 0.0343841 -0.117183 -0.190194 0.0224727 0.0805049 -0.0189683 -0.0554897 0.113226 0.156552 -0.0275031 0.0366048 -0.10903 0.0838614 -0.00372496 0.0162146 -5.31945e-06 0.100606 0.114618 0.00612011 -0.124527 -0.0212414 -0.020139 0.0591163 -0.14035 -0.188197 -0.0737023 0.0608191 0.0385814 -0.113835 -0.0459068 -0.0224859 -0.0910004 0.10601 -0.0466949 -0.00897773 
0.0590455 0.0256649 -0.0796628 -0.0673436 0.133258 0.232339 0.0255972 -0.0780433 -0.163811 0.0508149 0.0308661 0.114169 0.101804 -0.0506832 -0.00923286 -0.0984953 -0.00371754 0.162556 0.0656476 0.0801195 0.124689 0.0496686 -0.0278989 0.155465 -0.0251346 0.0565899 -0.0585532 -0.189058 0.104558 0.153051 -0.025221 -0.0130958 -0.102118 -0.00299133 0.103272 0.0278009 -0.0529771 -0.0532509 0.0555739 -0.0387245 0.0542393 -0.0229481 -0.0630236 0.125702 -0.207094 0.00267593 0.158931 0.0537089 -0.118415 -0.060669 0.061734 0.0102882 -0.0158492 -0.0150176 0.078498 0.065812 0.0228998 0.176756 -0.0562212 -0.0544993 -0.0136996 0.0430026 0.224145 -0.0940391 0.102882 -0.149459 0.0325629 -0.0221858 -0.0551975 0.0684803 0.0343521 0.0842477 -0.0720457 -0.0781981 -0.0441512 0.0468724 -0.11188 0.086998 0.0856459 0.0317913 -0.0468444 0.145331 0.0751124 0.064023 -0.00864233 -0.0600556 0.137231 0.0186868 -0.00126565 0.025683 0.0557104 -0.0463704 0.00244589 0.0490919 -0.0980234 -0.188627 0.011462 0.0983562 0.00417377 -0.0386109 0.0918154 0.155458 -0.0241875 0.06076 -0.102179 0.0800582 -0.0140037 0.0164118 -0.0441641 0.0738285 0.0881042 -0.0197039 -0.0753762 -0.0262408 -0.0349178 0.0901836 -0.116601 -0.156261 -0.0941087 0.085 0.0317946 -0.13645 -0.0583743 -0.0722133 -0.108278 0.159219 -0.060154 0.0210571 
0.0379103 0.0663511 -0.092946 -0.0717427 0.141438 0.239075 0.0229823 -0.109605 -0.144295 0.0806406 0.0208561 0.0941072 0.0942562 -0.0306812 0.00847503 -0.108541 -0.00746579 0.170551 0.0759825 0.0738498 0.0848567 0.0447336 -0.00857781 0.132132 -0.0216592 0.040831 -0.0742862 -0.162816 0.126726 0.145126 -0.00169562 0.0066817 -0.0947455 -0.0227808 0.108643 0.0544631 -0.0507659 -0.0533059 0.0505034 -0.0392394 0.047921 -0.0268454 -0.0727285 0.113968 -0.22278 0.0189611 0.149846 0.08682 -0.106903 -0.0586334 0.0399358 0.0441179 -0.0169846 -0.0380526 0.0558179 0.0733605 0.0235868 0.178466 -0.0570391 -0.04126 -0.0397559 0.0640986 0.236016 -0.108158 0.113811 -0.128532 0.0351822 -0.0253785 -0.0779992 0.106044 0.0432904 0.0988033 -0.0655696 -0.0462617 -0.0418259 0.0392424 -0.108552 0.076067 0.07968 -0.0140169 -0.0483575 0.155627 0.0507471 0.0784943 0.00521418 -0.0698155 0.10356 0.0187483 0.0135701 0.0385551 0.0706629 -0.0315662 0.0232442 0.0336493 -0.0593955 -0.206972 0.00600248 0.116123 0.00348898 -0.0358364 0.0923416 0.150943 -0.020354 0.0334977 -0.111104 0.102173 -0.00244 -0.00775737 -0.0036476 0.102024 0.0894376 -0.0107079 -0.055105 -0.0160421 -0.0438318 0.0691245 -0.0884085 -0.152925 -0.065144 0.0927309 0.0518 -0.153325 -0.0565506 -0.0637999 -0.12033 0.153998 -0.0563964 0.027139 
0.0832437 0.0271664 -0.134546 -0.073778 0.136493 0.229735 0.0266447 -0.074593 -0.175283 0.0531275 0.0166679 0.0966197 0.128258 -0.0442008 -0.0404791 -0.0755741 0.00446082 0.152292 0.0435029 0.102025 0.127673 0.0261729 0.000198932 0.140539 -0.0382557 0.0585477 -0.0599532 -0.197942 0.107042 0.155238 -0.0456254 0.0289668 -0.122314 -9.22686e-05 0.0738406 0.0158877 -0.0607892 -0.0183821 0.0453365 -0.0475031 0.0312252 -0.0193125 -0.0583158 0.144732 -0.207082 -5.51844e-05 0.17286 0.0791031 -0.11898 -0.0347131 0.0668932 0.000804427 -0.0303468 -0.0124379 0.0769836 0.0381623 0.0401303 0.181965 -0.00446729 -0.0979924 -0.00608923 0.0563868 0.237335 -0.0880905 0.0741023 -0.147948 0.0244256 0.000831907 -0.0320692 0.053256 0.0123346 0.0949488 -0.0524018 -0.0514603 -0.0659331 0.0246992 -0.0978817 0.0837589 0.0824746 0.0271237 -0.0182886 0.137379 0.0422394 0.0276308 -0.00567367 -0.0559738 0.115205 0.025042 0.0261539 0.00990165 0.0681194 -0.0452588 -0.0161094 0.017994 -0.0811908 -0.172266 0.0290232 0.132361 -0.000255692 -0.0488298 0.0973785 0.148402 -0.000501589 0.0945964 -0.136502 0.0599186 -0.0567646 0.0441512 -0.031228 0.0729027 0.10418 0.0229735 -0.079569 -0.0133121 -0.0454958 0.082193 -0.108857 -0.161561 -0.0876196 0.0700687 0.0113831 -0.116224 -0.0188387 -0.0580842 -0.139701 0.117254 -0.0932768 0.00412025 
0.0614403 0.0527017 -0.0980013 -0.0328142 0.116313 0.225849 0.0324616 -0.131516 -0.154 0.0342631 -0.0174605 0.0461737 0.101451 -0.00885681 0.0157036 -0.0734863 -0.0147167 0.140888 0.0551539 0.0833895 0.0894183 0.0112044 0.0677708 0.105323 -0.0277614 0.0383233 -0.132451 -0.207567 0.110335 0.123548 0.00777424 0.111848 -0.115864 -0.00478983 0.110467 0.0529413 -0.0208072 0.0667075 0.0478127 -0.0632585 0.0350062 -0.0151972 -0.075184 0.0761775 -0.228206 0.0335817 0.16949 0.0972791 -0.107952 -0.0225187 0.0194243 0.0439692 0.0244798 -0.00297174 0.0839663 0.0241272 0.105131 0.162316 0.00472741 -0.114248 -0.0469359 0.104852 0.212415 -0.139716 0.105342 -0.0725294 0.0578093 -0.00852313 -0.0565092 0.127214 -0.00120779 0.104111 -0.0602322 0.0409769 -0.0411695 -0.0259637 -0.115631 0.0312631 0.0844933 0.00558921 -0.0143159 0.158323 -0.00667837 -0.0208178 0.0269741 -0.0732519 0.0562917 0.020145 -0.00894099 0.0191999 0.134458 -0.0146429 0.0364646 -0.0463407 -0.0557609 -0.176073 0.0457102 0.203086 0.0313445 -0.038119 0.0913426 0.13121 0.0154699 0.0937592 -0.119124 0.0571755 -0.0311802 0.0334373 0.0570748 0.0942916 0.0651459 0.0651744 -0.0767905 -0.0469297 -0.0176099 0.0684171 -0.0659512 -0.19125 -0.0369326 0.0911912 0.0567288 -0.0979121 -0.00190502 -0.0341252 -0.153645 0.09589 -0.0435631 0.0314452 
0.0366723 0.0730986 -0.125392 -0.0288893 0.109744 0.199872 0.013009 -0.140007 -0.205634 0.093534 -0.00776213 0.0546649 0.0929144 -0.0140003 -0.00654581 -0.0398633 0.00823762 0.19128 0.108009 0.0677335 0.0744097 -0.00424492 0.0540529 0.087004 -0.0149952 0.0726813 -0.104699 -0.196704 0.126217 0.144698 -0.0292178 0.116977 -0.101569 -0.036057 0.0992978 0.0326522 -0.038571 0.0127738 0.0713086 -0.0493374 0.013364 -0.0223754 -0.0191842 0.104156 -0.216133 0.033509 0.211298 0.066983 -0.132765 -0.044866 0.0705667 0.0359092 -0.00349205 -0.0123698 0.0626184 0.0399399 0.12445 0.14315 0.0367134 -0.0868777 -0.0212479 0.0851475 0.208882 -0.118697 0.118338 -0.0895178 0.0249392 -0.0396103 -0.0454722 0.129644 -0.00966485 0.107924 -0.0565269 0.0316217 -0.0520752 -0.0295645 -0.0966575 0.0723357 0.0547704 -0.0473768 -0.023287 0.170388 -0.00788757 0.00580258 0.00376362 -0.0543286 0.0387186 -0.00343803 0.00940667 0.00630896 0.0730119 0.0135703 0.000715106 -0.0545441 -0.0200862 -0.150749 0.0465092 0.233189 0.0213418 -0.0369214 0.0663622 0.128153 0.0417944 0.0955034 -0.104015 0.0545898 -0.0219383 0.0465367 0.0408869 0.0826986 0.0433491 0.0373901 -0.0414207 -0.0593425 -0.0288904 0.0330851 -0.0345161 -0.200173 -0.0224399 0.0619968 0.0553334 -0.11544 0.0114273 -0.0721889 -0.165247 0.100824 -0.0500909 0.0369485 
0.0800221 0.0260786 -0.0844429 -0.0302652 0.145086 0.222463 0.0452871 -0.165308 -0.1752 0.0225052 -0.0360336 0.0866229 0.0756555 -0.0164067 0.00260949 -0.0677299 0.00112827 0.183978 0.0632464 0.070048 0.0709412 0.0625197 0.0408271 0.114256 -0.0466198 0.0614943 -0.112504 -0.193952 0.0700656 0.141198 -0.0401504 0.124016 -0.12963 0.00547057 0.13792 0.0296184 -0.0126106 0.0046329 0.0501387 -0.0779046 0.0421645 -0.000212012 -0.0215075 0.0797143 -0.223202 0.0607666 0.173009 0.0841202 -0.120557 -0.00842502 0.0631035 -0.013467 0.0324944 -0.00201271 0.0975783 0.0262096 0.0929276 0.168907 0.00611093 -0.0742719 0.00190014 0.119033 0.19462 -0.126419 0.12583 -0.0986997 0.024254 -0.0232106 -0.0651951 0.133755 -0.00268154 0.0805212 -0.037391 0.0189382 -0.0870108 -0.00191767 -0.0959182 0.0217149 0.0771072 -0.050252 0.0273645 0.189236 -0.0197647 -0.0195327 0.0162105 -0.0957354 0.0572244 0.00159466 -0.042291 0.0718091 0.128348 -0.00702816 0.00972884 -0.0329223 -0.0562031 -0.109053 0.0474961 0.183061 0.0485895 -0.0228491 0.101456 0.136804 0.00944155 0.0800746 -0.105825 0.0178458 -0.0365898 0.0165525 -0.0174803 0.12144 0.0915426 0.0423637 -0.0312441 -0.0515788 -0.0345778 0.0499681 -0.0669441 -0.180435 -0.072661 0.0567789 0.0654042 -0.0921551 0.0178087 -0.0637677 -0.130983 0.0924568 -0.0568958 -0.0212416 
0.0750248 0.040103 -0.073015 -0.0243314 0.163443 0.211744 0.0503832 -0.162992 -0.172598 0.0433562 -0.0292597 0.0886081 0.0609227 -0.030878 0.0046088 -0.0447856 0.014713 0.204555 0.0489621 0.0672207 0.0730395 0.0680908 0.0290751 0.126038 -0.038031 0.059025 -0.112834 -0.188788 0.0948874 0.145316 -0.0379543 0.137471 -0.133864 0.00501863 0.133578 0.029662 -0.018539 -0.0103978 0.0530217 -0.0699859 0.0404307 0.00309902 -0.0167992 0.0783314 -0.202728 0.0691645 0.180856 0.0810172 -0.128837 -0.0256028 0.0781042 -0.00145562 0.0104971 -0.0266714 0.0899074 0.0318499 0.0858048 0.171232 0.00789897 -0.0548336 0.00275542 0.104175 0.188075 -0.119908 0.130266 -0.112143 0.0116592 -0.0278383 -0.0696994 0.153178 -0.00129649 0.0930181 -0.0355792 0.0195891 -0.0941686 -0.00841622 -0.0869777 0.0630662 0.0610503 -0.0775639 0.0302511 0.213814 -0.0299837 -0.018536 0.0149456 -0.0933366 0.051607 0.00717212 -0.0495576 0.0749588 0.120948 0.00486134 -0.0153373 -0.0293546 -0.0352746 -0.0888815 0.0465747 0.170024 0.0466523 -0.0206665 0.0893961 0.120647 0.00300114 0.0849332 -0.105208 0.0203555 -0.0368275 0.00883792 0.006984 0.1111 0.078904 0.0526975 -0.0297288 -0.0485859 -0.0163999 0.0371599 -0.0702785 -0.185564 -0.0737573 0.0564714 0.068311 -0.0719135 0.0216357 -0.0557924 -0.133195 0.0958836 -0.0596731 -0.0402731 
0.081826 0.0371566 -0.079335 -0.0444982 0.152893 0.204091 0.0435377 -0.14253 -0.204679 0.0229254 -0.036922 0.0830659 0.0839712 -0.010772 -0.00307524 -0.0542265 0.0226175 0.166188 0.0587185 0.0879082 0.0794197 0.0608374 0.0398409 0.092164 -0.054498 0.0872243 -0.106729 -0.183168 0.100229 0.133039 -0.059122 0.131716 -0.121187 0.0158206 0.117324 0.0225609 -0.000963145 0.0387058 0.055828 -0.0759152 0.0400689 0.00793436 -0.0136807 0.0738984 -0.215964 0.0843796 0.194112 0.0700145 -0.14652 -0.0200461 0.0559043 0.00420777 0.00578638 0.00705296 0.0991697 0.0153133 0.0990591 0.167484 -0.00566903 -0.0774989 0.00900585 0.106547 0.197475 -0.112329 0.132472 -0.0969584 0.0165665 -0.00958033 -0.0490676 0.126435 -0.00213034 0.0716864 -0.0353874 0.0295949 -0.0712506 -0.00199383 -0.0879352 0.0498613 0.0785503 -0.0628516 0.0150551 0.195717 -0.0113934 -0.0191186 0.0176353 -0.0975599 0.0654425 0.0240295 -0.0340772 0.0668482 0.134168 -0.0134977 -0.00555492 -0.0205944 -0.0495875 -0.114886 0.0679235 0.188237 0.0406006 -0.0290493 0.0767108 0.138715 0.00502427 0.1106 -0.119947 0.0289502 -0.0436351 0.0408457 0.00582391 0.0799862 0.0887441 0.0511487 -0.0576819 -0.0291979 -0.0172861 0.0364502 -0.0813699 -0.201696 -0.070109 0.0546145 0.0506226 -0.0673749 0.0272207 -0.0598172 -0.120579 0.0884771 -0.0532047 -0.0378028 
0.0391179 0.074402 -0.0324741 -0.0252818 0.124947 0.215786 0.0344428 -0.151218 -0.198966 0.102464 -0.0413612 0.0586713 0.068314 -0.0190799 0.0651286 -0.0490308 0.0155534 0.208705 0.108469 0.0199822 0.0575683 0.0579089 0.0115153 0.0870911 -0.00782627 0.0734515 -0.159188 -0.170722 0.112519 0.140376 -0.0162189 0.138724 -0.109149 -0.0203661 0.15134 0.0281221 -0.00424114 -0.0298635 0.101712 -0.0706444 0.0496399 -0.0134715 0.00914884 0.0373226 -0.201975 0.0512844 0.178065 0.061274 -0.131735 -0.0740745 0.092572 0.0225852 0.0392287 -0.0096643 0.0721716 0.0434235 0.123801 0.115302 0.00659605 -0.0658961 -0.0160419 0.109849 0.128156 -0.131032 0.124591 -0.0435904 0.0325938 -0.0357626 -0.0860185 0.119816 0.0120666 0.101381 -0.0586388 0.00647947 -0.0484859 0.0110404 -0.119787 0.025485 0.0932959 -0.0530268 0.0133028 0.201358 0.0252119 0.0364951 0.0377223 -0.0868704 0.0544114 0.00147093 -0.0204694 0.0599278 0.0652045 0.0394126 0.0260711 -0.0119717 -0.0741207 -0.129606 0.0515272 0.209049 0.0129996 -0.0261228 0.100681 0.136256 0.0247481 0.0656875 -0.0951778 0.0415226 0.00116456 -0.00135752 0.0310758 0.116966 0.0510785 0.00191725 -0.0419522 -0.0860877 -0.0116807 0.0279396 -0.0731921 -0.175315 -0.0754247 0.0434566 0.0984345 -0.127442 0.0127807 -0.0957013 -0.123061 0.123124 -0.0259407 0.015779 
0.0825538 -0.010448 -0.0402384 -0.02317 0.134864 0.215555 0.0920895 -0.0604156 -0.150331 0.0449352 -0.0224634 0.0978162 0.134181 -0.0438358 0.0215291 -0.0780785 0.0204064 0.171835 0.0103802 0.104095 0.135487 0.0127761 -0.0116475 0.231753 -0.0404839 -0.00471536 -0.146658 -0.207584 0.0684042 0.159086 -0.0211228 0.0612125 -0.132442 0.0391423 0.0929456 0.0212092 -0.0324189 -0.0189279 0.00430823 -0.0708308 0.0654465 -0.0115754 -0.0250279 0.0702505 -0.18865 -0.0280615 0.149094 0.0676472 -0.0900069 -0.0276129 0.0845184 -0.081787 0.0151357 -0.00783821 0.124069 0.0547635 0.0432025 0.174062 0.020129 -0.0970417 -0.0136289 0.0991187 0.130519 -0.14177 0.0792985 -0.0901362 0.034711 -0.0465111 -0.11122 0.0118315 0.00440863 0.097986 -0.0606248 -0.039515 -0.0606276 0.0580037 -0.0695995 0.0676242 0.136043 0.0235537 -0.011961 0.12668 0.0269957 0.0106935 0.0187169 -0.0416917 0.116203 0.0129865 -0.0104854 0.0373935 0.0644828 -0.0305396 0.0303538 0.0044847 -0.126684 -0.116753 0.0129739 0.122677 0.0156361 -0.0164456 0.130847 0.121007 -0.000169583 0.107298 -0.119495 0.0371211 -0.0618247 -0.00472131 -0.0349783 0.0885317 0.0533593 0.0325576 -0.0578935 -0.0745177 -0.042632 0.108664 -0.0961868 -0.133996 -0.150598 0.0963613 0.020261 -0.110809 -0.0398294 -0.0427657 -0.158922 0.150061 -0.110216 -0.0331408 
0.12328 -0.0501055 -0.100541 -0.0308721 0.144228 0.188259 0.0986123 -0.0426534 -0.136244 0.0361498 -0.0115241 0.0820097 0.161937 0.0016483 -0.00459131 -0.0656991 0.0136676 0.154495 -0.0114812 0.115128 0.171032 -0.0211281 0.014296 0.216305 -0.028489 -0.0267687 -0.137979 -0.202604 0.058751 0.183165 -0.0588574 0.0630803 -0.141412 0.0365466 0.0510713 0.00595223 -0.0707319 0.0046923 -0.00132598 -0.0879661 0.0199381 0.0169369 -0.03856 0.0817476 -0.176089 -0.0537215 0.114959 0.0949044 -0.049758 -0.00267061 0.0659262 -0.0712051 0.0176927 0.00359843 0.12736 0.0186136 0.0455641 0.180233 0.0314317 -0.129767 0.00156877 0.0863281 0.151293 -0.0961214 0.00709053 -0.0666214 0.0224045 0.0166324 -0.0582331 -0.0223793 0.00942594 0.122805 -0.0475676 -0.0556269 -0.0901251 0.0541249 -0.0516913 0.0138195 0.129039 0.0583652 0.0237776 0.106039 0.00574199 -0.0332251 0.0162546 -0.023333 0.102844 0.0239192 0.0314555 0.0105256 0.083989 -0.037169 0.0043015 -0.00271173 -0.129518 -0.126145 -0.00697684 0.113817 0.0309864 -0.0394821 0.169245 0.0959159 0.0308371 0.0975951 -0.156698 0.0321998 -0.105192 0.0137098 -0.0140217 0.0759677 0.089012 0.0595835 -0.0817296 -0.0591266 -0.0297624 0.148894 -0.0858484 -0.10468 -0.141982 0.0836915 -0.0141435 -0.0913893 -0.0177628 -0.0181964 -0.192648 0.126821 -0.113819 -0.0217778 
