{
  "descriptor": [
    -0.08598867803812027,
    0.01687825657427311,
    0.04783034697175026,
    -0.11333232372999191,
    -0.0018149197567254305,
    -0.08712855726480484,
    -0.016751183196902275,
    -0.17162322998046875,
    0.2459796667098999,
    -0.13237477838993073,
    0.1893889456987381,
    -0.05748636648058891,
    -0.2646959722042084,
    -0.046405646950006485,
    -0.04683076590299606,
    0.20219482481479645,
    -0.16759610176086426,
    -0.2516420781612396,
    -0.06839681416749954,
    -0.016924364492297173,
    -0.04161038622260094,
    -0.03559098020195961,
    -0.00957468245178461,
    0.08571670204401016,
    -0.10258115828037262,
    -0.34233468770980835,
    -0.09615656733512878,
    -0.11289436370134354,
    -0.0010603313567116857,
    -0.030240023508667946,
    0.050395555794239044,
    0.1386987566947937,
    -0.21168245375156403,
    -0.02834203466773033,
    0.07477755099534988,
    0.10613065958023071,
    -0.03471329063177109,
    -0.09783463180065155,
    0.17515869438648224,
    -0.0332811176776886,
    -0.2618032991886139,
    -0.13061970472335815,
    0.07867695391178131,
    0.2354777306318283,
    0.18457111716270447,
    -0.04883215203881264,
    -0.009187406860291958,
    -0.11855237931013107,
    0.09084087610244751,
    -0.2722169756889343,
    -0.02621055766940117,
    0.1329382359981537,
    0.1062002032995224,
    0.09042771905660629,
    0.051873303949832916,
    -0.17158016562461853,
    0.08130376040935516,
    0.05355917289853096,
    -0.21826697885990143,
    -0.010754123330116272,
    0.046567123383283615,
    -0.0922054871916771,
    -0.07349362969398499,
    -0.040381863713264465,
    0.21791385114192963,
    0.07758782058954239,
    -0.18319296836853027,
    -0.052198804914951324,
    0.22087974846363068,
    -0.1468912810087204,
    0.047123707830905914,
    0.041515424847602844,
    -0.12572124600410461,
    -0.20966677367687225,
    -0.2740750312805176,
    -0.05951188877224922,
    0.41489720344543457,
    0.07017847895622253,
    -0.14506299793720245,
    0.08215135335922241,
    -0.06978882104158401,
    0.01390370074659586,
    -0.029962938278913498,
    0.08793513476848602,
    -0.10345440357923508,
    0.03773151710629463,
    -0.047735970467329025,
    0.0364033468067646,
    0.17571233212947845,
    -0.03012414090335369,
    0.03052101470530033,
    0.1688922643661499,
    -0.099097341299057,
    -0.00825740396976471,
    0.04316020756959915,
    0.10130197554826736,
    -0.06499411910772324,
    -0.03429543599486351,
    -0.18235939741134644,
    -0.01849302463233471,
    0.008433099836111069,
    -0.03817540779709816,
    0.013500086963176727,
    0.10238602757453918,
    -0.15975379943847656,
    0.11577937752008438,
    0.07553175091743469,
    -0.03510211408138275,
    0.04776311665773392,
    0.05114447697997093,
    -0.06358956545591354,
    -0.13996438682079315,
    0.1352195143699646,
    -0.1974957138299942,
    0.16548189520835876,
    0.15066394209861755,
    0.018070101737976074,
    0.1440768986940384,
    0.0228967797011137,
    0.08462397009134293,
    -0.05166091024875641,
    -0.07042970508337021,
    -0.12389525026082993,
    -0.04825009033083916,
    0.046279795467853546,
    0.005297480151057243,
    0.011271793395280838,
    -0.022399496287107468
  ]
}