{
  "descriptor": [
    -0.09385751187801361,
    0.05694693699479103,
    0.1358879953622818,
    -0.10860883444547653,
    -0.1611682027578354,
    0.006586750969290733,
    -0.0512230359017849,
    -0.10441429167985916,
    0.1921275407075882,
    -0.1493489295244217,
    0.19950537383556366,
    -0.0466119758784771,
    -0.24162741005420685,
    0.07282859086990356,
    -0.07892221212387085,
    0.12694896757602692,
    -0.11607146263122559,
    -0.1868646889925003,
    0.007843025028705597,
    -0.08547905087471008,
    0.04802589491009712,
    0.1520022749900818,
    -0.028208930045366287,
    0.05822848528623581,
    -0.10721412301063538,
    -0.3326117992401123,
    -0.0719064399600029,
    -0.09851730614900589,
    0.006535693071782589,
    -0.1165892481803894,
    -0.03509555384516716,
    0.12589971721172333,
    -0.14742176234722137,
    0.016626378521323204,
    0.02113289386034012,
    0.07409336417913437,
    -0.06590178608894348,
    -0.11977114528417587,
    0.2566694915294647,
    0.11598268151283264,
    -0.2162773460149765,
    -0.024981221184134483,
    0.06330627202987671,
    0.25545626878738403,
    0.11124922335147858,
    -0.06061476096510887,
    0.012042945250868797,
    -0.043594829738140106,
    0.11728507280349731,
    -0.2569882273674011,
    -0.009313574992120266,
    0.23727849125862122,
    0.07065005600452423,
    0.09515807777643204,
    0.06814458966255188,
    -0.12371350824832916,
    -0.004876402206718922,
    0.09037499874830246,
    -0.15796203911304474,
    0.07864774018526077,
    0.07292544096708298,
    -0.09904351085424423,
    -0.008504153229296207,
    -0.06992809474468231,
    0.17704500257968903,
    0.08481944352388382,
    -0.07912930846214294,
    -0.10384806245565414,
    0.13901840150356293,
    -0.12456744909286499,
    -0.174368754029274,
    0.07817571610212326,
    -0.16531114280223846,
    -0.138464093208313,
    -0.1893358677625656,
    0.042605988681316376,
    0.3696313798427582,
    0.09434405714273453,
    -0.10131428390741348,
    0.07787547260522842,
    -0.029215119779109955,
    -0.06955018639564514,
    -0.005310002248734236,
    0.0809936448931694,
    -0.08042549341917038,
    0.05214288458228111,
    -0.016252705827355385,
    0.05150219798088074,
    0.22891521453857422,
    0.017207415774464607,
    0.010434674099087715,
    0.24081993103027344,
    -0.018841613084077835,
    0.06644636392593384,
    0.06558212637901306,
    0.07739774882793427,
    -0.061005253344774246,
    -0.06195855140686035,
    -0.128692626953125,
    -0.022654244676232338,
    0.0006611907156184316,
    -0.10410939157009125,
    -0.010659373365342617,
    0.1358548104763031,
    -0.25992798805236816,
    0.12450617551803589,
    -0.042707689106464386,
    -0.08765369653701782,
    -0.04507856443524361,
    0.02846788801252842,
    -0.06947983056306839,
    0.005645979195833206,
    0.15194100141525269,
    -0.20914307236671448,
    0.1515411138534546,
    0.15814480185508728,
    0.04220665991306305,
    0.1282556802034378,
    0.06452867388725281,
    -0.006172092165797949,
    -0.021244699135422707,
    -0.07716640830039978,
    -0.12514786422252655,
    -0.13165412843227386,
    0.08379888534545898,
    0.024055317044258118,
    -0.02276686765253544,
    0.018952080979943275
  ]
}