0.068691 -0.0450753 -0.0903832 -0.0403475 0.057166 0.109722 0.0256526 0.0289223 -0.0674106 -0.097146 -0.0157249 0.104564 0.0750162 -0.222262 -0.15377 -0.0336652 -0.161261 0.0236998 -0.181066 0.208334 0.107393 -0.0667982 0.0983012 0.0548069 -0.116673 0.0251901 -0.0257635 -0.225856 -0.0435426 -0.0234843 -0.0581428 -0.0054029 -0.0889615 0.0988874 -0.0297344 -0.0532545 -0.096539 0.148075 -0.116491 -0.0365926 0.0206237 -0.0845159 -0.0742807 0.199526 -0.141913 -0.0489803 0.12788 0.0473716 -0.1116 0.193078 0.00419899 -0.130293 -0.100369 0.0302794 0.0770441 -0.0846522 -0.0102859 0.0904267 0.0183184 -0.146103 0.0221598 0.00679555 0.207395 0.0471109 0.0451714 -0.223566 -0.00585301 0.00013395 0.00501437 0.0338225 -0.0443151 0.0229217 0.0471695 0.0777043 -0.0650984 -0.0624669 -0.0656062 0.0531842 0.0233564 0.104751 -0.00943944 -0.00684175 -0.0612302 -0.0597955 -0.0868697 -0.00539186 0.0899177 0.0848207 0.0533103 0.00450839 0.107575 -0.104764 -0.0932624 -0.0545458 -0.0765822 -0.0293018 0.00270428 0.0436735 -0.0132384 -0.0495682 0.00857473 0.0177461 -0.0470709 0.106864 -0.0222306 -0.046604 -0.113645 0.190484 -0.0256475 -0.0177109 0.0634987 0.192434 -0.0729803 0.0260903 -0.0229226 0.0610401 -0.0732389 -0.0770424 0.01008 0.0752029 -0.0617551 0.0835167 0.0320331 0.0522651 -0.0379455 -0.0548194 -0.0458891 -0.0675157 
0.0613999 -0.0528992 -0.0783778 -0.0410898 0.046879 0.0980159 -0.00139578 0.0460453 -0.0680126 -0.0939423 -0.0230951 0.085603 0.0789324 -0.234445 -0.14809 0.0102906 -0.153393 0.015901 -0.18991 0.217541 0.125149 -0.0758855 0.114142 0.041753 -0.126605 0.0277384 -0.0378209 -0.244196 -0.0497888 -0.0418929 -0.0455992 0.00419092 -0.0779095 0.101423 -0.033564 -0.0378203 -0.0983256 0.156319 -0.112604 -0.0295462 -0.00431294 -0.0880484 -0.0810103 0.179633 -0.101432 -0.0409492 0.123991 0.0414311 -0.123472 0.193683 0.00203688 -0.148804 -0.104754 0.0303352 0.0574097 -0.089902 0.0130794 0.0608658 0.0243497 -0.133168 0.0341785 0.010849 0.178955 0.0462335 0.0607472 -0.242672 -0.0196084 0.01235 0.0134885 0.0196092 -0.0486058 0.0142536 0.0361711 0.0603667 -0.0699236 -0.066444 -0.0564413 0.0736801 0.0190924 0.113779 -0.00817423 -0.0257989 -0.078127 -0.055367 -0.107023 0.0171476 0.0803366 0.0801277 0.0425888 -0.00421029 0.0935473 -0.0911469 -0.105443 -0.0359848 -0.0730337 0.0114645 -0.00025951 0.047292 -0.0370584 -0.0308102 0.00942194 -0.00667848 -0.0806196 0.105829 0.00870007 -0.0513454 -0.110983 0.178799 -0.0177016 -0.0259814 0.0192399 0.190384 -0.0641744 0.0183683 -0.0113012 0.0697602 -0.0823851 -0.0709497 -0.00742392 0.0754917 -0.0794225 0.0991736 0.0433719 0.0588143 -0.0267564 -0.0574873 -0.0511536 -0.0751965 
0.048968 -0.0466174 -0.0957732 -0.0752764 0.0566848 0.0911365 0.0387082 0.0582915 -0.0739966 -0.0743101 -0.0591982 0.0998254 0.0664496 -0.219263 -0.1512 -0.0343313 -0.168075 0.0192807 -0.178221 0.171924 0.0699395 -0.0497045 0.0830188 0.0624482 -0.142707 0.0191243 0.00301856 -0.207404 -0.0432351 -0.0338823 -0.0913894 -0.0145587 -0.105398 0.0750741 -0.0479142 -0.0717177 -0.113501 0.11225 -0.153272 0.00585603 0.0294873 -0.0769662 -0.0719197 0.20338 -0.123873 -0.00507817 0.12042 0.0513069 -0.128195 0.175926 0.0178705 -0.166427 -0.0915523 0.00413494 0.048961 -0.0643375 -0.0152992 0.110907 0.0429708 -0.117202 0.0504104 0.0402208 0.17997 0.0731513 0.0405288 -0.232093 -0.0195338 -0.00209077 0.0110436 0.00770319 -0.0537785 0.0169166 0.0672204 0.0624384 -0.0649995 -0.0200735 -0.0694258 0.0559645 0.023953 0.0590896 0.0110901 -0.00657196 -0.0875287 -0.0544724 -0.104675 -0.00094517 0.0929152 0.0617018 0.0294129 0.00753959 0.0792914 -0.0831699 -0.0987377 -0.0708735 -0.0631515 0.0223902 0.0170048 0.01506 0.00773963 -0.0316106 0.00916754 -0.00922245 -0.0457505 0.0997536 -0.0554766 -0.0803728 -0.153416 0.180405 -0.0892733 -0.0133124 0.11016 0.190144 -0.038787 -0.00370926 -0.0621178 0.0641914 -0.101391 -0.0534038 -0.0083878 0.0478761 -0.0730605 0.0677673 0.0216709 0.0369468 -0.0525343 -0.0515969 -0.133726 -0.112063 
0.0486254 -0.0495019 -0.105753 -0.0851083 0.0568962 0.0987662 0.0467471 0.0818656 -0.0582273 -0.0726591 -0.0532626 0.0942759 0.0667234 -0.230803 -0.14899 -0.0381936 -0.162995 0.022195 -0.184532 0.15779 0.0701017 -0.0451124 0.0691418 0.0720252 -0.148011 0.000129535 0.0116594 -0.205628 -0.039549 -0.0423041 -0.081595 -0.0253794 -0.101772 0.0756676 -0.0546129 -0.0726432 -0.11172 0.0792016 -0.163303 0.0151222 0.0447646 -0.0831475 -0.0741815 0.211412 -0.119761 -0.0111627 0.107011 0.0571742 -0.129893 0.165946 0.00639308 -0.174241 -0.0908841 -0.00896183 0.0265506 -0.0496778 -0.0264659 0.108278 0.0397551 -0.106959 0.0435478 0.0472912 0.17424 0.0723563 0.0242068 -0.232886 -0.0180703 -0.0081896 0.0154193 -0.00224722 -0.0585629 0.00585509 0.0591321 0.0454372 -0.0622746 -0.0121371 -0.0694795 0.0690067 0.0155507 0.0527166 0.0060184 -0.00716226 -0.0911345 -0.0493506 -0.104579 0.0294103 0.0972813 0.0489815 0.0168697 0.0103448 0.0851664 -0.0849879 -0.112268 -0.0728308 -0.0568506 0.0301028 0.00487339 0.000853252 -0.00229831 -0.0280713 0.0141936 -0.0242126 -0.0423105 0.0916152 -0.0550132 -0.0803051 -0.154637 0.17847 -0.109372 -0.0110284 0.112484 0.17719 -0.0294601 -0.0167169 -0.0671421 0.0635341 -0.107415 -0.050232 -0.000555759 0.049873 -0.0677994 0.0548542 0.00894779 0.0496068 -0.0585412 -0.0570789 -0.153978 -0.11372 
0.0595409 -0.00861425 -0.0395378 -0.0893019 0.0300878 0.144737 0.0650424 0.0929728 -0.0917381 -0.0517025 -0.043826 0.0621678 0.10051 -0.248261 -0.0970104 -0.0108396 -0.177001 0.00275005 -0.199458 0.144717 0.119221 -0.0320024 0.0539618 0.0388567 -0.140566 0.0182208 -0.0661356 -0.227789 -0.00330252 -0.0219947 -0.0521492 0.00787904 -0.120072 0.111202 -0.0198464 -0.0851108 -0.0870744 0.126797 -0.0976315 0.00449945 0.0200629 -0.114856 -0.0509135 0.194995 -0.0942698 -0.0516941 0.116511 0.0406252 -0.159629 0.162257 0.0399916 -0.166919 -0.119046 0.0183406 0.0369175 -0.0531663 -0.0315433 0.0993161 0.0238777 -0.135008 0.0271819 0.00892996 0.161596 0.0298285 0.0586603 -0.216028 -0.00959909 -0.0222131 -0.0224548 -0.011965 -0.0547824 0.0181016 0.0359515 0.0591629 -0.0702519 -0.0508625 -0.0617813 0.0443926 0.0531938 0.110727 0.0278066 -0.0495961 -0.0484084 -0.0347791 -0.0927396 -0.0145737 0.111824 0.0466013 0.0504818 0.032786 0.0803319 -0.121435 -0.119014 -0.0299937 -0.106251 0.0307634 0.0247913 0.0307054 -0.0376031 0.00967279 0.0138185 0.0243657 -0.0825238 0.125206 -0.0444479 -0.0695571 -0.135668 0.190432 -0.0434014 -0.0403406 0.0643507 0.175401 -0.0997924 -0.00185991 -0.00768598 0.0693355 -0.0872169 -0.0421127 -0.0215837 0.0665979 -0.043221 0.0509735 0.0468644 0.060214 -0.00493821 -0.0668024 -0.0769291 -0.101236 
0.0426163 -0.018365 -0.0352488 -0.0794978 0.0589198 0.13548 0.0924452 0.0801816 -0.0635455 -0.047561 -0.0381786 0.0724282 0.0920148 -0.243658 -0.0720365 -0.044577 -0.215147 0.0116027 -0.191744 0.136703 0.12687 -0.0499122 0.0432977 0.093415 -0.103699 -0.027135 -0.0746182 -0.231857 0.0168156 0.00184879 -0.0291815 -0.0170834 -0.134554 0.0910967 -0.0102917 -0.0650315 -0.113161 0.0671831 -0.114707 -0.00085186 0.0643654 -0.122089 -0.0691464 0.217501 -0.120567 -0.0432969 0.107948 0.0712219 -0.131261 0.12959 0.0026374 -0.161103 -0.103833 -0.025685 0.0464989 -0.0273605 -0.0647923 0.134356 0.00754946 -0.108704 0.0178136 0.0231721 0.170509 0.0538231 0.0414459 -0.201256 -0.0031589 -0.0395073 -0.0218947 -0.00717241 -0.0556532 0.0523234 0.0253333 0.0425187 -0.0579556 -0.0337059 -0.0784693 0.0567015 0.0625233 0.12432 0.0206213 -0.0447934 -0.0546571 -0.0218054 -0.0890974 0.00265353 0.123096 0.0467898 0.0191903 0.0227811 0.107499 -0.0991173 -0.107417 -0.054503 -0.127052 -0.00936753 -0.0154838 0.0133697 0.00376654 -0.0109822 0.0275382 -0.00168718 -0.0519177 0.0856348 -0.0574799 -0.0455052 -0.136324 0.206352 -0.0309138 -0.0171118 0.0829896 0.160133 -0.109639 -0.0313381 -0.0168233 0.101636 -0.0825959 -0.0283614 -0.0140506 0.101622 -0.0280739 0.0330142 -0.0158136 0.0817125 -0.0692434 -0.0341199 -0.105826 -0.0772368 
0.0504377 -0.0293337 -0.087082 -0.071587 0.0926762 0.116894 0.0502882 0.0164688 -0.0958074 -0.103611 -0.066205 0.0743214 0.0737574 -0.155368 -0.0861785 -0.052485 -0.181093 -0.0233253 -0.146289 0.156344 0.0994326 -0.0639444 0.0407718 0.0758689 -0.0424845 0.00181452 -0.0332172 -0.187997 -0.0302694 0.0134595 -0.0294625 -0.0310018 -0.146646 0.0655428 -0.0150285 -0.0117075 -0.12858 0.0546387 -0.119893 -0.038619 0.0681168 -0.0744634 -0.0178212 0.232842 -0.109473 0.0399563 0.14487 0.076821 -0.128906 0.11727 -0.0161191 -0.157871 -0.0652388 -0.0324483 0.106144 -0.0452922 -0.104387 0.184465 0.0411713 -0.146284 0.0247466 0.0586955 0.188283 0.062454 0.0341835 -0.148355 -0.0173018 0.0241586 -0.000304661 -0.00564349 -0.0207911 0.0707245 0.0473648 -0.00096917 -0.0375535 0.00889873 -0.0823083 0.0327928 0.0553202 0.125398 0.0304952 -0.011493 -0.065139 -0.0550839 -0.126086 -0.0225097 0.100981 0.0643796 0.0146512 0.020511 0.102668 -0.0839301 -0.0888807 -0.0754206 -0.117428 0.000233918 0.0232858 0.027189 0.0251361 -0.0668894 -0.00779806 0.0117701 -0.0171742 0.067946 -0.152053 -0.00883125 -0.188053 0.212864 -0.063715 -0.0144334 0.154875 0.157937 -0.125455 0.000550543 -0.0341518 0.0874914 -0.11874 -0.0409808 -0.0171464 0.0863096 -0.0427267 0.0450865 0.0091583 0.0587054 -0.0843439 -0.0244337 -0.101351 -0.0924728 
0.0666336 0.0039471 -0.128279 -0.085853 0.113776 0.15227 0.0534549 -0.00543251 -0.118635 -0.0997563 -0.0730865 0.0556884 0.0901596 -0.112896 -0.0754444 -0.0605596 -0.149668 -0.0286842 -0.119521 0.133609 0.0919367 -0.0600079 0.0537386 0.0628417 -0.0214988 -0.0201827 -0.0379387 -0.172299 -0.0218729 0.0423082 -0.0218656 -0.0362472 -0.152893 0.0473928 -0.00705634 -0.00542751 -0.120852 0.0391881 -0.0977595 -0.0428932 0.0580714 -0.0557439 -0.00124299 0.217602 -0.127181 0.0654295 0.146862 0.0900709 -0.134099 0.107458 -0.0114768 -0.128693 -0.0406572 -0.035694 0.0966805 -0.0430644 -0.0858923 0.20956 0.0526063 -0.155583 0.00249976 0.0893237 0.201696 0.0151227 0.027948 -0.121274 -0.0208447 0.0505558 -0.0151634 -0.00540542 -0.00128951 0.0884335 0.0303498 -0.0227167 -0.0294949 0.0398733 -0.0842307 0.00438626 0.0604337 0.131031 0.0300502 -0.0128207 -0.0475432 -0.0380328 -0.120708 -0.0220395 0.084607 0.0462128 0.01314 0.0209351 0.0973815 -0.0918868 -0.0774346 -0.0750071 -0.104046 -0.0253289 0.035979 0.0639569 0.0157769 -0.0739358 0.00648775 0.0415655 0.00220598 0.0792715 -0.197745 0.0113175 -0.197531 0.209908 -0.0661904 -0.00304664 0.184551 0.133332 -0.118748 0.0132086 -0.0449743 0.102105 -0.133973 -0.0253171 -0.0185317 0.099632 -0.0372469 0.00614632 0.00990194 0.0436572 -0.0988674 -0.0122981 -0.112237 -0.0812043 
0.0801347 0.0334466 -0.130739 -0.0609756 0.105299 0.157626 0.0756103 -0.00927074 -0.154355 -0.0597178 -0.0464893 0.065364 0.126407 -0.118366 -0.0766877 -0.0293022 -0.102793 0.0204947 -0.13429 0.154553 0.113873 -0.073079 0.0462685 0.0775842 -0.0288003 -0.0200518 -0.0683202 -0.188374 0.00585196 0.0869652 -0.0536494 0.0450698 -0.126274 0.0737345 -0.0197951 -0.0336477 -0.0936083 0.0634839 -0.0740746 -0.0540541 0.0507713 -0.0839983 0.0415405 0.184222 -0.140732 0.0355233 0.184932 0.0568929 -0.173601 0.0952712 0.0443285 -0.130399 -0.0506174 -0.0116521 0.0979652 -0.0337564 -0.0575431 0.175409 0.064441 -0.161265 -0.0119152 0.0644025 0.182178 -0.0331074 0.0370536 -0.100081 -0.0349059 0.0206276 -0.0657949 -0.0308999 -0.0213755 0.0674434 0.00657308 -0.0133443 -0.0160232 0.0413516 -0.0524146 0.0111276 0.0537155 0.114649 0.0233758 -0.0134698 -0.0373472 -0.0377562 -0.103584 0.0139477 0.0759251 0.013817 0.0183232 0.0354112 0.0659551 -0.120349 -0.100001 -0.0611975 -0.112006 -0.00765857 0.0325413 0.100312 0.00935465 -0.0631869 0.0161732 0.0496748 0.0100219 0.159266 -0.179975 0.0109278 -0.190197 0.238941 -0.055934 -0.040046 0.122047 0.138181 -0.124957 0.00130026 -0.036469 0.0801985 -0.131768 -0.044201 -0.0167071 0.119966 -0.0249935 -0.00856476 0.0269794 0.0405896 -0.0759302 -0.00686101 -0.097507 -0.0921244 
0.0743735 0.0250186 -0.150514 -0.0682725 0.114057 0.162441 0.050538 -0.0345562 -0.166344 -0.0497829 -0.0563059 0.0763026 0.12491 -0.0728407 -0.0894212 -0.0416601 -0.0862089 0.0248732 -0.0994308 0.14458 0.0986776 -0.0705523 0.0517729 0.0775857 -0.0170718 0.0109296 -0.0456672 -0.174722 -0.00439194 0.0863025 -0.0532583 0.0419461 -0.138383 0.0459789 -0.0255628 -0.0166409 -0.11365 0.0632966 -0.062578 -0.0497759 0.0389603 -0.0541462 0.0238609 0.184713 -0.146221 0.0433384 0.185228 0.0621649 -0.156329 0.0759962 0.0550975 -0.102668 -0.0370379 -0.0156673 0.104979 -0.0331218 -0.0407936 0.205641 0.0811362 -0.174489 -0.00168023 0.0750555 0.199084 -0.0250232 0.0312644 -0.0944547 -0.0214748 0.0605962 -0.0393316 -0.00227836 -0.00388083 0.0897377 0.0142779 -0.0208592 -0.0245821 0.0496279 -0.0668467 0.00395376 0.0528517 0.102469 0.0179527 0.0161026 -0.025203 -0.0461956 -0.104081 -0.0217137 0.0862352 0.0313795 0.033176 0.00829092 0.0495389 -0.099719 -0.0675638 -0.0575579 -0.10092 -0.0297322 0.0503078 0.108291 0.0179721 -0.0813749 0.0160573 0.0656528 0.0138718 0.154751 -0.199996 0.0188037 -0.209525 0.208534 -0.0663613 -0.0334258 0.148892 0.144186 -0.118691 0.0132799 -0.042386 0.0789184 -0.149741 -0.0614687 -0.0224081 0.101352 -0.0286688 -0.0137363 0.0308504 0.00589679 -0.0945278 0.0102774 -0.112886 -0.0766304 
0.072222 0.0488591 -0.135099 -0.06601 0.107654 0.162288 0.0545021 -0.0315359 -0.170763 -0.0400884 -0.0393748 0.0677594 0.136699 -0.0839371 -0.0780147 -0.0234485 -0.0951497 0.0272912 -0.127159 0.155418 0.107097 -0.0778191 0.0578229 0.0616682 -0.0198558 -0.00322469 -0.0700993 -0.172217 0.00958505 0.08821 -0.0531935 0.0574635 -0.130134 0.0588583 -0.0297757 -0.015246 -0.110599 0.0743137 -0.0570678 -0.043902 0.0358539 -0.0753102 0.0333162 0.172818 -0.147654 0.0387903 0.190019 0.0601504 -0.175743 0.086986 0.0559073 -0.0979617 -0.0633198 -0.00699082 0.094666 -0.0396521 -0.046038 0.184119 0.0719726 -0.164734 -0.0176538 0.0673206 0.192285 -0.0332808 0.0378419 -0.0885517 -0.0295356 0.053777 -0.0625642 -0.00609166 0.000448363 0.0893568 0.0125711 -0.00901525 -0.0107001 0.0442933 -0.0614025 0.000791157 0.0481907 0.109332 0.0242765 -0.00571733 -0.0242009 -0.0343927 -0.113871 0.00655645 0.0773515 0.0197697 0.033277 0.0216266 0.0480255 -0.117808 -0.0804254 -0.0516886 -0.110873 -0.0289739 0.0355333 0.115707 0.00805895 -0.0751378 0.01257 0.0608735 0.00794201 0.165981 -0.182272 0.0314366 -0.201213 0.23798 -0.0410718 -0.0486577 0.116554 0.145859 -0.126785 0.0204477 -0.0348046 0.073882 -0.141167 -0.0448966 -0.0117719 0.120976 -0.0227609 -0.0176528 0.0341011 0.0263504 -0.0806625 0.00544865 -0.0943159 -0.0718767 
0.0748869 0.0588955 -0.151801 -0.0571376 0.109533 0.143702 0.0548914 -0.0411405 -0.16498 -0.041311 -0.0419167 0.0751645 0.134136 -0.0930377 -0.0961391 -0.00167485 -0.0789954 0.0197783 -0.134201 0.168195 0.101799 -0.0809409 0.0577474 0.0470334 -0.0256127 0.00373157 -0.0645281 -0.169164 0.00747939 0.101092 -0.0654183 0.0792977 -0.116716 0.0598985 -0.037253 -0.0291125 -0.0961088 0.0916411 -0.0518831 -0.0459176 0.02517 -0.0741219 0.0534664 0.161049 -0.135593 0.0487399 0.195213 0.0486561 -0.174495 0.0923685 0.0685265 -0.0978866 -0.0634068 -0.00193079 0.0992668 -0.048953 -0.0409365 0.167162 0.074093 -0.158517 -0.0180011 0.0509739 0.184347 -0.0402006 0.0410832 -0.0985511 -0.041942 0.0521781 -0.0701981 -0.0257874 -0.00259446 0.0775916 0.0110336 -0.00538526 -0.0097361 0.0536077 -0.0447979 0.00459141 0.0348265 0.106708 0.0287573 -0.00703075 -0.028452 -0.0259683 -0.110119 0.00944766 0.0635262 0.0166423 0.0354407 0.020504 0.0243831 -0.123261 -0.0920477 -0.0453088 -0.0996527 -0.0144078 0.0447137 0.113046 0.00695865 -0.0736558 0.00604696 0.0541249 0.0054643 0.18912 -0.184192 0.0178627 -0.200207 0.248177 -0.0404471 -0.0498544 0.106749 0.145382 -0.12466 0.0307371 -0.0412851 0.0642106 -0.147394 -0.0393446 -0.0163971 0.117157 -0.0318122 0.00379524 0.0466496 0.0249858 -0.0658982 -0.00228349 -0.0971644 -0.0892782 
0.0788508 0.0337908 -0.137973 -0.0594956 0.111967 0.147293 0.0660901 -0.0196705 -0.14834 -0.0649173 -0.0478806 0.0767685 0.124331 -0.103834 -0.0934053 -0.0180365 -0.0913235 0.00353282 -0.149187 0.172718 0.0973734 -0.0851187 0.0634101 0.0618777 -0.0314197 -0.00888206 -0.0594508 -0.170418 -0.000462201 0.0694887 -0.049173 0.0554142 -0.127211 0.0694743 -0.0427827 -0.0273177 -0.102529 0.0990176 -0.0775757 -0.045854 0.0432791 -0.0694575 0.0294861 0.165991 -0.136473 0.0382159 0.172782 0.0581365 -0.161087 0.105979 0.04468 -0.11515 -0.0620577 -0.0119691 0.0969487 -0.0495379 -0.0588949 0.186071 0.0632382 -0.156143 -0.0191156 0.063281 0.190058 -0.0379931 0.0425857 -0.0983335 -0.0388987 0.0482208 -0.0721587 -0.0221594 -0.00867375 0.0780318 0.0174769 0.00554762 -0.0121029 0.0473173 -0.0418711 0.00537517 0.0451523 0.110379 0.0175718 -0.0205689 -0.033108 -0.0397891 -0.110627 -0.00294465 0.074898 0.0330032 0.0270223 0.0185081 0.0508139 -0.125848 -0.0850394 -0.0495238 -0.0932327 -0.0127645 0.0449576 0.0890018 0.00600108 -0.0657388 0.00165058 0.0431713 -0.00813369 0.175834 -0.179755 0.0151994 -0.19909 0.235931 -0.0423391 -0.0524165 0.118469 0.160571 -0.11714 0.0360336 -0.0358027 0.0707246 -0.147281 -0.0278291 -0.0138425 0.125067 -0.0429964 0.00925708 0.0302065 0.0385036 -0.0667729 -0.00561604 -0.106683 -0.0989926 
0.0792884 0.0194158 -0.13527 -0.0599886 0.126556 0.135128 0.0638038 -0.0196044 -0.158948 -0.0706021 -0.0540988 0.0823956 0.129057 -0.0795528 -0.0947027 -0.0257913 -0.0760734 0.0153216 -0.145957 0.181555 0.0997688 -0.0838656 0.0637383 0.0622067 -0.0287287 -0.0102334 -0.0643748 -0.158034 -0.00339766 0.0710756 -0.0540798 0.0602267 -0.128366 0.0667025 -0.0471456 -0.0220327 -0.106716 0.0916281 -0.0823127 -0.0525399 0.0493466 -0.0486979 0.0344314 0.165409 -0.145713 0.0355016 0.171114 0.0581835 -0.146249 0.102472 0.040193 -0.122101 -0.0628268 -0.00877366 0.0994904 -0.0533212 -0.0569221 0.186906 0.0714071 -0.15853 -0.0104258 0.0738028 0.17652 -0.0256026 0.0320368 -0.0969689 -0.03583 0.0514161 -0.0616016 -0.0271515 0.000243511 0.0804374 0.0321398 -0.000292307 -0.0214472 0.0540194 -0.0430822 0.00252787 0.0467583 0.0968876 0.0196067 -0.00620758 -0.0315957 -0.0395873 -0.10413 -0.00421073 0.078807 0.0440624 0.0257179 0.0110765 0.0549214 -0.114904 -0.079986 -0.0554438 -0.0958721 -0.0180394 0.0399695 0.0959009 -0.00202205 -0.0702303 -0.000164886 0.0439051 0.00394545 0.178729 -0.186746 0.0183589 -0.206534 0.233278 -0.0409067 -0.0480285 0.121 0.154659 -0.1248 0.0456359 -0.0491732 0.0660951 -0.142385 -0.0363657 -0.0250807 0.116085 -0.0533219 0.0161723 0.0220638 0.032592 -0.0797654 -0.010219 -0.12013 -0.0974396 
0.061467 0.034774 -0.13588 -0.0766707 0.119683 0.156586 0.0594472 -0.0117951 -0.138844 -0.085614 -0.0676862 0.0667217 0.0958508 -0.113379 -0.0915068 -0.0214289 -0.114919 -0.0151735 -0.140204 0.158976 0.0861821 -0.0746691 0.0504827 0.0417032 -0.0305088 -0.0050532 -0.0472238 -0.158964 -0.0102951 0.0415535 -0.0382878 0.019075 -0.140782 0.0653275 -0.0267979 -0.0112681 -0.0926181 0.0744685 -0.0821275 -0.0481712 0.0659308 -0.0635853 0.0473506 0.17897 -0.12653 0.053798 0.177968 0.0666587 -0.170823 0.1058 0.00946585 -0.139231 -0.0651509 -0.013387 0.107332 -0.0431675 -0.0892211 0.201526 0.0462787 -0.159792 -0.0143472 0.0804001 0.2048 -0.0386645 0.0560135 -0.0858054 -0.0485739 0.0484364 -0.0584537 -0.0134118 -0.00598795 0.0830472 0.0285271 0.00375449 -0.00783819 0.0487392 -0.0468874 0.0187679 0.0511381 0.0826855 0.0215037 -0.0044064 -0.0366358 -0.0360741 -0.131116 -0.00739792 0.0731893 0.0546466 0.0279995 0.0346401 0.0770758 -0.125132 -0.0899012 -0.0585001 -0.0790826 -8.99542e-05 0.0513447 0.0790872 -0.00482105 -0.0575374 -0.0178807 0.0303615 -0.0158832 0.135029 -0.191096 0.0297264 -0.198422 0.222487 -0.073299 -0.037368 0.14607 0.147093 -0.104768 0.0433101 -0.0321704 0.0580023 -0.146802 -0.0232033 -0.0136917 0.105229 -0.0357817 0.0145309 0.0426085 0.0404909 -0.0684945 -0.00779048 -0.111684 -0.110676 
0.0651595 0.0381274 -0.136526 -0.0802947 0.117259 0.145717 0.0598493 -0.00524959 -0.138445 -0.0833357 -0.0645932 0.069196 0.0962616 -0.117294 -0.10173 -0.016219 -0.107175 -0.013158 -0.149219 0.160388 0.0867066 -0.0715497 0.052848 0.0303896 -0.0390168 0.000969088 -0.0383781 -0.153481 -0.00750824 0.0380636 -0.0496226 0.0211651 -0.135453 0.0689552 -0.0329128 -0.02581 -0.0904323 0.0893533 -0.0835632 -0.044982 0.0579776 -0.0595683 0.0472467 0.18335 -0.126367 0.0542002 0.173915 0.0605565 -0.175976 0.110271 0.0170098 -0.135183 -0.0789604 -0.00821619 0.10063 -0.0514686 -0.0838926 0.192937 0.0453363 -0.158145 -0.00803419 0.0673716 0.203119 -0.0290472 0.0581889 -0.102345 -0.0521299 0.0522031 -0.054071 -0.0113715 -0.00413487 0.0750451 0.0337322 0.00620824 -0.0143388 0.0441503 -0.0446347 0.0245872 0.0433194 0.0750376 0.0177581 -0.00334312 -0.0359859 -0.0339156 -0.12983 -0.0127438 0.0741912 0.0544912 0.0328421 0.0328339 0.0675176 -0.129314 -0.098765 -0.0602227 -0.072606 0.00131494 0.0561441 0.0767176 -0.0105597 -0.0563569 -0.0224748 0.0325088 -0.0169939 0.147117 -0.185847 0.016578 -0.198552 0.229084 -0.0683372 -0.0475441 0.143462 0.15053 -0.106828 0.0543666 -0.0313376 0.0494465 -0.147619 -0.0286528 -0.0120592 0.0995032 -0.043304 0.0280812 0.0454496 0.0409785 -0.0544978 -0.0199027 -0.110135 -0.116957 
0.0588858 0.0231492 -0.133551 -0.0818374 0.11656 0.144314 0.0530973 -0.00694417 -0.134496 -0.0856698 -0.0679364 0.0704456 0.0994332 -0.114561 -0.106602 -0.0214405 -0.117881 -0.00589779 -0.146178 0.161367 0.0928733 -0.0761423 0.0552032 0.0446972 -0.0415716 -0.00276449 -0.035572 -0.159076 -0.0162733 0.0393069 -0.0475702 0.00558072 -0.137619 0.0613181 -0.0272714 -0.0196932 -0.101697 0.0785763 -0.0945836 -0.0457241 0.0534666 -0.0567496 0.0387429 0.190477 -0.121865 0.050311 0.173222 0.0664286 -0.167204 0.111967 0.0126914 -0.148135 -0.0689678 -0.0135939 0.103379 -0.0458606 -0.0825218 0.196355 0.0509375 -0.161679 0.001252 0.0765552 0.202643 -0.015645 0.0554392 -0.10912 -0.0499672 0.0514362 -0.0467753 -0.0119722 -0.00540837 0.0753101 0.0364243 -0.00623795 -0.0218012 0.0478982 -0.0491901 0.0254758 0.0476689 0.0767708 0.021467 -0.00312464 -0.0451105 -0.0356881 -0.135367 -0.00925086 0.0754288 0.0580392 0.0308405 0.030352 0.0698399 -0.11979 -0.0909689 -0.0617317 -0.0791766 0.00427474 0.0441199 0.0778179 -0.00388061 -0.0573683 -0.0109231 0.0286428 -0.0171483 0.130378 -0.17885 0.0162799 -0.201485 0.217395 -0.0762486 -0.0377972 0.143775 0.149283 -0.100273 0.0454642 -0.0404875 0.0651647 -0.147807 -0.0236714 -0.0211184 0.0959898 -0.0489928 0.0237326 0.0364332 0.0356001 -0.0726852 -0.00965852 -0.121044 -0.112791 
0.063179 0.0396939 -0.137921 -0.0743234 0.116997 0.147491 0.0647536 -0.0103683 -0.13581 -0.0729097 -0.0582136 0.0742537 0.100726 -0.120701 -0.102774 -0.0109727 -0.106107 -0.00607844 -0.156192 0.16449 0.0848693 -0.0746813 0.0458955 0.0427111 -0.0423472 -0.0016144 -0.0430635 -0.155244 -0.00441079 0.0461233 -0.0513002 0.0330224 -0.138187 0.0689786 -0.0358815 -0.0213393 -0.0941778 0.0823827 -0.0860064 -0.0412805 0.0584899 -0.0675625 0.044496 0.17887 -0.122768 0.0514113 0.174915 0.063531 -0.176186 0.105524 0.0245605 -0.134505 -0.0797091 -0.0150351 0.100749 -0.0451078 -0.0905871 0.19323 0.0485775 -0.150204 -0.0130005 0.0666064 0.202058 -0.0347257 0.0570688 -0.10141 -0.0523974 0.0476873 -0.0653288 -0.0143605 -0.00673879 0.0758672 0.0317231 0.00570376 -0.0134453 0.0487075 -0.0393486 0.028766 0.0414006 0.0743764 0.0229686 -0.00661132 -0.0387858 -0.0340392 -0.13186 -0.00539521 0.0739903 0.0477761 0.0292284 0.0357168 0.0614751 -0.130027 -0.098793 -0.0545992 -0.0759535 0.00711991 0.0512068 0.0687239 -0.00462571 -0.0555184 -0.0151296 0.0306576 -0.0213222 0.148859 -0.182142 0.0194875 -0.198777 0.227251 -0.0698701 -0.0452197 0.136073 0.151643 -0.101711 0.0489007 -0.0331574 0.0525738 -0.150429 -0.0220695 -0.0150538 0.104477 -0.0422326 0.0200444 0.042979 0.0434204 -0.0580709 -0.00946156 -0.117379 -0.119896 
0.0698739 0.021742 -0.127 -0.0704954 0.123142 0.141197 0.0789514 -0.000362004 -0.133764 -0.0781219 -0.0557282 0.0841252 0.112193 -0.116578 -0.100461 -0.0182964 -0.102768 0.000261823 -0.16905 0.173757 0.0965476 -0.0792097 0.0522604 0.0470271 -0.0466409 -0.0127501 -0.0581475 -0.157351 -0.00699264 0.0485584 -0.0508529 0.0378883 -0.133974 0.0767815 -0.0407799 -0.0304061 -0.0977935 0.0921418 -0.0921297 -0.0447683 0.0615204 -0.0606854 0.0371692 0.173316 -0.134029 0.0303068 0.16053 0.0587754 -0.157821 0.113045 0.0236948 -0.142467 -0.0826065 -0.0103833 0.0981361 -0.0487331 -0.0861782 0.192052 0.0411863 -0.144131 -0.0121459 0.063491 0.191737 -0.0291382 0.0547023 -0.106698 -0.0506608 0.0431001 -0.0714231 -0.0241825 -0.00390087 0.0756424 0.0349603 0.00793877 -0.0226079 0.0520729 -0.0353765 0.0148108 0.0442557 0.081191 0.0158919 -0.0179978 -0.0330619 -0.0292801 -0.123822 -0.00634797 0.0835216 0.0518385 0.0268111 0.0285355 0.0638207 -0.135172 -0.0966701 -0.0531971 -0.0849196 -0.00067756 0.0401484 0.0665618 -0.0100815 -0.0471784 -0.0104432 0.0305762 -0.0210157 0.160944 -0.171346 0.0150125 -0.196114 0.230309 -0.0569871 -0.0497859 0.121616 0.150663 -0.111566 0.0543553 -0.0344295 0.0611862 -0.140411 -0.0149064 -0.0203607 0.116115 -0.0503872 0.0240867 0.0271824 0.0463693 -0.0578524 -0.0134834 -0.118697 -0.114867 
0.07944 0.0362947 -0.133099 -0.0755089 0.118093 0.161158 0.0771581 -0.00229976 -0.15229 -0.0748458 -0.0587503 0.075565 0.112738 -0.110097 -0.0920317 -0.0189356 -0.0871022 -0.00332117 -0.153635 0.158913 0.0900987 -0.0603958 0.043627 0.0404302 -0.0444685 -0.00591688 -0.0548337 -0.154049 -0.00683346 0.0555036 -0.0561261 0.0440232 -0.138497 0.0790936 -0.035166 -0.0303224 -0.0824173 0.0830315 -0.0774118 -0.043393 0.0595173 -0.0619919 0.0512628 0.165614 -0.13128 0.0406874 0.169781 0.0561449 -0.174429 0.108436 0.0395083 -0.134807 -0.0729287 -0.000932572 0.0998644 -0.0459814 -0.0794078 0.19231 0.0501451 -0.153292 -0.0154321 0.070504 0.189919 -0.0521978 0.0534522 -0.0949335 -0.0439971 0.0453734 -0.0745873 -0.0242328 -0.0055038 0.0716715 0.0287147 0.00481458 -0.0186468 0.0558297 -0.0333593 0.00827046 0.0465511 0.0805188 0.0245984 -0.0128238 -0.0246214 -0.0321438 -0.117894 -0.0102072 0.080013 0.0386145 0.026902 0.0399573 0.0611731 -0.140201 -0.0971203 -0.0466573 -0.0855464 0.00658141 0.0566649 0.0751371 -0.0136231 -0.0456705 -0.00872029 0.0485139 -0.0192663 0.169772 -0.187537 0.015375 -0.200577 0.224629 -0.075322 -0.0486448 0.133649 0.143031 -0.110657 0.0507807 -0.0349463 0.0536912 -0.145587 -0.0221968 -0.0229524 0.106996 -0.03986 0.00929442 0.0473197 0.036424 -0.0463591 -0.015452 -0.112106 -0.119711 
0.069951 0.0402246 -0.127745 -0.0844394 0.119403 0.160068 0.0721307 0.00124266 -0.133961 -0.0774198 -0.0551248 0.0682826 0.107026 -0.119431 -0.0908197 -0.0161327 -0.105176 -0.00558644 -0.168617 0.158784 0.0880948 -0.0611413 0.0433527 0.0365305 -0.0505883 -0.00980002 -0.0545961 -0.149993 -0.0075006 0.04033 -0.0454304 0.0281444 -0.141604 0.0803708 -0.0305655 -0.0204694 -0.0831676 0.0834317 -0.0830288 -0.0368055 0.0647743 -0.0619802 0.0466812 0.171727 -0.124673 0.0376775 0.165887 0.0653532 -0.174755 0.115473 0.0187433 -0.143179 -0.0872436 -0.0031743 0.0973746 -0.0440637 -0.0935787 0.195648 0.038298 -0.151801 -0.0188558 0.0711673 0.200081 -0.0448655 0.0549354 -0.0956739 -0.0476218 0.0494392 -0.0703681 -0.0175156 -0.000729976 0.0741844 0.0348281 0.00993158 -0.0157509 0.0478984 -0.0395224 0.0170111 0.0463661 0.0678424 0.0264462 -0.00684261 -0.0317665 -0.0294118 -0.131673 -0.00232397 0.079047 0.0464832 0.0305929 0.0454328 0.0722103 -0.145922 -0.0982483 -0.0535264 -0.0783754 0.00789722 0.0453406 0.0670856 -0.0188038 -0.0410626 -0.0157457 0.0332459 -0.0259994 0.151021 -0.179845 0.0227306 -0.200237 0.220812 -0.0744091 -0.0447221 0.13497 0.145316 -0.105617 0.0586125 -0.0313375 0.0519268 -0.143709 -0.0175325 -0.018957 0.103228 -0.0354666 0.0163813 0.0486434 0.0495882 -0.0523301 -0.0184646 -0.114317 -0.119454 
0.0724721 0.0390669 -0.135251 -0.0795792 0.118929 0.149239 0.0657376 -0.000785862 -0.135548 -0.0684459 -0.0496914 0.0764829 0.111309 -0.116353 -0.0958081 -0.00596083 -0.0919341 -0.00284242 -0.174938 0.169528 0.0839426 -0.0623535 0.0541875 0.0226214 -0.0558541 0.0013973 -0.0493247 -0.1512 -0.0144156 0.0385627 -0.0548415 0.0472111 -0.128982 0.0842757 -0.0424517 -0.0224152 -0.0799616 0.103689 -0.0836108 -0.0336187 0.0582482 -0.0601183 0.0434154 0.16727 -0.13344 0.0368186 0.165835 0.0587806 -0.170806 0.118721 0.0347885 -0.137662 -0.099691 0.00404222 0.0972427 -0.0538172 -0.0841786 0.18059 0.0431541 -0.147079 -0.0212775 0.0530884 0.193908 -0.0440362 0.0619975 -0.109572 -0.0509056 0.0626989 -0.0662696 -0.0119587 0.00413 0.0734895 0.0402046 0.0111754 -0.0183768 0.0483579 -0.0391991 0.0211076 0.0331793 0.0645789 0.0212528 -0.00740495 -0.029015 -0.026951 -0.134282 -0.0051765 0.0826016 0.0491226 0.0349833 0.0386224 0.0542336 -0.14936 -0.103075 -0.0523437 -0.0772046 0.00678188 0.0486422 0.0648028 -0.022324 -0.0457155 -0.0207801 0.0347776 -0.0270865 0.165949 -0.171091 0.0121756 -0.204623 0.22479 -0.0665898 -0.0534779 0.120939 0.153428 -0.106013 0.0684231 -0.0297561 0.0404377 -0.145346 -0.0274705 -0.0189909 0.103024 -0.0370827 0.0292834 0.0550322 0.0520216 -0.0353638 -0.0272294 -0.109208 -0.116331 
0.0634663 0.0303936 -0.135619 -0.0821412 0.114932 0.151583 0.0582618 -0.00304067 -0.12791 -0.0834491 -0.0599257 0.0681652 0.102747 -0.11868 -0.100053 -0.0122537 -0.112346 -0.00826107 -0.16123 0.159579 0.0931941 -0.0684255 0.0452743 0.0375233 -0.0468938 -0.00556852 -0.0417952 -0.157298 -0.019827 0.0419162 -0.0496703 0.0199663 -0.135158 0.0728112 -0.0284207 -0.014989 -0.0884123 0.0782851 -0.0914184 -0.0422615 0.0597611 -0.0632978 0.0469379 0.179525 -0.117066 0.0482703 0.171226 0.0644168 -0.173419 0.111088 0.0169882 -0.150412 -0.0764003 -0.00584231 0.105528 -0.0426244 -0.0918872 0.18852 0.0452211 -0.158267 -0.00914062 0.0689946 0.19879 -0.0313424 0.0568827 -0.102264 -0.0527593 0.0565185 -0.0555558 -0.0188147 -0.00336503 0.0690659 0.0338657 -0.0102806 -0.0154194 0.0551248 -0.0447634 0.0236538 0.0420218 0.0730602 0.0259577 -0.00623962 -0.0402826 -0.0319776 -0.142707 0.0039956 0.0778327 0.0490323 0.0273816 0.0425494 0.0646643 -0.139039 -0.0993947 -0.0560797 -0.0840232 0.0149638 0.0430283 0.0663315 -0.00897089 -0.0496167 -0.0098471 0.027461 -0.0238477 0.13757 -0.17738 0.0175545 -0.205737 0.219908 -0.0881998 -0.0427077 0.135773 0.142499 -0.103337 0.0473929 -0.0342202 0.0595708 -0.151971 -0.0203954 -0.0219344 0.0974526 -0.039899 0.020538 0.0485793 0.0457165 -0.0542272 -0.012852 -0.11622 -0.116812 
0.0698136 0.026292 -0.133625 -0.0737173 0.117569 0.151413 0.0600797 -0.0102807 -0.135944 -0.0870077 -0.0611575 0.0727733 0.102141 -0.1184 -0.100686 -0.0120032 -0.109253 -0.00708042 -0.154127 0.162566 0.0961926 -0.0675578 0.0439501 0.0412742 -0.0392617 -0.00322472 -0.0464701 -0.16075 -0.018247 0.0509641 -0.0533586 0.0263805 -0.13988 0.0711562 -0.0254893 -0.0192401 -0.0918067 0.0765541 -0.0825218 -0.0475277 0.0572665 -0.0607542 0.050133 0.175814 -0.117649 0.0478838 0.174105 0.060623 -0.170468 0.109057 0.0248708 -0.146464 -0.0697007 -0.00595905 0.109768 -0.0479923 -0.0868102 0.189926 0.0452796 -0.157245 -0.00562835 0.0696411 0.197977 -0.0315966 0.0562997 -0.101505 -0.0516731 0.0524563 -0.0568134 -0.0220477 -0.00330868 0.074303 0.0322767 -0.00847953 -0.018226 0.0546547 -0.0428809 0.0172571 0.044286 0.0837326 0.0308633 -0.00554942 -0.0362423 -0.0345056 -0.135991 -0.00140218 0.0767886 0.0491619 0.0241795 0.0388566 0.0636649 -0.132615 -0.0994127 -0.0495112 -0.0896387 0.0123614 0.0479689 0.0689819 -0.0056125 -0.0522347 -0.00820217 0.0322304 -0.021648 0.14233 -0.180044 0.0167493 -0.200514 0.223062 -0.0829249 -0.040449 0.137019 0.141671 -0.107525 0.0451872 -0.0335725 0.0624086 -0.153745 -0.0171034 -0.0265636 0.0981146 -0.0433332 0.0205835 0.0496976 0.0373015 -0.0532441 -0.00833005 -0.1115 -0.116925 
0.0810674 0.0316997 -0.121697 -0.0786289 0.116624 0.170544 0.0868442 0.00375566 -0.152775 -0.0753306 -0.0625214 0.0678162 0.113778 -0.112858 -0.0700566 -0.0279179 -0.0908877 0.000749482 -0.150755 0.146769 0.0897534 -0.047137 0.0299014 0.055459 -0.0434607 -0.0144047 -0.0664565 -0.160035 -0.0050456 0.0591914 -0.047677 0.0421883 -0.145466 0.0825781 -0.0208138 -0.0245348 -0.078858 0.061978 -0.0793744 -0.0430408 0.0700738 -0.0660541 0.0526148 0.169246 -0.128278 0.0420688 0.168756 0.0629043 -0.176322 0.101339 0.0371466 -0.148564 -0.0621303 -0.00779091 0.0994328 -0.0361929 -0.0882452 0.19685 0.0519063 -0.151656 -0.0187786 0.0810962 0.179379 -0.0543014 0.0482757 -0.0878572 -0.0371426 0.0321248 -0.0791776 -0.0357613 -0.00960215 0.0687576 0.0262272 -0.00286147 -0.0185931 0.0564556 -0.0408355 0.00314491 0.0569434 0.0862741 0.0367782 -0.0120155 -0.0285223 -0.0362009 -0.114495 -0.00638282 0.0832355 0.0269068 0.0123063 0.0509415 0.0711865 -0.133898 -0.0963042 -0.0502359 -0.0982138 0.0176998 0.0530001 0.0715922 -0.0126435 -0.0409163 -0.00142668 0.0496447 -0.0137547 0.1579 -0.194667 0.0146946 -0.202219 0.218416 -0.0824391 -0.0377616 0.141971 0.134122 -0.115207 0.0318797 -0.0398557 0.0621466 -0.143859 -0.0231467 -0.032025 0.107125 -0.029069 -0.00544305 0.0428865 0.0410938 -0.0532913 -0.0158312 -0.115505 -0.122238 
0.0815941 0.033199 -0.123156 -0.0774259 0.116366 0.168799 0.0830824 0.00293658 -0.157652 -0.0728175 -0.0579939 0.0658017 0.12078 -0.107357 -0.0775229 -0.0273398 -0.0882355 0.00452879 -0.151431 0.15483 0.0961333 -0.0587318 0.0393887 0.0535025 -0.0434792 -0.017112 -0.0673001 -0.157662 -0.00148032 0.0593796 -0.0527265 0.0393438 -0.142012 0.0831562 -0.0252293 -0.026706 -0.0816919 0.071441 -0.0784855 -0.048276 0.0640607 -0.0668934 0.0510929 0.164139 -0.132826 0.0348658 0.168415 0.064016 -0.176132 0.105559 0.0348705 -0.143571 -0.0650045 -0.00193405 0.0980311 -0.0396496 -0.0782141 0.191909 0.0514914 -0.157344 -0.0165195 0.0823355 0.183088 -0.0534617 0.0480731 -0.0842168 -0.0408454 0.0348506 -0.0801465 -0.0337723 -0.0113317 0.068788 0.0255587 -0.000642909 -0.0172773 0.0551799 -0.0356325 0.00318772 0.059364 0.0846795 0.0291627 -0.0171108 -0.0256141 -0.0341463 -0.115413 -0.00269649 0.0805737 0.0336799 0.0211205 0.0469627 0.0728005 -0.136876 -0.0905236 -0.0479367 -0.0983271 0.00692882 0.0488487 0.0820808 -0.0137848 -0.0427495 0.00346294 0.0525376 -0.0144567 0.163472 -0.185792 0.0191533 -0.198517 0.222806 -0.0746689 -0.0434219 0.134063 0.13699 -0.112779 0.0398773 -0.0387128 0.0642434 -0.141645 -0.0187855 -0.0301893 0.110131 -0.0379032 -0.00708308 0.0397456 0.0384105 -0.0572305 -0.0118763 -0.114786 -0.117577 
0.0748492 0.0345334 -0.131179 -0.0785202 0.119408 0.160844 0.0787084 -0.00478553 -0.14499 -0.0751228 -0.0550404 0.0711477 0.118491 -0.108459 -0.0883768 -0.0200937 -0.0979668 -0.00230209 -0.159732 0.157246 0.0981004 -0.064721 0.039226 0.0420002 -0.0424208 -0.0116482 -0.0649381 -0.156242 -0.00421514 0.0599474 -0.0499794 0.0443345 -0.141597 0.0774209 -0.0315332 -0.0234059 -0.0865483 0.0767766 -0.0755296 -0.0435182 0.0640534 -0.0656545 0.048007 0.165947 -0.128765 0.0380009 0.166714 0.0625863 -0.16974 0.100776 0.0279514 -0.136623 -0.0710257 -0.00305962 0.098196 -0.0423925 -0.0835616 0.191755 0.0448806 -0.153173 -0.016596 0.0732361 0.189401 -0.0441087 0.048679 -0.0888837 -0.0408734 0.0474238 -0.0692047 -0.0312543 -0.00370989 0.072992 0.0275324 -0.00149055 -0.0151814 0.0586757 -0.0399282 0.00461868 0.0471531 0.0858154 0.0292488 -0.0136298 -0.0261742 -0.0286382 -0.123321 0.00285142 0.0835652 0.037838 0.0218209 0.0382111 0.0673248 -0.140241 -0.093964 -0.0475905 -0.0967579 0.00236034 0.0444093 0.0741203 -0.00976202 -0.0450762 -0.00153218 0.0415783 -0.0175937 0.164039 -0.18332 0.0207666 -0.201907 0.231383 -0.0734345 -0.0446394 0.129509 0.137144 -0.119268 0.0461948 -0.0359889 0.0630345 -0.148788 -0.016209 -0.023661 0.108498 -0.0375757 0.00604436 0.0410002 0.0423592 -0.0573018 -0.0114348 -0.118492 -0.112511 
0.0769352 0.0269652 -0.127519 -0.0801486 0.125701 0.161542 0.0793628 -0.00358191 -0.147282 -0.0776089 -0.0572373 0.0718911 0.122236 -0.0953201 -0.0812811 -0.0299717 -0.0949225 -0.001404 -0.156807 0.160047 0.0958566 -0.0658873 0.0446331 0.0473331 -0.039299 -0.017387 -0.067839 -0.151612 -0.00630433 0.0577575 -0.0459715 0.0367145 -0.142012 0.0763445 -0.0315488 -0.018339 -0.0913522 0.0764567 -0.0794436 -0.0462369 0.0659537 -0.0571884 0.0426668 0.164369 -0.136828 0.0344239 0.160192 0.0671562 -0.160987 0.10401 0.0219393 -0.137981 -0.0673169 -0.00422889 0.0993108 -0.0425143 -0.0848235 0.200201 0.0446027 -0.153609 -0.0201874 0.0806407 0.188968 -0.0435558 0.0441539 -0.0824169 -0.0389009 0.0514766 -0.0714915 -0.030232 0.0022705 0.0785921 0.029612 -0.00296912 -0.0160932 0.0625905 -0.0419899 -0.00385138 0.0546365 0.0872033 0.0262258 -0.0143222 -0.0233665 -0.0291214 -0.120488 -0.00242198 0.0858364 0.0439139 0.0230064 0.0358699 0.0725465 -0.13726 -0.0844743 -0.0481389 -0.098384 -0.00682739 0.0411755 0.0761582 -0.0109063 -0.0480273 -0.000579264 0.044304 -0.0138347 0.158261 -0.189015 0.0267069 -0.204062 0.224119 -0.0666084 -0.0428391 0.135446 0.137561 -0.118491 0.0502513 -0.0380484 0.0681504 -0.14645 -0.0135368 -0.027387 0.113458 -0.0400055 -6.74313e-05 0.0321784 0.041636 -0.0648934 -0.00889013 -0.119519 -0.107646 
0.0778151 0.0305703 -0.12453 -0.0699134 0.120746 0.166259 0.0790536 -0.00295638 -0.157164 -0.0711652 -0.0522559 0.0691863 0.121987 -0.109575 -0.0823912 -0.0188785 -0.0945709 0.0126863 -0.153261 0.158372 0.105945 -0.0710614 0.0461335 0.0606587 -0.0360679 -0.0244291 -0.0699684 -0.16356 0.000757513 0.0644462 -0.0499431 0.0415762 -0.143397 0.0792509 -0.0299926 -0.0237449 -0.0935398 0.062412 -0.0757733 -0.0461404 0.0618956 -0.0696549 0.0497576 0.164529 -0.132109 0.0296815 0.17172 0.0630221 -0.172883 0.101901 0.0358366 -0.144384 -0.0669305 -0.00859942 0.0933788 -0.0370391 -0.0743793 0.192528 0.053028 -0.149542 -0.0153827 0.0837592 0.184411 -0.0497565 0.0485554 -0.0867012 -0.0458433 0.0331711 -0.0801626 -0.0290661 -0.0122298 0.0776802 0.0223006 -0.00463739 -0.018045 0.05505 -0.0341632 0.00802603 0.0524773 0.0888701 0.0264886 -0.0201588 -0.0278559 -0.0310096 -0.123131 0.0118761 0.0793009 0.0314528 0.0145595 0.0390668 0.0713192 -0.133302 -0.0938397 -0.0460823 -0.0982209 0.00508988 0.0358478 0.0860295 -0.011004 -0.0428673 0.00480576 0.0430471 -0.0142717 0.164368 -0.173605 0.023512 -0.195832 0.228903 -0.0689669 -0.0456589 0.120658 0.137058 -0.109852 0.0367728 -0.0372454 0.0695803 -0.141582 -0.0107363 -0.026702 0.117215 -0.0397298 -0.00613 0.0301714 0.038631 -0.0679167 -0.00269702 -0.119721 -0.110589 
0.0691805 0.0270304 -0.135685 -0.0728143 0.11151 0.155771 0.0694614 0.000438005 -0.139611 -0.073369 -0.0459978 0.0829929 0.11821 -0.112679 -0.107573 -0.0316778 -0.10275 0.00716355 -0.156487 0.157449 0.0978714 -0.0784228 0.0458904 0.0674879 -0.0408877 -0.0225623 -0.0395753 -0.155851 -0.00574794 0.0595939 -0.0527124 0.0178333 -0.135132 0.0685267 -0.0456711 -0.0292119 -0.113103 0.0590627 -0.0957195 -0.0327382 0.0549265 -0.0709013 0.0269436 0.184727 -0.133053 0.0302087 0.16199 0.0600742 -0.167061 0.105419 0.0350507 -0.129765 -0.0725996 -0.0204377 0.0843524 -0.0344489 -0.0838512 0.198509 0.0532414 -0.142831 -0.0124262 0.0737572 0.197539 -0.0266814 0.0397309 -0.112076 -0.0436207 0.039737 -0.072706 -0.0180609 -0.00716669 0.0707529 0.025277 -0.0121993 -0.0188816 0.0597892 -0.0402766 0.0145213 0.0400843 0.0959804 0.0103906 -0.0261492 -0.0278126 -0.0291103 -0.130064 0.00881976 0.0851114 0.0290417 0.0183224 0.0270976 0.0536478 -0.134866 -0.0936407 -0.0479186 -0.0890266 -0.0048252 0.03248 0.0685894 -0.00340652 -0.0550706 0.00109127 0.0431589 -0.0142669 0.157073 -0.173302 0.0188913 -0.199567 0.22977 -0.0765332 -0.0512329 0.132597 0.140092 -0.103779 0.0395426 -0.0452522 0.0730119 -0.146509 -0.010148 -0.0105326 0.120254 -0.0500255 -0.0057024 0.0125946 0.0344648 -0.0655767 0.000752992 -0.125564 -0.104528 
0.0551577 0.0090236 -0.125249 -0.0795013 0.115179 0.141025 0.0640641 0.00488196 -0.124885 -0.0942078 -0.0633903 0.0750382 0.107155 -0.108972 -0.103741 -0.0409888 -0.12454 -0.00554707 -0.155703 0.157797 0.099664 -0.0865115 0.048548 0.0640903 -0.0390751 -0.0328287 -0.0419209 -0.153033 -0.0168871 0.0437459 -0.0445309 -0.0079502 -0.1354 0.0600105 -0.0375954 -0.0173515 -0.121275 0.0512337 -0.114406 -0.0404719 0.0632795 -0.0637563 0.0248556 0.192316 -0.125492 0.0452038 0.154879 0.0668734 -0.158082 0.108468 0.000567316 -0.150363 -0.0658114 -0.0273197 0.0904228 -0.0341779 -0.0960737 0.202188 0.0444584 -0.141869 -3.25456e-05 0.0894801 0.192722 -0.00281189 0.0421086 -0.108944 -0.0483211 0.0412825 -0.0574495 -0.0208409 -0.00308435 0.0713105 0.0328449 -0.0188961 -0.018973 0.0665673 -0.047077 0.0143654 0.0474703 0.0904744 0.00960854 -0.0266933 -0.0445 -0.0295863 -0.139691 0.0135439 0.0825592 0.0436986 0.0107855 0.0290997 0.0717519 -0.124245 -0.0868572 -0.0616322 -0.0902536 0.000131056 0.0240572 0.0628101 0.00279349 -0.0537315 -0.00113808 0.0247716 -0.0129305 0.123489 -0.173494 0.0223254 -0.201995 0.228392 -0.0816592 -0.041794 0.140655 0.13473 -0.103367 0.0324249 -0.0493163 0.0831538 -0.143098 -0.00306641 -0.0125714 0.118094 -0.0574578 0.00510184 0.00114701 0.0421256 -0.0802301 -0.000494949 -0.132973 -0.106331 
0.0583599 0.0125328 -0.127263 -0.0775969 0.110121 0.148836 0.0642437 0.00128039 -0.13316 -0.0914741 -0.0629314 0.0725347 0.109895 -0.107802 -0.0987108 -0.0418003 -0.123134 -0.00699238 -0.147356 0.156438 0.0983355 -0.0840117 0.0511628 0.0663279 -0.0379507 -0.0312017 -0.0418272 -0.157512 -0.0164483 0.049471 -0.046524 -0.00541985 -0.133074 0.0626006 -0.0360524 -0.017685 -0.115859 0.0528671 -0.11115 -0.0409777 0.0590826 -0.0691601 0.028545 0.188543 -0.128282 0.0462559 0.161813 0.0658599 -0.16297 0.109845 0.00758289 -0.147412 -0.0580368 -0.0220443 0.0951778 -0.0328535 -0.0880854 0.200622 0.0486765 -0.147045 -0.00436648 0.0917002 0.193604 -0.0123675 0.0427464 -0.101829 -0.0449073 0.0383174 -0.0618896 -0.0197085 -0.00810847 0.0701528 0.0263885 -0.0160952 -0.0125991 0.0655217 -0.0459637 0.0100663 0.0504735 0.0956933 0.0119319 -0.0290058 -0.0424775 -0.0323071 -0.13693 0.0141126 0.0792774 0.038895 0.0112623 0.0330463 0.0728991 -0.125415 -0.0846859 -0.058739 -0.0944457 0.000739452 0.0269475 0.0718452 0.00671809 -0.0548353 0.00347811 0.0321109 -0.0111299 0.126984 -0.176512 0.0230206 -0.202115 0.226553 -0.0830288 -0.0424776 0.140668 0.137498 -0.101275 0.026141 -0.0485567 0.0855826 -0.141217 -0.00574085 -0.0126947 0.120748 -0.0517065 -0.00395686 0.00730161 0.037469 -0.0805016 0.00392889 -0.12591 -0.103165 
0.0552352 0.0154688 -0.126348 -0.0797641 0.106643 0.144314 0.066495 0.00311313 -0.127249 -0.0942294 -0.0627297 0.0696431 0.112089 -0.107532 -0.104418 -0.0392278 -0.125773 -0.0114751 -0.155515 0.151441 0.101201 -0.0874817 0.0435772 0.059187 -0.0395224 -0.0320431 -0.0444109 -0.154846 -0.0188782 0.0498071 -0.0462837 -0.00352058 -0.135326 0.060533 -0.0372985 -0.020619 -0.116796 0.0538597 -0.110005 -0.0384929 0.0598623 -0.06994 0.0302571 0.186582 -0.117976 0.0483123 0.156915 0.0624589 -0.163963 0.103604 0.00405377 -0.149293 -0.0582343 -0.0224677 0.0902465 -0.031691 -0.0926847 0.199168 0.0470149 -0.145169 -0.000601413 0.0900605 0.189032 -0.00869252 0.041676 -0.101039 -0.0457486 0.041084 -0.0593029 -0.0292514 -0.00585109 0.0658726 0.0282695 -0.0222299 -0.0121397 0.0707166 -0.0457852 0.00751701 0.0471915 0.0975131 0.0122267 -0.0350225 -0.0428568 -0.0290115 -0.143949 0.0197423 0.0811518 0.0338252 0.0084559 0.0296231 0.066735 -0.129679 -0.0840831 -0.0588723 -0.097147 0.00575117 0.0265486 0.0653851 0.00718546 -0.0500043 0.00260789 0.0296054 -0.0135533 0.131357 -0.173607 0.0199589 -0.203431 0.234269 -0.0895396 -0.0456228 0.137599 0.130581 -0.106744 0.0261782 -0.0495388 0.0876848 -0.148176 0.00223825 -0.012633 0.1169 -0.0558875 -0.00077898 0.00465253 0.0393042 -0.0753369 0.00185036 -0.133196 -0.106389 
0.0611908 0.0239154 -0.152166 -0.0687415 0.116452 0.15538 0.0689811 -0.0192261 -0.143832 -0.0580306 -0.0549341 0.0790203 0.126847 -0.0893502 -0.100468 -0.0485382 -0.101924 0.0265178 -0.126908 0.14298 0.101677 -0.0910261 0.0517907 0.0739501 -0.0256194 -0.0271938 -0.0494826 -0.171829 -0.00943659 0.0817143 -0.050544 0.0239725 -0.128858 0.0489303 -0.0295852 -0.0242501 -0.119294 0.0451745 -0.0898775 -0.0499305 0.053513 -0.0682214 0.0280079 0.192991 -0.152507 0.0408161 0.170312 0.0631134 -0.156886 0.0832566 0.0335952 -0.124694 -0.0459824 -0.0275531 0.0876584 -0.0232333 -0.0596565 0.197711 0.0698259 -0.1531 -0.00507617 0.0806383 0.192859 -0.0198306 0.0374983 -0.104459 -0.0417539 0.0459496 -0.0577574 -0.0149335 -0.00531922 0.078151 0.0157916 -0.0351347 -0.0238908 0.0706391 -0.0583001 0.00590909 0.0436084 0.0953992 -0.00041552 -0.0141573 -0.0342218 -0.025393 -0.123024 0.0115833 0.0841607 0.0216058 0.0180329 0.0156888 0.0489594 -0.116745 -0.0772655 -0.0704051 -0.0993931 -0.0219593 0.0254734 0.0957632 0.0124736 -0.0661838 0.0207952 0.0507183 0.0147526 0.146564 -0.17936 0.0157892 -0.205299 0.231158 -0.0782741 -0.0338669 0.135256 0.126441 -0.10873 0.0112303 -0.053802 0.0867048 -0.143089 -0.0301157 -0.0073781 0.121981 -0.0380032 -0.0206818 4.22647e-05 0.024727 -0.0931353 0.00757537 -0.130604 -0.0815609 
0.064256 0.0257953 -0.146176 -0.0739146 0.113799 0.155669 0.0762845 -0.0114027 -0.143036 -0.0608142 -0.0550817 0.0741704 0.129006 -0.0839778 -0.0962071 -0.0477191 -0.102012 0.018139 -0.133012 0.136294 0.104965 -0.0902423 0.0448192 0.0733214 -0.0243408 -0.0306103 -0.0531512 -0.165136 -0.00270887 0.0815527 -0.0507619 0.0252153 -0.132697 0.0510518 -0.0343008 -0.0268061 -0.120683 0.0483124 -0.089063 -0.046818 0.0540856 -0.0675395 0.0283662 0.186903 -0.144275 0.0415212 0.16367 0.0610277 -0.161198 0.0780895 0.0287854 -0.121202 -0.0446631 -0.0276668 0.0857562 -0.0212537 -0.064947 0.204273 0.0657462 -0.153803 -0.0076378 0.0826054 0.190915 -0.0204823 0.0315724 -0.091364 -0.0404941 0.0489348 -0.0604539 -0.0213459 -0.00400281 0.0764031 0.0134315 -0.0347728 -0.0179593 0.073967 -0.0546997 -0.00194612 0.0461513 0.0976493 0.00220869 -0.0192353 -0.0315625 -0.0289887 -0.123236 0.0132035 0.0856742 0.0185345 0.0166852 0.0180081 0.0518307 -0.121664 -0.0783792 -0.065906 -0.100112 -0.0178877 0.0265768 0.0901166 0.0146629 -0.0621655 0.0211653 0.048492 0.0121632 0.150485 -0.18834 0.0193729 -0.208266 0.232406 -0.0767711 -0.0447377 0.138856 0.127283 -0.114258 0.0106538 -0.0462318 0.0905433 -0.14746 -0.0229555 -0.00552501 0.123252 -0.0389194 -0.0236528 -0.000323234 0.0273399 -0.0901962 0.00955115 -0.131198 -0.0854021 
0.0620726 0.0308391 -0.153696 -0.0678009 0.110943 0.158605 0.0668942 -0.0198563 -0.148513 -0.0521976 -0.0496957 0.073848 0.129133 -0.0837634 -0.0985116 -0.0485156 -0.0995054 0.0254124 -0.121744 0.143211 0.104384 -0.0959475 0.0534288 0.0735289 -0.0207552 -0.0249113 -0.0487671 -0.169974 -0.00134948 0.0822341 -0.0514819 0.0261287 -0.126778 0.0489254 -0.0312258 -0.0221513 -0.118058 0.0521976 -0.0872236 -0.0547694 0.0501659 -0.0725321 0.0270268 0.191169 -0.155062 0.0400581 0.173894 0.0639123 -0.163494 0.0792542 0.0315914 -0.11224 -0.0455682 -0.0251525 0.0906689 -0.0222014 -0.0571224 0.196448 0.0711291 -0.161969 -0.0096661 0.0784763 0.199316 -0.0236586 0.0367477 -0.0908827 -0.0398762 0.0485524 -0.0583156 -0.0085204 -0.00755818 0.0787065 0.0118893 -0.0315714 -0.0169305 0.0650679 -0.0576917 0.00746756 0.045582 0.0947232 -0.00446273 -0.0136504 -0.0324965 -0.0321255 -0.12144 0.011483 0.0812824 0.0229762 0.0256318 0.0175117 0.0542328 -0.118715 -0.0761435 -0.0697329 -0.0983276 -0.0297877 0.0277565 0.102721 0.0159057 -0.0723017 0.022855 0.0550464 0.0175144 0.14645 -0.183793 0.0238531 -0.202351 0.231595 -0.0697803 -0.0413026 0.133903 0.132404 -0.110171 0.0103876 -0.0441613 0.0835753 -0.141638 -0.0362721 0.000286961 0.123412 -0.0355873 -0.0262849 0.00385845 0.0255667 -0.0942453 0.0121527 -0.119259 -0.0770969 
0.0725719 0.0229387 -0.15236 -0.0689789 0.106855 0.159538 0.0532835 -0.0200499 -0.162866 -0.0595029 -0.0594466 0.0638574 0.125734 -0.087349 -0.09684 -0.0485538 -0.0957261 0.00589328 -0.108015 0.148 0.0952499 -0.081976 0.0533788 0.064343 -0.0196399 0.00406366 -0.0498103 -0.170883 -0.00251091 0.065972 -0.0474 0.0311524 -0.149243 0.0453084 -0.0344654 -0.0225063 -0.121826 0.0644555 -0.0696138 -0.0475829 0.0470732 -0.0596057 0.0151399 0.190134 -0.142512 0.0351415 0.172466 0.0682089 -0.144874 0.082429 0.0402292 -0.102401 -0.040511 -0.0185548 0.0879971 -0.0436689 -0.0429803 0.197631 0.088472 -0.178219 -0.00103993 0.0817164 0.195719 -0.0136048 0.0217097 -0.0953014 -0.0130431 0.0515297 -0.0285615 -0.018005 -0.0116957 0.09 0.0273784 -0.00795517 -0.0248676 0.0410447 -0.0669979 0.000609074 0.0536163 0.118504 0.0168864 -0.00591987 -0.0228608 -0.0425779 -0.0995082 -0.0164067 0.087128 0.0379488 0.0354193 -0.00592283 0.0583196 -0.0957102 -0.0641593 -0.0624674 -0.104739 -0.0386292 0.0547486 0.10253 0.00956275 -0.0813331 0.0117251 0.0663686 0.0158286 0.156282 -0.195307 0.0153731 -0.201265 0.22693 -0.0611557 -0.0280975 0.150994 0.146014 -0.123555 0.0193727 -0.0499614 0.0769332 -0.145236 -0.04631 -0.0153038 0.0940778 -0.0449774 -0.0100983 0.0256902 0.00921566 -0.0970856 -0.00171507 -0.124519 -0.0743965 
0.0946076 0.037134 -0.140093 -0.0766815 0.110677 0.176023 0.066278 -0.00141992 -0.18454 -0.0272637 -0.0459547 0.0582129 0.127893 -0.0987035 -0.0399446 -0.0359818 -0.0751706 -0.00919981 -0.0991488 0.135169 0.0825615 -0.0456841 0.0349087 0.0707173 -0.0059415 0.0101765 -0.0559325 -0.167026 0.0182418 0.0705596 -0.0326253 0.0391101 -0.162437 0.0556524 -0.0336157 -0.0190763 -0.114598 0.0461931 -0.0418972 -0.0334979 0.045262 -0.0662085 0.0141522 0.194219 -0.135246 0.03832 0.16371 0.0788428 -0.152082 0.0765339 0.0708221 -0.0948868 -0.0620157 -0.0355478 0.0774523 -0.0454487 -0.0772027 0.209938 0.0864413 -0.151781 -0.0253637 0.0581872 0.184393 -0.0338693 0.0168061 -0.0942529 -0.00590341 0.0512677 -0.0467364 -0.0303924 -0.00447152 0.111906 0.0146124 -0.00743904 -0.0262912 0.0266778 -0.0634856 0.00287857 0.0643167 0.151289 0.0421836 -0.025126 -0.0094192 -0.0441128 -0.0884516 -0.0400532 0.0941558 0.0145658 0.036627 0.00516091 0.0489972 -0.0874275 -0.0876942 -0.0343112 -0.110334 -0.0303007 0.0699076 0.0746122 -0.00866096 -0.0859594 -0.00331328 0.0752659 0.00866771 0.150711 -0.223773 0.0188004 -0.201249 0.215636 -0.0312222 -0.031816 0.165564 0.149271 -0.134123 0.0202396 -0.0308826 0.0658343 -0.142516 -0.0442922 -0.0271447 0.104754 -0.0258956 -0.0230711 0.0367889 0.0315107 -0.0762525 -0.0147453 -0.103304 -0.0843515 
