{
  "descriptor": [
    -0.10300839692354202,
    0.08767774701118469,
    0.0776008665561676,
    -0.07379375398159027,
    -0.1809689849615097,
    0.04430535435676575,
    -0.0940825417637825,
    -0.013202259317040443,
    0.20408391952514648,
    -0.15781325101852417,
    0.1883496344089508,
    0.01064752321690321,
    -0.16981276869773865,
    0.10062164813280106,
    -0.09253031015396118,
    0.18248434364795685,
    -0.19943954050540924,
    -0.17684073746204376,
    0.002121434547007084,
    -0.00974881462752819,
    -0.010294870473444462,
    0.10197842121124268,
    -0.06271277368068695,
    0.06625937670469284,
    -0.15247271955013275,
    -0.3547098934650421,
    -0.060680609196424484,
    -0.0489930622279644,
    0.02442166768014431,
    -0.09405608475208282,
    -0.046922337263822556,
    0.10455913841724396,
    -0.11189352720975876,
    0.0233355350792408,
    0.09236039221286774,
    0.06690314412117004,
    -0.027360934764146805,
    -0.11555451899766922,
    0.22646518051624298,
    0.1417515128850937,
    -0.25670233368873596,
    -0.008814229629933834,
    0.050648707896471024,
    0.2902064621448517,
    0.1605125367641449,
    -0.01706322655081749,
    0.043044377118349075,
    -0.11778752505779266,
    0.20502544939517975,
    -0.25326550006866455,
    0.01573748141527176,
    0.18811185657978058,
    0.08996398746967316,
    0.056094974279403687,
    0.035648196935653687,
    -0.14317810535430908,
    -0.005014939233660698,
    0.1145714819431305,
    -0.16851459443569183,
    0.045884955674409866,
    0.06729740649461746,
    -0.057756535708904266,
    0.028913598507642746,
    -0.07447996735572815,
    0.18579010665416718,
    0.11231040954589844,
    -0.09368221461772919,
    -0.18079343438148499,
    0.2535555362701416,
    -0.11447339504957199,
    -0.10336317121982574,
    0.059263117611408234,
    -0.10412130504846573,
    -0.19149044156074524,
    -0.18190684914588928,
    0.04267849028110504,
    0.38831213116645813,
    0.1451576203107834,
    -0.11228328198194504,
    0.0537547804415226,
    -0.0009913454996421933,
    -0.0902906060218811,
    -0.010643054731190205,
    0.1816256046295166,
    -0.08891382068395615,
    -0.024428918957710266,
    -0.012905078940093517,
    0.0057013691402971745,
    0.2937299311161041,
    0.03774019330739975,
    0.013905337080359459,
    0.18704651296138763,
    0.011648504063487053,
    0.01697065681219101,
    0.07397880405187607,
    0.07115437835454941,
    -0.16096508502960205,
    0.007432928308844566,
    -0.14937563240528107,
    -0.03772672265768051,
    -0.05103607848286629,
    -0.049301017075777054,
    0.004884047899395227,
    0.18850916624069214,
    -0.18397510051727295,
    0.17372043430805206,
    -0.07828253507614136,
    -0.08278211206197739,
    -0.030006716027855873,
    0.05105177313089371,
    -0.05072760954499245,
    -0.04625694826245308,
    0.12590742111206055,
    -0.16746698319911957,
    0.13673515617847443,
    0.09835876524448395,
    0.09627833217382431,
    0.16006700694561005,
    0.09771996736526489,
    0.05759822204709053,
    0.02874237298965454,
    -0.03516380488872528,
    -0.1514752358198166,
    -0.10855373740196228,
    0.04901700094342232,
    -0.06683729588985443,
    0.002886583097279072,
    -0.007240915205329657
  ]
}