{
  "descriptor": [
    -0.0782061293721199,
    0.07835760712623596,
    0.09051653742790222,
    -0.048490654677152634,
    -0.08705401420593262,
    0.001820958568714559,
    -0.03753890097141266,
    -0.05575184151530266,
    0.11136863380670547,
    -0.0673803985118866,
    0.19625242054462433,
    -0.03749768063426018,
    -0.24039919674396515,
    -0.004284184891730547,
    -0.05617084726691246,
    0.11422443389892578,
    -0.14077605307102203,
    -0.11826812475919724,
    -0.07324806600809097,
    -0.10697463154792786,
    0.05339369177818298,
    0.06903320550918579,
    -0.0016027777455747128,
    -0.009623781777918339,
    -0.1524515002965927,
    -0.276357501745224,
    -0.06993091851472855,
    -0.07699161022901535,
    0.022264057770371437,
    -0.138905331492424,
    0.0036710361018776894,
    0.10218695551156998,
    -0.16554003953933716,
    0.001206915476359427,
    0.004011949058622122,
    0.0625544860959053,
    -0.03813482075929642,
    -0.09340009093284607,
    0.22334307432174683,
    0.0420648418366909,
    -0.15538881719112396,
    0.02950047142803669,
    0.06073780357837677,
    0.26162394881248474,
    0.18194109201431274,
    -0.0172526016831398,
    -0.017372963950037956,
    -0.025840893387794495,
    0.09080304950475693,
    -0.2923259437084198,
    0.013487973250448704,
    0.21379244327545166,
    0.07817807048559189,
    0.1190917119383812,
    0.05525524914264679,
    -0.12795661389827728,
    0.017906256020069122,
    0.0889868512749672,
    -0.13992933928966522,
    0.05549177527427673,
    0.03328309208154678,
    -0.1225515827536583,
    -0.003681856207549572,
    -0.09646042436361313,
    0.15881359577178955,
    0.08291694521903992,
    -0.08911582082509995,
    -0.11468395590782166,
    0.13771699368953705,
    -0.11164315789937973,
    -0.0833498165011406,
    0.07587795704603195,
    -0.1305643916130066,
    -0.15304549038410187,
    -0.21465404331684113,
    0.08246644586324692,
    0.35185933113098145,
    0.14851698279380798,
    -0.1550285369157791,
    0.05687686428427696,
    -0.07564952969551086,
    -0.061653975397348404,
    -0.00014787307009100914,
    0.051691073924303055,
    -0.05869138613343239,
    -0.02289399690926075,
    -0.058378711342811584,
    0.05223754420876503,
    0.21076588332653046,
    -0.037214044481515884,
    -0.006744566839188337,
    0.21260108053684235,
    -0.012057259678840637,
    0.02981848455965519,
    0.024847714230418205,
    0.0311773419380188,
    -0.10225030034780502,
    -0.014814794063568115,
    -0.0936620831489563,
    -0.0059850276447832584,
    0.030937885865569115,
    -0.14025801420211792,
    -0.00036476925015449524,
    0.1377265602350235,
    -0.18062512576580048,
    0.1565197855234146,
    -0.029643358662724495,
    -0.051766663789749146,
    -0.012130382470786572,
    0.011205948889255524,
    -0.05045335367321968,
    0.009796876460313797,
    0.16093267500400543,
    -0.22761906683444977,
    0.20847736299037933,
    0.18131273984909058,
    0.005086134187877178,
    0.12835116684436798,
    0.07346034795045853,
    0.09671833366155624,
    -0.027102166786789894,
    -0.005571735557168722,
    -0.13164515793323517,
    -0.10846876353025436,
    0.03948688134551048,
    0.00713752256706357,
    -0.01570054329931736,
    0.03130176290869713
  ]
}