{
  "descriptor": [
    -0.09517280012369156,
    0.08129002898931503,
    0.13575875759124756,
    -0.09267128258943558,
    -0.16031000018119812,
    0.040116388350725174,
    -0.036561667919158936,
    -0.054764777421951294,
    0.11848677694797516,
    -0.12825839221477509,
    0.26665547490119934,
    -0.012689419090747833,
    -0.2326124906539917,
    0.04545264691114426,
    0.00006169197149574757,
    0.1335756480693817,
    -0.15009763836860657,
    -0.14733733236789703,
    -0.06916311383247375,
    -0.0643315538764,
    0.0038498295471072197,
    0.12293653190135956,
    -0.008542024530470371,
    0.0396977998316288,
    -0.0948798730969429,
    -0.3879077136516571,
    -0.08404656499624252,
    -0.07371831685304642,
    0.13060468435287476,
    -0.10832300782203674,
    -0.0794047862291336,
    0.026257088407874107,
    -0.13412746787071228,
    0.02382725104689598,
    0.05090955272316933,
    0.02763129584491253,
    -0.036365970969200134,
    -0.1713300198316574,
    0.23441073298454285,
    0.09854375571012497,
    -0.2229672372341156,
    -0.0007745744660496712,
    0.059361785650253296,
    0.2538163959980011,
    0.1268976926803589,
    0.013053569942712784,
    0.030831540003418922,
    -0.050953835248947144,
    0.12714004516601562,
    -0.2553054094314575,
    0.06421246379613876,
    0.18101151287555695,
    0.06923894584178925,
    0.08390158414840698,
    0.06559701263904572,
    -0.17141541838645935,
    -0.009323888458311558,
    0.10054772347211838,
    -0.17736968398094177,
    0.03923351690173149,
    0.04198601469397545,
    -0.03829173743724823,
    -0.015393367037177086,
    -0.12585903704166412,
    0.20741206407546997,
    0.13815754652023315,
    -0.11175762116909027,
    -0.12385082244873047,
    0.16172122955322266,
    -0.12764456868171692,
    -0.10803762078285217,
    0.04924338310956955,
    -0.1447986662387848,
    -0.11859111487865448,
    -0.15851378440856934,
    0.05197789892554283,
    0.4015703797340393,
    0.1743093878030777,
    -0.17069298028945923,
    0.020427977666258812,
    -0.04029051959514618,
    -0.07568113505840302,
    0.030804015696048737,
    0.13865983486175537,
    -0.0825323760509491,
    0.034037139266729355,
    -0.0214723851531744,
    0.025071296840906143,
    0.21075817942619324,
    0.026575850322842598,
    0.025177503004670143,
    0.26537561416625977,
    0.014980901032686234,
    0.07564876973628998,
    0.0667596310377121,
    0.05506409704685211,
    -0.12115389853715897,
    -0.07161377370357513,
    -0.10194189846515656,
    -0.047059230506420135,
    -0.01651553250849247,
    -0.0685652643442154,
    -0.000619654543697834,
    0.15979862213134766,
    -0.23814237117767334,
    0.20503279566764832,
    -0.026519156992435455,
    -0.04752898961305618,
    0.016976797953248024,
    0.031727202236652374,
    0.024586623534560204,
    -0.024542538449168205,
    0.10392306745052338,
    -0.22699329257011414,
    0.1381615549325943,
    0.17476221919059753,
    0.052670709788799286,
    0.15221622586250305,
    0.05617166683077812,
    0.0378398597240448,
    -0.001989771844819188,
    -0.05259508267045021,
    -0.18309922516345978,
    -0.11650063842535019,
    0.04724343866109848,
    -0.06485237181186676,
    -0.011359039694070816,
    0.017329929396510124
  ]
}