0.0164336 0.0143343 -0.071268 0.0201111 0.103876 0.191912 0.104307 -0.00912451 -0.0240028 0.0700804 0.0673135 0.12003 0.0977686 -0.0998838 -0.0383921 -0.0538328 -0.0357725 0.175785 -0.106286 0.0497089 0.146975 -0.120327 0.0168798 0.258056 0.0248524 -0.0824774 -0.0917385 -0.192616 0.0789839 0.0784926 0.0637112 0.0584273 -0.0944806 0.0618963 -0.0371303 0.014819 -0.137572 -0.0344801 -0.0671191 -0.0145433 0.101576 -0.0549789 -0.0787787 0.145118 -0.1627 -0.159437 0.0943317 0.0384453 -0.0808015 -0.0403707 0.0629859 -0.0754605 -0.0814954 -0.10284 0.0267958 0.124003 -0.0458287 0.236581 0.0245869 -0.0492136 -0.0836085 0.025631 0.190917 -0.111683 0.0698737 -0.0672596 -0.0162568 -0.0466266 -0.139042 0.142244 -0.0197129 0.132336 -0.0494734 -0.00477895 -0.045647 -0.00916071 -0.032991 0.108775 0.00270633 -0.027333 -0.140065 0.0700232 0.0107441 -0.0307899 -0.0908074 0.0248192 0.138121 -0.0162055 -0.0207138 -0.0307346 0.0457472 -0.10205 -0.0257792 -0.076547 0.00024239 -0.073227 -0.0783437 0.0415539 -0.00221704 0.0234489 0.04384 0.00232484 -0.00711786 0.10915 -0.0431288 0.0572192 -0.0915972 0.0393851 -0.000884462 -0.0603497 -0.0141387 0.1203 -0.0274044 -0.0480334 0.0548957 0.0556897 -0.0512833 -0.0861187 0.052729 0.187881 0.0438779 -0.0830819 -0.125572 0.0437212 -0.144633 0.117415 -0.11461 0.00452395 
-0.0134328 0.0130436 -0.0153405 0.0382973 0.105338 0.214151 0.0850136 -0.0746308 0.0125509 0.0572288 0.0304585 0.0849005 0.0572048 -0.0813525 0.0339141 -0.0584108 -0.0642066 0.18026 -0.0608955 -0.0125166 0.13014 -0.0746276 0.0231379 0.266114 0.0775776 -0.0984949 -0.113335 -0.203889 0.0614544 0.0869503 0.152926 0.0463215 -0.111169 0.0395323 0.0445667 0.0588976 -0.131678 -0.0767817 -0.0381025 -0.0224891 0.0972638 -0.0451195 -0.0798864 0.133792 -0.1419 -0.141313 0.074678 0.0640242 -0.0363555 -0.067554 0.0559049 -0.0761809 0.000152571 -0.138528 0.0291599 0.139607 -0.0441554 0.248857 0.0220641 -0.046352 -0.101139 0.0446173 0.157485 -0.134942 0.0980455 -0.0436707 0.00854094 -0.0623634 -0.159898 0.178057 -0.0111671 0.166896 -0.0642143 -0.0298261 -0.0665586 -0.0256743 -0.0612291 0.0693551 0.0112891 0.00848226 -0.095379 0.0913506 0.000394781 -0.0285432 -0.0782123 -0.036151 0.109039 -0.0241159 -0.0592304 -0.014472 0.0605806 -0.0468848 0.0115131 -0.0792356 -0.00552172 -0.047461 -0.0938584 0.0486981 0.0110743 0.0367049 0.0606277 -0.00285108 -0.0232556 0.0367562 -0.0333136 0.0485916 -0.0620193 -0.0412929 0.0325281 0.016388 -0.00825425 0.105086 -0.0271536 -0.0753159 0.0592451 0.0761027 -0.0419279 -0.0650564 0.0222449 0.179444 0.0910536 -0.091502 -0.126422 0.0258934 -0.15614 0.135164 -0.0895844 0.0226283 
0.0232396 -0.0259402 -0.0797259 -8.73475e-05 0.134913 0.172546 0.0886915 -0.0215099 -0.0548386 0.0693691 0.0249639 0.11187 0.116748 -0.0443736 -0.00280391 -0.0571706 -0.00606461 0.158638 -0.0626092 0.087459 0.139575 -0.119857 0.0709589 0.257268 0.0257461 -0.0645772 -0.0894889 -0.216058 0.0842617 0.0874211 0.0773746 0.0463419 -0.0803613 0.034294 -0.00824561 0.0368534 -0.128518 0.0252873 -0.0796063 -0.0557874 0.0589783 -0.0159018 -0.0962842 0.15559 -0.191781 -0.112283 0.1031 0.0683689 -0.055636 -0.0322282 0.0322124 -0.0892605 -0.0344796 -0.112451 0.0531841 0.096313 -0.0339003 0.259943 0.0379792 -0.0814499 -0.0820394 0.026741 0.189817 -0.110999 0.0897865 -0.0677634 -0.0204447 -0.00980051 -0.124273 0.114931 -0.014361 0.144836 -0.0617806 -0.0327831 -0.0644361 -0.0055177 -0.0386613 0.102469 0.0510207 -0.00261705 -0.127435 0.06339 -0.0280618 -0.0503458 -0.0519297 -0.0442489 0.113746 0.0206779 0.00144394 -0.0384359 0.0613737 -0.0554132 -0.0106604 -0.073607 0.00919749 -0.0883115 -0.0569594 0.0813008 0.00396275 -0.00350724 0.0522448 0.00572316 -0.0057454 0.0764774 -0.095414 0.0526551 -0.101175 -0.000828381 0.0614026 -0.0394108 0.00442718 0.148236 -0.0348027 -0.0444959 0.0532945 0.0820248 -0.0616804 -0.113134 0.00709273 0.189763 0.0124478 -0.067565 -0.120592 0.0482088 -0.177589 0.113239 -0.11598 -0.00472665 
0.00994511 -0.0238226 -0.0695929 -0.00240784 0.0797861 0.188799 0.0202174 -0.0367388 -0.0911431 0.075016 0.0632413 0.0937358 0.0668221 -0.0591581 -0.0104478 -0.0167034 -0.0555838 0.157563 0.00143572 0.0557299 0.105973 -0.0758173 0.101389 0.192725 0.0132513 0.0376112 -0.0327996 -0.235012 0.106076 0.0230227 0.0766395 0.026565 -0.0965307 -0.0196068 -0.00186117 0.061729 -0.150934 0.0513565 -0.0180359 0.0184861 0.0352365 0.0018352 -0.15442 0.159273 -0.19856 -0.123118 0.134273 0.0278838 -0.0713194 -0.04104 0.0305478 -0.0281294 -0.0619423 -0.0721434 0.0244727 0.0764531 0.0583165 0.247255 0.0385709 -0.0673582 -0.092087 0.013747 0.250711 -0.0911839 0.103051 -0.0781925 0.0192279 -0.0143591 -0.0497167 0.19351 -0.0123301 0.185311 -0.0332405 0.047524 -0.0370319 -0.0978262 -0.0934696 0.117657 0.00619664 -0.0178918 -0.102763 0.100015 -0.0136134 -0.0718249 -0.072139 -0.044311 0.106937 0.0317428 -0.00863853 -0.0951941 0.0729066 -0.00426697 -0.0144368 -0.0789216 0.0581263 -0.112208 -0.0244548 0.13239 0.00791487 0.0057888 -0.0152872 -4.96675e-05 -0.0102318 0.0582215 -0.0456485 0.0695369 -0.0466733 -0.0201589 0.0949561 -0.0526679 -0.0100583 0.168463 0.0154996 -0.0524586 0.0834723 0.0604664 -0.0270117 -0.152489 0.0353541 0.125436 0.0350093 -0.085346 -0.0611238 -0.00579485 -0.1758 0.120395 -0.0708326 0.0759266 
-0.00313664 -0.0216614 -0.0467251 -0.0106665 0.103995 0.185697 0.0378189 -0.0434823 -0.0772165 0.0690554 0.0308002 0.108319 0.0624047 -0.0814096 0.0110415 -0.0564089 -0.0572722 0.149028 0.0163035 0.0672523 0.110076 -0.0742904 0.0838661 0.216078 0.0142375 0.0221047 -0.0588713 -0.257135 0.0926371 0.0453853 0.0906554 -0.0087996 -0.0774637 -0.00963276 0.048871 0.059157 -0.115991 0.0451311 -0.028827 -0.0228972 0.0571233 -0.00444889 -0.136071 0.158545 -0.210954 -0.0894759 0.137987 0.0372373 -0.0705623 -0.0410675 0.0082439 -0.0546399 -0.0260954 -0.081649 0.0584013 0.0891958 0.0262886 0.249042 0.000318924 -0.0729819 -0.0873044 0.0132495 0.237923 -0.108682 0.139276 -0.0931692 0.0115922 -0.0277457 -0.077381 0.16305 -0.00723949 0.16547 -0.0591121 0.0124097 -0.0400568 -0.0532865 -0.100471 0.125379 0.0535355 -0.00358683 -0.129127 0.100952 -0.0119445 -0.0391263 -0.0519145 -0.0770074 0.115884 0.0466553 -0.00229698 -0.0650273 0.0788294 -0.0126568 0.0116044 -0.068653 0.0268008 -0.127905 -0.0226447 0.115966 0.0096134 0.000768654 0.00807332 0.0130643 -0.0231447 0.025703 -0.0594292 0.0635173 -0.0350775 -0.032558 0.0799284 -0.0136839 0.00744465 0.137875 -0.00639338 -0.0659642 0.0753919 0.0819516 -0.0508151 -0.160289 0.00584356 0.145889 0.0414456 -0.0795689 -0.0882076 0.00260884 -0.168867 0.138009 -0.068781 0.0505478 
0.0400501 0.0219089 -0.0740366 0.032757 0.0436104 0.195676 0.0712193 -0.0449461 -0.0477156 0.0377174 0.0727916 0.0493807 0.0872259 -0.0732919 -0.0598285 -0.051226 -0.110127 0.122287 -0.0850712 0.0850038 0.142687 -0.148364 0.0716659 0.243079 0.0364931 -0.0695744 -0.0858359 -0.197569 0.087324 0.0599564 0.0459511 0.0163983 -0.135738 0.0313211 -0.0390879 0.0415374 -0.179233 0.0310501 -0.074049 -0.0298413 0.0288044 -0.0730687 -0.12183 0.152752 -0.141143 -0.128171 0.102337 0.0749402 -0.0866667 0.026123 0.0213278 -0.00314418 -0.0474184 -0.0685321 0.063382 0.0592559 0.00286793 0.220765 0.0684525 -0.126049 -0.0667501 0.0686852 0.23952 -0.0710344 0.00963819 -0.0205269 0.0270781 -0.040824 -0.0905316 0.158312 -0.0438253 0.155536 -0.0274736 0.0674575 -0.0155423 -0.0947545 -0.0355238 0.0708896 0.0338812 0.0534994 -0.073222 0.035628 -0.0340511 -0.106922 -0.0676527 0.015656 0.0653083 0.0019708 0.0204106 -0.0291823 0.114308 -0.0667232 0.000100258 -0.0821898 -0.0226725 -0.110166 -0.0556906 0.0960249 0.0635218 -0.0206954 0.0730008 0.0256774 0.00658093 0.069483 -0.0652651 0.0821616 -0.0713279 0.0630465 0.0695512 -0.0449836 0.0290096 0.200701 -0.0138538 -0.0574437 0.0670735 0.0966341 -0.0187673 -0.0697796 0.0696497 0.15524 0.00616613 -0.0964652 -0.0729393 0.0286164 -0.198724 0.122833 -0.0584942 0.0436032 
-0.0261119 0.0152494 -0.0734318 0.0316436 0.0238044 0.197741 0.0124201 -0.0998707 -0.00136635 0.0273353 0.0553653 0.0429561 0.0452668 0.0107566 -0.0135847 -0.00884866 -0.0675268 0.0925217 0.0196702 -0.00163182 0.105738 -0.0864191 0.0538897 0.193641 0.0440613 0.0207037 -0.0657948 -0.198979 0.110126 0.0592095 0.151323 0.0643041 -0.090964 -0.0477896 0.00328864 0.131671 -0.147941 0.0442522 -0.025805 0.0183095 0.00696785 0.0140433 -0.152753 0.115996 -0.0957215 -0.111226 0.115745 0.0279706 -0.0448719 -0.0915028 -0.0259801 0.0106486 0.0293729 -0.100724 0.0446571 0.119433 0.0236322 0.26968 0.0422761 -0.0986199 -0.128567 0.0566318 0.256401 -0.135488 0.0863487 0.0244957 0.0750299 -0.034374 -0.0776313 0.199903 -0.00950522 0.165992 -0.0540002 0.0509548 -0.00556905 -0.0929908 -0.0773388 0.0554055 -0.0219404 -0.0132857 -0.0636223 0.114241 -0.047078 -0.106932 -0.0651999 -0.0465543 0.051362 -0.0165662 -0.03172 -0.076575 0.0855266 -0.00492712 0.0258194 -0.0749721 0.100045 -0.0594878 -0.0229858 0.11413 0.0473336 0.0451686 0.00191411 -0.016371 -0.0289192 0.0143708 -0.106814 0.117246 -0.0340417 -0.0945394 0.0849002 -0.0270034 -0.00767709 0.147203 0.00064479 -0.0968494 0.100122 0.0878754 -0.0177637 -0.124494 0.0671667 0.115002 0.0569824 -0.10851 -0.0352749 -0.0138599 -0.188943 0.165685 -0.0462571 0.0877437 
0.009824 0.0121695 -0.0937421 0.0358107 0.0472431 0.200726 0.0310296 -0.0928787 0.00546354 -0.00799613 0.0597012 0.0405145 0.0557131 -0.00636913 -0.0375808 -0.0109655 -0.0943875 0.0896874 -0.0314149 0.0128514 0.146543 -0.102965 0.070883 0.166505 0.0584852 -0.00723816 -0.0893823 -0.21538 0.0888999 0.0643681 0.140251 0.0697744 -0.110814 -0.0341365 -0.0113257 0.109035 -0.166628 0.0595962 -0.0203936 0.00600637 0.0244175 0.0117814 -0.152759 0.133428 -0.114549 -0.107118 0.105832 0.0203992 -0.0493679 -0.0751994 -0.0375792 0.0169649 0.00810043 -0.0777974 0.0418272 0.0869948 0.0332475 0.261726 0.0420363 -0.11225 -0.114375 0.0514134 0.263718 -0.113958 0.0580672 0.00696455 0.0694344 0.0101381 -0.0455566 0.193535 0.0168415 0.182486 -0.0417516 0.0397467 -0.0149062 -0.0833372 -0.0953122 0.0344213 -0.0410772 0.0268123 -0.0721875 0.108159 -0.0358439 -0.108614 -0.0834313 -0.00455091 0.073392 -0.0140262 -0.0389189 -0.0944375 0.102909 -0.0362841 -0.00226992 -0.0925821 0.0618262 -0.0855804 -0.0320257 0.114151 0.0435149 0.0309261 0.00755902 -0.0214104 -0.00284114 0.0472051 -0.110893 0.104555 -0.0592777 -0.0151202 0.0876475 -0.0437119 0.0015751 0.148649 -0.0429477 -0.08266 0.111086 0.100478 -0.0466521 -0.11868 0.0809305 0.126094 0.0498473 -0.0704726 -0.0392813 0.0119845 -0.179478 0.130955 -0.0424849 0.0987962 
-0.0460664 0.0220886 -0.0578714 0.011305 0.020237 0.206914 0.0188095 -0.114231 0.0141428 -0.00614706 0.0348348 0.029593 0.0386094 0.0198391 0.00699561 -0.0392789 -0.103987 0.0776544 0.036829 -0.0465763 0.117794 -0.0557989 0.0170787 0.147663 0.043913 0.0255727 -0.11033 -0.213476 0.0923664 0.0801526 0.164475 0.0448437 -0.0858361 -0.0716133 0.0500167 0.143165 -0.140375 0.0146453 -0.0086876 0.0195049 0.0271501 0.0307382 -0.146454 0.118918 -0.089299 -0.0717283 0.113673 0.000723679 -0.0569197 -0.132202 -0.0740013 -0.00690698 0.0672134 -0.08913 0.0366932 0.135356 0.0112163 0.275016 0.00959549 -0.08975 -0.118631 0.0817287 0.2508 -0.120699 0.0994762 0.0325272 0.0989269 -0.023937 -0.0498347 0.170704 0.0310497 0.149615 -0.0489287 0.00591584 -0.00390102 -0.0493239 -0.132663 0.00419988 -0.0234655 -0.00707769 -0.0542839 0.132454 -0.0487563 -0.0766549 -0.0798372 -0.0320176 0.0718348 -0.0439448 -0.0619277 -0.0702192 0.0970323 -0.0135928 0.0340339 -0.0781041 0.0655828 -0.0607128 -0.0296106 0.099276 0.0479351 0.0713629 -0.00133906 -0.0114338 -0.0195238 -0.0286808 -0.133816 0.127265 -0.0272021 -0.0845786 0.038626 0.00557935 0.0260956 0.0752706 -0.0390161 -0.139764 0.0870377 0.113661 -0.0492153 -0.124074 0.0595045 0.0846744 0.0760832 -0.120073 -0.0422308 -0.020437 -0.168049 0.172434 -0.0454027 0.0996508 
