0.044676 0.0176543 -0.0616957 -0.0562319 0.0192142 0.0931584 0.0604769 0.0117196 0.0185943 -0.0768756 0.0153529 0.0763962 0.1579 -0.106033 -0.0770273 -0.0915265 -0.073476 -0.0830066 -0.174847 0.241499 0.0741153 -0.114597 0.0141087 0.158556 -0.0836698 -0.00283658 -0.0468981 -0.1206 0.0358786 0.0427414 0.0471999 0.00867298 -0.0229263 0.119661 -0.0621077 0.00435833 -0.00811723 0.206897 -0.10305 -0.070176 0.0304102 -0.12159 -0.0412215 0.113807 -0.0741141 -0.0913162 0.0812692 0.0989114 -0.0528844 0.145796 -0.0838349 -0.0746384 -0.025141 0.0100241 0.12713 -0.0111796 -0.170037 0.143133 -0.0366987 -0.183273 -0.0998339 -0.0127671 0.187954 -0.0673463 -0.0220632 -0.0283848 0.0594317 -0.0247854 -0.135682 -0.0987604 -0.0716776 -0.038448 -0.0505892 0.0838542 0.055176 -0.0321453 0.0306052 0.0232296 0.123065 0.179091 -0.0350577 -0.0638933 -0.0359201 -0.0549604 0.0199378 -0.047379 0.055468 0.0704994 0.122455 0.0505483 0.102055 -0.177639 0.0314044 0.0237434 -0.0805338 -0.0781208 -0.0166823 0.00223253 0.0249883 -0.0846685 0.0241939 0.021575 -0.081371 0.131942 -0.128366 0.0752312 -0.100583 0.121126 0.0451922 -0.0462532 0.050512 0.185393 -0.138998 0.0775805 -0.0229399 0.0662157 -0.0664482 -0.0576087 0.00593291 0.170033 -0.0330282 0.0297288 -0.0239516 0.111843 -0.0922426 0.00216635 -0.0369836 -0.0736671 
0.014848 0.00722504 -0.0685933 -0.0807922 0.0153517 0.108325 0.0400703 0.0103511 0.0114121 -0.0703586 -0.00177624 0.0823561 0.152778 -0.113598 -0.094228 -0.114527 -0.124622 -0.0682537 -0.158078 0.228654 0.0764807 -0.128643 0.0304459 0.154 -0.100634 0.00844842 -0.0339855 -0.148989 0.00936804 0.0251629 0.0324023 -0.041789 -0.0238426 0.0972139 -0.0499053 0.0152899 -0.0250732 0.190229 -0.128899 -0.0571885 0.0442953 -0.125526 -0.0603808 0.140763 -0.101683 -0.0774266 0.103677 0.0964637 -0.0719389 0.141383 -0.0979356 -0.0993108 -0.0236804 0.0188121 0.13394 0.00793008 -0.142325 0.148535 -0.0318595 -0.196615 -0.0745717 0.0134596 0.2094 -0.0399238 0.00276528 -0.0505738 0.0614236 -0.0114549 -0.0985433 -0.0683644 -0.0666485 -0.031541 -0.0378407 0.0639078 0.0624462 -0.00645333 -0.0172658 0.0377463 0.12651 0.149971 -0.0602812 -0.04081 -0.0413957 -0.0396198 -0.0249675 -0.0272646 0.0803742 0.0844466 0.114993 0.0427337 0.10403 -0.175812 0.0547314 -0.0086783 -0.0995282 -0.0994008 -0.028743 0.0209431 0.0431064 -0.0840047 0.0338691 0.0196241 -0.0740991 0.0968199 -0.11151 0.0708872 -0.113199 0.123304 -0.00869697 -0.031537 0.0639283 0.175599 -0.113453 0.0472056 -0.0406602 0.0878654 -0.0866834 -0.0721391 0.00142584 0.152565 -0.026336 0.007445 -0.0386441 0.0900926 -0.114636 0.0279627 -0.0703159 -0.0502304 
0.014848 0.00722504 -0.0685933 -0.0807922 0.0153517 0.108325 0.0400703 0.0103511 0.0114121 -0.0703586 -0.00177624 0.0823561 0.152778 -0.113598 -0.094228 -0.114527 -0.124622 -0.0682537 -0.158078 0.228654 0.0764807 -0.128643 0.0304459 0.154 -0.100634 0.00844842 -0.0339855 -0.148989 0.00936804 0.0251629 0.0324023 -0.041789 -0.0238426 0.0972139 -0.0499053 0.0152899 -0.0250732 0.190229 -0.128899 -0.0571885 0.0442953 -0.125526 -0.0603808 0.140763 -0.101683 -0.0774266 0.103677 0.0964637 -0.0719389 0.141383 -0.0979356 -0.0993108 -0.0236804 0.0188121 0.13394 0.00793008 -0.142325 0.148535 -0.0318595 -0.196615 -0.0745717 0.0134596 0.2094 -0.0399238 0.00276528 -0.0505738 0.0614236 -0.0114549 -0.0985433 -0.0683644 -0.0666485 -0.031541 -0.0378407 0.0639078 0.0624462 -0.00645333 -0.0172658 0.0377463 0.12651 0.149971 -0.0602812 -0.04081 -0.0413957 -0.0396198 -0.0249675 -0.0272646 0.0803742 0.0844466 0.114993 0.0427337 0.10403 -0.175812 0.0547314 -0.0086783 -0.0995282 -0.0994008 -0.028743 0.0209431 0.0431064 -0.0840047 0.0338691 0.0196241 -0.0740991 0.0968199 -0.11151 0.0708872 -0.113199 0.123304 -0.00869697 -0.031537 0.0639283 0.175599 -0.113453 0.0472056 -0.0406602 0.0878654 -0.0866834 -0.0721391 0.00142584 0.152565 -0.026336 0.007445 -0.0386441 0.0900926 -0.114636 0.0279627 -0.0703159 -0.0502304 
0.00397418 0.0319843 -0.088765 -0.0883091 0.0146288 0.124159 0.0267152 0.0232817 -0.000489442 -0.0421365 0.000958344 0.0615058 0.132585 -0.129834 -0.0784173 -0.115726 -0.10219 -0.0605868 -0.115015 0.21424 0.066166 -0.145281 0.0550512 0.141355 -0.0866623 0.0182542 -0.02028 -0.169548 0.0438822 -0.0137581 0.0593611 -0.0454116 -0.00889715 0.0862983 -0.0421619 0.0165532 -0.0088415 0.203619 -0.117576 -0.0691348 0.0608552 -0.128861 -0.0793907 0.145732 -0.127945 -0.0592265 0.120278 0.0966699 -0.098774 0.112549 -0.123334 -0.0661222 -0.0204995 0.00380701 0.105548 0.0167731 -0.103416 0.135888 -0.0285348 -0.20988 -0.0904928 0.0122101 0.225599 -0.0615936 0.0232755 -0.0349674 0.0628977 -0.00873637 -0.0802574 -0.0366138 -0.084108 -0.0264675 -0.0626203 0.0764223 0.0803079 -0.0378594 -0.0352191 0.0814544 0.12502 0.121084 -0.115346 -0.0148319 -0.0445993 -0.0454145 -0.00379949 -0.0308129 0.0726402 0.0922115 0.121375 0.0261298 0.123016 -0.149924 0.0524798 -0.0346988 -0.0543383 -0.133187 -0.00702678 0.0578133 0.0253453 -0.0994373 0.0152685 0.00825793 -0.0554025 0.0916258 -0.113979 0.0765015 -0.0841418 0.117559 0.0205454 -0.0410551 0.0580831 0.182483 -0.0948733 0.0303673 -0.010301 0.0586599 -0.0919766 -0.132111 0.0407571 0.152615 -0.00983628 0.00461575 -0.0423716 0.0999577 -0.125026 0.0160105 -0.0608491 -0.0323386 
0.00397418 0.0319843 -0.088765 -0.0883091 0.0146288 0.124159 0.0267152 0.0232817 -0.000489442 -0.0421365 0.000958344 0.0615058 0.132585 -0.129834 -0.0784173 -0.115726 -0.10219 -0.0605868 -0.115015 0.21424 0.066166 -0.145281 0.0550512 0.141355 -0.0866623 0.0182542 -0.02028 -0.169548 0.0438822 -0.0137581 0.0593611 -0.0454116 -0.00889715 0.0862983 -0.0421619 0.0165532 -0.0088415 0.203619 -0.117576 -0.0691348 0.0608552 -0.128861 -0.0793907 0.145732 -0.127945 -0.0592265 0.120278 0.0966699 -0.098774 0.112549 -0.123334 -0.0661222 -0.0204995 0.00380701 0.105548 0.0167731 -0.103416 0.135888 -0.0285348 -0.20988 -0.0904928 0.0122101 0.225599 -0.0615936 0.0232755 -0.0349674 0.0628977 -0.00873637 -0.0802574 -0.0366138 -0.084108 -0.0264675 -0.0626203 0.0764223 0.0803079 -0.0378594 -0.0352191 0.0814544 0.12502 0.121084 -0.115346 -0.0148319 -0.0445993 -0.0454145 -0.00379949 -0.0308129 0.0726402 0.0922115 0.121375 0.0261298 0.123016 -0.149924 0.0524798 -0.0346988 -0.0543383 -0.133187 -0.00702678 0.0578133 0.0253453 -0.0994373 0.0152685 0.00825793 -0.0554025 0.0916258 -0.113979 0.0765015 -0.0841418 0.117559 0.0205454 -0.0410551 0.0580831 0.182483 -0.0948733 0.0303673 -0.010301 0.0586599 -0.0919766 -0.132111 0.0407571 0.152615 -0.00983628 0.00461575 -0.0423716 0.0999577 -0.125026 0.0160105 -0.0608491 -0.0323386 
0.000655926 0.0194047 -0.107108 -0.0839083 0.0225356 0.138931 0.0013094 0.0240129 -0.00583805 -0.0235048 6.05372e-05 0.0667534 0.133186 -0.12538 -0.0507023 -0.106927 -0.088123 -0.0448122 -0.0831206 0.206988 0.0663016 -0.132379 0.0723997 0.181275 -0.0710784 0.0114214 0.00155769 -0.199027 0.0306568 -0.000337782 0.0774125 -0.0491227 0.00565143 0.0833993 -0.0360517 0.0385508 -0.00562316 0.164154 -0.125298 -0.0634261 0.0574822 -0.126313 -0.0809312 0.164512 -0.141225 -0.0628536 0.141202 0.104064 -0.0928773 0.110052 -0.100373 -0.0950982 -0.00435754 -0.0117078 0.107828 0.0399618 -0.0937502 0.145289 -0.00175843 -0.212859 -0.101709 0.0124248 0.217025 -0.0777272 0.0255392 -0.0459633 0.0591773 -0.00919738 -0.0731891 -0.0303617 -0.0938303 -0.0096038 -0.0794171 0.0381384 0.0778423 -0.0339779 -0.0467026 0.100898 0.120991 0.1228 -0.112905 -0.00539869 -0.0524235 -0.0475215 -0.00834526 -0.0164348 0.0717879 0.0741482 0.105401 0.0229887 0.110349 -0.134974 0.0440529 -0.0404645 -0.0509457 -0.117898 -0.0263482 0.068804 0.0219519 -0.106222 0.0249298 -0.00383445 -0.044723 0.070657 -0.123689 0.0689009 -0.104091 0.081562 -3.68002e-05 -0.0249969 0.053461 0.180113 -0.072519 0.00136548 -0.0226715 0.0683425 -0.0900284 -0.154021 0.0305049 0.161101 0.0163495 -0.0110828 -0.047946 0.102539 -0.149188 0.0233554 -0.071836 -0.0190734 
-0.0267503 0.0464107 -0.0919072 -0.104287 0.00312651 0.150025 -0.0216725 0.0335312 0.0122946 0.0113718 0.0212419 0.0463487 0.133814 -0.126467 -0.0272733 -0.124058 -0.0977991 -0.0414743 -0.0670428 0.172021 0.0561615 -0.124519 0.0728321 0.174848 -0.0626104 0.0103861 0.020918 -0.191243 0.0438171 -0.0169777 0.109465 -0.0903079 0.0246053 0.0669818 -0.0275988 0.0502714 -0.00294341 0.155449 -0.111678 -0.0334498 0.057056 -0.138111 -0.11287 0.174128 -0.147886 -0.073199 0.12668 0.111117 -0.0910993 0.0830803 -0.107327 -0.0623448 -0.0105394 -0.0224657 0.0716564 0.0582142 -0.0875477 0.1306 -0.0107822 -0.211343 -0.121755 -0.00661801 0.213226 -0.0701752 0.0259251 -0.0519182 0.0793153 0.00608821 -0.0561186 -0.0112562 -0.0816778 -0.00849062 -0.089801 0.0147486 0.0965779 -0.0379223 -0.0822123 0.120865 0.117567 0.130916 -0.13898 -0.0089598 -0.0306398 -0.0210709 -0.0130389 -0.012972 0.0877095 0.071524 0.108307 0.00809501 0.0921032 -0.12893 0.0669796 -0.0323718 -0.0591721 -0.159413 -0.0444841 0.0633432 0.0116033 -0.113453 0.0266474 0.00143163 -0.0502562 0.0468938 -0.0999654 0.0725263 -0.0866135 0.0648709 0.0137813 -0.0288653 0.045532 0.163906 -0.0693849 0.00279468 -0.0196619 0.0710667 -0.106556 -0.157011 0.0372037 0.159688 0.0340939 -0.0348798 -0.0777228 0.104932 -0.139569 0.0300105 -0.0693729 0.0180534 
-0.0267503 0.0464107 -0.0919072 -0.104287 0.00312651 0.150025 -0.0216725 0.0335312 0.0122946 0.0113718 0.0212419 0.0463487 0.133814 -0.126467 -0.0272733 -0.124058 -0.0977991 -0.0414743 -0.0670428 0.172021 0.0561615 -0.124519 0.0728321 0.174848 -0.0626104 0.0103861 0.020918 -0.191243 0.0438171 -0.0169777 0.109465 -0.0903079 0.0246053 0.0669818 -0.0275988 0.0502714 -0.00294341 0.155449 -0.111678 -0.0334498 0.057056 -0.138111 -0.11287 0.174128 -0.147886 -0.073199 0.12668 0.111117 -0.0910993 0.0830803 -0.107327 -0.0623448 -0.0105394 -0.0224657 0.0716564 0.0582142 -0.0875477 0.1306 -0.0107822 -0.211343 -0.121755 -0.00661801 0.213226 -0.0701752 0.0259251 -0.0519182 0.0793153 0.00608821 -0.0561186 -0.0112562 -0.0816778 -0.00849062 -0.089801 0.0147486 0.0965779 -0.0379223 -0.0822123 0.120865 0.117567 0.130916 -0.13898 -0.0089598 -0.0306398 -0.0210709 -0.0130389 -0.012972 0.0877095 0.071524 0.108307 0.00809501 0.0921032 -0.12893 0.0669796 -0.0323718 -0.0591721 -0.159413 -0.0444841 0.0633432 0.0116033 -0.113453 0.0266474 0.00143163 -0.0502562 0.0468938 -0.0999654 0.0725263 -0.0866135 0.0648709 0.0137813 -0.0288653 0.045532 0.163906 -0.0693849 0.00279468 -0.0196619 0.0710667 -0.106556 -0.157011 0.0372037 0.159688 0.0340939 -0.0348798 -0.0777228 0.104932 -0.139569 0.0300105 -0.0693729 0.0180534 
-0.0186404 0.0402894 -0.0861629 -0.100598 0.0161917 0.144237 -0.0229575 0.0315868 0.015844 0.0176823 0.0254854 0.0580866 0.158861 -0.113566 -0.0256449 -0.119764 -0.0826942 -0.0374591 -0.0933553 0.191168 0.0645672 -0.129793 0.0774897 0.187039 -0.0649283 -0.00555509 0.00118409 -0.177621 0.0326047 -0.00411933 0.112442 -0.0830155 0.0211944 0.0738894 -0.0476666 0.0541431 -0.0218862 0.156064 -0.115436 -0.0231877 0.0452436 -0.130816 -0.119515 0.160495 -0.142903 -0.0916331 0.10763 0.120981 -0.0685411 0.0998345 -0.0828923 -0.0614148 -0.0280268 -0.0284439 0.0674733 0.049373 -0.0973495 0.132937 -0.00273921 -0.197992 -0.125129 -0.00758646 0.193207 -0.0710633 0.0126244 -0.0712406 0.0751635 0.0252762 -0.0720064 -0.0191877 -0.0600902 0.00565133 -0.0866352 0.00628067 0.0807864 -0.0210804 -0.0735572 0.109325 0.11865 0.150186 -0.133685 -0.0265635 -0.0185844 -0.0059802 -0.0190791 -0.0112791 0.0962357 0.0705693 0.114554 -0.00129531 0.0613956 -0.136569 0.0760599 -0.0144205 -0.0725918 -0.163055 -0.0561078 0.0493041 -0.00455198 -0.114631 0.0376795 0.00896043 -0.0615489 0.0634464 -0.0964443 0.0720692 -0.102411 0.061758 0.0270969 -0.0266732 0.0295032 0.163395 -0.0777394 0.0267855 -0.029986 0.0834481 -0.108332 -0.130685 0.0147297 0.178497 0.0175128 -0.0323022 -0.0898155 0.107987 -0.138413 0.0320802 -0.0804582 0.020563 
-0.0186404 0.0402894 -0.0861629 -0.100598 0.0161917 0.144237 -0.0229575 0.0315868 0.015844 0.0176823 0.0254854 0.0580866 0.158861 -0.113566 -0.0256449 -0.119764 -0.0826942 -0.0374591 -0.0933553 0.191168 0.0645672 -0.129793 0.0774897 0.187039 -0.0649283 -0.00555509 0.00118409 -0.177621 0.0326047 -0.00411933 0.112442 -0.0830155 0.0211944 0.0738894 -0.0476666 0.0541431 -0.0218862 0.156064 -0.115436 -0.0231877 0.0452436 -0.130816 -0.119515 0.160495 -0.142903 -0.0916331 0.10763 0.120981 -0.0685411 0.0998345 -0.0828923 -0.0614148 -0.0280268 -0.0284439 0.0674733 0.049373 -0.0973495 0.132937 -0.00273921 -0.197992 -0.125129 -0.00758646 0.193207 -0.0710633 0.0126244 -0.0712406 0.0751635 0.0252762 -0.0720064 -0.0191877 -0.0600902 0.00565133 -0.0866352 0.00628067 0.0807864 -0.0210804 -0.0735572 0.109325 0.11865 0.150186 -0.133685 -0.0265635 -0.0185844 -0.0059802 -0.0190791 -0.0112791 0.0962357 0.0705693 0.114554 -0.00129531 0.0613956 -0.136569 0.0760599 -0.0144205 -0.0725918 -0.163055 -0.0561078 0.0493041 -0.00455198 -0.114631 0.0376795 0.00896043 -0.0615489 0.0634464 -0.0964443 0.0720692 -0.102411 0.061758 0.0270969 -0.0266732 0.0295032 0.163395 -0.0777394 0.0267855 -0.029986 0.0834481 -0.108332 -0.130685 0.0147297 0.178497 0.0175128 -0.0323022 -0.0898155 0.107987 -0.138413 0.0320802 -0.0804582 0.020563 
-0.0262825 0.0265948 -0.0670055 -0.0937073 0.0166241 0.148884 -0.02849 0.0294479 0.0340495 0.00111553 0.0235119 0.0651923 0.147047 -0.108478 -0.0309959 -0.13011 -0.112717 -0.0454211 -0.10625 0.181995 0.06178 -0.128542 0.0762662 0.188343 -0.0576998 -0.00910403 0.000556931 -0.160927 0.015948 -0.0211792 0.121452 -0.093508 0.00972793 0.0757334 -0.0544493 0.0666583 -0.0384226 0.141299 -0.122822 -0.0123871 0.0643208 -0.128789 -0.126613 0.154387 -0.140747 -0.109986 0.0926023 0.120031 -0.0503475 0.112642 -0.0902227 -0.0591517 -0.0330703 -0.0227597 0.0782701 0.0449553 -0.105474 0.14022 -0.0141379 -0.196296 -0.125951 0.00168056 0.194302 -0.0532461 0.00126714 -0.0600848 0.0799827 0.0320003 -0.0666948 0.0029461 -0.0489926 0.0208638 -0.0707612 0.0230045 0.08546 -0.0213553 -0.0796594 0.0936075 0.111887 0.150598 -0.127449 -0.0225433 -0.00130147 -0.00577648 -0.0320666 -0.00857121 0.109454 0.0859952 0.109615 -0.00515767 0.0715076 -0.139415 0.0854714 -0.0160392 -0.0832426 -0.165932 -0.0672407 0.0362382 -0.000509911 -0.109102 0.0343774 0.00389136 -0.0637623 0.0486037 -0.0837657 0.0820017 -0.108571 0.0590049 0.0188104 -0.0255195 0.0305109 0.167653 -0.0788371 0.0336163 -0.02458 0.0869868 -0.093868 -0.113154 0.0247219 0.182139 0.0286003 -0.031841 -0.0903757 0.098123 -0.143727 0.0389422 -0.0704421 0.0418556 
-0.0262825 0.0265948 -0.0670055 -0.0937073 0.0166241 0.148884 -0.02849 0.0294479 0.0340495 0.00111553 0.0235119 0.0651923 0.147047 -0.108478 -0.0309959 -0.13011 -0.112717 -0.0454211 -0.10625 0.181995 0.06178 -0.128542 0.0762662 0.188343 -0.0576998 -0.00910403 0.000556931 -0.160927 0.015948 -0.0211792 0.121452 -0.093508 0.00972793 0.0757334 -0.0544493 0.0666583 -0.0384226 0.141299 -0.122822 -0.0123871 0.0643208 -0.128789 -0.126613 0.154387 -0.140747 -0.109986 0.0926023 0.120031 -0.0503475 0.112642 -0.0902227 -0.0591517 -0.0330703 -0.0227597 0.0782701 0.0449553 -0.105474 0.14022 -0.0141379 -0.196296 -0.125951 0.00168056 0.194302 -0.0532461 0.00126714 -0.0600848 0.0799827 0.0320003 -0.0666948 0.0029461 -0.0489926 0.0208638 -0.0707612 0.0230045 0.08546 -0.0213553 -0.0796594 0.0936075 0.111887 0.150598 -0.127449 -0.0225433 -0.00130147 -0.00577648 -0.0320666 -0.00857121 0.109454 0.0859952 0.109615 -0.00515767 0.0715076 -0.139415 0.0854714 -0.0160392 -0.0832426 -0.165932 -0.0672407 0.0362382 -0.000509911 -0.109102 0.0343774 0.00389136 -0.0637623 0.0486037 -0.0837657 0.0820017 -0.108571 0.0590049 0.0188104 -0.0255195 0.0305109 0.167653 -0.0788371 0.0336163 -0.02458 0.0869868 -0.093868 -0.113154 0.0247219 0.182139 0.0286003 -0.031841 -0.0903757 0.098123 -0.143727 0.0389422 -0.0704421 0.0418556 
-0.0262825 0.0265948 -0.0670055 -0.0937073 0.0166241 0.148884 -0.02849 0.0294479 0.0340495 0.00111553 0.0235119 0.0651923 0.147047 -0.108478 -0.0309959 -0.13011 -0.112717 -0.0454211 -0.10625 0.181995 0.06178 -0.128542 0.0762662 0.188343 -0.0576998 -0.00910403 0.000556931 -0.160927 0.015948 -0.0211792 0.121452 -0.093508 0.00972793 0.0757334 -0.0544493 0.0666583 -0.0384226 0.141299 -0.122822 -0.0123871 0.0643208 -0.128789 -0.126613 0.154387 -0.140747 -0.109986 0.0926023 0.120031 -0.0503475 0.112642 -0.0902227 -0.0591517 -0.0330703 -0.0227597 0.0782701 0.0449553 -0.105474 0.14022 -0.0141379 -0.196296 -0.125951 0.00168056 0.194302 -0.0532461 0.00126714 -0.0600848 0.0799827 0.0320003 -0.0666948 0.0029461 -0.0489926 0.0208638 -0.0707612 0.0230045 0.08546 -0.0213553 -0.0796594 0.0936075 0.111887 0.150598 -0.127449 -0.0225433 -0.00130147 -0.00577648 -0.0320666 -0.00857121 0.109454 0.0859952 0.109615 -0.00515767 0.0715076 -0.139415 0.0854714 -0.0160392 -0.0832426 -0.165932 -0.0672407 0.0362382 -0.000509911 -0.109102 0.0343774 0.00389136 -0.0637623 0.0486037 -0.0837657 0.0820017 -0.108571 0.0590049 0.0188104 -0.0255195 0.0305109 0.167653 -0.0788371 0.0336163 -0.02458 0.0869868 -0.093868 -0.113154 0.0247219 0.182139 0.0286003 -0.031841 -0.0903757 0.098123 -0.143727 0.0389422 -0.0704421 0.0418556 
-0.0262825 0.0265948 -0.0670055 -0.0937073 0.0166241 0.148884 -0.02849 0.0294479 0.0340495 0.00111553 0.0235119 0.0651923 0.147047 -0.108478 -0.0309959 -0.13011 -0.112717 -0.0454211 -0.10625 0.181995 0.06178 -0.128542 0.0762662 0.188343 -0.0576998 -0.00910403 0.000556931 -0.160927 0.015948 -0.0211792 0.121452 -0.093508 0.00972793 0.0757334 -0.0544493 0.0666583 -0.0384226 0.141299 -0.122822 -0.0123871 0.0643208 -0.128789 -0.126613 0.154387 -0.140747 -0.109986 0.0926023 0.120031 -0.0503475 0.112642 -0.0902227 -0.0591517 -0.0330703 -0.0227597 0.0782701 0.0449553 -0.105474 0.14022 -0.0141379 -0.196296 -0.125951 0.00168056 0.194302 -0.0532461 0.00126714 -0.0600848 0.0799827 0.0320003 -0.0666948 0.0029461 -0.0489926 0.0208638 -0.0707612 0.0230045 0.08546 -0.0213553 -0.0796594 0.0936075 0.111887 0.150598 -0.127449 -0.0225433 -0.00130147 -0.00577648 -0.0320666 -0.00857121 0.109454 0.0859952 0.109615 -0.00515767 0.0715076 -0.139415 0.0854714 -0.0160392 -0.0832426 -0.165932 -0.0672407 0.0362382 -0.000509911 -0.109102 0.0343774 0.00389136 -0.0637623 0.0486037 -0.0837657 0.0820017 -0.108571 0.0590049 0.0188104 -0.0255195 0.0305109 0.167653 -0.0788371 0.0336163 -0.02458 0.0869868 -0.093868 -0.113154 0.0247219 0.182139 0.0286003 -0.031841 -0.0903757 0.098123 -0.143727 0.0389422 -0.0704421 0.0418556 
-0.0262825 0.0265948 -0.0670055 -0.0937073 0.0166241 0.148884 -0.02849 0.0294479 0.0340495 0.00111553 0.0235119 0.0651923 0.147047 -0.108478 -0.0309959 -0.13011 -0.112717 -0.0454211 -0.10625 0.181995 0.06178 -0.128542 0.0762662 0.188343 -0.0576998 -0.00910403 0.000556931 -0.160927 0.015948 -0.0211792 0.121452 -0.093508 0.00972793 0.0757334 -0.0544493 0.0666583 -0.0384226 0.141299 -0.122822 -0.0123871 0.0643208 -0.128789 -0.126613 0.154387 -0.140747 -0.109986 0.0926023 0.120031 -0.0503475 0.112642 -0.0902227 -0.0591517 -0.0330703 -0.0227597 0.0782701 0.0449553 -0.105474 0.14022 -0.0141379 -0.196296 -0.125951 0.00168056 0.194302 -0.0532461 0.00126714 -0.0600848 0.0799827 0.0320003 -0.0666948 0.0029461 -0.0489926 0.0208638 -0.0707612 0.0230045 0.08546 -0.0213553 -0.0796594 0.0936075 0.111887 0.150598 -0.127449 -0.0225433 -0.00130147 -0.00577648 -0.0320666 -0.00857121 0.109454 0.0859952 0.109615 -0.00515767 0.0715076 -0.139415 0.0854714 -0.0160392 -0.0832426 -0.165932 -0.0672407 0.0362382 -0.000509911 -0.109102 0.0343774 0.00389136 -0.0637623 0.0486037 -0.0837657 0.0820017 -0.108571 0.0590049 0.0188104 -0.0255195 0.0305109 0.167653 -0.0788371 0.0336163 -0.02458 0.0869868 -0.093868 -0.113154 0.0247219 0.182139 0.0286003 -0.031841 -0.0903757 0.098123 -0.143727 0.0389422 -0.0704421 0.0418556 
-0.0262825 0.0265948 -0.0670055 -0.0937073 0.0166241 0.148884 -0.02849 0.0294479 0.0340495 0.00111553 0.0235119 0.0651923 0.147047 -0.108478 -0.0309959 -0.13011 -0.112717 -0.0454211 -0.10625 0.181995 0.06178 -0.128542 0.0762662 0.188343 -0.0576998 -0.00910403 0.000556931 -0.160927 0.015948 -0.0211792 0.121452 -0.093508 0.00972793 0.0757334 -0.0544493 0.0666583 -0.0384226 0.141299 -0.122822 -0.0123871 0.0643208 -0.128789 -0.126613 0.154387 -0.140747 -0.109986 0.0926023 0.120031 -0.0503475 0.112642 -0.0902227 -0.0591517 -0.0330703 -0.0227597 0.0782701 0.0449553 -0.105474 0.14022 -0.0141379 -0.196296 -0.125951 0.00168056 0.194302 -0.0532461 0.00126714 -0.0600848 0.0799827 0.0320003 -0.0666948 0.0029461 -0.0489926 0.0208638 -0.0707612 0.0230045 0.08546 -0.0213553 -0.0796594 0.0936075 0.111887 0.150598 -0.127449 -0.0225433 -0.00130147 -0.00577648 -0.0320666 -0.00857121 0.109454 0.0859952 0.109615 -0.00515767 0.0715076 -0.139415 0.0854714 -0.0160392 -0.0832426 -0.165932 -0.0672407 0.0362382 -0.000509911 -0.109102 0.0343774 0.00389136 -0.0637623 0.0486037 -0.0837657 0.0820017 -0.108571 0.0590049 0.0188104 -0.0255195 0.0305109 0.167653 -0.0788371 0.0336163 -0.02458 0.0869868 -0.093868 -0.113154 0.0247219 0.182139 0.0286003 -0.031841 -0.0903757 0.098123 -0.143727 0.0389422 -0.0704421 0.0418556 
-0.0262825 0.0265948 -0.0670055 -0.0937073 0.0166241 0.148884 -0.02849 0.0294479 0.0340495 0.00111553 0.0235119 0.0651923 0.147047 -0.108478 -0.0309959 -0.13011 -0.112717 -0.0454211 -0.10625 0.181995 0.06178 -0.128542 0.0762662 0.188343 -0.0576998 -0.00910403 0.000556931 -0.160927 0.015948 -0.0211792 0.121452 -0.093508 0.00972793 0.0757334 -0.0544493 0.0666583 -0.0384226 0.141299 -0.122822 -0.0123871 0.0643208 -0.128789 -0.126613 0.154387 -0.140747 -0.109986 0.0926023 0.120031 -0.0503475 0.112642 -0.0902227 -0.0591517 -0.0330703 -0.0227597 0.0782701 0.0449553 -0.105474 0.14022 -0.0141379 -0.196296 -0.125951 0.00168056 0.194302 -0.0532461 0.00126714 -0.0600848 0.0799827 0.0320003 -0.0666948 0.0029461 -0.0489926 0.0208638 -0.0707612 0.0230045 0.08546 -0.0213553 -0.0796594 0.0936075 0.111887 0.150598 -0.127449 -0.0225433 -0.00130147 -0.00577648 -0.0320666 -0.00857121 0.109454 0.0859952 0.109615 -0.00515767 0.0715076 -0.139415 0.0854714 -0.0160392 -0.0832426 -0.165932 -0.0672407 0.0362382 -0.000509911 -0.109102 0.0343774 0.00389136 -0.0637623 0.0486037 -0.0837657 0.0820017 -0.108571 0.0590049 0.0188104 -0.0255195 0.0305109 0.167653 -0.0788371 0.0336163 -0.02458 0.0869868 -0.093868 -0.113154 0.0247219 0.182139 0.0286003 -0.031841 -0.0903757 0.098123 -0.143727 0.0389422 -0.0704421 0.0418556 
-0.0262825 0.0265948 -0.0670055 -0.0937073 0.0166241 0.148884 -0.02849 0.0294479 0.0340495 0.00111553 0.0235119 0.0651923 0.147047 -0.108478 -0.0309959 -0.13011 -0.112717 -0.0454211 -0.10625 0.181995 0.06178 -0.128542 0.0762662 0.188343 -0.0576998 -0.00910403 0.000556931 -0.160927 0.015948 -0.0211792 0.121452 -0.093508 0.00972793 0.0757334 -0.0544493 0.0666583 -0.0384226 0.141299 -0.122822 -0.0123871 0.0643208 -0.128789 -0.126613 0.154387 -0.140747 -0.109986 0.0926023 0.120031 -0.0503475 0.112642 -0.0902227 -0.0591517 -0.0330703 -0.0227597 0.0782701 0.0449553 -0.105474 0.14022 -0.0141379 -0.196296 -0.125951 0.00168056 0.194302 -0.0532461 0.00126714 -0.0600848 0.0799827 0.0320003 -0.0666948 0.0029461 -0.0489926 0.0208638 -0.0707612 0.0230045 0.08546 -0.0213553 -0.0796594 0.0936075 0.111887 0.150598 -0.127449 -0.0225433 -0.00130147 -0.00577648 -0.0320666 -0.00857121 0.109454 0.0859952 0.109615 -0.00515767 0.0715076 -0.139415 0.0854714 -0.0160392 -0.0832426 -0.165932 -0.0672407 0.0362382 -0.000509911 -0.109102 0.0343774 0.00389136 -0.0637623 0.0486037 -0.0837657 0.0820017 -0.108571 0.0590049 0.0188104 -0.0255195 0.0305109 0.167653 -0.0788371 0.0336163 -0.02458 0.0869868 -0.093868 -0.113154 0.0247219 0.182139 0.0286003 -0.031841 -0.0903757 0.098123 -0.143727 0.0389422 -0.0704421 0.0418556 
-0.0262825 0.0265948 -0.0670055 -0.0937073 0.0166241 0.148884 -0.02849 0.0294479 0.0340495 0.00111553 0.0235119 0.0651923 0.147047 -0.108478 -0.0309959 -0.13011 -0.112717 -0.0454211 -0.10625 0.181995 0.06178 -0.128542 0.0762662 0.188343 -0.0576998 -0.00910403 0.000556931 -0.160927 0.015948 -0.0211792 0.121452 -0.093508 0.00972793 0.0757334 -0.0544493 0.0666583 -0.0384226 0.141299 -0.122822 -0.0123871 0.0643208 -0.128789 -0.126613 0.154387 -0.140747 -0.109986 0.0926023 0.120031 -0.0503475 0.112642 -0.0902227 -0.0591517 -0.0330703 -0.0227597 0.0782701 0.0449553 -0.105474 0.14022 -0.0141379 -0.196296 -0.125951 0.00168056 0.194302 -0.0532461 0.00126714 -0.0600848 0.0799827 0.0320003 -0.0666948 0.0029461 -0.0489926 0.0208638 -0.0707612 0.0230045 0.08546 -0.0213553 -0.0796594 0.0936075 0.111887 0.150598 -0.127449 -0.0225433 -0.00130147 -0.00577648 -0.0320666 -0.00857121 0.109454 0.0859952 0.109615 -0.00515767 0.0715076 -0.139415 0.0854714 -0.0160392 -0.0832426 -0.165932 -0.0672407 0.0362382 -0.000509911 -0.109102 0.0343774 0.00389136 -0.0637623 0.0486037 -0.0837657 0.0820017 -0.108571 0.0590049 0.0188104 -0.0255195 0.0305109 0.167653 -0.0788371 0.0336163 -0.02458 0.0869868 -0.093868 -0.113154 0.0247219 0.182139 0.0286003 -0.031841 -0.0903757 0.098123 -0.143727 0.0389422 -0.0704421 0.0418556 
-0.0262825 0.0265948 -0.0670055 -0.0937073 0.0166241 0.148884 -0.02849 0.0294479 0.0340495 0.00111553 0.0235119 0.0651923 0.147047 -0.108478 -0.0309959 -0.13011 -0.112717 -0.0454211 -0.10625 0.181995 0.06178 -0.128542 0.0762662 0.188343 -0.0576998 -0.00910403 0.000556931 -0.160927 0.015948 -0.0211792 0.121452 -0.093508 0.00972793 0.0757334 -0.0544493 0.0666583 -0.0384226 0.141299 -0.122822 -0.0123871 0.0643208 -0.128789 -0.126613 0.154387 -0.140747 -0.109986 0.0926023 0.120031 -0.0503475 0.112642 -0.0902227 -0.0591517 -0.0330703 -0.0227597 0.0782701 0.0449553 -0.105474 0.14022 -0.0141379 -0.196296 -0.125951 0.00168056 0.194302 -0.0532461 0.00126714 -0.0600848 0.0799827 0.0320003 -0.0666948 0.0029461 -0.0489926 0.0208638 -0.0707612 0.0230045 0.08546 -0.0213553 -0.0796594 0.0936075 0.111887 0.150598 -0.127449 -0.0225433 -0.00130147 -0.00577648 -0.0320666 -0.00857121 0.109454 0.0859952 0.109615 -0.00515767 0.0715076 -0.139415 0.0854714 -0.0160392 -0.0832426 -0.165932 -0.0672407 0.0362382 -0.000509911 -0.109102 0.0343774 0.00389136 -0.0637623 0.0486037 -0.0837657 0.0820017 -0.108571 0.0590049 0.0188104 -0.0255195 0.0305109 0.167653 -0.0788371 0.0336163 -0.02458 0.0869868 -0.093868 -0.113154 0.0247219 0.182139 0.0286003 -0.031841 -0.0903757 0.098123 -0.143727 0.0389422 -0.0704421 0.0418556 
-0.0262825 0.0265948 -0.0670055 -0.0937073 0.0166241 0.148884 -0.02849 0.0294479 0.0340495 0.00111553 0.0235119 0.0651923 0.147047 -0.108478 -0.0309959 -0.13011 -0.112717 -0.0454211 -0.10625 0.181995 0.06178 -0.128542 0.0762662 0.188343 -0.0576998 -0.00910403 0.000556931 -0.160927 0.015948 -0.0211792 0.121452 -0.093508 0.00972793 0.0757334 -0.0544493 0.0666583 -0.0384226 0.141299 -0.122822 -0.0123871 0.0643208 -0.128789 -0.126613 0.154387 -0.140747 -0.109986 0.0926023 0.120031 -0.0503475 0.112642 -0.0902227 -0.0591517 -0.0330703 -0.0227597 0.0782701 0.0449553 -0.105474 0.14022 -0.0141379 -0.196296 -0.125951 0.00168056 0.194302 -0.0532461 0.00126714 -0.0600848 0.0799827 0.0320003 -0.0666948 0.0029461 -0.0489926 0.0208638 -0.0707612 0.0230045 0.08546 -0.0213553 -0.0796594 0.0936075 0.111887 0.150598 -0.127449 -0.0225433 -0.00130147 -0.00577648 -0.0320666 -0.00857121 0.109454 0.0859952 0.109615 -0.00515767 0.0715076 -0.139415 0.0854714 -0.0160392 -0.0832426 -0.165932 -0.0672407 0.0362382 -0.000509911 -0.109102 0.0343774 0.00389136 -0.0637623 0.0486037 -0.0837657 0.0820017 -0.108571 0.0590049 0.0188104 -0.0255195 0.0305109 0.167653 -0.0788371 0.0336163 -0.02458 0.0869868 -0.093868 -0.113154 0.0247219 0.182139 0.0286003 -0.031841 -0.0903757 0.098123 -0.143727 0.0389422 -0.0704421 0.0418556 
-0.0262825 0.0265948 -0.0670055 -0.0937073 0.0166241 0.148884 -0.02849 0.0294479 0.0340495 0.00111553 0.0235119 0.0651923 0.147047 -0.108478 -0.0309959 -0.13011 -0.112717 -0.0454211 -0.10625 0.181995 0.06178 -0.128542 0.0762662 0.188343 -0.0576998 -0.00910403 0.000556931 -0.160927 0.015948 -0.0211792 0.121452 -0.093508 0.00972793 0.0757334 -0.0544493 0.0666583 -0.0384226 0.141299 -0.122822 -0.0123871 0.0643208 -0.128789 -0.126613 0.154387 -0.140747 -0.109986 0.0926023 0.120031 -0.0503475 0.112642 -0.0902227 -0.0591517 -0.0330703 -0.0227597 0.0782701 0.0449553 -0.105474 0.14022 -0.0141379 -0.196296 -0.125951 0.00168056 0.194302 -0.0532461 0.00126714 -0.0600848 0.0799827 0.0320003 -0.0666948 0.0029461 -0.0489926 0.0208638 -0.0707612 0.0230045 0.08546 -0.0213553 -0.0796594 0.0936075 0.111887 0.150598 -0.127449 -0.0225433 -0.00130147 -0.00577648 -0.0320666 -0.00857121 0.109454 0.0859952 0.109615 -0.00515767 0.0715076 -0.139415 0.0854714 -0.0160392 -0.0832426 -0.165932 -0.0672407 0.0362382 -0.000509911 -0.109102 0.0343774 0.00389136 -0.0637623 0.0486037 -0.0837657 0.0820017 -0.108571 0.0590049 0.0188104 -0.0255195 0.0305109 0.167653 -0.0788371 0.0336163 -0.02458 0.0869868 -0.093868 -0.113154 0.0247219 0.182139 0.0286003 -0.031841 -0.0903757 0.098123 -0.143727 0.0389422 -0.0704421 0.0418556 
-0.0262825 0.0265948 -0.0670055 -0.0937073 0.0166241 0.148884 -0.02849 0.0294479 0.0340495 0.00111553 0.0235119 0.0651923 0.147047 -0.108478 -0.0309959 -0.13011 -0.112717 -0.0454211 -0.10625 0.181995 0.06178 -0.128542 0.0762662 0.188343 -0.0576998 -0.00910403 0.000556931 -0.160927 0.015948 -0.0211792 0.121452 -0.093508 0.00972793 0.0757334 -0.0544493 0.0666583 -0.0384226 0.141299 -0.122822 -0.0123871 0.0643208 -0.128789 -0.126613 0.154387 -0.140747 -0.109986 0.0926023 0.120031 -0.0503475 0.112642 -0.0902227 -0.0591517 -0.0330703 -0.0227597 0.0782701 0.0449553 -0.105474 0.14022 -0.0141379 -0.196296 -0.125951 0.00168056 0.194302 -0.0532461 0.00126714 -0.0600848 0.0799827 0.0320003 -0.0666948 0.0029461 -0.0489926 0.0208638 -0.0707612 0.0230045 0.08546 -0.0213553 -0.0796594 0.0936075 0.111887 0.150598 -0.127449 -0.0225433 -0.00130147 -0.00577648 -0.0320666 -0.00857121 0.109454 0.0859952 0.109615 -0.00515767 0.0715076 -0.139415 0.0854714 -0.0160392 -0.0832426 -0.165932 -0.0672407 0.0362382 -0.000509911 -0.109102 0.0343774 0.00389136 -0.0637623 0.0486037 -0.0837657 0.0820017 -0.108571 0.0590049 0.0188104 -0.0255195 0.0305109 0.167653 -0.0788371 0.0336163 -0.02458 0.0869868 -0.093868 -0.113154 0.0247219 0.182139 0.0286003 -0.031841 -0.0903757 0.098123 -0.143727 0.0389422 -0.0704421 0.0418556 
-0.0262825 0.0265948 -0.0670055 -0.0937073 0.0166241 0.148884 -0.02849 0.0294479 0.0340495 0.00111553 0.0235119 0.0651923 0.147047 -0.108478 -0.0309959 -0.13011 -0.112717 -0.0454211 -0.10625 0.181995 0.06178 -0.128542 0.0762662 0.188343 -0.0576998 -0.00910403 0.000556931 -0.160927 0.015948 -0.0211792 0.121452 -0.093508 0.00972793 0.0757334 -0.0544493 0.0666583 -0.0384226 0.141299 -0.122822 -0.0123871 0.0643208 -0.128789 -0.126613 0.154387 -0.140747 -0.109986 0.0926023 0.120031 -0.0503475 0.112642 -0.0902227 -0.0591517 -0.0330703 -0.0227597 0.0782701 0.0449553 -0.105474 0.14022 -0.0141379 -0.196296 -0.125951 0.00168056 0.194302 -0.0532461 0.00126714 -0.0600848 0.0799827 0.0320003 -0.0666948 0.0029461 -0.0489926 0.0208638 -0.0707612 0.0230045 0.08546 -0.0213553 -0.0796594 0.0936075 0.111887 0.150598 -0.127449 -0.0225433 -0.00130147 -0.00577648 -0.0320666 -0.00857121 0.109454 0.0859952 0.109615 -0.00515767 0.0715076 -0.139415 0.0854714 -0.0160392 -0.0832426 -0.165932 -0.0672407 0.0362382 -0.000509911 -0.109102 0.0343774 0.00389136 -0.0637623 0.0486037 -0.0837657 0.0820017 -0.108571 0.0590049 0.0188104 -0.0255195 0.0305109 0.167653 -0.0788371 0.0336163 -0.02458 0.0869868 -0.093868 -0.113154 0.0247219 0.182139 0.0286003 -0.031841 -0.0903757 0.098123 -0.143727 0.0389422 -0.0704421 0.0418556 
-0.0262825 0.0265948 -0.0670055 -0.0937073 0.0166241 0.148884 -0.02849 0.0294479 0.0340495 0.00111553 0.0235119 0.0651923 0.147047 -0.108478 -0.0309959 -0.13011 -0.112717 -0.0454211 -0.10625 0.181995 0.06178 -0.128542 0.0762662 0.188343 -0.0576998 -0.00910403 0.000556931 -0.160927 0.015948 -0.0211792 0.121452 -0.093508 0.00972793 0.0757334 -0.0544493 0.0666583 -0.0384226 0.141299 -0.122822 -0.0123871 0.0643208 -0.128789 -0.126613 0.154387 -0.140747 -0.109986 0.0926023 0.120031 -0.0503475 0.112642 -0.0902227 -0.0591517 -0.0330703 -0.0227597 0.0782701 0.0449553 -0.105474 0.14022 -0.0141379 -0.196296 -0.125951 0.00168056 0.194302 -0.0532461 0.00126714 -0.0600848 0.0799827 0.0320003 -0.0666948 0.0029461 -0.0489926 0.0208638 -0.0707612 0.0230045 0.08546 -0.0213553 -0.0796594 0.0936075 0.111887 0.150598 -0.127449 -0.0225433 -0.00130147 -0.00577648 -0.0320666 -0.00857121 0.109454 0.0859952 0.109615 -0.00515767 0.0715076 -0.139415 0.0854714 -0.0160392 -0.0832426 -0.165932 -0.0672407 0.0362382 -0.000509911 -0.109102 0.0343774 0.00389136 -0.0637623 0.0486037 -0.0837657 0.0820017 -0.108571 0.0590049 0.0188104 -0.0255195 0.0305109 0.167653 -0.0788371 0.0336163 -0.02458 0.0869868 -0.093868 -0.113154 0.0247219 0.182139 0.0286003 -0.031841 -0.0903757 0.098123 -0.143727 0.0389422 -0.0704421 0.0418556 
-0.0262825 0.0265948 -0.0670055 -0.0937073 0.0166241 0.148884 -0.02849 0.0294479 0.0340495 0.00111553 0.0235119 0.0651923 0.147047 -0.108478 -0.0309959 -0.13011 -0.112717 -0.0454211 -0.10625 0.181995 0.06178 -0.128542 0.0762662 0.188343 -0.0576998 -0.00910403 0.000556931 -0.160927 0.015948 -0.0211792 0.121452 -0.093508 0.00972793 0.0757334 -0.0544493 0.0666583 -0.0384226 0.141299 -0.122822 -0.0123871 0.0643208 -0.128789 -0.126613 0.154387 -0.140747 -0.109986 0.0926023 0.120031 -0.0503475 0.112642 -0.0902227 -0.0591517 -0.0330703 -0.0227597 0.0782701 0.0449553 -0.105474 0.14022 -0.0141379 -0.196296 -0.125951 0.00168056 0.194302 -0.0532461 0.00126714 -0.0600848 0.0799827 0.0320003 -0.0666948 0.0029461 -0.0489926 0.0208638 -0.0707612 0.0230045 0.08546 -0.0213553 -0.0796594 0.0936075 0.111887 0.150598 -0.127449 -0.0225433 -0.00130147 -0.00577648 -0.0320666 -0.00857121 0.109454 0.0859952 0.109615 -0.00515767 0.0715076 -0.139415 0.0854714 -0.0160392 -0.0832426 -0.165932 -0.0672407 0.0362382 -0.000509911 -0.109102 0.0343774 0.00389136 -0.0637623 0.0486037 -0.0837657 0.0820017 -0.108571 0.0590049 0.0188104 -0.0255195 0.0305109 0.167653 -0.0788371 0.0336163 -0.02458 0.0869868 -0.093868 -0.113154 0.0247219 0.182139 0.0286003 -0.031841 -0.0903757 0.098123 -0.143727 0.0389422 -0.0704421 0.0418556 
-0.0262825 0.0265948 -0.0670055 -0.0937073 0.0166241 0.148884 -0.02849 0.0294479 0.0340495 0.00111553 0.0235119 0.0651923 0.147047 -0.108478 -0.0309959 -0.13011 -0.112717 -0.0454211 -0.10625 0.181995 0.06178 -0.128542 0.0762662 0.188343 -0.0576998 -0.00910403 0.000556931 -0.160927 0.015948 -0.0211792 0.121452 -0.093508 0.00972793 0.0757334 -0.0544493 0.0666583 -0.0384226 0.141299 -0.122822 -0.0123871 0.0643208 -0.128789 -0.126613 0.154387 -0.140747 -0.109986 0.0926023 0.120031 -0.0503475 0.112642 -0.0902227 -0.0591517 -0.0330703 -0.0227597 0.0782701 0.0449553 -0.105474 0.14022 -0.0141379 -0.196296 -0.125951 0.00168056 0.194302 -0.0532461 0.00126714 -0.0600848 0.0799827 0.0320003 -0.0666948 0.0029461 -0.0489926 0.0208638 -0.0707612 0.0230045 0.08546 -0.0213553 -0.0796594 0.0936075 0.111887 0.150598 -0.127449 -0.0225433 -0.00130147 -0.00577648 -0.0320666 -0.00857121 0.109454 0.0859952 0.109615 -0.00515767 0.0715076 -0.139415 0.0854714 -0.0160392 -0.0832426 -0.165932 -0.0672407 0.0362382 -0.000509911 -0.109102 0.0343774 0.00389136 -0.0637623 0.0486037 -0.0837657 0.0820017 -0.108571 0.0590049 0.0188104 -0.0255195 0.0305109 0.167653 -0.0788371 0.0336163 -0.02458 0.0869868 -0.093868 -0.113154 0.0247219 0.182139 0.0286003 -0.031841 -0.0903757 0.098123 -0.143727 0.0389422 -0.0704421 0.0418556 
-0.0262825 0.0265948 -0.0670055 -0.0937073 0.0166241 0.148884 -0.02849 0.0294479 0.0340495 0.00111553 0.0235119 0.0651923 0.147047 -0.108478 -0.0309959 -0.13011 -0.112717 -0.0454211 -0.10625 0.181995 0.06178 -0.128542 0.0762662 0.188343 -0.0576998 -0.00910403 0.000556931 -0.160927 0.015948 -0.0211792 0.121452 -0.093508 0.00972793 0.0757334 -0.0544493 0.0666583 -0.0384226 0.141299 -0.122822 -0.0123871 0.0643208 -0.128789 -0.126613 0.154387 -0.140747 -0.109986 0.0926023 0.120031 -0.0503475 0.112642 -0.0902227 -0.0591517 -0.0330703 -0.0227597 0.0782701 0.0449553 -0.105474 0.14022 -0.0141379 -0.196296 -0.125951 0.00168056 0.194302 -0.0532461 0.00126714 -0.0600848 0.0799827 0.0320003 -0.0666948 0.0029461 -0.0489926 0.0208638 -0.0707612 0.0230045 0.08546 -0.0213553 -0.0796594 0.0936075 0.111887 0.150598 -0.127449 -0.0225433 -0.00130147 -0.00577648 -0.0320666 -0.00857121 0.109454 0.0859952 0.109615 -0.00515767 0.0715076 -0.139415 0.0854714 -0.0160392 -0.0832426 -0.165932 -0.0672407 0.0362382 -0.000509911 -0.109102 0.0343774 0.00389136 -0.0637623 0.0486037 -0.0837657 0.0820017 -0.108571 0.0590049 0.0188104 -0.0255195 0.0305109 0.167653 -0.0788371 0.0336163 -0.02458 0.0869868 -0.093868 -0.113154 0.0247219 0.182139 0.0286003 -0.031841 -0.0903757 0.098123 -0.143727 0.0389422 -0.0704421 0.0418556 
