{
  "descriptor": [
    -0.10741597414016724,
    0.15109455585479736,
    0.042968448251485825,
    -0.04028988629579544,
    -0.07105859369039536,
    0.016319990158081055,
    0.014836050570011139,
    -0.0748571828007698,
    0.17363375425338745,
    -0.06997369974851608,
    0.2370559126138687,
    -0.08640046417713165,
    -0.21746057271957397,
    -0.12643460929393768,
    -0.0036857326049357653,
    0.11784335970878601,
    -0.16311946511268616,
    -0.1951359361410141,
    -0.06119536980986595,
    -0.09042932838201523,
    0.07744720578193665,
    -0.048737142235040665,
    -0.0454595610499382,
    0.05286094918847084,
    -0.16699711978435516,
    -0.3622390627861023,
    -0.04341879114508629,
    -0.11936687678098679,
    -0.011902802623808384,
    -0.13006941974163055,
    0.006095889490097761,
    0.017399054020643234,
    -0.23750822246074677,
    -0.0958990752696991,
    -0.041567813605070114,
    0.04976137354969978,
    -0.04653540998697281,
    -0.00959299597889185,
    0.1274188756942749,
    -0.0023522383999079466,
    -0.12899912893772125,
    0.045697685331106186,
    0.055517785251140594,
    0.32051247358322144,
    0.16408251225948334,
    0.07345083355903625,
    -0.004364961292594671,
    -0.0360984168946743,
    0.06275878846645355,
    -0.2319968044757843,
    0.02954646572470665,
    0.17159956693649292,
    0.12973913550376892,
    0.045561980456113815,
    0.06249967962503433,
    -0.16434381902217865,
    0.01915728487074375,
    0.030903488397598267,
    -0.19920291006565094,
    0.08917374908924103,
    0.056613512337207794,
    -0.00764068216085434,
    -0.05391359329223633,
    -0.015195097774267197,
    0.23907211422920227,
    0.11076970398426056,
    -0.07725153118371964,
    -0.10726343095302582,
    0.17921225726604462,
    -0.10245863348245621,
    -0.005634963512420654,
    0.047754108905792236,
    -0.13450412452220917,
    -0.19871380925178528,
    -0.23939640820026398,
    0.06134669855237007,
    0.4161722958087921,
    0.07797519862651825,
    -0.20243771374225616,
    -0.01999581605195999,
    -0.09660051017999649,
    0.04553303122520447,
    0.09786345064640045,
    -0.005670760292559862,
    -0.09043637663125992,
    -0.03651511296629906,
    -0.13565082848072052,
    0.08528393507003784,
    0.16512437164783478,
    -0.003286084858700633,
    -0.05122967064380646,
    0.18932974338531494,
    0.016827955842018127,
    -0.04181330278515816,
    0.04974200949072838,
    0.019026193767786026,
    -0.0852908194065094,
    0.05650505796074867,
    -0.17040234804153442,
    -0.001669396529905498,
    0.0403066910803318,
    -0.08991630375385284,
    -0.03461334481835365,
    0.09892359375953674,
    -0.1724211573600769,
    0.09594955295324326,
    0.051023516803979874,
    -0.015275564044713974,
    -0.0646262839436531,
    0.04527303948998451,
    -0.15348882973194122,
    -0.03354663774371147,
    0.1414313167333603,
    -0.2476319819688797,
    0.1992323398590088,
    0.19806893169879913,
    0.02513185143470764,
    0.1154508888721466,
    0.059635039418935776,
    0.01736045442521572,
    0.016667459160089493,
    -0.040291525423526764,
    -0.16109000146389008,
    -0.04543956741690636,
    0.018849879503250122,
    -0.034451063722372055,
    0.022614143788814545,
    0.02798950858414173
  ]
}