-0.0708627 0.12782 -0.0201287 -0.129808 0.0110124 0.222964 -0.047767 0.0789859 -0.129502 0.114372 0.0334728 -0.085316 0.0916453 -0.00712522 0.133582 -0.046008 -0.092367 0.0811878 0.023725 0.0258911 0.0633794 0.013007 0.0660563 0.029735 -0.0191393 0.0172223 -0.0670781 -0.152089 0.179584 -0.0247867 0.0785573 -0.0305152 -0.0454893 -0.0255225 0.0225581 0.13983 -0.0769192 0.0606474 -0.0645298 0.0620799 0.0112612 -0.039285 -0.131017 0.150427 -0.180549 0.00688996 0.17703 0.0462925 -0.198778 -0.0571249 -0.0541419 0.0118747 -0.0997504 -0.035104 -0.0218417 0.0994466 -0.0126895 0.14967 0.0446421 -0.141823 -0.134417 0.0453 0.200318 -0.081114 0.0943569 0.000151996 0.0804703 0.00758302 -0.00673472 0.146715 0.0445324 0.129079 -0.00592463 0.00275286 0.0509288 -0.0786699 -0.176413 0.09848 0.0501126 -0.0700725 -0.0548455 0.0908023 -0.0417079 -0.0290936 -0.054311 0.0286338 0.0763441 0.0117664 0.058521 0.0142082 0.107746 -0.0513567 -0.0382218 -0.0683986 0.0316914 -0.123596 -0.00645651 0.151678 -0.0390339 0.000717682 -0.0648069 0.044157 -0.00251603 -0.0354294 -0.178211 0.163387 -0.0799196 -0.0164698 0.098094 -0.0613731 0.0485786 0.0919995 -0.0744972 -0.0877858 0.0661936 0.00907312 -0.0318441 -0.211177 0.0678893 0.0588 0.0853243 -0.131326 0.00196965 0.0599513 -0.0893347 0.065115 0.0108562 0.0753934 
-0.0708627 0.12782 -0.0201287 -0.129808 0.0110124 0.222964 -0.047767 0.0789859 -0.129502 0.114372 0.0334728 -0.085316 0.0916453 -0.00712522 0.133582 -0.046008 -0.092367 0.0811878 0.023725 0.0258911 0.0633794 0.013007 0.0660563 0.029735 -0.0191393 0.0172223 -0.0670781 -0.152089 0.179584 -0.0247867 0.0785573 -0.0305152 -0.0454893 -0.0255225 0.0225581 0.13983 -0.0769192 0.0606474 -0.0645298 0.0620799 0.0112612 -0.039285 -0.131017 0.150427 -0.180549 0.00688996 0.17703 0.0462925 -0.198778 -0.0571249 -0.0541419 0.0118747 -0.0997504 -0.035104 -0.0218417 0.0994466 -0.0126895 0.14967 0.0446421 -0.141823 -0.134417 0.0453 0.200318 -0.081114 0.0943569 0.000151996 0.0804703 0.00758302 -0.00673472 0.146715 0.0445324 0.129079 -0.00592463 0.00275286 0.0509288 -0.0786699 -0.176413 0.09848 0.0501126 -0.0700725 -0.0548455 0.0908023 -0.0417079 -0.0290936 -0.054311 0.0286338 0.0763441 0.0117664 0.058521 0.0142082 0.107746 -0.0513567 -0.0382218 -0.0683986 0.0316914 -0.123596 -0.00645651 0.151678 -0.0390339 0.000717682 -0.0648069 0.044157 -0.00251603 -0.0354294 -0.178211 0.163387 -0.0799196 -0.0164698 0.098094 -0.0613731 0.0485786 0.0919995 -0.0744972 -0.0877858 0.0661936 0.00907312 -0.0318441 -0.211177 0.0678893 0.0588 0.0853243 -0.131326 0.00196965 0.0599513 -0.0893347 0.065115 0.0108562 0.0753934 
-0.0708627 0.12782 -0.0201287 -0.129808 0.0110124 0.222964 -0.047767 0.0789859 -0.129502 0.114372 0.0334728 -0.085316 0.0916453 -0.00712522 0.133582 -0.046008 -0.092367 0.0811878 0.023725 0.0258911 0.0633794 0.013007 0.0660563 0.029735 -0.0191393 0.0172223 -0.0670781 -0.152089 0.179584 -0.0247867 0.0785573 -0.0305152 -0.0454893 -0.0255225 0.0225581 0.13983 -0.0769192 0.0606474 -0.0645298 0.0620799 0.0112612 -0.039285 -0.131017 0.150427 -0.180549 0.00688996 0.17703 0.0462925 -0.198778 -0.0571249 -0.0541419 0.0118747 -0.0997504 -0.035104 -0.0218417 0.0994466 -0.0126895 0.14967 0.0446421 -0.141823 -0.134417 0.0453 0.200318 -0.081114 0.0943569 0.000151996 0.0804703 0.00758302 -0.00673472 0.146715 0.0445324 0.129079 -0.00592463 0.00275286 0.0509288 -0.0786699 -0.176413 0.09848 0.0501126 -0.0700725 -0.0548455 0.0908023 -0.0417079 -0.0290936 -0.054311 0.0286338 0.0763441 0.0117664 0.058521 0.0142082 0.107746 -0.0513567 -0.0382218 -0.0683986 0.0316914 -0.123596 -0.00645651 0.151678 -0.0390339 0.000717682 -0.0648069 0.044157 -0.00251603 -0.0354294 -0.178211 0.163387 -0.0799196 -0.0164698 0.098094 -0.0613731 0.0485786 0.0919995 -0.0744972 -0.0877858 0.0661936 0.00907312 -0.0318441 -0.211177 0.0678893 0.0588 0.0853243 -0.131326 0.00196965 0.0599513 -0.0893347 0.065115 0.0108562 0.0753934 
-0.0484097 0.129763 -0.027592 -0.153562 0.015258 0.243684 -0.0541958 0.0772027 -0.14448 0.0900794 0.0250023 -0.0766594 0.105718 -0.00133655 0.125258 -0.0509205 -0.0973047 0.0655285 0.00179034 0.0309265 0.0610975 0.0551442 0.0626901 0.0246198 -0.0407927 0.0202601 -0.0513608 -0.138495 0.172986 -0.0176462 0.0570176 -0.0257598 -0.0646949 -0.0133717 0.0115816 0.131139 -0.0710312 0.0532188 -0.0624974 0.088371 0.0102317 -0.0388496 -0.132074 0.153117 -0.187103 0.0210248 0.179655 0.0526399 -0.208667 -0.0349743 -0.0314008 0.0135236 -0.112665 -0.0174272 -0.0280362 0.0815047 -0.0110672 0.158844 0.0475675 -0.141332 -0.127903 0.0604636 0.203129 -0.0749369 0.0714966 -0.0285303 0.0967727 0.0248662 0.00266864 0.148955 0.0497381 0.123211 0.00476696 0.0104907 0.050969 -0.0727082 -0.18566 0.0855046 0.044496 -0.0561481 -0.0177904 0.0966354 -0.0299085 -0.0284537 -0.0545635 0.0382407 0.0876241 0.00268092 0.0413706 0.0263353 0.112211 -0.0732731 -0.0478208 -0.0537703 0.011649 -0.121653 -0.00348952 0.147056 -0.0365391 -0.00242914 -0.0637426 0.059687 -0.0072354 -0.00404271 -0.195869 0.152002 -0.10943 0.00482199 0.0662392 -0.0596472 0.0728641 0.0930482 -0.0852275 -0.0655592 0.0382654 0.0129175 -0.0483006 -0.203753 0.0543663 0.0527292 0.0853779 -0.128366 0.0186024 0.054975 -0.081664 0.0478152 -0.00752573 0.0646315 
-0.0484097 0.129763 -0.027592 -0.153562 0.015258 0.243684 -0.0541958 0.0772027 -0.14448 0.0900794 0.0250023 -0.0766594 0.105718 -0.00133655 0.125258 -0.0509205 -0.0973047 0.0655285 0.00179034 0.0309265 0.0610975 0.0551442 0.0626901 0.0246198 -0.0407927 0.0202601 -0.0513608 -0.138495 0.172986 -0.0176462 0.0570176 -0.0257598 -0.0646949 -0.0133717 0.0115816 0.131139 -0.0710312 0.0532188 -0.0624974 0.088371 0.0102317 -0.0388496 -0.132074 0.153117 -0.187103 0.0210248 0.179655 0.0526399 -0.208667 -0.0349743 -0.0314008 0.0135236 -0.112665 -0.0174272 -0.0280362 0.0815047 -0.0110672 0.158844 0.0475675 -0.141332 -0.127903 0.0604636 0.203129 -0.0749369 0.0714966 -0.0285303 0.0967727 0.0248662 0.00266864 0.148955 0.0497381 0.123211 0.00476696 0.0104907 0.050969 -0.0727082 -0.18566 0.0855046 0.044496 -0.0561481 -0.0177904 0.0966354 -0.0299085 -0.0284537 -0.0545635 0.0382407 0.0876241 0.00268092 0.0413706 0.0263353 0.112211 -0.0732731 -0.0478208 -0.0537703 0.011649 -0.121653 -0.00348952 0.147056 -0.0365391 -0.00242914 -0.0637426 0.059687 -0.0072354 -0.00404271 -0.195869 0.152002 -0.10943 0.00482199 0.0662392 -0.0596472 0.0728641 0.0930482 -0.0852275 -0.0655592 0.0382654 0.0129175 -0.0483006 -0.203753 0.0543663 0.0527292 0.0853779 -0.128366 0.0186024 0.054975 -0.081664 0.0478152 -0.00752573 0.0646315 
-0.0390227 0.101562 -0.0261479 -0.168693 0.0405303 0.242212 -0.042989 0.0780131 -0.142037 0.0701584 0.0174252 -0.0635284 0.103754 0.0206664 0.132729 -0.0511377 -0.0962026 0.0301673 -0.00907992 0.0484283 0.0614836 0.0731959 0.0406294 0.0176189 -0.0504102 0.0265275 -0.0568516 -0.120359 0.162715 -0.0186617 0.0455844 -0.0395007 -0.080227 -0.0155789 0.00728782 0.155564 -0.0794929 0.0490481 -0.0764295 0.0914419 0.017427 -0.0100909 -0.13665 0.142988 -0.174573 0.0466674 0.165974 0.0596819 -0.200027 -0.0337474 -0.0564224 0.00408816 -0.121502 -0.0181677 -0.00556064 0.0745064 -0.0573051 0.190121 0.0222884 -0.117695 -0.126318 0.0676738 0.209188 -0.0733577 0.0756769 -0.0214285 0.0957954 0.0522239 0.00910604 0.127335 0.0779578 0.136631 0.0190481 0.00318718 0.0471255 -0.0381771 -0.182148 0.073137 0.0547384 -0.0610841 0.0084943 0.0945454 -0.0327869 -0.0303242 -0.0680526 0.0291711 0.101481 0.0145573 0.0345 0.0346214 0.12479 -0.0789359 -0.0476606 -0.031417 0.00663115 -0.112789 0.00427254 0.104162 -0.0272511 -0.000355847 -0.0656253 0.0531259 -0.022486 -0.0360424 -0.228694 0.171093 -0.124084 -0.0092478 0.0496836 -0.0544065 0.102611 0.0854582 -0.0916809 -0.050281 0.0402689 0.0288405 -0.0625721 -0.184544 0.0247745 0.0486841 0.0726906 -0.121603 0.0297546 0.0688373 -0.078743 0.0633508 -0.0191708 0.0451569 
-0.0390227 0.101562 -0.0261479 -0.168693 0.0405303 0.242212 -0.042989 0.0780131 -0.142037 0.0701584 0.0174252 -0.0635284 0.103754 0.0206664 0.132729 -0.0511377 -0.0962026 0.0301673 -0.00907992 0.0484283 0.0614836 0.0731959 0.0406294 0.0176189 -0.0504102 0.0265275 -0.0568516 -0.120359 0.162715 -0.0186617 0.0455844 -0.0395007 -0.080227 -0.0155789 0.00728782 0.155564 -0.0794929 0.0490481 -0.0764295 0.0914419 0.017427 -0.0100909 -0.13665 0.142988 -0.174573 0.0466674 0.165974 0.0596819 -0.200027 -0.0337474 -0.0564224 0.00408816 -0.121502 -0.0181677 -0.00556064 0.0745064 -0.0573051 0.190121 0.0222884 -0.117695 -0.126318 0.0676738 0.209188 -0.0733577 0.0756769 -0.0214285 0.0957954 0.0522239 0.00910604 0.127335 0.0779578 0.136631 0.0190481 0.00318718 0.0471255 -0.0381771 -0.182148 0.073137 0.0547384 -0.0610841 0.0084943 0.0945454 -0.0327869 -0.0303242 -0.0680526 0.0291711 0.101481 0.0145573 0.0345 0.0346214 0.12479 -0.0789359 -0.0476606 -0.031417 0.00663115 -0.112789 0.00427254 0.104162 -0.0272511 -0.000355847 -0.0656253 0.0531259 -0.022486 -0.0360424 -0.228694 0.171093 -0.124084 -0.0092478 0.0496836 -0.0544065 0.102611 0.0854582 -0.0916809 -0.050281 0.0402689 0.0288405 -0.0625721 -0.184544 0.0247745 0.0486841 0.0726906 -0.121603 0.0297546 0.0688373 -0.078743 0.0633508 -0.0191708 0.0451569 
-0.0390227 0.101562 -0.0261479 -0.168693 0.0405303 0.242212 -0.042989 0.0780131 -0.142037 0.0701584 0.0174252 -0.0635284 0.103754 0.0206664 0.132729 -0.0511377 -0.0962026 0.0301673 -0.00907992 0.0484283 0.0614836 0.0731959 0.0406294 0.0176189 -0.0504102 0.0265275 -0.0568516 -0.120359 0.162715 -0.0186617 0.0455844 -0.0395007 -0.080227 -0.0155789 0.00728782 0.155564 -0.0794929 0.0490481 -0.0764295 0.0914419 0.017427 -0.0100909 -0.13665 0.142988 -0.174573 0.0466674 0.165974 0.0596819 -0.200027 -0.0337474 -0.0564224 0.00408816 -0.121502 -0.0181677 -0.00556064 0.0745064 -0.0573051 0.190121 0.0222884 -0.117695 -0.126318 0.0676738 0.209188 -0.0733577 0.0756769 -0.0214285 0.0957954 0.0522239 0.00910604 0.127335 0.0779578 0.136631 0.0190481 0.00318718 0.0471255 -0.0381771 -0.182148 0.073137 0.0547384 -0.0610841 0.0084943 0.0945454 -0.0327869 -0.0303242 -0.0680526 0.0291711 0.101481 0.0145573 0.0345 0.0346214 0.12479 -0.0789359 -0.0476606 -0.031417 0.00663115 -0.112789 0.00427254 0.104162 -0.0272511 -0.000355847 -0.0656253 0.0531259 -0.022486 -0.0360424 -0.228694 0.171093 -0.124084 -0.0092478 0.0496836 -0.0544065 0.102611 0.0854582 -0.0916809 -0.050281 0.0402689 0.0288405 -0.0625721 -0.184544 0.0247745 0.0486841 0.0726906 -0.121603 0.0297546 0.0688373 -0.078743 0.0633508 -0.0191708 0.0451569 
-0.026873 0.115067 -0.052998 -0.175697 0.0443742 0.246611 -0.0195658 0.0815325 -0.143049 0.112769 0.0196691 -0.0684858 0.124389 0.00267258 0.134937 -0.0227673 -0.110273 0.0374803 -0.0262315 0.0411064 0.071898 0.0412686 0.0517495 -0.000753034 -0.041337 0.0176995 -0.0720548 -0.134879 0.160152 -0.00747527 0.0348915 -0.0170231 -0.088758 -0.0104445 0.00259719 0.127257 -0.0853816 0.0561418 -0.0575517 0.0757702 0.00673734 -0.0368831 -0.118152 0.151101 -0.174344 0.0313053 0.160794 0.0726739 -0.211144 -0.029865 -0.0404135 -0.0163508 -0.1388 -0.0206769 -0.010256 0.0646157 -0.0580638 0.182779 0.027212 -0.126691 -0.123008 0.0445068 0.213752 -0.0750906 0.0793646 -0.00192539 0.0570957 0.0793282 -0.000990647 0.109968 0.0692859 0.158233 0.00525291 -0.00670002 0.0346587 -0.037651 -0.167581 0.0630869 0.0588819 -0.0549137 0.0115424 0.0660029 -0.0446231 -0.0281108 -0.0857963 0.0353208 0.0964301 0.0122598 0.0648546 0.0336623 0.11014 -0.0852233 -0.0720599 -0.0372372 -0.00257398 -0.102651 -0.00273585 0.114151 -0.0313033 -0.000136816 -0.0433466 0.0316664 -0.0166699 -0.0332751 -0.223086 0.156865 -0.139024 0.0187384 0.0581956 -0.0645598 0.0877297 0.100445 -0.0836334 -0.0546339 0.0648501 0.0265542 -0.0682869 -0.154388 0.0302048 0.0588034 0.0780534 -0.124298 0.0434096 0.0892617 -0.082575 0.0460158 -0.0227657 0.0414929 
-0.026873 0.115067 -0.052998 -0.175697 0.0443742 0.246611 -0.0195658 0.0815325 -0.143049 0.112769 0.0196691 -0.0684858 0.124389 0.00267258 0.134937 -0.0227673 -0.110273 0.0374803 -0.0262315 0.0411064 0.071898 0.0412686 0.0517495 -0.000753034 -0.041337 0.0176995 -0.0720548 -0.134879 0.160152 -0.00747527 0.0348915 -0.0170231 -0.088758 -0.0104445 0.00259719 0.127257 -0.0853816 0.0561418 -0.0575517 0.0757702 0.00673734 -0.0368831 -0.118152 0.151101 -0.174344 0.0313053 0.160794 0.0726739 -0.211144 -0.029865 -0.0404135 -0.0163508 -0.1388 -0.0206769 -0.010256 0.0646157 -0.0580638 0.182779 0.027212 -0.126691 -0.123008 0.0445068 0.213752 -0.0750906 0.0793646 -0.00192539 0.0570957 0.0793282 -0.000990647 0.109968 0.0692859 0.158233 0.00525291 -0.00670002 0.0346587 -0.037651 -0.167581 0.0630869 0.0588819 -0.0549137 0.0115424 0.0660029 -0.0446231 -0.0281108 -0.0857963 0.0353208 0.0964301 0.0122598 0.0648546 0.0336623 0.11014 -0.0852233 -0.0720599 -0.0372372 -0.00257398 -0.102651 -0.00273585 0.114151 -0.0313033 -0.000136816 -0.0433466 0.0316664 -0.0166699 -0.0332751 -0.223086 0.156865 -0.139024 0.0187384 0.0581956 -0.0645598 0.0877297 0.100445 -0.0836334 -0.0546339 0.0648501 0.0265542 -0.0682869 -0.154388 0.0302048 0.0588034 0.0780534 -0.124298 0.0434096 0.0892617 -0.082575 0.0460158 -0.0227657 0.0414929 
-0.0354269 0.115763 -0.0524911 -0.166274 0.0516369 0.253226 -0.00998476 0.0603795 -0.124664 0.099232 0.0189233 -0.0661459 0.116235 0.00809097 0.134132 -0.0373756 -0.111298 0.0422864 -0.0236174 0.030557 0.0710918 0.0471731 0.0381839 0.01352 -0.037332 0.008625 -0.084314 -0.13313 0.161469 0.00681847 0.0484039 -0.0174366 -0.0930993 -0.0169666 0.0224465 0.141532 -0.0845806 0.0373851 -0.0615616 0.0659996 0.0165077 -0.0320681 -0.119502 0.151427 -0.17372 0.0353947 0.154802 0.0816371 -0.198467 -0.0420485 -0.0546149 -0.0131408 -0.117994 -0.035782 -0.00660521 0.0811911 -0.0741442 0.199894 0.0178937 -0.118473 -0.130506 0.0580168 0.221697 -0.0856589 0.08587 0.00357144 0.0634444 0.0625263 -0.0147804 0.112996 0.0718939 0.151879 0.00362707 -0.0138358 0.027797 -0.0294989 -0.165908 0.0534272 0.0591155 -0.0613771 0.0140955 0.0756055 -0.0496121 -0.0257901 -0.0827094 0.0274369 0.0925575 0.00340369 0.0488446 0.0443869 0.122412 -0.0853687 -0.0626676 -0.0402246 0.000932324 -0.101652 -0.00858761 0.105362 -0.0227005 0.0078142 -0.0342917 0.0388872 -0.0192032 -0.0481695 -0.226588 0.163915 -0.126475 0.0033511 0.051802 -0.0414382 0.0973843 0.0848163 -0.0857403 -0.0590542 0.0572479 0.0343314 -0.0630996 -0.152847 0.0314895 0.0637041 0.0842344 -0.136453 0.0333424 0.0869521 -0.0891681 0.0618335 -0.0258266 0.0369513 
-0.0354269 0.115763 -0.0524911 -0.166274 0.0516369 0.253226 -0.00998476 0.0603795 -0.124664 0.099232 0.0189233 -0.0661459 0.116235 0.00809097 0.134132 -0.0373756 -0.111298 0.0422864 -0.0236174 0.030557 0.0710918 0.0471731 0.0381839 0.01352 -0.037332 0.008625 -0.084314 -0.13313 0.161469 0.00681847 0.0484039 -0.0174366 -0.0930993 -0.0169666 0.0224465 0.141532 -0.0845806 0.0373851 -0.0615616 0.0659996 0.0165077 -0.0320681 -0.119502 0.151427 -0.17372 0.0353947 0.154802 0.0816371 -0.198467 -0.0420485 -0.0546149 -0.0131408 -0.117994 -0.035782 -0.00660521 0.0811911 -0.0741442 0.199894 0.0178937 -0.118473 -0.130506 0.0580168 0.221697 -0.0856589 0.08587 0.00357144 0.0634444 0.0625263 -0.0147804 0.112996 0.0718939 0.151879 0.00362707 -0.0138358 0.027797 -0.0294989 -0.165908 0.0534272 0.0591155 -0.0613771 0.0140955 0.0756055 -0.0496121 -0.0257901 -0.0827094 0.0274369 0.0925575 0.00340369 0.0488446 0.0443869 0.122412 -0.0853687 -0.0626676 -0.0402246 0.000932324 -0.101652 -0.00858761 0.105362 -0.0227005 0.0078142 -0.0342917 0.0388872 -0.0192032 -0.0481695 -0.226588 0.163915 -0.126475 0.0033511 0.051802 -0.0414382 0.0973843 0.0848163 -0.0857403 -0.0590542 0.0572479 0.0343314 -0.0630996 -0.152847 0.0314895 0.0637041 0.0842344 -0.136453 0.0333424 0.0869521 -0.0891681 0.0618335 -0.0258266 0.0369513 
-0.0354269 0.115763 -0.0524911 -0.166274 0.0516369 0.253226 -0.00998476 0.0603795 -0.124664 0.099232 0.0189233 -0.0661459 0.116235 0.00809097 0.134132 -0.0373756 -0.111298 0.0422864 -0.0236174 0.030557 0.0710918 0.0471731 0.0381839 0.01352 -0.037332 0.008625 -0.084314 -0.13313 0.161469 0.00681847 0.0484039 -0.0174366 -0.0930993 -0.0169666 0.0224465 0.141532 -0.0845806 0.0373851 -0.0615616 0.0659996 0.0165077 -0.0320681 -0.119502 0.151427 -0.17372 0.0353947 0.154802 0.0816371 -0.198467 -0.0420485 -0.0546149 -0.0131408 -0.117994 -0.035782 -0.00660521 0.0811911 -0.0741442 0.199894 0.0178937 -0.118473 -0.130506 0.0580168 0.221697 -0.0856589 0.08587 0.00357144 0.0634444 0.0625263 -0.0147804 0.112996 0.0718939 0.151879 0.00362707 -0.0138358 0.027797 -0.0294989 -0.165908 0.0534272 0.0591155 -0.0613771 0.0140955 0.0756055 -0.0496121 -0.0257901 -0.0827094 0.0274369 0.0925575 0.00340369 0.0488446 0.0443869 0.122412 -0.0853687 -0.0626676 -0.0402246 0.000932324 -0.101652 -0.00858761 0.105362 -0.0227005 0.0078142 -0.0342917 0.0388872 -0.0192032 -0.0481695 -0.226588 0.163915 -0.126475 0.0033511 0.051802 -0.0414382 0.0973843 0.0848163 -0.0857403 -0.0590542 0.0572479 0.0343314 -0.0630996 -0.152847 0.0314895 0.0637041 0.0842344 -0.136453 0.0333424 0.0869521 -0.0891681 0.0618335 -0.0258266 0.0369513 
-0.0291449 0.105346 -0.0491049 -0.146061 0.0413649 0.253174 -0.0158019 0.0478497 -0.115647 0.0684123 0.0140395 -0.0606088 0.110638 -0.021261 0.117751 -0.0398834 -0.134287 0.044168 -0.0324758 0.0401213 0.0816213 0.0235257 0.0616043 0.0347943 -0.0302801 0.00908348 -0.0841177 -0.161977 0.135003 -0.0048195 0.0639698 -0.0200704 -0.0863019 -0.000351821 0.0319705 0.132861 -0.07683 0.0539156 -0.0669358 0.0441433 0.0334475 -0.0474939 -0.104637 0.16595 -0.182189 0.0160655 0.168767 0.0793683 -0.198822 -0.0136089 -0.0618423 -0.0408986 -0.0953075 -0.0232133 0.014 0.0752231 -0.0578 0.194625 0.027115 -0.153809 -0.128659 0.0639245 0.229007 -0.0859572 0.0872549 0.00722099 0.0614653 0.0439434 -0.0177977 0.118562 0.0456748 0.138796 -0.0004969 0.000300307 0.0374417 -0.0510899 -0.171715 0.051058 0.0631556 -0.0361038 0.00344765 0.0751374 -0.0518787 -0.0458462 -0.0873675 0.0322682 0.0884774 0.00781861 0.0466274 0.0448839 0.142065 -0.0903841 -0.0567001 -0.0676322 -0.00875479 -0.0958598 -0.0153666 0.13508 -0.0205664 -0.00271647 -0.0320146 0.0295198 -0.00945318 -0.0330005 -0.204544 0.148344 -0.123867 0.0239793 0.0452728 -0.0414781 0.0876509 0.1087 -0.0856882 -0.0672751 0.0617652 0.0360357 -0.0605625 -0.164569 0.0463509 0.0750967 0.0970834 -0.122144 0.0336477 0.0858444 -0.102423 0.0485938 -0.012876 0.0471469 
-0.0291449 0.105346 -0.0491049 -0.146061 0.0413649 0.253174 -0.0158019 0.0478497 -0.115647 0.0684123 0.0140395 -0.0606088 0.110638 -0.021261 0.117751 -0.0398834 -0.134287 0.044168 -0.0324758 0.0401213 0.0816213 0.0235257 0.0616043 0.0347943 -0.0302801 0.00908348 -0.0841177 -0.161977 0.135003 -0.0048195 0.0639698 -0.0200704 -0.0863019 -0.000351821 0.0319705 0.132861 -0.07683 0.0539156 -0.0669358 0.0441433 0.0334475 -0.0474939 -0.104637 0.16595 -0.182189 0.0160655 0.168767 0.0793683 -0.198822 -0.0136089 -0.0618423 -0.0408986 -0.0953075 -0.0232133 0.014 0.0752231 -0.0578 0.194625 0.027115 -0.153809 -0.128659 0.0639245 0.229007 -0.0859572 0.0872549 0.00722099 0.0614653 0.0439434 -0.0177977 0.118562 0.0456748 0.138796 -0.0004969 0.000300307 0.0374417 -0.0510899 -0.171715 0.051058 0.0631556 -0.0361038 0.00344765 0.0751374 -0.0518787 -0.0458462 -0.0873675 0.0322682 0.0884774 0.00781861 0.0466274 0.0448839 0.142065 -0.0903841 -0.0567001 -0.0676322 -0.00875479 -0.0958598 -0.0153666 0.13508 -0.0205664 -0.00271647 -0.0320146 0.0295198 -0.00945318 -0.0330005 -0.204544 0.148344 -0.123867 0.0239793 0.0452728 -0.0414781 0.0876509 0.1087 -0.0856882 -0.0672751 0.0617652 0.0360357 -0.0605625 -0.164569 0.0463509 0.0750967 0.0970834 -0.122144 0.0336477 0.0858444 -0.102423 0.0485938 -0.012876 0.0471469 
-0.033009 0.0805285 -0.0589155 -0.131617 0.0541669 0.24461 -0.00432654 0.0451476 -0.0957848 0.0724593 0.0172343 -0.039373 0.111236 -0.03446 0.102879 -0.0372887 -0.138196 0.057318 -0.0452963 0.0536494 0.0872504 -0.00024745 0.0700573 0.0447045 -0.029097 0.0105197 -0.0926764 -0.180218 0.127659 -0.00946705 0.0776733 -0.00726952 -0.087032 0.000976713 0.0270005 0.131451 -0.0833622 0.0684076 -0.0692134 0.033303 0.047152 -0.0415159 -0.115548 0.170282 -0.192927 -0.0141783 0.161406 0.0815296 -0.169159 -0.0153897 -0.0696068 -0.0572874 -0.103598 -0.0285577 0.0228298 0.0741182 -0.05902 0.201705 0.0240846 -0.154281 -0.129975 0.0521778 0.234372 -0.0893482 0.0969841 -0.00177751 0.0545556 0.0446266 -0.0174307 0.119762 0.0442604 0.154733 0.00135787 0.0115823 0.0235753 -0.0574956 -0.166715 0.0655698 0.0599064 -0.0449536 -0.0163668 0.0799039 -0.0518744 -0.0461126 -0.0890834 0.0255697 0.0995361 0.0282123 0.0530694 0.0187506 0.139594 -0.0867528 -0.048696 -0.0806336 -0.00186511 -0.104422 -0.0219781 0.129094 -0.0261565 0.00159937 -0.0322607 0.0102667 -0.0116682 -0.026766 -0.184594 0.14304 -0.12059 0.0199302 0.0544423 -0.0353977 0.0647159 0.122816 -0.0802323 -0.0594372 0.0676007 0.03363 -0.0540534 -0.166658 0.0437698 0.0817911 0.0933548 -0.103882 0.0245484 0.0918849 -0.117497 0.0483105 -0.0300232 0.0529853 
-0.033009 0.0805285 -0.0589155 -0.131617 0.0541669 0.24461 -0.00432654 0.0451476 -0.0957848 0.0724593 0.0172343 -0.039373 0.111236 -0.03446 0.102879 -0.0372887 -0.138196 0.057318 -0.0452963 0.0536494 0.0872504 -0.00024745 0.0700573 0.0447045 -0.029097 0.0105197 -0.0926764 -0.180218 0.127659 -0.00946705 0.0776733 -0.00726952 -0.087032 0.000976713 0.0270005 0.131451 -0.0833622 0.0684076 -0.0692134 0.033303 0.047152 -0.0415159 -0.115548 0.170282 -0.192927 -0.0141783 0.161406 0.0815296 -0.169159 -0.0153897 -0.0696068 -0.0572874 -0.103598 -0.0285577 0.0228298 0.0741182 -0.05902 0.201705 0.0240846 -0.154281 -0.129975 0.0521778 0.234372 -0.0893482 0.0969841 -0.00177751 0.0545556 0.0446266 -0.0174307 0.119762 0.0442604 0.154733 0.00135787 0.0115823 0.0235753 -0.0574956 -0.166715 0.0655698 0.0599064 -0.0449536 -0.0163668 0.0799039 -0.0518744 -0.0461126 -0.0890834 0.0255697 0.0995361 0.0282123 0.0530694 0.0187506 0.139594 -0.0867528 -0.048696 -0.0806336 -0.00186511 -0.104422 -0.0219781 0.129094 -0.0261565 0.00159937 -0.0322607 0.0102667 -0.0116682 -0.026766 -0.184594 0.14304 -0.12059 0.0199302 0.0544423 -0.0353977 0.0647159 0.122816 -0.0802323 -0.0594372 0.0676007 0.03363 -0.0540534 -0.166658 0.0437698 0.0817911 0.0933548 -0.103882 0.0245484 0.0918849 -0.117497 0.0483105 -0.0300232 0.0529853 
-0.033009 0.0805285 -0.0589155 -0.131617 0.0541669 0.24461 -0.00432654 0.0451476 -0.0957848 0.0724593 0.0172343 -0.039373 0.111236 -0.03446 0.102879 -0.0372887 -0.138196 0.057318 -0.0452963 0.0536494 0.0872504 -0.00024745 0.0700573 0.0447045 -0.029097 0.0105197 -0.0926764 -0.180218 0.127659 -0.00946705 0.0776733 -0.00726952 -0.087032 0.000976713 0.0270005 0.131451 -0.0833622 0.0684076 -0.0692134 0.033303 0.047152 -0.0415159 -0.115548 0.170282 -0.192927 -0.0141783 0.161406 0.0815296 -0.169159 -0.0153897 -0.0696068 -0.0572874 -0.103598 -0.0285577 0.0228298 0.0741182 -0.05902 0.201705 0.0240846 -0.154281 -0.129975 0.0521778 0.234372 -0.0893482 0.0969841 -0.00177751 0.0545556 0.0446266 -0.0174307 0.119762 0.0442604 0.154733 0.00135787 0.0115823 0.0235753 -0.0574956 -0.166715 0.0655698 0.0599064 -0.0449536 -0.0163668 0.0799039 -0.0518744 -0.0461126 -0.0890834 0.0255697 0.0995361 0.0282123 0.0530694 0.0187506 0.139594 -0.0867528 -0.048696 -0.0806336 -0.00186511 -0.104422 -0.0219781 0.129094 -0.0261565 0.00159937 -0.0322607 0.0102667 -0.0116682 -0.026766 -0.184594 0.14304 -0.12059 0.0199302 0.0544423 -0.0353977 0.0647159 0.122816 -0.0802323 -0.0594372 0.0676007 0.03363 -0.0540534 -0.166658 0.0437698 0.0817911 0.0933548 -0.103882 0.0245484 0.0918849 -0.117497 0.0483105 -0.0300232 0.0529853 
-0.0458551 0.10329 -0.0190325 -0.0873727 0.0425018 0.23239 -0.0291188 0.00473433 -0.0237758 0.0421152 0.0495419 -0.0350641 0.0643953 0.0120819 0.0997676 0.0141481 -0.0856293 0.0793913 -0.0422988 -0.0205848 0.140559 0.00936944 0.054936 0.0906199 0.0341702 -0.00604722 -0.0707224 -0.143807 0.14394 0.0415637 0.13368 0.00871983 -0.0351912 -0.000771278 0.0430322 0.159893 -0.0806106 0.0566204 -0.0437574 0.0246825 0.00485401 0.0064365 -0.073612 0.13618 -0.107727 -0.0559159 0.151447 0.0218619 -0.161951 -0.0581939 -0.0610069 -0.0275909 -0.0648654 -0.049422 0.0373204 0.133165 -0.068667 0.229166 -0.00351335 -0.143255 -0.169469 0.0151669 0.233426 -0.138431 0.114289 0.035642 0.0294691 0.0299468 -0.0811659 0.184971 0.050869 0.139037 -0.05128 -0.0328217 0.0173142 -0.0610306 -0.118927 0.0548358 0.00173457 -0.0740038 -0.0329336 0.113373 -0.0405079 -0.0692743 -0.100342 0.00422391 0.0594799 -0.00946038 0.0221476 0.0420348 0.105227 -0.103428 -0.0714687 -0.0538524 0.0912862 -0.0301431 -0.0552452 0.137589 -0.0246734 0.0495116 -0.0486655 -0.0108434 -0.04556 -0.0277678 -0.171469 0.156656 -0.0948432 -0.0712576 0.0877667 -0.0932122 0.00426709 0.107558 -0.0809004 -0.0533892 0.150233 0.0437148 -0.0210917 -0.162462 0.0782504 0.120096 0.126637 -0.0936972 0.0274585 0.0705512 -0.0944659 0.0874092 0.0432192 0.0584846 
-0.0458551 0.10329 -0.0190325 -0.0873727 0.0425018 0.23239 -0.0291188 0.00473433 -0.0237758 0.0421152 0.0495419 -0.0350641 0.0643953 0.0120819 0.0997676 0.0141481 -0.0856293 0.0793913 -0.0422988 -0.0205848 0.140559 0.00936944 0.054936 0.0906199 0.0341702 -0.00604722 -0.0707224 -0.143807 0.14394 0.0415637 0.13368 0.00871983 -0.0351912 -0.000771278 0.0430322 0.159893 -0.0806106 0.0566204 -0.0437574 0.0246825 0.00485401 0.0064365 -0.073612 0.13618 -0.107727 -0.0559159 0.151447 0.0218619 -0.161951 -0.0581939 -0.0610069 -0.0275909 -0.0648654 -0.049422 0.0373204 0.133165 -0.068667 0.229166 -0.00351335 -0.143255 -0.169469 0.0151669 0.233426 -0.138431 0.114289 0.035642 0.0294691 0.0299468 -0.0811659 0.184971 0.050869 0.139037 -0.05128 -0.0328217 0.0173142 -0.0610306 -0.118927 0.0548358 0.00173457 -0.0740038 -0.0329336 0.113373 -0.0405079 -0.0692743 -0.100342 0.00422391 0.0594799 -0.00946038 0.0221476 0.0420348 0.105227 -0.103428 -0.0714687 -0.0538524 0.0912862 -0.0301431 -0.0552452 0.137589 -0.0246734 0.0495116 -0.0486655 -0.0108434 -0.04556 -0.0277678 -0.171469 0.156656 -0.0948432 -0.0712576 0.0877667 -0.0932122 0.00426709 0.107558 -0.0809004 -0.0533892 0.150233 0.0437148 -0.0210917 -0.162462 0.0782504 0.120096 0.126637 -0.0936972 0.0274585 0.0705512 -0.0944659 0.0874092 0.0432192 0.0584846 
-0.0458551 0.10329 -0.0190325 -0.0873727 0.0425018 0.23239 -0.0291188 0.00473433 -0.0237758 0.0421152 0.0495419 -0.0350641 0.0643953 0.0120819 0.0997676 0.0141481 -0.0856293 0.0793913 -0.0422988 -0.0205848 0.140559 0.00936944 0.054936 0.0906199 0.0341702 -0.00604722 -0.0707224 -0.143807 0.14394 0.0415637 0.13368 0.00871983 -0.0351912 -0.000771278 0.0430322 0.159893 -0.0806106 0.0566204 -0.0437574 0.0246825 0.00485401 0.0064365 -0.073612 0.13618 -0.107727 -0.0559159 0.151447 0.0218619 -0.161951 -0.0581939 -0.0610069 -0.0275909 -0.0648654 -0.049422 0.0373204 0.133165 -0.068667 0.229166 -0.00351335 -0.143255 -0.169469 0.0151669 0.233426 -0.138431 0.114289 0.035642 0.0294691 0.0299468 -0.0811659 0.184971 0.050869 0.139037 -0.05128 -0.0328217 0.0173142 -0.0610306 -0.118927 0.0548358 0.00173457 -0.0740038 -0.0329336 0.113373 -0.0405079 -0.0692743 -0.100342 0.00422391 0.0594799 -0.00946038 0.0221476 0.0420348 0.105227 -0.103428 -0.0714687 -0.0538524 0.0912862 -0.0301431 -0.0552452 0.137589 -0.0246734 0.0495116 -0.0486655 -0.0108434 -0.04556 -0.0277678 -0.171469 0.156656 -0.0948432 -0.0712576 0.0877667 -0.0932122 0.00426709 0.107558 -0.0809004 -0.0533892 0.150233 0.0437148 -0.0210917 -0.162462 0.0782504 0.120096 0.126637 -0.0936972 0.0274585 0.0705512 -0.0944659 0.0874092 0.0432192 0.0584846 
-0.0458551 0.10329 -0.0190325 -0.0873727 0.0425018 0.23239 -0.0291188 0.00473433 -0.0237758 0.0421152 0.0495419 -0.0350641 0.0643953 0.0120819 0.0997676 0.0141481 -0.0856293 0.0793913 -0.0422988 -0.0205848 0.140559 0.00936944 0.054936 0.0906199 0.0341702 -0.00604722 -0.0707224 -0.143807 0.14394 0.0415637 0.13368 0.00871983 -0.0351912 -0.000771278 0.0430322 0.159893 -0.0806106 0.0566204 -0.0437574 0.0246825 0.00485401 0.0064365 -0.073612 0.13618 -0.107727 -0.0559159 0.151447 0.0218619 -0.161951 -0.0581939 -0.0610069 -0.0275909 -0.0648654 -0.049422 0.0373204 0.133165 -0.068667 0.229166 -0.00351335 -0.143255 -0.169469 0.0151669 0.233426 -0.138431 0.114289 0.035642 0.0294691 0.0299468 -0.0811659 0.184971 0.050869 0.139037 -0.05128 -0.0328217 0.0173142 -0.0610306 -0.118927 0.0548358 0.00173457 -0.0740038 -0.0329336 0.113373 -0.0405079 -0.0692743 -0.100342 0.00422391 0.0594799 -0.00946038 0.0221476 0.0420348 0.105227 -0.103428 -0.0714687 -0.0538524 0.0912862 -0.0301431 -0.0552452 0.137589 -0.0246734 0.0495116 -0.0486655 -0.0108434 -0.04556 -0.0277678 -0.171469 0.156656 -0.0948432 -0.0712576 0.0877667 -0.0932122 0.00426709 0.107558 -0.0809004 -0.0533892 0.150233 0.0437148 -0.0210917 -0.162462 0.0782504 0.120096 0.126637 -0.0936972 0.0274585 0.0705512 -0.0944659 0.0874092 0.0432192 0.0584846 
-0.0458551 0.10329 -0.0190325 -0.0873727 0.0425018 0.23239 -0.0291188 0.00473433 -0.0237758 0.0421152 0.0495419 -0.0350641 0.0643953 0.0120819 0.0997676 0.0141481 -0.0856293 0.0793913 -0.0422988 -0.0205848 0.140559 0.00936944 0.054936 0.0906199 0.0341702 -0.00604722 -0.0707224 -0.143807 0.14394 0.0415637 0.13368 0.00871983 -0.0351912 -0.000771278 0.0430322 0.159893 -0.0806106 0.0566204 -0.0437574 0.0246825 0.00485401 0.0064365 -0.073612 0.13618 -0.107727 -0.0559159 0.151447 0.0218619 -0.161951 -0.0581939 -0.0610069 -0.0275909 -0.0648654 -0.049422 0.0373204 0.133165 -0.068667 0.229166 -0.00351335 -0.143255 -0.169469 0.0151669 0.233426 -0.138431 0.114289 0.035642 0.0294691 0.0299468 -0.0811659 0.184971 0.050869 0.139037 -0.05128 -0.0328217 0.0173142 -0.0610306 -0.118927 0.0548358 0.00173457 -0.0740038 -0.0329336 0.113373 -0.0405079 -0.0692743 -0.100342 0.00422391 0.0594799 -0.00946038 0.0221476 0.0420348 0.105227 -0.103428 -0.0714687 -0.0538524 0.0912862 -0.0301431 -0.0552452 0.137589 -0.0246734 0.0495116 -0.0486655 -0.0108434 -0.04556 -0.0277678 -0.171469 0.156656 -0.0948432 -0.0712576 0.0877667 -0.0932122 0.00426709 0.107558 -0.0809004 -0.0533892 0.150233 0.0437148 -0.0210917 -0.162462 0.0782504 0.120096 0.126637 -0.0936972 0.0274585 0.0705512 -0.0944659 0.0874092 0.0432192 0.0584846 
-0.0458551 0.10329 -0.0190325 -0.0873727 0.0425018 0.23239 -0.0291188 0.00473433 -0.0237758 0.0421152 0.0495419 -0.0350641 0.0643953 0.0120819 0.0997676 0.0141481 -0.0856293 0.0793913 -0.0422988 -0.0205848 0.140559 0.00936944 0.054936 0.0906199 0.0341702 -0.00604722 -0.0707224 -0.143807 0.14394 0.0415637 0.13368 0.00871983 -0.0351912 -0.000771278 0.0430322 0.159893 -0.0806106 0.0566204 -0.0437574 0.0246825 0.00485401 0.0064365 -0.073612 0.13618 -0.107727 -0.0559159 0.151447 0.0218619 -0.161951 -0.0581939 -0.0610069 -0.0275909 -0.0648654 -0.049422 0.0373204 0.133165 -0.068667 0.229166 -0.00351335 -0.143255 -0.169469 0.0151669 0.233426 -0.138431 0.114289 0.035642 0.0294691 0.0299468 -0.0811659 0.184971 0.050869 0.139037 -0.05128 -0.0328217 0.0173142 -0.0610306 -0.118927 0.0548358 0.00173457 -0.0740038 -0.0329336 0.113373 -0.0405079 -0.0692743 -0.100342 0.00422391 0.0594799 -0.00946038 0.0221476 0.0420348 0.105227 -0.103428 -0.0714687 -0.0538524 0.0912862 -0.0301431 -0.0552452 0.137589 -0.0246734 0.0495116 -0.0486655 -0.0108434 -0.04556 -0.0277678 -0.171469 0.156656 -0.0948432 -0.0712576 0.0877667 -0.0932122 0.00426709 0.107558 -0.0809004 -0.0533892 0.150233 0.0437148 -0.0210917 -0.162462 0.0782504 0.120096 0.126637 -0.0936972 0.0274585 0.0705512 -0.0944659 0.0874092 0.0432192 0.0584846 
-0.0458551 0.10329 -0.0190325 -0.0873727 0.0425018 0.23239 -0.0291188 0.00473433 -0.0237758 0.0421152 0.0495419 -0.0350641 0.0643953 0.0120819 0.0997676 0.0141481 -0.0856293 0.0793913 -0.0422988 -0.0205848 0.140559 0.00936944 0.054936 0.0906199 0.0341702 -0.00604722 -0.0707224 -0.143807 0.14394 0.0415637 0.13368 0.00871983 -0.0351912 -0.000771278 0.0430322 0.159893 -0.0806106 0.0566204 -0.0437574 0.0246825 0.00485401 0.0064365 -0.073612 0.13618 -0.107727 -0.0559159 0.151447 0.0218619 -0.161951 -0.0581939 -0.0610069 -0.0275909 -0.0648654 -0.049422 0.0373204 0.133165 -0.068667 0.229166 -0.00351335 -0.143255 -0.169469 0.0151669 0.233426 -0.138431 0.114289 0.035642 0.0294691 0.0299468 -0.0811659 0.184971 0.050869 0.139037 -0.05128 -0.0328217 0.0173142 -0.0610306 -0.118927 0.0548358 0.00173457 -0.0740038 -0.0329336 0.113373 -0.0405079 -0.0692743 -0.100342 0.00422391 0.0594799 -0.00946038 0.0221476 0.0420348 0.105227 -0.103428 -0.0714687 -0.0538524 0.0912862 -0.0301431 -0.0552452 0.137589 -0.0246734 0.0495116 -0.0486655 -0.0108434 -0.04556 -0.0277678 -0.171469 0.156656 -0.0948432 -0.0712576 0.0877667 -0.0932122 0.00426709 0.107558 -0.0809004 -0.0533892 0.150233 0.0437148 -0.0210917 -0.162462 0.0782504 0.120096 0.126637 -0.0936972 0.0274585 0.0705512 -0.0944659 0.0874092 0.0432192 0.0584846 
-0.0458551 0.10329 -0.0190325 -0.0873727 0.0425018 0.23239 -0.0291188 0.00473433 -0.0237758 0.0421152 0.0495419 -0.0350641 0.0643953 0.0120819 0.0997676 0.0141481 -0.0856293 0.0793913 -0.0422988 -0.0205848 0.140559 0.00936944 0.054936 0.0906199 0.0341702 -0.00604722 -0.0707224 -0.143807 0.14394 0.0415637 0.13368 0.00871983 -0.0351912 -0.000771278 0.0430322 0.159893 -0.0806106 0.0566204 -0.0437574 0.0246825 0.00485401 0.0064365 -0.073612 0.13618 -0.107727 -0.0559159 0.151447 0.0218619 -0.161951 -0.0581939 -0.0610069 -0.0275909 -0.0648654 -0.049422 0.0373204 0.133165 -0.068667 0.229166 -0.00351335 -0.143255 -0.169469 0.0151669 0.233426 -0.138431 0.114289 0.035642 0.0294691 0.0299468 -0.0811659 0.184971 0.050869 0.139037 -0.05128 -0.0328217 0.0173142 -0.0610306 -0.118927 0.0548358 0.00173457 -0.0740038 -0.0329336 0.113373 -0.0405079 -0.0692743 -0.100342 0.00422391 0.0594799 -0.00946038 0.0221476 0.0420348 0.105227 -0.103428 -0.0714687 -0.0538524 0.0912862 -0.0301431 -0.0552452 0.137589 -0.0246734 0.0495116 -0.0486655 -0.0108434 -0.04556 -0.0277678 -0.171469 0.156656 -0.0948432 -0.0712576 0.0877667 -0.0932122 0.00426709 0.107558 -0.0809004 -0.0533892 0.150233 0.0437148 -0.0210917 -0.162462 0.0782504 0.120096 0.126637 -0.0936972 0.0274585 0.0705512 -0.0944659 0.0874092 0.0432192 0.0584846 
-0.0458551 0.10329 -0.0190325 -0.0873727 0.0425018 0.23239 -0.0291188 0.00473433 -0.0237758 0.0421152 0.0495419 -0.0350641 0.0643953 0.0120819 0.0997676 0.0141481 -0.0856293 0.0793913 -0.0422988 -0.0205848 0.140559 0.00936944 0.054936 0.0906199 0.0341702 -0.00604722 -0.0707224 -0.143807 0.14394 0.0415637 0.13368 0.00871983 -0.0351912 -0.000771278 0.0430322 0.159893 -0.0806106 0.0566204 -0.0437574 0.0246825 0.00485401 0.0064365 -0.073612 0.13618 -0.107727 -0.0559159 0.151447 0.0218619 -0.161951 -0.0581939 -0.0610069 -0.0275909 -0.0648654 -0.049422 0.0373204 0.133165 -0.068667 0.229166 -0.00351335 -0.143255 -0.169469 0.0151669 0.233426 -0.138431 0.114289 0.035642 0.0294691 0.0299468 -0.0811659 0.184971 0.050869 0.139037 -0.05128 -0.0328217 0.0173142 -0.0610306 -0.118927 0.0548358 0.00173457 -0.0740038 -0.0329336 0.113373 -0.0405079 -0.0692743 -0.100342 0.00422391 0.0594799 -0.00946038 0.0221476 0.0420348 0.105227 -0.103428 -0.0714687 -0.0538524 0.0912862 -0.0301431 -0.0552452 0.137589 -0.0246734 0.0495116 -0.0486655 -0.0108434 -0.04556 -0.0277678 -0.171469 0.156656 -0.0948432 -0.0712576 0.0877667 -0.0932122 0.00426709 0.107558 -0.0809004 -0.0533892 0.150233 0.0437148 -0.0210917 -0.162462 0.0782504 0.120096 0.126637 -0.0936972 0.0274585 0.0705512 -0.0944659 0.0874092 0.0432192 0.0584846 
-0.0458551 0.10329 -0.0190325 -0.0873727 0.0425018 0.23239 -0.0291188 0.00473433 -0.0237758 0.0421152 0.0495419 -0.0350641 0.0643953 0.0120819 0.0997676 0.0141481 -0.0856293 0.0793913 -0.0422988 -0.0205848 0.140559 0.00936944 0.054936 0.0906199 0.0341702 -0.00604722 -0.0707224 -0.143807 0.14394 0.0415637 0.13368 0.00871983 -0.0351912 -0.000771278 0.0430322 0.159893 -0.0806106 0.0566204 -0.0437574 0.0246825 0.00485401 0.0064365 -0.073612 0.13618 -0.107727 -0.0559159 0.151447 0.0218619 -0.161951 -0.0581939 -0.0610069 -0.0275909 -0.0648654 -0.049422 0.0373204 0.133165 -0.068667 0.229166 -0.00351335 -0.143255 -0.169469 0.0151669 0.233426 -0.138431 0.114289 0.035642 0.0294691 0.0299468 -0.0811659 0.184971 0.050869 0.139037 -0.05128 -0.0328217 0.0173142 -0.0610306 -0.118927 0.0548358 0.00173457 -0.0740038 -0.0329336 0.113373 -0.0405079 -0.0692743 -0.100342 0.00422391 0.0594799 -0.00946038 0.0221476 0.0420348 0.105227 -0.103428 -0.0714687 -0.0538524 0.0912862 -0.0301431 -0.0552452 0.137589 -0.0246734 0.0495116 -0.0486655 -0.0108434 -0.04556 -0.0277678 -0.171469 0.156656 -0.0948432 -0.0712576 0.0877667 -0.0932122 0.00426709 0.107558 -0.0809004 -0.0533892 0.150233 0.0437148 -0.0210917 -0.162462 0.0782504 0.120096 0.126637 -0.0936972 0.0274585 0.0705512 -0.0944659 0.0874092 0.0432192 0.0584846 
-0.0458551 0.10329 -0.0190325 -0.0873727 0.0425018 0.23239 -0.0291188 0.00473433 -0.0237758 0.0421152 0.0495419 -0.0350641 0.0643953 0.0120819 0.0997676 0.0141481 -0.0856293 0.0793913 -0.0422988 -0.0205848 0.140559 0.00936944 0.054936 0.0906199 0.0341702 -0.00604722 -0.0707224 -0.143807 0.14394 0.0415637 0.13368 0.00871983 -0.0351912 -0.000771278 0.0430322 0.159893 -0.0806106 0.0566204 -0.0437574 0.0246825 0.00485401 0.0064365 -0.073612 0.13618 -0.107727 -0.0559159 0.151447 0.0218619 -0.161951 -0.0581939 -0.0610069 -0.0275909 -0.0648654 -0.049422 0.0373204 0.133165 -0.068667 0.229166 -0.00351335 -0.143255 -0.169469 0.0151669 0.233426 -0.138431 0.114289 0.035642 0.0294691 0.0299468 -0.0811659 0.184971 0.050869 0.139037 -0.05128 -0.0328217 0.0173142 -0.0610306 -0.118927 0.0548358 0.00173457 -0.0740038 -0.0329336 0.113373 -0.0405079 -0.0692743 -0.100342 0.00422391 0.0594799 -0.00946038 0.0221476 0.0420348 0.105227 -0.103428 -0.0714687 -0.0538524 0.0912862 -0.0301431 -0.0552452 0.137589 -0.0246734 0.0495116 -0.0486655 -0.0108434 -0.04556 -0.0277678 -0.171469 0.156656 -0.0948432 -0.0712576 0.0877667 -0.0932122 0.00426709 0.107558 -0.0809004 -0.0533892 0.150233 0.0437148 -0.0210917 -0.162462 0.0782504 0.120096 0.126637 -0.0936972 0.0274585 0.0705512 -0.0944659 0.0874092 0.0432192 0.0584846 
-0.0458551 0.10329 -0.0190325 -0.0873727 0.0425018 0.23239 -0.0291188 0.00473433 -0.0237758 0.0421152 0.0495419 -0.0350641 0.0643953 0.0120819 0.0997676 0.0141481 -0.0856293 0.0793913 -0.0422988 -0.0205848 0.140559 0.00936944 0.054936 0.0906199 0.0341702 -0.00604722 -0.0707224 -0.143807 0.14394 0.0415637 0.13368 0.00871983 -0.0351912 -0.000771278 0.0430322 0.159893 -0.0806106 0.0566204 -0.0437574 0.0246825 0.00485401 0.0064365 -0.073612 0.13618 -0.107727 -0.0559159 0.151447 0.0218619 -0.161951 -0.0581939 -0.0610069 -0.0275909 -0.0648654 -0.049422 0.0373204 0.133165 -0.068667 0.229166 -0.00351335 -0.143255 -0.169469 0.0151669 0.233426 -0.138431 0.114289 0.035642 0.0294691 0.0299468 -0.0811659 0.184971 0.050869 0.139037 -0.05128 -0.0328217 0.0173142 -0.0610306 -0.118927 0.0548358 0.00173457 -0.0740038 -0.0329336 0.113373 -0.0405079 -0.0692743 -0.100342 0.00422391 0.0594799 -0.00946038 0.0221476 0.0420348 0.105227 -0.103428 -0.0714687 -0.0538524 0.0912862 -0.0301431 -0.0552452 0.137589 -0.0246734 0.0495116 -0.0486655 -0.0108434 -0.04556 -0.0277678 -0.171469 0.156656 -0.0948432 -0.0712576 0.0877667 -0.0932122 0.00426709 0.107558 -0.0809004 -0.0533892 0.150233 0.0437148 -0.0210917 -0.162462 0.0782504 0.120096 0.126637 -0.0936972 0.0274585 0.0705512 -0.0944659 0.0874092 0.0432192 0.0584846 
-0.0458551 0.10329 -0.0190325 -0.0873727 0.0425018 0.23239 -0.0291188 0.00473433 -0.0237758 0.0421152 0.0495419 -0.0350641 0.0643953 0.0120819 0.0997676 0.0141481 -0.0856293 0.0793913 -0.0422988 -0.0205848 0.140559 0.00936944 0.054936 0.0906199 0.0341702 -0.00604722 -0.0707224 -0.143807 0.14394 0.0415637 0.13368 0.00871983 -0.0351912 -0.000771278 0.0430322 0.159893 -0.0806106 0.0566204 -0.0437574 0.0246825 0.00485401 0.0064365 -0.073612 0.13618 -0.107727 -0.0559159 0.151447 0.0218619 -0.161951 -0.0581939 -0.0610069 -0.0275909 -0.0648654 -0.049422 0.0373204 0.133165 -0.068667 0.229166 -0.00351335 -0.143255 -0.169469 0.0151669 0.233426 -0.138431 0.114289 0.035642 0.0294691 0.0299468 -0.0811659 0.184971 0.050869 0.139037 -0.05128 -0.0328217 0.0173142 -0.0610306 -0.118927 0.0548358 0.00173457 -0.0740038 -0.0329336 0.113373 -0.0405079 -0.0692743 -0.100342 0.00422391 0.0594799 -0.00946038 0.0221476 0.0420348 0.105227 -0.103428 -0.0714687 -0.0538524 0.0912862 -0.0301431 -0.0552452 0.137589 -0.0246734 0.0495116 -0.0486655 -0.0108434 -0.04556 -0.0277678 -0.171469 0.156656 -0.0948432 -0.0712576 0.0877667 -0.0932122 0.00426709 0.107558 -0.0809004 -0.0533892 0.150233 0.0437148 -0.0210917 -0.162462 0.0782504 0.120096 0.126637 -0.0936972 0.0274585 0.0705512 -0.0944659 0.0874092 0.0432192 0.0584846 
-0.0458551 0.10329 -0.0190325 -0.0873727 0.0425018 0.23239 -0.0291188 0.00473433 -0.0237758 0.0421152 0.0495419 -0.0350641 0.0643953 0.0120819 0.0997676 0.0141481 -0.0856293 0.0793913 -0.0422988 -0.0205848 0.140559 0.00936944 0.054936 0.0906199 0.0341702 -0.00604722 -0.0707224 -0.143807 0.14394 0.0415637 0.13368 0.00871983 -0.0351912 -0.000771278 0.0430322 0.159893 -0.0806106 0.0566204 -0.0437574 0.0246825 0.00485401 0.0064365 -0.073612 0.13618 -0.107727 -0.0559159 0.151447 0.0218619 -0.161951 -0.0581939 -0.0610069 -0.0275909 -0.0648654 -0.049422 0.0373204 0.133165 -0.068667 0.229166 -0.00351335 -0.143255 -0.169469 0.0151669 0.233426 -0.138431 0.114289 0.035642 0.0294691 0.0299468 -0.0811659 0.184971 0.050869 0.139037 -0.05128 -0.0328217 0.0173142 -0.0610306 -0.118927 0.0548358 0.00173457 -0.0740038 -0.0329336 0.113373 -0.0405079 -0.0692743 -0.100342 0.00422391 0.0594799 -0.00946038 0.0221476 0.0420348 0.105227 -0.103428 -0.0714687 -0.0538524 0.0912862 -0.0301431 -0.0552452 0.137589 -0.0246734 0.0495116 -0.0486655 -0.0108434 -0.04556 -0.0277678 -0.171469 0.156656 -0.0948432 -0.0712576 0.0877667 -0.0932122 0.00426709 0.107558 -0.0809004 -0.0533892 0.150233 0.0437148 -0.0210917 -0.162462 0.0782504 0.120096 0.126637 -0.0936972 0.0274585 0.0705512 -0.0944659 0.0874092 0.0432192 0.0584846 
-0.0458551 0.10329 -0.0190325 -0.0873727 0.0425018 0.23239 -0.0291188 0.00473433 -0.0237758 0.0421152 0.0495419 -0.0350641 0.0643953 0.0120819 0.0997676 0.0141481 -0.0856293 0.0793913 -0.0422988 -0.0205848 0.140559 0.00936944 0.054936 0.0906199 0.0341702 -0.00604722 -0.0707224 -0.143807 0.14394 0.0415637 0.13368 0.00871983 -0.0351912 -0.000771278 0.0430322 0.159893 -0.0806106 0.0566204 -0.0437574 0.0246825 0.00485401 0.0064365 -0.073612 0.13618 -0.107727 -0.0559159 0.151447 0.0218619 -0.161951 -0.0581939 -0.0610069 -0.0275909 -0.0648654 -0.049422 0.0373204 0.133165 -0.068667 0.229166 -0.00351335 -0.143255 -0.169469 0.0151669 0.233426 -0.138431 0.114289 0.035642 0.0294691 0.0299468 -0.0811659 0.184971 0.050869 0.139037 -0.05128 -0.0328217 0.0173142 -0.0610306 -0.118927 0.0548358 0.00173457 -0.0740038 -0.0329336 0.113373 -0.0405079 -0.0692743 -0.100342 0.00422391 0.0594799 -0.00946038 0.0221476 0.0420348 0.105227 -0.103428 -0.0714687 -0.0538524 0.0912862 -0.0301431 -0.0552452 0.137589 -0.0246734 0.0495116 -0.0486655 -0.0108434 -0.04556 -0.0277678 -0.171469 0.156656 -0.0948432 -0.0712576 0.0877667 -0.0932122 0.00426709 0.107558 -0.0809004 -0.0533892 0.150233 0.0437148 -0.0210917 -0.162462 0.0782504 0.120096 0.126637 -0.0936972 0.0274585 0.0705512 -0.0944659 0.0874092 0.0432192 0.0584846 
-0.0458551 0.10329 -0.0190325 -0.0873727 0.0425018 0.23239 -0.0291188 0.00473433 -0.0237758 0.0421152 0.0495419 -0.0350641 0.0643953 0.0120819 0.0997676 0.0141481 -0.0856293 0.0793913 -0.0422988 -0.0205848 0.140559 0.00936944 0.054936 0.0906199 0.0341702 -0.00604722 -0.0707224 -0.143807 0.14394 0.0415637 0.13368 0.00871983 -0.0351912 -0.000771278 0.0430322 0.159893 -0.0806106 0.0566204 -0.0437574 0.0246825 0.00485401 0.0064365 -0.073612 0.13618 -0.107727 -0.0559159 0.151447 0.0218619 -0.161951 -0.0581939 -0.0610069 -0.0275909 -0.0648654 -0.049422 0.0373204 0.133165 -0.068667 0.229166 -0.00351335 -0.143255 -0.169469 0.0151669 0.233426 -0.138431 0.114289 0.035642 0.0294691 0.0299468 -0.0811659 0.184971 0.050869 0.139037 -0.05128 -0.0328217 0.0173142 -0.0610306 -0.118927 0.0548358 0.00173457 -0.0740038 -0.0329336 0.113373 -0.0405079 -0.0692743 -0.100342 0.00422391 0.0594799 -0.00946038 0.0221476 0.0420348 0.105227 -0.103428 -0.0714687 -0.0538524 0.0912862 -0.0301431 -0.0552452 0.137589 -0.0246734 0.0495116 -0.0486655 -0.0108434 -0.04556 -0.0277678 -0.171469 0.156656 -0.0948432 -0.0712576 0.0877667 -0.0932122 0.00426709 0.107558 -0.0809004 -0.0533892 0.150233 0.0437148 -0.0210917 -0.162462 0.0782504 0.120096 0.126637 -0.0936972 0.0274585 0.0705512 -0.0944659 0.0874092 0.0432192 0.0584846 
-0.0458551 0.10329 -0.0190325 -0.0873727 0.0425018 0.23239 -0.0291188 0.00473433 -0.0237758 0.0421152 0.0495419 -0.0350641 0.0643953 0.0120819 0.0997676 0.0141481 -0.0856293 0.0793913 -0.0422988 -0.0205848 0.140559 0.00936944 0.054936 0.0906199 0.0341702 -0.00604722 -0.0707224 -0.143807 0.14394 0.0415637 0.13368 0.00871983 -0.0351912 -0.000771278 0.0430322 0.159893 -0.0806106 0.0566204 -0.0437574 0.0246825 0.00485401 0.0064365 -0.073612 0.13618 -0.107727 -0.0559159 0.151447 0.0218619 -0.161951 -0.0581939 -0.0610069 -0.0275909 -0.0648654 -0.049422 0.0373204 0.133165 -0.068667 0.229166 -0.00351335 -0.143255 -0.169469 0.0151669 0.233426 -0.138431 0.114289 0.035642 0.0294691 0.0299468 -0.0811659 0.184971 0.050869 0.139037 -0.05128 -0.0328217 0.0173142 -0.0610306 -0.118927 0.0548358 0.00173457 -0.0740038 -0.0329336 0.113373 -0.0405079 -0.0692743 -0.100342 0.00422391 0.0594799 -0.00946038 0.0221476 0.0420348 0.105227 -0.103428 -0.0714687 -0.0538524 0.0912862 -0.0301431 -0.0552452 0.137589 -0.0246734 0.0495116 -0.0486655 -0.0108434 -0.04556 -0.0277678 -0.171469 0.156656 -0.0948432 -0.0712576 0.0877667 -0.0932122 0.00426709 0.107558 -0.0809004 -0.0533892 0.150233 0.0437148 -0.0210917 -0.162462 0.0782504 0.120096 0.126637 -0.0936972 0.0274585 0.0705512 -0.0944659 0.0874092 0.0432192 0.0584846 
-0.0458551 0.10329 -0.0190325 -0.0873727 0.0425018 0.23239 -0.0291188 0.00473433 -0.0237758 0.0421152 0.0495419 -0.0350641 0.0643953 0.0120819 0.0997676 0.0141481 -0.0856293 0.0793913 -0.0422988 -0.0205848 0.140559 0.00936944 0.054936 0.0906199 0.0341702 -0.00604722 -0.0707224 -0.143807 0.14394 0.0415637 0.13368 0.00871983 -0.0351912 -0.000771278 0.0430322 0.159893 -0.0806106 0.0566204 -0.0437574 0.0246825 0.00485401 0.0064365 -0.073612 0.13618 -0.107727 -0.0559159 0.151447 0.0218619 -0.161951 -0.0581939 -0.0610069 -0.0275909 -0.0648654 -0.049422 0.0373204 0.133165 -0.068667 0.229166 -0.00351335 -0.143255 -0.169469 0.0151669 0.233426 -0.138431 0.114289 0.035642 0.0294691 0.0299468 -0.0811659 0.184971 0.050869 0.139037 -0.05128 -0.0328217 0.0173142 -0.0610306 -0.118927 0.0548358 0.00173457 -0.0740038 -0.0329336 0.113373 -0.0405079 -0.0692743 -0.100342 0.00422391 0.0594799 -0.00946038 0.0221476 0.0420348 0.105227 -0.103428 -0.0714687 -0.0538524 0.0912862 -0.0301431 -0.0552452 0.137589 -0.0246734 0.0495116 -0.0486655 -0.0108434 -0.04556 -0.0277678 -0.171469 0.156656 -0.0948432 -0.0712576 0.0877667 -0.0932122 0.00426709 0.107558 -0.0809004 -0.0533892 0.150233 0.0437148 -0.0210917 -0.162462 0.0782504 0.120096 0.126637 -0.0936972 0.0274585 0.0705512 -0.0944659 0.0874092 0.0432192 0.0584846 
