0.0551202 0.0419284 0.0810349 0.00866822 0.153678 0.206396 0.0639208 -0.116938 -0.113996 -0.0843268 -0.0671204 0.0496685 0.0190443 -0.0328093 0.126956 -0.0475175 -0.0669234 0.0497329 -0.0525509 0.0956762 0.0480619 0.0374061 0.064887 0.131945 0.0385575 -0.0167902 -0.18232 -0.136908 0.0605578 0.0256353 0.0606533 0.0992858 -0.108755 0.0745172 0.105789 0.0884052 0.0037493 0.0657447 -0.000327887 -0.0943221 0.126231 -0.00834045 0.0274354 -0.0347248 -0.1738 0.0753678 0.156648 0.0567197 -0.124108 0.0577213 -0.0407702 -0.0524812 0.0639848 -0.00616373 0.157095 0.00562203 -0.015474 0.190579 -0.0435081 -0.103915 -0.107572 0.151683 0.132934 -0.171144 0.108981 0.10864 0.0245876 -0.0184291 -0.165893 0.121142 0.00485024 0.122059 -0.0357634 0.102585 0.0540415 0.0094815 -0.0711379 -0.0451258 0.12254 0.00757483 0.0434266 0.141788 -0.0146001 -0.0642412 0.0259085 -0.0819808 0.0222234 0.0701789 -0.0676518 0.139207 0.211414 -0.0372266 0.0205595 -0.0203757 -0.0602462 -0.0493584 0.0287663 0.143161 0.05999 -0.0398424 0.00838741 0.0120747 -0.0173411 0.0381416 -0.161904 0.112542 -0.0458787 0.0243123 0.0812906 0.0186582 0.0854196 0.137218 -0.0592089 -0.0348357 0.0752197 0.035625 -0.0846628 -0.0943083 -0.0327603 0.143705 0.110665 -0.0284973 0.0307543 0.023974 -0.101006 0.100962 0.0534148 -0.051647 
0.0618085 0.0866966 0.00800665 -0.0357921 0.126492 0.224633 0.0582053 -0.148739 -0.121767 -0.102221 -0.0592825 0.0669351 0.0439122 -0.0291294 0.0854248 -0.0664496 -0.0911466 -0.00293907 -0.0532819 0.0671219 0.0374735 0.0650668 0.0262963 0.088728 0.0231149 0.0220637 -0.13757 -0.133143 0.0452617 0.0780226 0.0450935 0.104389 -0.117088 0.0713874 0.0952942 0.0740287 0.0136165 0.0573222 0.0362093 -0.0495757 0.120624 -0.0345706 0.0459106 0.0143959 -0.165415 0.104489 0.180244 0.0481457 -0.157643 0.0334124 -0.027578 -0.0400734 0.0488875 0.0157173 0.146113 0.0126316 -0.0533308 0.222304 -0.0582135 -0.107585 -0.107568 0.12916 0.178161 -0.159778 0.0986921 0.0750329 0.0470009 0.00593065 -0.137263 0.0843222 0.0155069 0.0932408 -0.0391026 0.0784093 0.0776007 0.0318119 -0.0916747 -0.0802187 0.0891618 0.0535085 0.061593 0.127261 0.00696227 -0.0449835 -0.023177 -0.0747015 0.0514529 0.0114991 -0.0731897 0.127403 0.172968 -0.10149 0.0118183 -0.0116089 -0.0933116 -0.0587864 0.0506963 0.11638 0.073988 -0.0376069 -0.0165421 0.0503908 -0.0184705 0.0885872 -0.207494 0.099745 -0.0910909 0.101945 -0.00244076 0.0153415 0.133654 0.097937 -0.114823 -0.0147006 0.0255327 0.0474756 -0.121494 -0.0908113 -0.0134157 0.136646 0.125721 -0.0427175 0.0433305 0.0160854 -0.0695029 0.0708426 0.0166652 -0.0498041 
0.142251 0.0674347 -0.130958 -0.000128666 0.134728 0.187212 0.124983 -0.0361221 -0.0765463 -0.0681467 0.000315139 0.0961636 0.0756399 -0.174283 -0.0713276 -0.0195793 -0.0011367 0.0323159 -0.153279 0.180428 0.107488 -0.00137433 0.0268621 0.0883241 -0.0600375 -0.0278509 -0.0986523 -0.200994 0.0499909 0.0969639 -0.0291353 0.138042 -0.0980951 0.127086 0.018621 -0.0407416 0.0219299 0.127866 -0.0431387 -0.08087 0.0686888 -0.0573626 0.0113621 0.100324 -0.160456 0.0328652 0.146213 0.0403917 -0.147539 0.104655 0.0407834 -0.0319512 -0.0727356 0.0122126 0.121688 -0.0506483 -0.0327616 0.122739 -0.0109048 -0.114655 -0.054594 -0.00356454 0.200285 -0.158627 0.0805997 -0.144985 -0.00424135 -0.00225035 -0.100116 0.0428944 -0.0196632 0.0418009 -0.0324895 0.0701024 -0.0461295 -0.0104504 -0.0124935 0.0834062 0.0177749 0.0481094 -0.0112848 0.0779696 -0.0275781 -0.0475064 0.0125299 -0.028637 0.0605356 0.0197534 -0.000495924 0.0838325 0.118572 -0.164707 -0.125908 -0.0294107 -0.0380409 -0.0489464 0.0633772 0.0412173 0.00506009 -0.0385209 0.0165089 0.070555 -0.0355386 0.204727 -0.158159 -0.00989259 -0.0907206 0.172636 -0.000719707 -0.00129187 0.0731674 0.144288 -0.109265 0.029014 0.0361804 0.0133182 -0.108363 -0.138487 -0.00207406 0.12852 0.0136792 0.0705071 0.0701998 0.0956095 -0.00323668 -0.0265584 -0.00569742 -0.130451 
0.112283 0.0292237 -0.0710757 -0.0394535 0.136658 0.206876 0.0706088 -0.0529089 -0.0989116 -0.113051 -0.0203363 0.124912 0.0566151 -0.116206 -0.0306842 -0.046109 -0.033997 -0.00230066 -0.12153 0.162027 0.0732842 0.0693894 0.0228366 0.0960293 -0.0648731 0.0484979 -0.0624574 -0.170094 0.0203489 0.0527533 -0.0221581 0.0757445 -0.101586 0.129262 0.032459 0.0197197 0.0240641 0.129459 -0.0410979 -0.0396534 0.103728 -0.0133394 0.00177812 0.0883984 -0.176138 0.0306953 0.167792 0.0299196 -0.145228 0.105583 0.0259205 -0.0680906 -0.0656743 0.043678 0.173334 -0.0324231 -0.065324 0.199589 -0.050818 -0.117308 -0.0761347 0.0309951 0.224697 -0.15327 0.113333 -0.100625 0.0216891 0.0178793 -0.0991575 0.073697 0.0123515 0.0552553 0.00138413 0.0816583 0.00736818 0.0114652 -0.0533719 0.0384404 0.0527414 0.0354658 0.0231512 0.111294 0.0276521 -0.051016 -0.0283753 -0.0850744 0.104875 0.0579623 -0.0197603 0.101133 0.130535 -0.170917 -0.0701812 -0.00472271 -0.0511419 -0.0454523 0.0776498 0.0391344 0.00992355 -0.0293575 -0.0243357 0.0764499 -0.0601028 0.159409 -0.180345 0.0315172 -0.12505 0.111075 -0.0500527 -0.0140891 0.121188 0.145387 -0.10126 0.0569809 0.0247625 0.0176823 -0.121857 -0.146084 -0.0369588 0.112953 0.051036 0.035436 0.0847303 0.0409906 0.000895098 0.0226946 -0.00149383 -0.108963 
0.117652 0.040226 -0.0684124 -0.031682 0.150148 0.202339 0.0686041 -0.0679454 -0.117385 -0.100544 -0.0196252 0.123019 0.0535769 -0.0997957 -0.0407817 -0.0271984 -0.0153466 0.0144298 -0.104498 0.160689 0.0884359 0.0685654 0.0230375 0.09709 -0.053754 0.0584448 -0.0660423 -0.168746 0.0433518 0.0708719 -0.035715 0.0900188 -0.108414 0.116552 0.0359789 0.0158702 0.0198693 0.130634 -0.017189 -0.0473649 0.0890883 -0.00199735 0.0104236 0.0712245 -0.168802 0.0486896 0.177237 0.0217417 -0.150389 0.0855509 0.040336 -0.0392602 -0.0644317 0.04392 0.179501 -0.036844 -0.0361202 0.200082 -0.0456775 -0.111649 -0.0621626 0.0303402 0.224377 -0.154817 0.121378 -0.102458 0.0124324 0.0235211 -0.0908708 0.0917662 0.0141539 0.0683483 -0.006484 0.07523 0.00328757 0.0141815 -0.0437794 0.0589776 0.0466123 0.0209051 0.0268772 0.130759 0.0327767 -0.0467881 -0.0211073 -0.0880972 0.0982063 0.0648858 -0.0221372 0.0967876 0.125496 -0.156013 -0.0741746 0.00536388 -0.04602 -0.0530817 0.0864209 0.055726 0.0211333 -0.0297132 -0.0160249 0.0857173 -0.0576732 0.172447 -0.180689 0.0344086 -0.116354 0.10731 -0.0309851 -0.021741 0.113073 0.142447 -0.100195 0.0569808 0.0382266 0.0226578 -0.128996 -0.150139 -0.0482614 0.109139 0.0426703 0.040522 0.0899686 0.0234593 -0.00772641 0.0448911 -0.0025765 -0.109595 
0.100749 0.0488498 -0.0570685 -0.0382315 0.135839 0.223795 0.0627872 -0.0636623 -0.131702 -0.0911675 -0.0185198 0.121059 0.0572218 -0.119281 -0.00995791 -0.0520528 -0.043988 0.0312709 -0.0874432 0.142557 0.0903275 0.0602727 0.0248379 0.128161 -0.0399238 0.0342787 -0.071603 -0.188258 0.0473392 0.0797523 -0.0144445 0.0666058 -0.106687 0.111339 0.049567 0.025563 -0.00144256 0.0946885 -0.0214777 -0.0336055 0.0931407 -0.0291525 -0.0028322 0.0922705 -0.177275 0.0448531 0.191351 0.025155 -0.17541 0.0834714 0.0348272 -0.0487631 -0.0489946 0.0196301 0.153972 -0.00918916 -0.048025 0.212254 -0.0496684 -0.108336 -0.0740787 0.0482021 0.229098 -0.157168 0.116334 -0.0991467 0.0185829 -0.00400325 -0.119511 0.0921539 0.00352605 0.0654232 -0.0294081 0.0665612 0.012302 0.00943213 -0.0651022 0.039346 0.0636987 0.0533062 0.00284223 0.113085 0.0219871 -0.0459194 -0.032748 -0.0765064 0.0962418 0.0314675 -0.0320474 0.0996234 0.126484 -0.146944 -0.0615557 -8.99427e-05 -0.054911 -0.0565136 0.0653803 0.0701924 0.0181272 -0.0352981 -0.0150053 0.0854006 -0.056323 0.154448 -0.178828 0.0487492 -0.111212 0.112422 -0.0331664 -0.0162849 0.117649 0.127451 -0.104282 0.0221569 0.02855 0.0411531 -0.120233 -0.150882 -0.0215452 0.142002 0.0625867 -0.0027745 0.054301 0.0267869 -0.028531 0.0522933 0.00139955 -0.0958172 
0.100682 0.0468619 -0.0528826 -0.0459543 0.148079 0.224592 0.0854008 -0.0630321 -0.136839 -0.0828364 -0.0195335 0.109576 0.0648618 -0.0954985 0.00357351 -0.06686 -0.0478623 0.0311013 -0.0770737 0.134705 0.101029 0.0545939 0.013967 0.100362 -0.0352377 0.0324619 -0.103935 -0.184426 0.0692855 0.087796 -0.0119688 0.0784554 -0.124144 0.0950554 0.0664038 0.030584 -0.0148272 0.0964995 -0.00358698 -0.0524891 0.0948945 -0.0173026 -0.0249325 0.0792137 -0.185449 0.0613716 0.171753 0.0320564 -0.17568 0.0517025 -0.000467066 -0.0245399 -0.0403687 0.0105954 0.13753 -0.00881739 -0.0522308 0.224148 -0.0788061 -0.0935959 -0.0695141 0.0592725 0.241125 -0.153679 0.12196 -0.0709163 0.0214085 0.00853381 -0.112908 0.0846095 0.0181357 0.0762501 -0.0310812 0.063186 -0.00314825 0.0141653 -0.0687219 0.010874 0.0768061 0.0482145 -0.00597749 0.106504 0.0163894 -0.0451383 -0.0252297 -0.0891699 0.100636 0.0366177 -0.0269014 0.0921876 0.155034 -0.133603 -0.0516552 0.00823904 -0.0593083 -0.0830609 0.0698031 0.0679372 0.0225403 -0.0287445 -0.00477537 0.0876777 -0.0571493 0.134037 -0.188855 0.0714186 -0.0894405 0.115097 -0.00604306 -0.00567914 0.121954 0.108123 -0.128359 0.0150669 0.0479609 0.0496287 -0.118403 -0.144811 -0.00965081 0.14145 0.0532168 -0.0156828 0.044235 0.0344207 -0.0309573 0.0618691 0.00670342 -0.0893783 
0.0825273 0.0686172 -0.0270886 -0.0391706 0.132867 0.227081 0.0891678 -0.112818 -0.172351 -0.0508341 -0.0377748 0.0923471 0.0604546 -0.0510372 0.0473071 -0.0756037 -0.0552897 0.0464976 -0.013321 0.0788655 0.0742716 0.0556708 0.00674823 0.0624393 -0.0012078 0.0504345 -0.14647 -0.176729 0.0745891 0.120347 -0.0107152 0.128963 -0.12109 0.0654729 0.102878 0.0283045 -0.017164 0.0795662 0.0584645 -0.0675445 0.0860858 -0.0329338 -0.00476736 0.0248573 -0.183725 0.0989472 0.171557 0.0179427 -0.194032 -0.00125555 -0.000223613 0.0079566 0.0274355 0.00980768 0.117992 0.00816583 -0.0138876 0.213191 -0.09934 -0.0736097 -0.0654709 0.0900007 0.214444 -0.164925 0.139904 0.00937256 0.0247299 0.0069644 -0.137032 0.0820324 0.0188012 0.0813171 -0.0589844 0.0618001 0.00865354 0.0324331 -0.0764487 -0.0719885 0.0894675 0.0518449 -0.00684469 0.108612 0.0148436 -0.0318551 -0.0181709 -0.108972 0.0789483 0.00716383 -0.0395023 0.0972949 0.150166 -0.0926356 -0.0093999 0.0283293 -0.0800805 -0.0878984 0.0813351 0.104414 0.0546142 -0.0217529 0.0151816 0.0979097 -0.048384 0.115279 -0.186294 0.0861406 -0.0506426 0.109657 0.00583001 0.00857961 0.117935 0.0704121 -0.133217 -0.0318625 0.0571044 0.0552322 -0.120881 -0.124939 0.00749451 0.142098 0.0841186 -0.0670302 0.0374983 -0.00740617 -0.0248212 0.0917025 0.0311955 -0.0696555 
0.111605 0.0317618 -0.04526 -0.0440463 0.143455 0.216243 0.0731919 -0.0504434 -0.173311 -0.0804661 -0.0284212 0.0989767 0.0661756 -0.093327 0.014346 -0.0626251 -0.0261545 0.0396911 -0.0561674 0.142479 0.0941258 0.0484715 0.0389311 0.100372 -0.0348637 0.0443989 -0.0946035 -0.19573 0.064622 0.0682582 -0.0232116 0.084108 -0.116791 0.10317 0.0617987 0.0159397 -0.00991165 0.118063 0.00177768 -0.065222 0.0868731 -0.0174882 -0.0205139 0.0683991 -0.191883 0.0652065 0.180141 0.0250487 -0.191061 0.0620837 0.00505271 -0.0366381 -0.0247729 0.0185499 0.132168 -0.0200361 -0.015342 0.211445 -0.0603373 -0.108955 -0.0591822 0.0681266 0.225945 -0.153718 0.12266 -0.0561591 0.0163075 0.00984694 -0.108573 0.0792574 0.000502653 0.068341 -0.0356686 0.0696714 -0.00360983 0.000938334 -0.067473 0.00818302 0.089254 0.0452294 -0.0193927 0.105874 0.00933827 -0.0650382 -0.0182146 -0.0939749 0.0923626 0.0429335 -0.0201026 0.0877426 0.164846 -0.11559 -0.0471118 0.00697237 -0.0554649 -0.0738379 0.0818802 0.0957487 0.0167145 -0.0398577 -0.00804032 0.0869067 -0.05223 0.147996 -0.177817 0.060307 -0.0860935 0.11185 0.00243587 -0.0216813 0.117509 0.127208 -0.117123 0.00817837 0.0539259 0.0423213 -0.122742 -0.163502 -0.00796119 0.134552 0.0468936 -0.0154162 0.0525758 0.0268958 -0.0296947 0.0521785 0.0137208 -0.0960642 
0.0771424 0.064536 -0.0352533 -0.0224383 0.132812 0.203506 0.064607 -0.154539 -0.182275 -0.0337528 -0.0177727 0.0812848 0.044519 -0.00199619 0.050777 -0.0606256 -0.0195095 0.0545165 0.0633184 0.0727151 0.0587355 0.0568645 0.0158005 0.058169 0.0152141 0.0868191 -0.131357 -0.171265 0.103377 0.126145 -0.00295126 0.118606 -0.109876 0.0145179 0.11535 0.0582093 -0.0270441 0.0803442 0.089775 -0.0682848 0.0510612 0.00585851 -0.0300601 0.0123141 -0.178681 0.127062 0.170066 0.0182231 -0.167523 -0.0405066 -0.0161857 0.0580321 0.0471176 -0.0034037 0.113327 0.00940294 0.017883 0.22446 -0.0984912 -0.040509 -0.0627766 0.0870031 0.236225 -0.16393 0.152822 0.0126976 0.034984 0.00420351 -0.108421 0.106696 0.0313653 0.0994443 -0.0648104 0.0628542 0.00372817 0.0144871 -0.0753086 -0.0485032 0.0811421 0.0323213 -0.00594855 0.130924 0.0071699 -0.0384178 0.00320992 -0.135142 0.0541008 0.0090285 -0.0469479 0.0654195 0.156885 -0.0342688 0.00886738 0.0417478 -0.0363446 -0.119534 0.0989545 0.124038 0.0744705 -0.0309569 0.0076182 0.10628 -0.0402197 0.076303 -0.186554 0.107931 -0.00273666 0.0626905 0.061271 0.0233264 0.114346 0.0561754 -0.108875 -0.0411031 0.0690745 0.0574071 -0.106867 -0.144751 -0.00197781 0.123444 0.0675792 -0.0774866 0.032269 -0.0257292 -0.0566844 0.130399 0.0410635 -0.0398435 
0.126835 0.052353 -0.11987 -0.0427039 0.161228 0.196655 0.0546908 -0.0752468 -0.14875 -0.0696462 -0.00931118 0.0989722 0.079961 -0.0764053 -0.0424917 -0.0361651 -0.00847454 0.0353182 -0.0836827 0.170341 0.0936481 0.0329336 0.0588549 0.0726413 -0.0351951 0.0351052 -0.0663911 -0.175545 0.056733 0.087652 -0.030637 0.0876828 -0.109535 0.0864617 0.0221582 0.0171295 -0.0237063 0.128434 -0.011716 -0.0486772 0.0494885 0.000101199 -0.0198346 0.108039 -0.192717 0.0684421 0.181198 0.0527638 -0.149365 0.082388 0.0328225 5.1357e-05 -0.073943 0.0181617 0.131867 -0.0523653 -0.00885062 0.20249 -0.0136591 -0.115382 -0.0567065 0.0386993 0.241395 -0.127846 0.0894785 -0.122188 0.00901791 0.0548938 -0.0677881 0.0958463 0.0273114 0.0900491 -0.0112355 0.0615728 -0.0182035 0.000735417 -0.0624635 0.048841 0.0416049 0.0446643 0.00516739 0.109314 0.00793777 -0.0508792 -0.0296861 -0.073436 0.0800665 0.0501901 -0.0006738 0.0567993 0.122879 -0.126897 -0.073172 -0.0177238 -0.0381684 -0.098742 0.0756594 0.0942483 0.00854413 -0.060676 -0.0105026 0.0974662 -0.0281993 0.172559 -0.19479 0.043252 -0.126173 0.14305 0.0216687 -0.0129087 0.12369 0.141918 -0.119405 0.0645435 0.0197279 0.0333899 -0.120528 -0.15581 -0.0169671 0.123969 0.0184108 0.0262849 0.0644041 0.0378202 -0.0446516 0.0184428 -0.0159323 -0.0777297 
0.116599 0.0381869 -0.0809517 -0.0368729 0.136162 0.22069 0.0425631 -0.0951227 -0.183658 -0.0542969 -0.00361541 0.0779583 0.0861919 -0.0399328 -0.0147307 -0.0280932 -0.0214065 0.0537447 -0.0231562 0.131152 0.130988 0.0159892 0.0633971 0.091272 -0.0118085 0.0504449 -0.102314 -0.202304 0.0812287 0.110487 -0.0226757 0.0847966 -0.123078 0.0575287 0.0598639 0.0381996 -0.0557895 0.121963 0.0321924 -0.0631479 0.0117286 0.00353567 -0.0427174 0.0646627 -0.168268 0.0673422 0.185583 0.0428581 -0.179164 0.0331664 0.015538 0.0196916 -0.0152143 0.0108077 0.122459 -0.0256006 0.0300442 0.225001 -0.04551 -0.112808 -0.0463417 0.0757128 0.256981 -0.148429 0.118849 -0.0579797 0.00613352 0.0511179 -0.0866845 0.108253 0.0192121 0.103318 -0.0543533 0.0422982 -0.0181437 -0.00166608 -0.0628473 0.00352331 0.0750789 0.0643649 -0.00772388 0.0917525 0.00224109 -0.0716957 -0.0412296 -0.086029 0.0662651 0.0341548 -0.00731886 0.0544668 0.145638 -0.0887713 -0.0360081 0.0221015 -0.0433834 -0.10463 0.0771781 0.13314 0.0297298 -0.041039 0.0288945 0.103583 -0.0548513 0.130454 -0.174929 0.0819802 -0.0799662 0.0991037 0.0468137 -0.0238063 0.104948 0.120781 -0.106222 0.00710888 0.0656318 0.0852894 -0.124433 -0.134105 -0.0166909 0.13913 0.0178831 -0.0392229 0.0538572 0.000637581 -0.0665718 0.091106 0.0112232 -0.0563944 
0.090073 0.0858619 -0.0888809 -0.00669105 0.128797 0.195114 0.0489645 -0.168309 -0.144033 -0.0291058 0.021904 0.0538158 0.084419 0.00753104 -0.0268694 -0.0246483 -0.000928244 0.0938315 -0.00348609 0.101499 0.128891 -0.0127063 0.0544227 0.0927652 0.0145625 0.0226934 -0.135541 -0.175963 0.126158 0.162209 0.00875627 0.118703 -0.102589 0.012149 0.0906547 0.0565769 -0.0601753 0.114727 0.0526188 -0.0860223 -0.019521 0.0102021 -0.0501792 0.0461752 -0.149983 0.0854671 0.170225 0.0635806 -0.160514 -0.0224223 -0.0119064 0.0928345 0.0213977 -0.0259034 0.0990904 -0.000647298 0.0373841 0.213961 -0.0490779 -0.0933459 -0.0674135 0.0796918 0.260649 -0.151215 0.117295 -0.0246515 0.0121824 0.0324583 -0.116149 0.130605 0.0331811 0.0950852 -0.0699188 0.0308932 -0.0252274 -0.00620687 -0.0543895 -0.00494604 0.0557157 0.0364314 -0.0149352 0.109021 -0.0277114 -0.0655548 -0.01767 -0.0842142 0.0165148 0.00413755 -0.0159399 0.0494411 0.147666 -0.0600721 -0.00475424 0.0148845 -0.0104774 -0.133736 0.0558146 0.154558 0.0536333 -0.0397409 0.0583921 0.111595 -0.0388629 0.105956 -0.168224 0.110154 -0.0263542 0.078986 0.11798 -4.7154e-06 0.0759254 0.088688 -0.111046 -0.00667618 0.0703299 0.0888919 -0.109747 -0.120011 0.0114731 0.146674 0.0143704 -0.0598374 0.0161822 -0.00436696 -0.098334 0.12433 0.02333 -0.0370984 
0.0740672 0.101432 -0.0571856 0.00240219 0.134909 0.223509 0.0517462 -0.182494 -0.160881 -0.0426425 0.00718249 0.0608721 0.0718593 -0.0156329 -0.0115826 -0.04035 -0.0224538 0.10974 -0.0166849 0.0850425 0.113476 -0.00311297 0.0482637 0.0899535 0.0221543 0.00683773 -0.161665 -0.163069 0.106375 0.14739 0.01905 0.12354 -0.123088 0.0253683 0.105324 0.0569419 -0.0617131 0.0685783 0.056922 -0.0810157 0.0227643 -0.00802518 -0.0192854 0.0337348 -0.160566 0.0765516 0.179042 0.0620668 -0.178443 -0.0130092 0.00201759 0.0621126 0.0229211 -0.0248177 0.0876345 0.00821507 0.0249023 0.211423 -0.0473779 -0.0844897 -0.0686516 0.121418 0.239708 -0.159165 0.129113 -0.00740229 0.0125224 0.00443666 -0.145649 0.140387 0.029179 0.094056 -0.0530497 0.0445644 -0.0181876 0.00560286 -0.0645777 -0.0317837 0.056609 0.0286009 -0.00783775 0.112104 -0.0135402 -0.047763 -0.0342906 -0.0699437 0.0229561 -0.00807928 -0.0489175 0.0701031 0.154137 -0.0683577 0.00475813 0.0128483 -0.0347052 -0.119185 0.0482603 0.157959 0.0428303 -0.0258235 0.0499845 0.117799 -0.0401678 0.11204 -0.144811 0.112751 -0.0226549 0.101382 0.0798021 0.0187656 0.076576 0.0732964 -0.101321 -0.00687925 0.048603 0.0694638 -0.117188 -0.0930178 0.0168628 0.149541 0.0352373 -0.0762226 0.00584976 -0.0226198 -0.0859546 0.12507 0.0160233 -0.0440373 
0.0437694 0.115739 -0.062763 0.0144978 0.123378 0.191493 0.0198482 -0.203076 -0.16 -0.0291206 -0.00307243 0.0389138 0.0659536 0.00403524 0.00816116 -0.022411 -0.000909382 0.117924 0.0223032 0.0792287 0.0980488 -0.0227033 0.0706358 0.0810932 0.0409456 0.013117 -0.168527 -0.168155 0.115466 0.145129 0.0474931 0.152907 -0.0806559 -0.00101203 0.116496 0.0733791 -0.048697 0.0760522 0.0617296 -0.0961478 0.00772413 -0.00387314 -0.0033396 0.0280297 -0.153878 0.0982732 0.200636 0.0586178 -0.17849 -0.0352994 -0.0141293 0.0626358 0.0627584 -0.044163 0.0710559 0.0203257 0.051111 0.181952 -0.0236975 -0.0965052 -0.0830877 0.130141 0.21311 -0.158959 0.131504 0.021125 0.0147037 -0.00848355 -0.1477 0.128624 0.0174965 0.0771962 -0.0697938 0.0336566 -0.0044764 -0.00335489 -0.0791022 -0.0357426 0.0508144 0.0256769 -0.0200151 0.127438 -0.0453154 -0.0516147 -0.0161652 -0.0648097 -0.0154953 -0.0208979 -0.0528431 0.0579396 0.142156 -0.0246188 0.0137379 -0.00507393 -0.00772802 -0.110543 0.0446855 0.205677 0.0313794 -0.041202 0.0410294 0.0938177 -0.0180453 0.0953336 -0.149101 0.119734 -0.00327277 0.0862 0.117882 0.0245263 0.051533 0.0673873 -0.0963976 -0.0368614 0.0421145 0.0532473 -0.115217 -0.124722 0.0325879 0.148531 0.046434 -0.0753288 -0.00267082 -0.0234712 -0.105054 0.117646 0.0255204 -0.0277911 
0.0546271 0.102978 -0.0903562 0.00448449 0.116436 0.189616 0.0327406 -0.192292 -0.179959 -0.00379297 -0.0200224 0.0468934 0.084093 -0.0138592 0.0145988 -0.0140682 0.000642548 0.10269 0.0372424 0.0956559 0.0813643 -0.0269221 0.049582 0.0865387 0.0213654 0.0425098 -0.161695 -0.195798 0.0931518 0.159151 0.0148143 0.169744 -0.085913 0.00917135 0.112765 0.064877 -0.0240367 0.0718162 0.0644463 -0.108864 0.0060269 -0.0324917 0.0289595 0.039625 -0.14455 0.114557 0.223526 0.0677475 -0.188999 -0.0248311 0.0119871 0.0214513 0.0637409 -0.0334154 0.107564 0.0188334 0.0360418 0.17374 -0.00120994 -0.108836 -0.0645792 0.115043 0.206311 -0.163696 0.129287 0.0171189 0.00430929 -0.00678008 -0.135458 0.0816274 -0.00621036 0.0707662 -0.078562 0.0271787 -0.00282222 0.00590855 -0.0672981 -0.0150607 0.0733084 0.0312601 0.000373884 0.117699 -0.0617169 -0.0547436 -0.020275 -0.0675254 -0.01017 -0.025399 -0.0247524 0.0735532 0.122656 -0.0240278 0.00527776 -0.0103528 -0.0349399 -0.0789306 0.0668871 0.198464 0.0460049 -0.0547333 0.0530222 0.095183 -0.00873851 0.0923643 -0.166881 0.096616 -0.0362076 0.0947349 0.0735793 0.0405767 0.062017 0.0723711 -0.0932379 -0.0647218 0.0293729 0.0504819 -0.114721 -0.141115 0.00897622 0.131708 0.0554537 -0.0779925 0.0339976 -0.0125923 -0.113668 0.104754 0.0125899 -0.0479713 
0.037085 0.102096 -0.0669806 0.00698317 0.0748712 0.222931 0.034938 -0.182189 -0.146271 -0.00751875 0.00888371 0.0353697 0.0761414 -0.0476228 -0.00473005 -0.0379845 -0.0615241 0.115753 0.0273831 0.0471404 0.111442 -0.0331591 0.0317656 0.0882344 0.022856 0.0340402 -0.166708 -0.207137 0.104332 0.150999 0.0396869 0.139739 -0.101663 -0.00363122 0.126783 0.0537193 -0.0678697 0.0510748 0.0703189 -0.090213 0.0173837 -0.0606186 -0.0253807 0.0604517 -0.138678 0.0586419 0.192037 0.0631176 -0.192692 -0.051029 -0.00452816 0.0545856 0.0766986 -0.0420852 0.0739535 0.041678 0.0456078 0.173247 -0.0273304 -0.115308 -0.0699833 0.12013 0.236119 -0.13917 0.118503 0.0235745 0.0306279 -0.0287727 -0.131779 0.10405 -0.0125035 0.0645754 -0.0817247 0.0278271 -0.00744003 -0.0213874 -0.0944443 -0.0439103 0.0624693 0.0657408 -0.0183155 0.101726 -0.0374743 -0.0534193 -0.0402679 -0.0573797 0.0120051 -0.0381803 -0.0309661 0.0586004 0.137276 -0.0281575 0.0103075 -0.000816798 -0.0557791 -0.101902 0.0455914 0.185391 0.0499095 -0.0371012 0.0830401 0.103157 -0.0220435 0.0731744 -0.123384 0.104034 4.11533e-05 0.0937327 0.0755766 0.0407519 0.0640454 0.0625965 -0.104639 -0.0907057 0.0499472 0.0764894 -0.116826 -0.117933 0.0470202 0.128568 0.0656359 -0.121993 0.00631776 -0.0368451 -0.105205 0.131609 0.0248644 -0.00779353 
-4.51752e-05 0.104724 -0.0636579 0.00366532 0.0809052 0.202403 0.00954257 -0.195997 -0.120226 -0.0027313 0.0157684 0.0337937 0.0683326 -0.00795759 0.0244071 -0.030245 -0.0585904 0.114411 0.0549611 0.0318491 0.107995 -0.0360462 0.0523368 0.0801547 0.0453674 0.0299393 -0.153594 -0.20716 0.113155 0.155348 0.0750855 0.120479 -0.0534897 -0.0318129 0.131673 0.0914587 -0.0695643 0.0477541 0.0545791 -0.0795391 0.0105828 -0.0408478 -0.0328994 0.070692 -0.149303 0.0770705 0.191579 0.045922 -0.173546 -0.0874422 -0.0296028 0.0514976 0.0880794 -0.0630749 0.0650873 0.0749374 0.0399658 0.182307 -0.0340704 -0.0881122 -0.0941991 0.102589 0.22972 -0.137735 0.151207 0.0249606 0.0225451 -0.0217902 -0.126739 0.124063 0.0130508 0.0725289 -0.093228 -0.0176486 0.01138 0.000365366 -0.114133 -0.0355477 0.0394489 0.0490804 -0.0387505 0.106771 -0.0450711 -0.0295662 -0.0511564 -0.0530366 0.0102899 -0.0425907 -0.0541412 0.0464041 0.117953 -0.0176167 0.0126356 -0.00993975 -0.031257 -0.109772 0.0201548 0.192822 0.0537514 -0.0287838 0.0620743 0.0809958 -0.0172689 0.0305598 -0.128853 0.123364 0.0102389 0.0619314 0.0971795 0.027482 0.0392834 0.0374778 -0.100627 -0.102838 0.0541974 0.0839027 -0.114507 -0.124606 0.0489632 0.147613 0.0762905 -0.124148 -0.0294933 -0.0290643 -0.106601 0.152179 0.0308412 0.0256632 
-0.00762159 0.0984285 -0.0630753 0.0100672 0.0693661 0.2125 -0.000699919 -0.211867 -0.0890978 -0.0166436 0.0222369 0.0287605 0.0555174 0.022064 0.0232865 -0.0324656 -0.0778302 0.106399 0.0578222 0.0021689 0.110447 -0.0266609 0.0274986 0.0908128 0.067344 0.0231615 -0.143331 -0.186501 0.0980076 0.164586 0.0874433 0.105165 -0.066786 -0.051046 0.122042 0.118661 -0.0966694 0.00374469 0.0489059 -0.0637803 0.011041 -0.0282424 -0.0326586 0.0798287 -0.12626 0.0634361 0.179257 0.0425662 -0.153177 -0.104281 -0.0226784 0.0518597 0.10173 -0.0712377 0.0734792 0.0933042 0.0157363 0.209086 -0.0215863 -0.0881644 -0.0946313 0.113497 0.233833 -0.123338 0.131568 0.043861 0.0350784 -0.0179779 -0.118369 0.14351 0.0295265 0.0893997 -0.0805044 -0.0365949 0.0128398 0.00624276 -0.11942 -0.055172 0.0161793 0.0466311 -0.00621267 0.120351 -0.040923 -0.0405062 -0.06372 -0.0415849 0.0129731 -0.0569873 -0.0702473 0.046921 0.10951 -0.0233641 0.0107551 -0.0112793 -0.0314974 -0.0897159 0.0051392 0.168927 0.0708796 -0.0147619 0.0636603 0.0773723 -0.00788111 -0.00088894 -0.14866 0.136882 -0.00365216 0.0339503 0.0681298 0.0308508 0.0569176 0.0257415 -0.097486 -0.113451 0.0514916 0.0929206 -0.108551 -0.102368 0.0483004 0.131292 0.0880741 -0.136802 -0.0252291 -0.041815 -0.112397 0.172084 0.0310756 0.0453547 
0.0456879 0.0559818 -0.0730497 -0.0114351 0.110009 0.231272 0.0322368 -0.146427 -0.112059 -0.0487902 0.0165614 0.0676184 0.0772601 -0.071656 -0.0385055 -0.0391051 -0.103864 0.117517 -0.031647 0.076708 0.166666 -0.0404946 0.0565124 0.110291 0.0166272 0.0108237 -0.133346 -0.2358 0.0669437 0.136364 0.0415022 0.0593167 -0.112522 0.0167741 0.113785 0.0633371 -0.100461 0.0471277 0.0248835 -0.0757634 0.0263971 -0.0368529 -0.0430446 0.120886 -0.161371 0.0273382 0.18971 0.0554978 -0.167173 -0.00881416 -0.0127396 0.00380165 0.0128837 -0.0291077 0.0977533 0.0333337 0.0189808 0.208364 -0.0400591 -0.12014 -0.052572 0.0857399 0.269759 -0.109728 0.12888 -0.0652838 0.00243999 0.00945995 -0.094051 0.143401 0.0221594 0.102137 -0.0642134 -0.0110107 -0.0342874 -0.0108322 -0.109466 0.00598405 0.0486525 0.0701357 -0.0380787 0.0999276 -0.0231347 -0.0411113 -0.0938227 -0.0385001 0.0616682 0.00366742 -0.0287315 0.041659 0.13654 -0.0765902 -0.0183897 -0.0281823 -0.0634812 -0.111803 0.0053076 0.15916 0.0363761 -0.0257922 0.0634808 0.0860305 -0.0353672 0.0660492 -0.104009 0.0911343 -0.0490366 0.107117 0.0426083 0.0193528 0.0571461 0.0735963 -0.113612 -0.0512339 0.0593273 0.11184 -0.110213 -0.11295 0.0244901 0.152822 0.0501436 -0.0749973 -0.0108831 -0.00869187 -0.109714 0.116719 0.00737934 0.00674172 
0.0160738 0.0724544 -0.0712712 0.0105984 0.101289 0.214924 0.00228819 -0.187931 -0.11401 -0.0182594 0.00315994 0.0445379 0.0756248 -0.0189791 0.0166838 -0.0212739 -0.073218 0.103927 0.0370257 0.0601627 0.129265 -0.0496546 0.0589542 0.117702 0.0591953 0.0197641 -0.150009 -0.2265 0.0792612 0.155698 0.0738698 0.0991227 -0.0794744 -0.0194733 0.117683 0.104259 -0.0845383 0.0218412 0.0426086 -0.0870603 0.0165234 -0.0386735 -0.016282 0.0812487 -0.143153 0.0593016 0.204141 0.0583975 -0.150938 -0.0542322 -0.00943371 0.00883891 0.0853711 -0.0582071 0.103382 0.0608248 0.0292244 0.194146 -0.00569179 -0.11739 -0.07858 0.108246 0.225557 -0.133718 0.128781 0.0109353 0.0159487 -0.00147559 -0.108882 0.118521 0.0101963 0.109727 -0.0895503 -0.0320348 0.00472176 0.00837232 -0.112399 -0.0134473 0.0515133 0.0773114 -0.0162856 0.111453 -0.041689 -0.038304 -0.059573 -0.0379365 0.0213825 -0.0171199 -0.0442869 0.0409604 0.113371 -0.0194355 0.00594852 -0.0154592 -0.0583324 -0.0959475 0.00952912 0.189645 0.0541446 -0.0431763 0.0728924 0.0660162 -0.0119936 0.0264409 -0.138597 0.112763 -0.032143 0.0615848 0.0680296 0.0429824 0.0440034 0.0574602 -0.098004 -0.101631 0.048711 0.103512 -0.122644 -0.113561 0.0126068 0.148491 0.0725687 -0.101809 -0.0127101 -0.0228325 -0.136231 0.149386 0.0113903 0.0285205 
0.0519885 0.0380874 -0.0682418 0.0276084 0.117344 0.189612 0.0514463 -0.11841 -0.106614 -0.0203245 0.0126627 0.082396 0.084558 -0.127008 -0.0536497 -0.0288573 -0.132527 0.140198 -0.0489223 0.110102 0.186869 -0.0659186 0.0397765 0.151969 0.0334923 -0.0321986 -0.144959 -0.262582 0.0463312 0.176418 -0.00153323 0.0423806 -0.109191 0.0255963 0.100776 0.0179393 -0.110604 -0.0140125 -0.00231877 -0.0915901 0.0352634 -0.0737331 -0.000391979 0.155747 -0.164073 0.0102354 0.207807 0.0505223 -0.135855 0.0158283 0.0469084 -0.0368157 0.00349627 -0.0309043 0.127903 0.0192793 0.0205334 0.13709 0.0130867 -0.12136 -0.0131811 0.0512353 0.207125 -0.0487293 0.0817912 -0.123145 -0.0147797 -0.0264723 -0.0690566 0.0826567 0.00908014 0.118724 -0.052037 -0.0470994 -0.0456146 0.0111339 -0.108824 0.0499706 0.0503928 0.120657 -0.00840558 0.0864535 -0.0213213 -0.00434175 -0.075333 0.0180659 0.0623809 0.0050695 -0.0200307 0.0353926 0.0831957 -0.0557438 -0.0648652 -0.0474187 -0.140863 -0.10887 -0.0316557 0.146772 0.050824 -0.0608167 0.0958472 0.0722042 0.0228715 0.0618265 -0.0926929 0.0480557 -0.0673299 0.162218 0.0241909 0.0535693 0.0513712 0.0643609 -0.122097 -0.0870009 0.0170425 0.128535 -0.0991518 -0.089748 -0.0254015 0.142049 0.0317731 -0.0440807 -0.0249691 -0.00536467 -0.129729 0.111807 -0.00367182 0.0180921 
0.112289 0.0694202 -0.118619 0.0074642 0.154872 0.243986 0.0455822 -0.0776897 -0.144352 -0.0404006 0.0026016 0.0633153 0.10676 -0.138006 -0.0627514 0.00450046 -0.0138217 0.119076 -0.099033 0.135821 0.173721 -0.0311922 0.0762458 0.11268 0.00113325 -0.0589127 -0.142886 -0.238249 0.0569537 0.12101 0.0174487 0.084258 -0.139892 0.0619716 0.0579824 0.000522104 -0.0543655 0.0397349 0.0157905 -0.0646717 0.0324395 -0.0293293 -0.00633816 0.113516 -0.171026 0.00569531 0.186295 0.0621155 -0.149999 0.0497642 0.0764924 -0.0351891 -0.0524413 -0.0126339 0.0643417 -0.0344664 0.0499432 0.141599 0.04732 -0.134653 -0.0354898 0.0720786 0.190041 -0.153289 0.0868755 -0.161287 -0.00112033 0.018435 -0.07922 0.0778735 0.0132488 0.117129 -0.0434995 -0.0156887 -0.0652444 0.00236342 -0.0726543 0.0879209 0.028835 0.0943338 -0.00873165 0.0756988 0.00343659 -0.0133178 -0.0410775 0.0249016 0.0604944 0.00742111 -0.0342072 0.0164343 0.0850243 -0.10738 -0.0907253 -0.0228762 -0.0762951 -0.0928869 0.0216742 0.143831 -0.0442397 -0.0254055 0.0558138 0.0929112 -0.0184864 0.185097 -0.103785 0.0246237 -0.0837158 0.168838 0.0183749 0.0325101 0.0302497 0.0801748 -0.0964948 0.0105809 0.00346417 0.0793827 -0.146596 -0.0926755 -0.0484416 0.133814 -0.0110869 -0.00158085 0.014914 0.0198076 -0.0746579 0.0308657 -0.0654426 -0.0440071 
0.0211341 0.0370254 -0.113375 0.0214037 0.15637 0.161069 0.00745856 -0.163972 -0.108053 -0.0126924 -0.00474341 0.10386 0.0710046 -0.0773003 -0.0774323 -0.0035006 -0.0828192 0.152607 -0.0209126 0.143033 0.159161 -0.0794735 0.0653717 0.130489 0.03543 0.0115245 -0.124704 -0.244757 0.0445394 0.160393 0.00448348 0.0639355 -0.0839242 -0.0140884 0.0975708 0.0590908 -0.108548 0.0155741 -0.007058 -0.106702 0.0243807 -0.0148149 0.00588618 0.145621 -0.172251 0.0532812 0.231211 0.0502603 -0.128466 -0.00949808 0.0184408 -0.0450009 0.00544019 -0.0510004 0.131366 0.020387 0.0225822 0.159673 0.0197045 -0.120189 -0.0162457 0.0624626 0.227726 -0.0594295 0.117763 -0.114139 -0.0406531 0.018585 -0.0548423 0.0998191 0.0400564 0.127218 -0.0364296 -0.0627373 -0.0437355 0.0351002 -0.118842 0.0744476 0.0362196 0.0432701 -0.0287635 0.140843 -0.0440316 -0.00531381 -0.0838194 -0.00161634 0.0483809 0.0415597 -0.0140783 0.0114993 0.0708543 -0.0299406 -0.0471258 -0.0482006 -0.0743722 -0.104816 -0.0149878 0.168112 0.0369972 -0.0754991 0.0663117 0.0465083 0.018924 0.0485373 -0.120632 0.073456 -0.0728404 0.119083 0.0318156 0.0563798 0.0499078 0.0680548 -0.0878894 -0.0586754 0.00834188 0.0962026 -0.137625 -0.124994 -0.0358282 0.124538 0.0161309 -0.0159423 -0.0186722 -0.0180362 -0.153089 0.126711 -0.0350912 -0.00060857 
0.0713378 -0.0140686 -0.146008 0.0178527 0.190651 0.158435 0.0272547 -0.132166 -0.0702629 -0.0605308 -0.00650882 0.107676 0.0819953 -0.076752 -0.11258 0.00127011 -0.0635993 0.153035 -0.0969455 0.16433 0.183038 -0.0800718 0.0793496 0.14469 0.0225977 -0.0393294 -0.111942 -0.234955 0.0116152 0.140504 0.0133469 0.0725931 -0.120411 0.0175785 0.0597898 0.0469688 -0.114449 0.0137988 -0.0296887 -0.105856 0.0296183 0.0166474 -0.0149053 0.152723 -0.157754 0.0102343 0.183986 0.0790483 -0.0758689 0.033812 0.0114908 -0.075715 -0.0213665 -0.0496467 0.113242 -0.0111147 0.0127686 0.177323 0.0339312 -0.126363 -0.000812886 0.072829 0.219641 -0.0551643 0.0658258 -0.150267 -0.0385829 0.0520227 -0.0332567 0.0945796 0.0370391 0.134588 -0.0138538 -0.0615357 -0.0975761 0.0215773 -0.0846619 0.0766799 0.0129876 0.0442796 -0.00961516 0.13561 -0.0602133 -0.0321107 -0.082351 0.0188321 0.0542162 0.0541346 -0.0211042 -0.00697958 0.101719 -0.0554276 -0.068807 -0.0633274 -0.0528932 -0.0798625 -0.0389508 0.12983 0.00923134 -0.0614629 0.0685556 0.0183778 0.00669998 0.0886647 -0.104989 0.0447825 -0.113564 0.121596 0.0126074 0.0599625 0.0482146 0.0938503 -0.0883466 -0.00379891 -0.00503492 0.103022 -0.128601 -0.102489 -0.0463924 0.119279 -0.0144481 0.040307 -0.0163739 0.0174157 -0.162949 0.067495 -0.0847172 -0.0306639 
0.10414 -0.0136622 -0.179528 0.00279149 0.196185 0.167873 0.0290566 -0.102119 -0.135359 -0.0405824 -0.0269322 0.107946 0.104294 -0.0775179 -0.101322 0.016783 -0.00337254 0.108229 -0.0771722 0.192779 0.150288 -0.0690664 0.112708 0.100245 -0.0085516 -0.00295483 -0.0954058 -0.234106 0.0119709 0.108159 -0.0233649 0.106086 -0.120007 0.0412403 0.0230846 0.0234514 -0.0787076 0.0749105 -0.0196466 -0.096598 0.0311681 0.0239976 -0.0126415 0.120751 -0.192907 0.024296 0.175136 0.0743879 -0.0807788 0.0497945 0.052572 -0.0754808 -0.0454922 -0.0156251 0.114764 -0.0525454 0.0548541 0.155933 0.0616884 -0.129431 -0.00679887 0.0608939 0.200502 -0.0941372 0.0977921 -0.165424 -0.0405215 0.0755951 -0.0207326 0.063786 0.0161444 0.133248 -0.00911623 -0.0272948 -0.0844878 0.0345262 -0.0628786 0.0901985 0.0180023 0.0427315 -0.0105366 0.0933926 -0.0229575 -0.0250534 -0.0601582 -0.00702447 0.0728047 0.0709823 -0.0151896 -0.0225723 0.0772196 -0.064697 -0.0725159 -0.0472747 -0.0545958 -0.0918538 0.0183159 0.140754 -0.0113422 -0.0565865 0.0557894 0.0519954 -0.00129371 0.157936 -0.11341 0.00885377 -0.126372 0.143289 0.00944713 0.044166 0.0412587 0.110898 -0.0687433 0.0355704 -0.0175592 0.0739892 -0.140144 -0.111933 -0.0684498 0.107287 -0.0400716 0.0464619 0.0203374 0.0120047 -0.12604 0.0393935 -0.113923 -0.0491316 
0.0272618 0.0830399 -0.159404 -0.00622451 0.0438238 0.229644 0.0870789 -0.148966 -0.103602 0.0166597 -0.0185322 0.0247843 0.0861606 -0.0121824 -0.0230859 -0.0690356 -0.1129 0.0589367 0.0366204 0.00880493 0.0738053 -0.0833255 -0.00253344 0.0902589 0.0168946 0.00825581 -0.156146 -0.209801 0.040779 0.158828 0.0217873 0.107849 -0.139182 -0.0263747 0.070816 0.0711062 -0.0782557 -0.00855289 0.0141518 -0.0642726 0.0357772 -0.066 0.000458018 0.119935 -0.135865 0.0412831 0.173127 0.0715007 -0.141579 -0.0333736 -0.0192351 -0.0160908 0.06757 -0.0263456 0.116176 0.0741245 0.00292394 0.226881 0.0351563 -0.131912 -0.0537771 0.134867 0.249936 -0.133482 0.0721167 0.0488013 0.0429439 -0.0145764 -0.0675749 0.0724643 -0.0143986 0.118469 -0.0504354 0.0320492 0.00122111 0.00884697 -0.085469 -0.0399679 0.0426845 0.0219994 0.00375752 0.085229 -0.0659554 -0.0643621 -0.0849745 0.000189872 0.0281397 -0.0699565 0.0150279 0.0283173 0.117112 -0.0614619 0.0177999 -0.0998247 -0.0534742 -0.070885 0.0336368 0.143524 0.0905517 -0.00595191 0.0757454 0.0763512 0.0427547 0.0260127 -0.190431 0.0937113 -0.0949828 0.0952402 -0.0564918 0.0701324 0.118507 0.0686927 -0.0690302 -0.138742 0.00731997 0.0944392 -0.0476128 -0.0995157 0.0551909 0.0877862 0.0807418 -0.144667 0.0375106 -0.00182256 -0.173618 0.108923 -0.0531714 0.0260996 
-0.0175353 0.0780069 -0.137927 0.0204858 0.0777802 0.189987 0.0316243 -0.186109 -0.139413 0.0629788 0.00065203 0.0936083 0.0656283 -0.0127303 0.00660214 -0.0195921 -0.0705987 0.0775614 0.107164 0.0453364 0.0534478 -0.0833383 0.0309488 0.0852414 0.0478679 0.0774124 -0.113742 -0.230962 0.0585019 0.162381 0.0380078 0.124698 -0.068634 -0.056458 0.0587207 0.0956132 -0.0809437 0.0106253 0.0421162 -0.0353153 0.0387518 -0.0503157 -0.00154967 0.098457 -0.170967 0.0607647 0.223844 0.00346282 -0.140096 -0.0919401 0.0248684 -0.0150191 0.0462595 -0.0562508 0.11308 0.101881 0.0150453 0.227424 0.011594 -0.0473655 -0.0821061 0.0619981 0.24624 -0.160595 0.176935 0.00621194 0.0116186 -0.0231842 -0.0895354 0.105879 0.00100315 0.154114 -0.0788961 0.0137903 0.0262742 0.0328992 -0.0863302 0.0230044 0.00338584 -0.000677241 -0.0592301 0.100167 -0.0418571 -0.0147297 -0.0968137 -0.0311079 0.0460955 -0.0464318 -0.0241462 -0.0148443 0.0421414 -0.0254936 0.0116545 -0.0483532 -0.0165167 -0.0788305 0.0423111 0.152349 0.0935789 -0.0147243 -0.00210233 0.049997 0.015743 0.0344795 -0.165189 0.112202 -0.0532165 0.0687435 -0.00491918 0.0339188 0.032001 0.0504885 -0.0442495 -0.129315 0.0289967 0.0594022 -0.0728696 -0.13009 0.037379 0.129087 0.0902475 -0.119634 0.00318694 -0.0234519 -0.139451 0.163527 -0.0378022 0.0464468 
0.0194699 0.0489739 -0.128419 0.00672906 0.0664333 0.219236 0.0751586 -0.155926 -0.112433 -0.0186562 -0.0292985 0.0543633 0.0892586 -0.0169391 -0.0444386 -0.0547779 -0.11697 0.0610663 0.0125734 0.0364104 0.108229 -0.102324 0.0158561 0.109891 0.0237527 0.0119166 -0.16282 -0.224838 0.0305165 0.145621 0.0240238 0.111943 -0.139184 -0.0201704 0.0547626 0.0681739 -0.111902 0.00485236 0.00276432 -0.065443 0.0478462 -0.0501202 -0.00584527 0.0965434 -0.124485 0.0331007 0.179782 0.04417 -0.143358 -0.0449236 -0.023256 -0.0510318 0.0802828 -0.0353991 0.111028 0.0683017 0.013212 0.239627 0.0280425 -0.125805 -0.0375272 0.155366 0.234396 -0.119546 0.0879594 0.048649 0.0322238 -0.00674231 -0.0762224 0.0627799 -0.0135775 0.123802 -0.0472556 0.0208585 0.00211394 0.0325016 -0.0866447 -0.0495152 0.0432323 0.040287 -0.0141149 0.0834048 -0.0603391 -0.062383 -0.103882 0.00407153 0.048341 -0.0469692 -0.0239256 0.00575312 0.115305 -0.0520225 0.0248247 -0.0693222 -0.0683192 -0.0556969 0.025345 0.145669 0.0916439 -0.000916986 0.0716994 0.0471758 0.0188411 0.0496252 -0.175108 0.0925255 -0.0926555 0.105654 -0.0562505 0.0457497 0.0933446 0.0764752 -0.0711557 -0.135811 0.0121506 0.115024 -0.0995625 -0.0754337 0.0317468 0.106371 0.0503182 -0.118076 0.00582732 -0.0204836 -0.179937 0.139531 -0.0821153 0.00931121 
0.0328104 0.0946727 -0.0497729 0.0187882 0.101695 0.194402 0.0306197 -0.188123 -0.156028 -0.00943046 -0.0256153 0.0406142 0.0725863 -0.0396673 0.00947184 -0.0192699 -0.0553935 0.11533 0.00567027 0.096778 0.0867581 -0.0424535 0.0654715 0.0924515 0.0243556 0.0437116 -0.174949 -0.195613 0.101633 0.120165 0.033318 0.169961 -0.106058 0.0114774 0.106939 0.0596109 -0.0355315 0.0902368 0.0671304 -0.0953481 0.0471251 -0.0461752 0.0196925 0.0330536 -0.161742 0.0486377 0.220446 0.0670033 -0.162803 -0.0101103 -0.000779456 0.0168943 0.0579407 -0.0134813 0.106416 0.0120906 0.0657246 0.159779 0.00401561 -0.147891 -0.0734997 0.121345 0.203008 -0.138792 0.102499 0.0418435 0.0333626 -0.0291929 -0.117591 0.105908 -0.0239235 0.0943913 -0.0567177 0.0850747 0.0155484 -0.0364749 -0.092131 -0.0139754 0.0741838 0.0279887 0.00561499 0.147165 -0.0385742 -0.057732 -0.0100801 -0.0528001 0.0016117 0.019414 -0.0177084 0.0520668 0.146326 -0.015547 0.0249033 -0.0355434 -0.0520027 -0.104074 0.0414172 0.22434 0.0514887 -0.0575407 0.0439168 0.0660977 0.00159541 0.110478 -0.123934 0.0927931 -0.0260662 0.102753 0.0927057 0.0416032 0.0420327 0.111817 -0.0929443 -0.0559079 0.0273245 0.0434266 -0.0998983 -0.14149 0.0142556 0.116359 0.0763867 -0.0620076 0.0317366 -0.023125 -0.14921 0.0992271 0.00337941 -0.00883301 
-0.0235725 0.0811355 -0.103573 0.0304333 0.0806624 0.160818 0.0207371 -0.16448 -0.109031 0.0122683 -0.0081944 0.0415053 0.0721841 -0.039742 -0.036227 -0.0406585 -0.0805121 0.100617 0.0513907 0.0952407 0.105859 -0.117172 0.0457103 0.0540042 0.0322402 0.0556024 -0.191788 -0.224602 0.109638 0.118136 0.0712948 0.132139 -0.0783579 -0.0657643 0.0961686 0.0841239 -0.0955378 0.0752307 0.0311502 -0.0976513 0.0476567 -0.02683 -0.0354156 0.0996157 -0.164641 0.0326475 0.212377 0.0358962 -0.124905 -0.0806446 -0.0654533 0.025263 0.0614058 -0.0536354 0.0807923 0.0438462 0.0440341 0.162959 0.00448986 -0.138203 -0.0704236 0.0940227 0.238916 -0.0968788 0.11652 0.0138766 0.0494145 -0.0388271 -0.0575194 0.0748198 0.00858864 0.112165 -0.0401253 0.0409543 0.00105676 -0.0208055 -0.131082 0.0158189 0.0437702 0.0359582 -0.0658201 0.133148 -0.0543492 -0.0226567 -0.0221282 -0.031677 0.0250438 0.0234608 0.00825184 -0.0414317 0.109247 0.0130551 0.0253146 -0.0697152 -0.0299741 -0.155012 0.0420334 0.207219 0.0346095 -0.043934 0.0262599 0.0490359 0.0307406 0.0395504 -0.147556 0.127941 0.00597483 0.105315 0.106635 0.0598008 0.0292349 0.058979 -0.117777 -0.106954 0.0320024 0.0577327 -0.0968084 -0.161815 0.0440915 0.0991963 0.0350796 -0.07285 -0.0179743 -0.021589 -0.167181 0.122116 -0.0171025 0.0563448 
0.0288058 0.103922 -0.0835624 0.025534 0.0941272 0.239043 0.110204 -0.154564 -0.0869725 -0.00565567 0.00613521 0.0477995 0.0645821 -0.011796 0.0403087 -0.0823827 -0.0825201 0.0710418 0.0100852 0.000337033 0.086968 -0.0551971 -0.0516584 0.0991937 0.0818404 -0.054839 -0.199542 -0.146514 0.0598852 0.175362 0.0592888 0.123475 -0.137926 0.00219108 0.0709194 0.0834848 -0.0968612 -0.0893687 0.0351571 -0.0650878 0.102956 -0.0726735 0.0268374 0.0601507 -0.127208 0.034914 0.143063 0.046278 -0.136212 -0.0766925 -0.00443611 0.0152955 0.056123 -0.0668433 0.0890827 0.0956989 -0.0876779 0.229097 -0.0258695 -0.0530197 -0.0913822 0.127832 0.200829 -0.162556 0.080519 0.0886801 0.0351644 -0.0441139 -0.152572 0.0813678 0.0305089 0.130501 -0.0650752 0.00324101 0.010642 0.0562321 -0.0566568 -0.0790275 0.0245116 0.0477744 -0.013761 0.0804511 -0.0106649 -0.0264527 -0.0677556 0.0108539 0.0437232 -0.0849882 -0.0455843 0.0667391 0.112247 -0.0830854 -0.00605647 -0.031502 -0.0819928 -0.0790453 0.0136134 0.0714142 0.0680961 -0.00381705 0.0557511 0.0735726 0.024093 0.02345 -0.192977 0.150726 -0.052029 0.102925 -0.0294335 0.0543255 0.0917503 0.00234972 -0.119247 -0.111163 0.0336491 0.0643477 -0.0704195 -0.0413046 0.0656458 0.146585 0.100008 -0.150201 -0.013563 0.0110371 -0.0969364 0.141352 0.000499216 0.00677215 
0.0155313 0.104873 -0.0925128 -0.00177069 0.0997333 0.210066 0.0325075 -0.172401 -0.164288 0.0389653 -0.0135862 0.0452937 0.101535 -0.0152319 0.015816 -0.0492985 -0.0384947 0.117838 0.0347262 0.0886466 0.0705565 -0.0619299 0.0438484 0.0994005 0.0253805 0.0357173 -0.171439 -0.184694 0.102579 0.13681 0.0339527 0.148043 -0.0991115 -0.0127699 0.0874978 0.0801502 -0.0628118 0.0439614 0.0417826 -0.0829509 0.0480255 -0.054533 0.00404552 0.0627489 -0.180614 0.0522753 0.212947 0.0804628 -0.156737 -0.0383258 0.00908703 0.020618 0.0443436 -0.0404763 0.0922744 0.0451514 0.0262239 0.178941 0.0205557 -0.126413 -0.0852904 0.122992 0.21107 -0.143094 0.104731 0.0300479 0.0352481 -0.0265144 -0.126076 0.0868555 -0.00251186 0.103705 -0.0599968 0.0423336 0.0188328 0.00440244 -0.0975621 -0.00488909 0.0747777 0.0244343 -0.0182324 0.120673 -0.0322141 -0.027405 -0.0232672 -0.041652 0.0212323 -0.00831189 1.69191e-05 0.0384643 0.102932 -0.0184288 0.0350501 -0.0390205 -0.0568238 -0.127737 0.0463224 0.203482 0.0434869 -0.0569391 0.0553967 0.0938459 0.0209809 0.085054 -0.157261 0.114321 -0.0458655 0.0956812 0.0664478 0.0554614 0.0569508 0.0776707 -0.0914042 -0.0727479 0.000956533 0.0487483 -0.0984399 -0.138189 0.0192451 0.128626 0.067196 -0.117002 0.00377101 -0.0231522 -0.152839 0.118362 -0.026137 0.00904043 
-0.0236302 0.0847823 -0.105575 0.0277221 0.0573959 0.211088 0.0651708 -0.183635 -0.0768003 0.0269554 -0.029558 0.0605462 0.0790259 -0.00718034 -0.0272168 -0.0949199 -0.0852459 0.087308 0.0526168 0.0384323 0.0669316 -0.103726 -0.0380749 0.103696 0.0319185 0.0242907 -0.201528 -0.184954 0.0609099 0.162093 0.0657658 0.150219 -0.111702 -0.0490907 0.0890765 0.0900098 -0.0897489 -0.0162896 0.0165046 -0.0934433 0.0768907 -0.067705 -0.0109341 0.0703597 -0.131753 0.0165267 0.165954 0.0559042 -0.115271 -0.0923237 -0.0272088 0.0108446 0.111309 -0.0667456 0.107072 0.0966283 -0.022814 0.196493 0.00493078 -0.120612 -0.0719284 0.138614 0.209597 -0.138591 0.0979913 0.0727464 0.0695562 -0.0655269 -0.121653 0.0578201 -0.00682337 0.0941738 -0.0519219 0.0237073 0.00468653 0.0394527 -0.0885024 -0.0494633 0.056072 0.0280358 -0.0389487 0.114601 -0.0420356 -0.0160637 -0.0316606 -0.0406173 0.0368196 -0.0358311 0.00545781 0.0210992 0.0867855 -0.0214175 0.068958 -0.0480831 -0.0671467 -0.107595 0.0408398 0.131836 0.0764161 -0.0137331 0.0891885 0.0808176 0.0175667 0.0197016 -0.168264 0.124045 -0.0232629 0.0594454 -0.0132733 0.100012 0.0654757 0.0290471 -0.101062 -0.139301 -0.00680195 0.0660206 -0.0871692 -0.105178 0.0435432 0.100548 0.0698986 -0.150708 -0.017408 -0.0447938 -0.152959 0.161325 -0.0439681 0.0275151 
-0.0145461 0.0741488 -0.0886919 0.0310173 0.0623068 0.205177 0.0673868 -0.156204 -0.104913 0.0389799 -0.00854503 0.0591258 0.0829835 0.00532358 0.00523139 -0.0799933 -0.0661538 0.0952576 0.0664927 0.0351851 0.0892187 -0.096674 -0.0315906 0.118549 0.0493429 0.0253195 -0.188863 -0.187313 0.080382 0.167502 0.0531505 0.132603 -0.102192 -0.0479264 0.0791475 0.0954218 -0.102024 -0.0142631 0.00512648 -0.0918272 0.0668485 -0.0531787 -0.00946601 0.0891517 -0.144097 0.0167121 0.178978 0.0374616 -0.126362 -0.107391 -0.00149043 0.0129229 0.0803111 -0.067951 0.123472 0.10764 -0.0300862 0.210541 0.0147366 -0.111048 -0.0730915 0.105477 0.210988 -0.136044 0.115805 0.0654336 0.051349 -0.0608888 -0.116486 0.0817831 0.00614233 0.117451 -0.0571343 0.00349373 0.00293468 0.0354201 -0.0827097 -0.0192093 0.0523201 0.0174817 -0.04597 0.108681 -0.03305 -0.0312758 -0.0347032 -0.0451359 0.047204 -0.0332324 0.0051964 0.0220471 0.0797488 -0.0229308 0.0323056 -0.0540652 -0.0629745 -0.105658 0.0451326 0.132127 0.0760401 -0.0160085 0.068776 0.0914735 0.0318853 0.0051435 -0.190895 0.134313 -0.0332897 0.0503207 0.0128693 0.0586308 0.0589708 0.03117 -0.108094 -0.148568 0.0308736 0.0636554 -0.0674937 -0.125545 0.0371263 0.114009 0.0697814 -0.149789 -0.0147784 -0.0348162 -0.13925 0.173929 -0.00897092 0.0360454 
0.0436994 0.054666 -0.0814622 -0.00357226 0.155398 0.219967 0.0514449 -0.17808 -0.109476 -0.0547402 -0.0168652 0.0690064 0.072436 -0.00180769 -0.0164213 -0.0493033 -0.0752951 0.10361 -0.0279202 0.0958386 0.126488 -0.0357022 0.0521762 0.0915658 0.0301436 -0.0074683 -0.168781 -0.181498 0.0657773 0.142971 0.0372436 0.10142 -0.116892 0.00992446 0.106954 0.0948325 -0.085455 0.0363887 0.00811859 -0.105969 0.0451783 -0.000448367 -0.0126708 0.0673326 -0.169859 0.062249 0.177725 0.0816441 -0.134047 -0.00996352 -0.0413494 0.00107048 0.0408528 -0.0384402 0.121944 0.0296363 -0.00630178 0.22238 -0.0371275 -0.107879 -0.0645816 0.132823 0.246434 -0.127226 0.119568 0.0031 0.00237336 0.0246318 -0.109634 0.13451 0.0436743 0.118601 -0.0393202 0.00661894 -0.0272497 0.0351484 -0.0859915 -0.0344702 0.0589502 0.0128236 -0.00334388 0.12702 -0.0366621 -0.0407653 -0.0632086 -0.044808 0.0370192 0.0249982 -0.0314898 0.0663377 0.167364 -0.0575008 0.00402021 -0.0258808 -0.0523824 -0.107602 0.0116806 0.156678 0.0544404 -0.0300981 0.0662344 0.0754917 -0.0152474 0.0401692 -0.159635 0.116982 -0.0611386 0.080013 0.0474919 0.0554181 0.0815532 0.0722676 -0.106665 -0.0366875 0.0373316 0.0955188 -0.105261 -0.0908109 0.00703388 0.147271 0.0472643 -0.0644884 0.00291334 -0.00295059 -0.135475 0.127493 -0.00487401 -0.0158908 
-0.0215263 0.0857071 -0.0703877 0.0266241 0.0401421 0.228883 0.0375318 -0.202012 -0.0599193 -0.0233561 -0.0321205 0.028047 0.0681364 -0.00479184 -0.0183296 -0.0683066 -0.134432 0.0728087 0.0146916 0.028054 0.0827522 -0.0862247 0.0109569 0.122804 0.0346193 -0.00550937 -0.186396 -0.185435 0.0278019 0.139733 0.0694576 0.112464 -0.11622 -0.019397 0.0963488 0.107844 -0.0756506 -0.00224877 0.00247477 -0.0804637 0.0542684 -0.0744476 0.00079032 0.0528329 -0.111357 0.018017 0.173092 0.0757452 -0.12103 -0.0320709 -0.0329096 -0.0172564 0.122776 -0.0335676 0.131277 0.0832558 0.00540989 0.18703 0.0227723 -0.155009 -0.065626 0.172664 0.206498 -0.137249 0.0784788 0.092321 0.06071 -0.033423 -0.114638 0.102714 -0.0121405 0.100774 -0.0523974 0.0330896 0.0314027 0.0220908 -0.0982208 -0.0645109 0.0638962 0.0350438 0.00971491 0.115494 -0.0491721 -0.0468534 -0.0713194 -0.0087184 0.0153348 -0.0276687 -0.0198157 0.0512375 0.123194 -0.0432278 0.0843008 -0.0608876 -0.0864917 -0.0713677 0.00460971 0.159748 0.0944182 -0.0172551 0.106737 0.0625261 0.00187613 0.00772036 -0.135178 0.113139 -0.0551489 0.0505354 -0.0317262 0.0905038 0.0706719 0.0648556 -0.0661121 -0.131622 -0.00125279 0.0982611 -0.0843369 -0.0675266 0.0245338 0.107853 0.0876228 -0.133688 0.00333822 -0.0353945 -0.179103 0.1623 -0.0304089 0.0351892 
-0.0174117 0.127675 -0.136808 -0.0372961 0.0360935 0.220179 0.0526454 -0.152544 -0.132356 0.0440488 -0.0177418 0.0664173 0.0811102 0.00433091 -0.0195594 -0.0392512 -0.0625821 0.0350707 0.0681757 0.0250784 0.0226733 -0.040186 -0.0193721 0.0875295 -0.0131463 0.093617 -0.102189 -0.158987 0.0996042 0.140414 0.0202769 0.138333 -0.102891 -0.0268911 0.0433542 0.088335 -0.0421501 0.0393206 0.0323985 -0.0181531 0.0309287 -0.054371 0.0071541 0.0758948 -0.122845 0.0486776 0.214663 0.0321569 -0.17923 -0.0668138 -0.00475105 -0.00397783 0.0407367 -0.0359519 0.100856 0.11282 -0.0240336 0.25903 -0.000782989 -0.0940522 -0.0864859 0.10976 0.27585 -0.188642 0.12859 0.0682447 0.0501804 -0.0414678 -0.118722 0.0869184 -0.0267464 0.095967 -0.0667246 0.0836883 0.0426185 0.0139084 -0.0448959 -0.00739878 0.0408663 -0.0583409 -0.0125836 0.112464 -0.0490855 -0.0476017 -0.0670808 -0.059373 0.0311496 -0.0543332 0.0139348 0.0338541 0.0889684 -0.0708542 0.0357106 -0.025195 0.0298811 -0.0415867 0.0768711 0.137688 0.08399 0.0125804 -0.00372689 0.064766 -0.0294173 0.0680852 -0.211589 0.130642 -0.0719122 0.0361987 -0.0495142 0.015138 0.0832027 0.0770583 -0.0428804 -0.0889654 0.016022 0.0326911 -0.0596355 -0.127578 0.0567737 0.0960045 0.0855402 -0.141671 0.0476446 -0.0296543 -0.142803 0.142541 -0.0604707 -0.0193666 
