0.0836495 0.0611533 -0.0950372 -0.0799105 0.091143 0.130721 0.0202083 -0.0330145 -0.0627372 0.0682925 0.0849029 0.0566798 0.0781052 -0.0974396 -0.0600623 0.0100781 0.0228294 0.120862 -0.0571858 0.0745863 0.118833 0.00690896 0.0706959 0.0531284 -0.058474 0.122219 0.0326768 -0.194582 0.130635 0.0303124 0.000749127 0.0865571 -0.0479612 0.0578179 0.0454692 -0.0398714 0.00494019 0.224857 0.0846622 -0.0296631 -0.0207224 -0.024586 -0.144485 0.123288 -0.149379 -0.0114484 0.0929101 0.0426575 -0.136314 -0.0353109 0.0295471 0.0947129 -0.116124 -0.00258927 0.014919 -0.0125004 0.0867439 0.137598 -0.078891 -0.088162 -0.0425375 -0.127485 0.263107 -0.0790114 0.118739 -0.171343 -0.0108468 0.0924129 0.0117436 0.156163 -0.0244145 0.056241 -0.078041 0.0272372 -0.0588184 -0.128503 -0.0626129 0.16771 0.00310317 -0.0112146 -0.104457 0.120087 0.0129813 -0.0521152 -0.0298473 -0.127756 0.108499 0.0766443 0.0658938 -0.0253362 0.0837204 -0.079352 -0.0568692 0.012526 0.0467785 -0.127187 0.0411559 0.0857907 -0.00965235 -0.0404553 0.00550722 0.056487 -0.0922882 0.184382 -0.000803914 -0.0168325 -0.0285027 0.0435691 0.141356 -0.0897934 0.00350084 0.162101 -0.0880083 0.0891241 0.129254 0.00987404 -0.115929 -0.218889 0.0238095 0.0752733 0.0322592 0.0507164 0.0226777 0.0506157 -0.0046149 -0.00761561 -0.00954972 -0.0339709 
0.0873011 0.0499374 -0.0922939 -0.069708 0.0956213 0.127844 0.0320572 -0.0229591 -0.077405 0.0689792 0.0737267 0.056823 0.0962266 -0.104429 -0.0609831 0.0176544 0.0266999 0.12205 -0.0775519 0.095376 0.130155 -0.0218853 0.0767394 0.0598605 -0.0625869 0.113493 -0.00432765 -0.208808 0.12541 0.0278462 -0.00119365 0.113171 -0.0549848 0.0677618 0.0332507 -0.045425 -0.00833725 0.238041 0.0693718 -0.0509564 -0.0129607 -0.0317308 -0.13813 0.115257 -0.145799 -0.0187213 0.094547 0.0483366 -0.144896 -0.0357001 0.0319157 0.0727199 -0.110189 -0.00706697 0.0209942 -0.0174566 0.0824751 0.132629 -0.0587245 -0.10344 -0.0391062 -0.1121 0.242931 -0.0788093 0.118099 -0.152596 -0.0176836 0.0946073 0.000555836 0.129364 -0.0317513 0.0539304 -0.0760807 0.0313032 -0.0639429 -0.122228 -0.0564107 0.156888 0.0155016 0.00116171 -0.108362 0.100948 0.00141813 -0.0643892 -0.0311063 -0.11933 0.112339 0.0784672 0.0702954 -0.0269718 0.0836901 -0.0785461 -0.0549415 0.00673086 0.0284648 -0.115474 0.0449603 0.091633 -0.0189686 -0.0412387 0.0199675 0.0517492 -0.0903775 0.194173 -0.00337497 -0.0198991 -0.0374013 0.0631952 0.148978 -0.0919115 -0.00706324 0.173234 -0.0983154 0.0762635 0.131548 0.0107998 -0.129258 -0.215336 0.0218472 0.0819197 0.0185475 0.0545287 0.0210527 0.0569672 -0.00997611 -0.00814965 -0.0192122 -0.0453087 
0.075624 0.06765 -0.0827924 -0.0585775 0.0844554 0.12524 0.0401803 -0.0176066 -0.0791366 0.0934866 0.0766793 0.0518619 0.0991744 -0.122937 -0.0515665 0.0171084 0.0227406 0.130246 -0.0749184 0.0966432 0.127249 -0.04173 0.0753535 0.0724021 -0.060572 0.0976245 -0.0168194 -0.213848 0.139021 0.0328059 0.000284295 0.11601 -0.0475115 0.0671767 0.0369202 -0.0500045 -0.00862055 0.234608 0.0583471 -0.0575074 -0.0137743 -0.0551423 -0.135586 0.110381 -0.144414 -0.0181272 0.101813 0.0504751 -0.159367 -0.0408538 0.0398207 0.0771808 -0.10833 -0.0181473 0.0183768 -0.00587106 0.0795354 0.115553 -0.0534501 -0.102377 -0.0445658 -0.115059 0.23162 -0.0859564 0.127355 -0.144167 -0.0211024 0.0738253 -0.024397 0.125128 -0.0431057 0.048931 -0.0897684 0.0347453 -0.0561749 -0.122925 -0.0485878 0.167452 0.0250917 0.00258706 -0.12338 0.0836904 -0.00722904 -0.0592104 -0.0236044 -0.112174 0.100986 0.0675613 0.0774949 -0.0159296 0.0738687 -0.0738349 -0.0520905 0.00457476 0.023041 -0.11581 0.0436554 0.0968777 -0.0148904 -0.0428456 0.0307231 0.0510086 -0.090233 0.189037 0.00471242 -0.0158134 -0.0236302 0.0682853 0.161571 -0.0913939 -0.0248552 0.174042 -0.0939152 0.0549614 0.137048 0.00987625 -0.124025 -0.213923 0.0324675 0.0968322 0.0201968 0.0414432 0.0111057 0.0640104 -0.00930654 0.00315225 -0.0101668 -0.0467234 
0.0748215 0.0587112 -0.0867575 -0.0519673 0.0812806 0.120867 0.0436878 -0.0200647 -0.0779113 0.0879942 0.0731557 0.0562562 0.0983291 -0.118127 -0.0500857 0.00852926 0.0158098 0.120862 -0.0695686 0.100863 0.119468 -0.0513873 0.0851484 0.0713479 -0.0599149 0.0998083 -0.0200978 -0.220928 0.132257 0.0272416 0.00193767 0.121399 -0.0449519 0.0650917 0.027472 -0.0479678 -0.0104962 0.24576 0.0519515 -0.0547311 -0.00543821 -0.0527803 -0.144278 0.107689 -0.155671 -0.0198172 0.100479 0.0432519 -0.147761 -0.0396138 0.0341599 0.0770904 -0.10207 -0.0137641 0.0235958 -0.00596108 0.0870651 0.119431 -0.0498 -0.10049 -0.0486091 -0.111777 0.23117 -0.0878564 0.12864 -0.138259 -0.012957 0.0720902 -0.019781 0.125408 -0.0441226 0.0534857 -0.0871142 0.0487344 -0.0481566 -0.123105 -0.052425 0.158311 0.0234594 0.006262 -0.132891 0.0804186 -0.00663284 -0.0616937 -0.0213542 -0.112253 0.105637 0.0685099 0.0717988 -0.0288875 0.0763829 -0.0726768 -0.0404141 -0.00782232 0.0211928 -0.126656 0.0470454 0.0991779 -0.00527103 -0.0423184 0.024893 0.0479426 -0.0822852 0.19153 0.00331223 -0.0167598 -0.023913 0.073587 0.161156 -0.0907318 -0.0258222 0.179342 -0.0933356 0.0492641 0.133627 0.0114845 -0.117806 -0.219757 0.0399755 0.0997947 0.0213886 0.043072 0.00488152 0.063659 -0.0131854 0.00412206 -0.0123671 -0.0346907 
0.076728 0.044518 -0.0857724 -0.0433538 0.0799827 0.123542 0.0481863 -0.0181833 -0.0720707 0.0788995 0.0712847 0.0616731 0.0977414 -0.126049 -0.0558013 -0.0021317 -0.00157381 0.122893 -0.0729141 0.106749 0.125681 -0.064242 0.0921022 0.0760233 -0.0581472 0.0927524 -0.0306681 -0.23281 0.121486 0.0255581 0.00401997 0.115948 -0.0466637 0.0658816 0.0272425 -0.0518186 -0.0216836 0.246221 0.0447645 -0.063401 0.000640135 -0.0554356 -0.152889 0.112397 -0.16472 -0.037689 0.0947278 0.0409625 -0.136287 -0.0301572 0.0284643 0.0698537 -0.0937355 -0.0113939 0.0278852 -0.00816749 0.0897283 0.117925 -0.0504921 -0.107539 -0.0469053 -0.107373 0.234399 -0.0802934 0.123065 -0.13522 -0.010028 0.0657106 -0.0194681 0.122908 -0.0467694 0.0554145 -0.0839966 0.0527904 -0.052729 -0.125838 -0.0566575 0.141601 0.0268278 0.0221165 -0.139105 0.0733283 -0.00654179 -0.0643389 -0.0179221 -0.110821 0.11016 0.0736169 0.074345 -0.0348014 0.0828112 -0.0726334 -0.0357766 -0.0149679 0.0106015 -0.137498 0.0410546 0.100743 -0.00354991 -0.0412532 0.0332323 0.0461486 -0.0761405 0.183064 0.0104115 -0.0164394 -0.0180836 0.0786631 0.161416 -0.0845399 -0.0254336 0.182025 -0.0943926 0.0407894 0.133549 0.0204131 -0.110995 -0.213687 0.0469817 0.103916 0.0185603 0.0403025 -0.00317353 0.0601973 -0.0178653 0.0056517 -0.00533354 -0.0223702 
0.076728 0.044518 -0.0857724 -0.0433538 0.0799827 0.123542 0.0481863 -0.0181833 -0.0720707 0.0788995 0.0712847 0.0616731 0.0977414 -0.126049 -0.0558013 -0.0021317 -0.00157381 0.122893 -0.0729141 0.106749 0.125681 -0.064242 0.0921022 0.0760233 -0.0581472 0.0927524 -0.0306681 -0.23281 0.121486 0.0255581 0.00401997 0.115948 -0.0466637 0.0658816 0.0272425 -0.0518186 -0.0216836 0.246221 0.0447645 -0.063401 0.000640135 -0.0554356 -0.152889 0.112397 -0.16472 -0.037689 0.0947278 0.0409625 -0.136287 -0.0301572 0.0284643 0.0698537 -0.0937355 -0.0113939 0.0278852 -0.00816749 0.0897283 0.117925 -0.0504921 -0.107539 -0.0469053 -0.107373 0.234399 -0.0802934 0.123065 -0.13522 -0.010028 0.0657106 -0.0194681 0.122908 -0.0467694 0.0554145 -0.0839966 0.0527904 -0.052729 -0.125838 -0.0566575 0.141601 0.0268278 0.0221165 -0.139105 0.0733283 -0.00654179 -0.0643389 -0.0179221 -0.110821 0.11016 0.0736169 0.074345 -0.0348014 0.0828112 -0.0726334 -0.0357766 -0.0149679 0.0106015 -0.137498 0.0410546 0.100743 -0.00354991 -0.0412532 0.0332323 0.0461486 -0.0761405 0.183064 0.0104115 -0.0164394 -0.0180836 0.0786631 0.161416 -0.0845399 -0.0254336 0.182025 -0.0943926 0.0407894 0.133549 0.0204131 -0.110995 -0.213687 0.0469817 0.103916 0.0185603 0.0403025 -0.00317353 0.0601973 -0.0178653 0.0056517 -0.00533354 -0.0223702 
0.0727868 0.0611512 -0.0662637 -0.0401889 0.068501 0.126226 0.0507189 -0.0202106 -0.0739731 0.0771145 0.0739372 0.0476342 0.0887619 -0.130553 -0.0425747 -0.00542982 -0.00687762 0.119003 -0.063053 0.0902666 0.127791 -0.0561953 0.0818977 0.0792522 -0.0498759 0.0917377 -0.0343067 -0.229372 0.139425 0.0269487 0.0107272 0.115897 -0.0509553 0.0649675 0.0386342 -0.0521168 -0.0140318 0.239958 0.0558169 -0.0589675 0.0033512 -0.0636795 -0.152078 0.106117 -0.154296 -0.0281091 0.0995171 0.0372776 -0.146867 -0.0435413 0.0246839 0.0909969 -0.0862511 -0.0124265 0.0243936 -0.00369174 0.0946904 0.111832 -0.0572788 -0.107642 -0.0473887 -0.106174 0.230888 -0.0817736 0.120231 -0.124047 0.00269961 0.0488177 -0.0202119 0.131255 -0.0543643 0.0509756 -0.093068 0.0599446 -0.0402895 -0.13641 -0.0600511 0.145248 0.0298749 0.0295654 -0.136828 0.0779809 -0.00440919 -0.0650574 -0.00593331 -0.111391 0.102998 0.0655782 0.0644537 -0.0281879 0.0936188 -0.0659898 -0.0356348 -0.0127533 0.00740819 -0.14155 0.0453186 0.105154 0.00543011 -0.0409793 0.0315561 0.0500486 -0.0767302 0.184899 0.0116234 -0.0122397 -0.00402026 0.0835198 0.171269 -0.0870893 -0.0265995 0.17672 -0.105473 0.0296814 0.141607 0.0210278 -0.108516 -0.220557 0.0548787 0.103489 0.0276252 0.0369 -0.00406206 0.0594509 -0.0156657 0.00962757 0.00901798 -0.0204764 
0.0799705 0.0159254 -0.0795507 -0.0331735 0.0822881 0.116193 0.0476077 -0.0266094 -0.0515843 0.0459763 0.068352 0.065183 0.0959264 -0.109876 -0.0637076 -0.0149919 -0.0279909 0.118921 -0.0751984 0.114376 0.144388 -0.0721183 0.0996974 0.0814415 -0.0503632 0.08847 -0.0411128 -0.245492 0.103715 0.0315662 0.0121699 0.101352 -0.0441419 0.0579335 0.0326414 -0.0412367 -0.037749 0.25404 0.0313732 -0.0763002 0.00453418 -0.0383605 -0.1642 0.125231 -0.174351 -0.0506076 0.0874189 0.0358226 -0.108137 -0.024448 0.00347866 0.0621332 -0.0758063 -0.00273885 0.0504227 -0.0138241 0.089993 0.124672 -0.0526413 -0.122814 -0.0456395 -0.104954 0.242515 -0.0596982 0.110321 -0.131863 6.28381e-05 0.0701721 -0.000550509 0.124454 -0.0325167 0.0635199 -0.0726132 0.0427996 -0.0581961 -0.123036 -0.0743265 0.118543 0.0286676 0.0445984 -0.134394 0.0798893 -0.0103102 -0.0707512 -0.0167497 -0.110521 0.117772 0.0886187 0.0713106 -0.0450634 0.0987168 -0.0709227 -0.027645 -0.0313613 -0.00414778 -0.156808 0.0281964 0.104933 0.0105032 -0.0457451 0.0395834 0.0414801 -0.0581467 0.15781 0.00295632 -0.0122704 -0.0196335 0.0776439 0.169284 -0.0766656 -0.0167732 0.180369 -0.109802 0.0301128 0.136247 0.0437266 -0.101909 -0.214116 0.0437728 0.102043 0.0148229 0.0492864 -0.0123754 0.0583782 -0.0327447 0.0119283 0.0108725 0.00401491 
0.077407 0.011192 -0.0794904 -0.0359996 0.0775798 0.118983 0.0408386 -0.016783 -0.0399517 0.0364065 0.068933 0.0615292 0.101306 -0.115631 -0.0728619 -0.0237753 -0.0347188 0.111538 -0.090133 0.119039 0.146435 -0.0802118 0.103472 0.0742035 -0.0527109 0.0828225 -0.0381026 -0.243495 0.0897088 0.0208011 0.0200146 0.0924851 -0.0373038 0.0664656 0.0271064 -0.0440692 -0.0367645 0.260399 0.0211133 -0.0832099 0.012582 -0.0470125 -0.167471 0.130915 -0.177078 -0.064316 0.0763806 0.0402289 -0.101971 -0.0159806 -0.00418415 0.0553653 -0.0719502 0.00103837 0.0487871 -0.0164252 0.083617 0.11205 -0.0493416 -0.138272 -0.0482843 -0.106547 0.237232 -0.0523437 0.102934 -0.131355 0.00278742 0.0767788 0.003943 0.118042 -0.03597 0.0514015 -0.0678161 0.034262 -0.0558486 -0.122146 -0.0760305 0.112427 0.0286095 0.0576445 -0.140305 0.0690904 -0.00443388 -0.0680911 -0.0177722 -0.105297 0.12556 0.0969994 0.0783371 -0.0450191 0.0994028 -0.0824549 -0.0232579 -0.0340968 -0.0154397 -0.159134 0.0216228 0.0993582 0.00200556 -0.0498216 0.0451981 0.0434346 -0.0573538 0.156585 0.0129884 -0.0181678 -0.0237776 0.0835948 0.16229 -0.0792584 -0.0173823 0.182648 -0.115996 0.0384845 0.131875 0.0425559 -0.107377 -0.208841 0.0483047 0.101856 0.0127502 0.0519553 -0.0168172 0.0616403 -0.023796 0.00132972 0.0126138 0.00881734 
0.0629713 0.0314403 -0.0689116 -0.0300509 0.0609352 0.12621 0.0332509 -0.0153219 -0.0627328 0.0612275 0.0687949 0.051811 0.0967388 -0.130365 -0.0623866 -0.00267811 -0.0383199 0.11669 -0.0692541 0.107819 0.145276 -0.0838882 0.10206 0.0812787 -0.0483865 0.0927981 -0.0408996 -0.249293 0.115479 0.019406 0.0199579 0.10317 -0.0417019 0.0618131 0.0288337 -0.0433316 -0.0357457 0.247949 0.0334588 -0.0742938 0.00578844 -0.0670494 -0.153672 0.119559 -0.160767 -0.0648472 0.10118 0.0346291 -0.126491 -0.0292664 0.0143256 0.0603229 -0.0702463 -0.00225515 0.0428799 -0.00340684 0.102719 0.104163 -0.0402089 -0.137435 -0.0476175 -0.100522 0.233705 -0.061038 0.112787 -0.114476 0.000596483 0.0513609 -0.00632323 0.123881 -0.0588244 0.0564073 -0.0844187 0.0505489 -0.0389666 -0.135789 -0.0695626 0.131591 0.0306451 0.0496694 -0.137111 0.0664255 -0.00450039 -0.0682628 -0.0172527 -0.0953292 0.11158 0.0882755 0.0780994 -0.041443 0.0950466 -0.0661113 -0.0286511 -0.0262782 -0.0100421 -0.144056 0.0289077 0.122953 0.00577089 -0.0432095 0.0440106 0.0380865 -0.0637655 0.162568 0.0235617 -0.00992108 -0.0129254 0.0827503 0.167755 -0.085024 -0.0398926 0.186633 -0.104049 0.0146545 0.142496 0.0367562 -0.0989055 -0.211758 0.0554122 0.103937 0.0241588 0.0347713 -0.00406076 0.0459116 -0.0369663 0.0180572 0.0151156 0.0113026 
0.0677645 0.0254298 -0.0651086 -0.0214364 0.0599677 0.133238 0.0351515 -0.0170378 -0.0601377 0.0543768 0.0737954 0.0570715 0.0947613 -0.134843 -0.0681864 -0.007036 -0.0444656 0.12431 -0.0718333 0.107484 0.156473 -0.0859281 0.0986762 0.0964911 -0.0433663 0.0842574 -0.0430618 -0.253552 0.110068 0.0276184 0.017726 0.09629 -0.0459175 0.0643607 0.0311423 -0.0425866 -0.0444728 0.23483 0.0284079 -0.0798405 0.00564804 -0.0681798 -0.153753 0.125633 -0.160191 -0.0770684 0.102181 0.0327488 -0.125612 -0.023517 0.019883 0.0548821 -0.0672816 -0.00295363 0.049127 4.96365e-05 0.0970034 0.107185 -0.0390232 -0.140704 -0.0451136 -0.0976496 0.238053 -0.0595321 0.108496 -0.114887 0.00105358 0.0427687 -0.0119268 0.130215 -0.0604381 0.0568111 -0.0845471 0.0456771 -0.0451456 -0.13623 -0.0665376 0.127038 0.0302226 0.0558924 -0.135078 0.0667631 -0.00484558 -0.0743885 -0.0166512 -0.0920576 0.111729 0.084164 0.0760717 -0.0350854 0.0990261 -0.0705503 -0.033136 -0.0264713 -0.0144902 -0.142057 0.0213873 0.120181 0.00816132 -0.0408424 0.0516278 0.0404667 -0.0617372 0.155422 0.0242226 -0.00684328 -0.0120261 0.0800368 0.160448 -0.0836579 -0.0375464 0.185453 -0.101986 0.00814684 0.145142 0.0430595 -0.093173 -0.206957 0.0574459 0.106764 0.0233822 0.0299787 -0.0065511 0.0426807 -0.0378814 0.0250327 0.0241608 0.0136554 
0.0695583 0.0327127 -0.0662673 -0.0145225 0.0636924 0.128346 0.0302229 -0.0203695 -0.0466654 0.0599344 0.0820197 0.0558966 0.0879737 -0.142895 -0.0631379 -0.00442153 -0.0292625 0.133217 -0.066297 0.104697 0.156545 -0.0754846 0.0952906 0.105893 -0.0385739 0.0785122 -0.0346676 -0.254703 0.113607 0.0345404 0.0253735 0.0929897 -0.0355443 0.0638786 0.0426093 -0.0416653 -0.030787 0.224869 0.032707 -0.0815369 0.00266916 -0.06709 -0.153648 0.129666 -0.15968 -0.0723976 0.101667 0.0371482 -0.116275 -0.0273981 0.026534 0.0673418 -0.0663602 -0.0108363 0.0463494 0.00251774 0.098636 0.0923607 -0.0386093 -0.135874 -0.0490133 -0.113032 0.230328 -0.0635109 0.106055 -0.133307 0.00193756 0.0370998 -0.00949052 0.135731 -0.0608931 0.0519447 -0.092696 0.0340207 -0.0496043 -0.139413 -0.0680934 0.14875 0.0252452 0.058012 -0.135529 0.0782361 -0.00534064 -0.0684602 -0.0024395 -0.0911791 0.10582 0.0799566 0.0717966 -0.0319588 0.0925617 -0.0636902 -0.0410133 -0.0254978 -0.00906456 -0.145442 0.0166605 0.115575 0.00495863 -0.0495889 0.0548438 0.0429894 -0.0571874 0.152176 0.0300769 -0.0151478 -0.00191728 0.0694089 0.168771 -0.072332 -0.0437671 0.177524 -0.100111 0.00825989 0.143687 0.0386454 -0.0917363 -0.219279 0.0518303 0.105874 0.0292686 0.0386666 -0.0104225 0.0499322 -0.0349129 0.0200446 0.0312984 0.0142205 
0.0598206 0.0340319 -0.062767 -0.0124834 0.0607864 0.124819 0.0278232 -0.0226993 -0.0441984 0.0638164 0.0793771 0.0520457 0.0836988 -0.137593 -0.0575394 -0.00835708 -0.0300281 0.132087 -0.0536923 0.102594 0.150192 -0.0805485 0.0986992 0.106709 -0.0359668 0.0794428 -0.0358772 -0.255982 0.119759 0.0300903 0.0346022 0.0882155 -0.0315375 0.0557981 0.0467674 -0.0329505 -0.0287767 0.226818 0.0294183 -0.0811848 0.00397057 -0.0641389 -0.158418 0.127095 -0.162593 -0.0697662 0.102708 0.0366605 -0.110155 -0.0339923 0.0160604 0.0702365 -0.0608399 -0.0146665 0.0463159 0.00785933 0.103152 0.0935064 -0.0389592 -0.133807 -0.0540063 -0.11065 0.230247 -0.0674688 0.112283 -0.127994 0.00634029 0.0311357 -0.00954513 0.140409 -0.0606291 0.0556588 -0.0946834 0.0377859 -0.0438182 -0.141176 -0.0704539 0.155862 0.0279661 0.0505458 -0.143822 0.0807302 -0.00833429 -0.0664435 0.00251655 -0.0938132 0.10178 0.0836464 0.0702384 -0.0369915 0.0951996 -0.0544002 -0.0299341 -0.0326426 -0.00128318 -0.15252 0.0174132 0.12177 0.00844668 -0.0476756 0.050153 0.0399286 -0.0565366 0.143074 0.0314975 -0.00988202 0.0063743 0.0594874 0.176349 -0.0675316 -0.0500159 0.175632 -0.0947515 0.00229865 0.144434 0.0398232 -0.0852403 -0.224849 0.0532463 0.106094 0.0295654 0.0348475 -0.0157632 0.0489845 -0.0440558 0.0264292 0.0301685 0.0218403 
0.051714 0.0419845 -0.0664075 -0.0137443 0.0592099 0.119477 0.0313134 -0.0285268 -0.0539914 0.0770258 0.0751635 0.0463743 0.0810004 -0.126781 -0.0436426 -0.00437103 -0.0173421 0.122521 -0.026811 0.0937036 0.136631 -0.0794479 0.0965783 0.10322 -0.0342154 0.0897087 -0.0332801 -0.255752 0.137929 0.0330902 0.0405525 0.0973191 -0.0291493 0.0414173 0.0487087 -0.0248103 -0.0207932 0.225745 0.0383921 -0.0737593 0.00306232 -0.0629026 -0.160247 0.117939 -0.159361 -0.0444408 0.109561 0.0363568 -0.114355 -0.0580828 0.00871869 0.0851611 -0.0519012 -0.02418 0.0422994 0.016743 0.110667 0.101576 -0.040773 -0.117114 -0.0590742 -0.107152 0.229974 -0.079772 0.125234 -0.119411 0.0108144 0.0262523 -0.00978368 0.138015 -0.064791 0.0602368 -0.106347 0.0415771 -0.032661 -0.138247 -0.0681878 0.168302 0.0292552 0.041376 -0.149592 0.0821464 -0.0132317 -0.0627514 0.00704004 -0.09895 0.0951896 0.0762285 0.0584938 -0.0446844 0.0948169 -0.0367399 -0.0230029 -0.0302414 0.0115108 -0.154385 0.0312428 0.128297 0.018932 -0.046829 0.041965 0.0386905 -0.057524 0.143857 0.0223102 -0.00427148 0.014816 0.0537265 0.186443 -0.0660057 -0.0537639 0.16784 -0.0916894 -0.00939487 0.144501 0.0394003 -0.0859433 -0.234631 0.052835 0.10812 0.032281 0.0248664 -0.0192243 0.0469672 -0.0547381 0.0386516 0.0195386 0.0207208 
0.051714 0.0419845 -0.0664075 -0.0137443 0.0592099 0.119477 0.0313134 -0.0285268 -0.0539914 0.0770258 0.0751635 0.0463743 0.0810004 -0.126781 -0.0436426 -0.00437103 -0.0173421 0.122521 -0.026811 0.0937036 0.136631 -0.0794479 0.0965783 0.10322 -0.0342154 0.0897087 -0.0332801 -0.255752 0.137929 0.0330902 0.0405525 0.0973191 -0.0291493 0.0414173 0.0487087 -0.0248103 -0.0207932 0.225745 0.0383921 -0.0737593 0.00306232 -0.0629026 -0.160247 0.117939 -0.159361 -0.0444408 0.109561 0.0363568 -0.114355 -0.0580828 0.00871869 0.0851611 -0.0519012 -0.02418 0.0422994 0.016743 0.110667 0.101576 -0.040773 -0.117114 -0.0590742 -0.107152 0.229974 -0.079772 0.125234 -0.119411 0.0108144 0.0262523 -0.00978368 0.138015 -0.064791 0.0602368 -0.106347 0.0415771 -0.032661 -0.138247 -0.0681878 0.168302 0.0292552 0.041376 -0.149592 0.0821464 -0.0132317 -0.0627514 0.00704004 -0.09895 0.0951896 0.0762285 0.0584938 -0.0446844 0.0948169 -0.0367399 -0.0230029 -0.0302414 0.0115108 -0.154385 0.0312428 0.128297 0.018932 -0.046829 0.041965 0.0386905 -0.057524 0.143857 0.0223102 -0.00427148 0.014816 0.0537265 0.186443 -0.0660057 -0.0537639 0.16784 -0.0916894 -0.00939487 0.144501 0.0394003 -0.0859433 -0.234631 0.052835 0.10812 0.032281 0.0248664 -0.0192243 0.0469672 -0.0547381 0.0386516 0.0195386 0.0207208 
0.0476278 0.0384445 -0.064638 -0.0214446 0.0646612 0.11605 0.0278455 -0.0250553 -0.0629136 0.0830333 0.0722988 0.0485441 0.0846546 -0.12602 -0.0428791 0.00457814 -0.0118056 0.122769 -0.0247211 0.0940998 0.139232 -0.0771824 0.0953962 0.106582 -0.0380035 0.0997486 -0.0297443 -0.258226 0.143796 0.0318416 0.0383095 0.0967531 -0.0302136 0.039605 0.044538 -0.02612 -0.0239985 0.223204 0.0436089 -0.0672354 0.00208591 -0.0590127 -0.157511 0.116973 -0.153101 -0.040735 0.11496 0.0358448 -0.119265 -0.0670248 0.0114388 0.0764408 -0.0539815 -0.0276564 0.0384437 0.0197259 0.113235 0.108604 -0.0386843 -0.113587 -0.053263 -0.104603 0.226768 -0.07491 0.126154 -0.12201 0.00592883 0.0300879 -0.00351517 0.129526 -0.0668707 0.0618889 -0.107985 0.0360276 -0.0315051 -0.133935 -0.0700347 0.177481 0.0319719 0.0382036 -0.146741 0.0856747 -0.0117878 -0.0588059 0.00274484 -0.0982845 0.100662 0.0783999 0.0555571 -0.0510824 0.0894919 -0.0302989 -0.0242064 -0.0224952 0.0124397 -0.146566 0.0323501 0.129869 0.0158728 -0.0458059 0.0395625 0.0328175 -0.061674 0.148833 0.0208192 -0.00592255 0.00982678 0.0518054 0.184303 -0.0710105 -0.054195 0.167526 -0.0911199 -0.00901942 0.142666 0.0417398 -0.0969305 -0.235519 0.0413912 0.104828 0.0302041 0.026331 -0.0217969 0.0417808 -0.0641729 0.0436581 0.00259867 0.0157651 
0.0562121 0.027929 -0.0706892 -0.0170974 0.0708782 0.113698 0.0206362 -0.0233605 -0.0685017 0.0772677 0.0752731 0.0641429 0.0892183 -0.130728 -0.0638394 0.0147453 -0.0031927 0.135646 -0.0419105 0.101478 0.153292 -0.0776384 0.0984375 0.113359 -0.042383 0.0992501 -0.0230281 -0.258324 0.126474 0.0381762 0.0222343 0.102118 -0.027132 0.0527683 0.0308005 -0.0382137 -0.0316193 0.221452 0.043782 -0.0639718 -0.00442566 -0.0557354 -0.148777 0.116779 -0.148474 -0.0545413 0.117257 0.0249048 -0.121367 -0.053129 0.0346876 0.0637717 -0.0654725 -0.0191166 0.0380284 0.0154634 0.119708 0.102633 -0.0298847 -0.114513 -0.0407683 -0.109293 0.218592 -0.0690862 0.119444 -0.142485 -0.00723526 0.0382497 -0.00173812 0.131528 -0.065841 0.055533 -0.105025 0.0290976 -0.0436612 -0.127435 -0.0629368 0.176585 0.0203191 0.036055 -0.148655 0.0885172 -0.00515966 -0.0583225 -0.0100653 -0.0885678 0.107373 0.0752929 0.0568619 -0.0532281 0.0730439 -0.0427362 -0.0351489 -0.017371 0.0123575 -0.129918 0.0240134 0.127576 0.00688557 -0.0441506 0.0427069 0.0337234 -0.0636825 0.170106 0.0329015 -0.0202024 -0.00403965 0.0580851 0.165306 -0.0817406 -0.0618845 0.168275 -0.0879894 0.00265154 0.1383 0.0402045 -0.0988131 -0.233442 0.0373547 0.106146 0.0251038 0.0387924 -0.0183093 0.0349567 -0.0581805 0.0372056 -0.0013509 0.0094287 
0.0447808 0.0321767 -0.0611283 -0.017034 0.0515001 0.113926 0.013388 -0.0302613 -0.0672774 0.0752211 0.0824126 0.0468533 0.0939429 -0.108709 -0.0558107 0.0273915 -0.0064349 0.120731 -0.0229498 0.0791474 0.166476 -0.0814091 0.0918905 0.11179 -0.0338093 0.112309 -0.0270961 -0.25543 0.147976 0.0434503 0.0400386 0.104743 -0.0320073 0.0361826 0.0346861 -0.0219154 -0.0378323 0.222525 0.0633643 -0.0566273 -0.019133 -0.0522542 -0.155028 0.106873 -0.121406 -0.0568099 0.118763 0.0224009 -0.12554 -0.084587 0.0179642 0.0767899 -0.0475782 -0.0222095 0.0308246 0.027011 0.125302 0.116425 -0.0347222 -0.116234 -0.0433264 -0.101257 0.228255 -0.0719196 0.118912 -0.110975 0.0038522 0.0371871 0.00420087 0.130787 -0.0706012 0.0594196 -0.118336 0.0249497 -0.0322239 -0.136677 -0.0616237 0.168217 0.0194101 0.0449266 -0.14153 0.0844999 -0.00704149 -0.0684119 -0.0151265 -0.090715 0.100337 0.066831 0.0472624 -0.0655753 0.0800572 -0.0297386 -0.0258923 -0.00375939 0.0204111 -0.125914 0.0258362 0.139579 0.0159958 -0.0320766 0.0410999 0.0269767 -0.073099 0.161938 0.0302746 -0.00216835 0.00816459 0.0450506 0.180328 -0.0944907 -0.0750466 0.160035 -0.0941125 -0.0116842 0.156034 0.0547212 -0.0989719 -0.225689 0.0385928 0.104141 0.0228037 0.0204727 -0.0173041 0.0243489 -0.0728232 0.0580242 -0.00077036 0.0212757 
0.035758 0.0336631 -0.0685855 -0.0205022 0.0495385 0.113387 0.00857475 -0.029992 -0.0691975 0.0765613 0.0792351 0.0454395 0.097005 -0.10872 -0.060999 0.0330221 -0.0175395 0.111838 -0.0198001 0.086559 0.166041 -0.0925902 0.0944596 0.111171 -0.0343633 0.114854 -0.0270109 -0.25682 0.152227 0.0416775 0.0421052 0.0978137 -0.031787 0.0308633 0.0291979 -0.0135034 -0.043808 0.219683 0.0571908 -0.0559608 -0.0202603 -0.0573586 -0.148784 0.112072 -0.118225 -0.0557195 0.127734 0.0274831 -0.129528 -0.0820441 0.00673262 0.0663552 -0.0482153 -0.0242176 0.0359233 0.0301187 0.119232 0.121951 -0.0307483 -0.121273 -0.0443835 -0.0936813 0.237399 -0.0683888 0.120017 -0.104191 -0.00020396 0.0354426 0.00580753 0.123395 -0.0744843 0.0636439 -0.118591 0.0269556 -0.024053 -0.135199 -0.0602832 0.17302 0.0224691 0.0429235 -0.138808 0.0793522 -0.0119546 -0.0664636 -0.0237839 -0.0825664 0.0965347 0.0707296 0.053122 -0.0674805 0.0826961 -0.0282381 -0.0256543 -0.00584506 0.0227967 -0.123714 0.0232389 0.147001 0.0184047 -0.0336032 0.0381029 0.0184638 -0.0730653 0.152577 0.023213 0.00782126 0.00385976 0.0497409 0.176833 -0.0940356 -0.0756336 0.162774 -0.0899217 -0.0163534 0.152988 0.0578039 -0.0966066 -0.22006 0.039702 0.10651 0.0197612 0.0153831 -0.0149327 0.0241478 -0.0902076 0.0647402 -0.00940917 0.0249171 
0.0334908 0.0320678 -0.0661899 -0.0254334 0.0526384 0.114038 -0.00612748 -0.0321487 -0.073757 0.0685703 0.0768123 0.0503254 0.0923345 -0.107939 -0.0651837 0.0394106 -0.0146939 0.114043 -0.0171953 0.0871821 0.171479 -0.0829049 0.0964323 0.113793 -0.035048 0.122698 -0.0153319 -0.25879 0.146932 0.0424882 0.038229 0.0918007 -0.0260091 0.035418 0.0289115 -0.0113021 -0.0395585 0.21541 0.0610568 -0.050105 -0.0231133 -0.0528585 -0.13929 0.112366 -0.113575 -0.0524441 0.139387 0.0192554 -0.136377 -0.0778249 0.011323 0.0560573 -0.0486331 -0.0175072 0.0382589 0.0322442 0.12513 0.122068 -0.0309443 -0.124572 -0.0378073 -0.092439 0.236091 -0.0672351 0.121952 -0.112918 -0.0039609 0.0374767 0.0119049 0.12875 -0.0750568 0.058642 -0.120027 0.0192234 -0.0215627 -0.132311 -0.0638271 0.17906 0.0197538 0.0379008 -0.13835 0.0928237 -0.00890623 -0.0630037 -0.0297019 -0.0782906 0.0972757 0.0715851 0.0485709 -0.0645955 0.0800135 -0.0323553 -0.0297168 -0.000581295 0.0262926 -0.113701 0.0191249 0.152364 0.0151646 -0.0337997 0.0323631 0.0152768 -0.0780538 0.157951 0.0249619 0.00513792 -0.00284437 0.0454777 0.161762 -0.0989555 -0.0759712 0.159867 -0.0878295 -0.0118797 0.149361 0.057235 -0.101502 -0.228377 0.0334525 0.102393 0.0243692 0.0233471 -0.0105285 0.0167016 -0.0902734 0.0650459 -0.0104409 0.0221557 
0.0334908 0.0320678 -0.0661899 -0.0254334 0.0526384 0.114038 -0.00612748 -0.0321487 -0.073757 0.0685703 0.0768123 0.0503254 0.0923345 -0.107939 -0.0651837 0.0394106 -0.0146939 0.114043 -0.0171953 0.0871821 0.171479 -0.0829049 0.0964323 0.113793 -0.035048 0.122698 -0.0153319 -0.25879 0.146932 0.0424882 0.038229 0.0918007 -0.0260091 0.035418 0.0289115 -0.0113021 -0.0395585 0.21541 0.0610568 -0.050105 -0.0231133 -0.0528585 -0.13929 0.112366 -0.113575 -0.0524441 0.139387 0.0192554 -0.136377 -0.0778249 0.011323 0.0560573 -0.0486331 -0.0175072 0.0382589 0.0322442 0.12513 0.122068 -0.0309443 -0.124572 -0.0378073 -0.092439 0.236091 -0.0672351 0.121952 -0.112918 -0.0039609 0.0374767 0.0119049 0.12875 -0.0750568 0.058642 -0.120027 0.0192234 -0.0215627 -0.132311 -0.0638271 0.17906 0.0197538 0.0379008 -0.13835 0.0928237 -0.00890623 -0.0630037 -0.0297019 -0.0782906 0.0972757 0.0715851 0.0485709 -0.0645955 0.0800135 -0.0323553 -0.0297168 -0.000581295 0.0262926 -0.113701 0.0191249 0.152364 0.0151646 -0.0337997 0.0323631 0.0152768 -0.0780538 0.157951 0.0249619 0.00513792 -0.00284437 0.0454777 0.161762 -0.0989555 -0.0759712 0.159867 -0.0878295 -0.0118797 0.149361 0.057235 -0.101502 -0.228377 0.0334525 0.102393 0.0243692 0.0233471 -0.0105285 0.0167016 -0.0902734 0.0650459 -0.0104409 0.0221557 
0.0344603 0.0304525 -0.0816529 -0.0253438 0.0477122 0.117898 0.00560152 -0.0258658 -0.06796 0.0732843 0.0808937 0.055082 0.0972568 -0.119304 -0.0778631 0.0322422 -0.0358498 0.108894 -0.0275096 0.100787 0.16506 -0.0998733 0.0954314 0.115633 -0.0410951 0.112496 -0.0184165 -0.259162 0.146979 0.0423056 0.0314209 0.0877066 -0.0311499 0.0316639 0.0167372 -0.0133272 -0.0579302 0.212135 0.0445555 -0.0503265 -0.0207258 -0.0670682 -0.149416 0.12225 -0.119465 -0.0596273 0.134363 0.0280774 -0.137113 -0.0645527 0.0022525 0.0582561 -0.0537829 -0.0212496 0.0388763 0.0303981 0.111181 0.125912 -0.0308769 -0.123726 -0.0426507 -0.0866886 0.253732 -0.0609616 0.112216 -0.10926 -0.00459376 0.0324159 0.00361198 0.119457 -0.0765442 0.0614933 -0.115047 0.0313895 -0.0196572 -0.131272 -0.0584588 0.170152 0.0209733 0.0425811 -0.137475 0.0752178 -0.016463 -0.0642398 -0.0332713 -0.0660831 0.0952757 0.0701069 0.0606678 -0.0631259 0.0845613 -0.0378362 -0.0334095 -0.00428091 0.0227807 -0.120717 0.0166541 0.143501 0.024387 -0.0371401 0.0394974 0.0107508 -0.0738419 0.148612 0.0171394 0.016035 -0.00447367 0.0588074 0.158626 -0.095693 -0.0676513 0.168841 -0.0805345 -0.0189574 0.144226 0.0612623 -0.0946047 -0.213498 0.0488513 0.110087 0.0183738 0.00860882 -0.0117399 0.0226682 -0.0999402 0.0690812 -0.0144651 0.0243698 
0.035632 0.028228 -0.0795966 -0.0302938 0.0433597 0.120826 0.00572484 -0.0196818 -0.0622737 0.0683637 0.0812856 0.0577364 0.0941297 -0.129219 -0.0809254 0.0231769 -0.0475863 0.102087 -0.031139 0.102863 0.162932 -0.0976113 0.093409 0.113763 -0.0453502 0.113808 -0.0124703 -0.259839 0.143515 0.0366814 0.0289519 0.0779046 -0.0298695 0.0352719 0.0160988 -0.0181156 -0.0577856 0.214172 0.0421598 -0.0493944 -0.014933 -0.0753826 -0.155924 0.125257 -0.122482 -0.0621395 0.128933 0.0279917 -0.13783 -0.0566505 -0.00211489 0.0619264 -0.0534591 -0.0166197 0.0399871 0.0273264 0.108853 0.121652 -0.0393555 -0.126276 -0.0418244 -0.0890977 0.258718 -0.0548305 0.108019 -0.113376 -0.000986405 0.0314642 0.00603631 0.117792 -0.0789711 0.0552645 -0.114676 0.0344908 -0.0151843 -0.132115 -0.0618869 0.16569 0.0240709 0.0518575 -0.139512 0.0710652 -0.0110075 -0.0609063 -0.0306373 -0.0671974 0.100439 0.0743963 0.0647656 -0.0587595 0.0886994 -0.0436414 -0.0322197 -0.000871853 0.0144922 -0.127233 0.0171748 0.135867 0.0273015 -0.0408524 0.0426385 0.0124317 -0.0762794 0.145588 0.0201304 0.0139413 -0.00219321 0.0637387 0.152694 -0.095421 -0.0602264 0.170641 -0.0823224 -0.0177665 0.14241 0.062877 -0.0964503 -0.212279 0.0533297 0.110512 0.0208601 0.00752746 -0.0123754 0.0226053 -0.0941889 0.0664505 -0.00900775 0.0260463 
0.0316636 0.0633925 -0.0774727 -0.0364861 0.0337731 0.112504 0.00483941 -0.0239408 -0.073684 0.0990775 0.0887578 0.0472828 0.0897269 -0.126212 -0.0594767 0.0238073 -0.02145 0.112279 -0.0241785 0.0837556 0.126035 -0.0733191 0.0956183 0.110365 -0.0525161 0.11375 0.00370495 -0.240344 0.157351 0.0299728 0.0259059 0.0889345 -0.02182 0.035549 0.0140173 -0.0207504 -0.034405 0.222159 0.0470751 -0.0173355 -0.0214464 -0.0735372 -0.158855 0.117996 -0.129902 -0.0362937 0.13243 0.0275307 -0.146162 -0.059655 0.0243145 0.0914952 -0.0751322 -0.0192527 0.0177486 0.0310043 0.122927 0.111949 -0.0280763 -0.101971 -0.0573221 -0.10177 0.239702 -0.070695 0.113806 -0.131998 0.0063539 0.0278129 -0.00346628 0.136877 -0.0743939 0.05279 -0.113035 0.0560559 -0.00322835 -0.140264 -0.0668989 0.187183 0.0138756 0.0242281 -0.142404 0.0798336 -0.0110869 -0.0543647 -0.0278043 -0.0704608 0.0908043 0.0505587 0.054064 -0.0571814 0.0673812 -0.0401433 -0.0254871 -0.0128794 0.0365338 -0.126608 0.0264301 0.136591 0.0260632 -0.0419316 0.0203796 0.0271219 -0.0711665 0.171027 0.0237021 -0.000794354 -0.00445994 0.0582556 0.165903 -0.0984857 -0.062904 0.174526 -0.0704513 -0.00387161 0.130117 0.0408788 -0.0862251 -0.232398 0.0583283 0.108056 0.036173 0.0073976 -0.0137259 0.0321996 -0.0781266 0.0501242 -0.014531 0.0215285 
0.0180145 0.0841987 -0.0675663 -0.0463201 0.0324433 0.118377 0.00304769 -0.0341865 -0.0865048 0.109567 0.0800389 0.0266827 0.0997952 -0.0987369 -0.0287417 0.0337745 0.0143623 0.106993 -0.0138427 0.06964 0.111022 -0.0552333 0.0831081 0.102238 -0.0589836 0.121161 -0.0170838 -0.22166 0.184443 0.0288201 0.0509924 0.12438 -0.0280766 0.0349395 0.0260757 0.00522785 -0.00783871 0.225214 0.0610275 -0.0137405 -0.0209031 -0.0630685 -0.144619 0.0919189 -0.113444 -0.0205953 0.137956 0.0440923 -0.155831 -0.0872376 0.0127973 0.0951994 -0.068182 -0.0293204 0.00798778 0.0430034 0.112888 0.122986 -0.0278014 -0.0944621 -0.0759244 -0.081412 0.223581 -0.103655 0.12919 -0.102659 0.0208959 0.0238388 -0.0216204 0.132454 -0.0777042 0.0464368 -0.120187 0.0668789 0.00297648 -0.144965 -0.0591812 0.190984 0.0217822 -0.00404563 -0.128664 0.0888128 -0.0211111 -0.0619416 -0.021661 -0.0843768 0.0790202 0.0392375 0.0430961 -0.0457303 0.0783951 -0.0302701 -0.0122224 -0.00561352 0.0574838 -0.107875 0.0406291 0.147567 0.011405 -0.025696 0.00756891 0.0309534 -0.0870392 0.180352 0.010853 0.0145767 -0.00324364 0.0344035 0.181652 -0.0930542 -0.0749124 0.166968 -0.0800301 0.00188782 0.13146 0.0253567 -0.0852728 -0.245422 0.0522908 0.10566 0.0456793 -0.00527048 -0.00142103 0.0373149 -0.0843114 0.0486245 -0.0301665 0.00317551 
0.00101203 0.102384 -0.0527096 -0.0454649 0.0374735 0.137065 0.00681062 -0.0427866 -0.0843737 0.111009 0.0756541 0.011069 0.096658 -0.113921 -0.0117261 0.0381557 -0.0181181 0.105624 -0.0291014 0.074242 0.10796 -0.0631866 0.0814706 0.0867021 -0.0501532 0.105712 -0.0589666 -0.22129 0.198679 0.0168074 0.0734356 0.130518 -0.0443478 0.0323297 0.0387011 0.0279204 -0.0170375 0.207477 0.0685272 -0.0190079 0.00148104 -0.0774169 -0.141078 0.0765654 -0.116197 -0.0247864 0.139554 0.061824 -0.165583 -0.0918145 -0.0195916 0.0947082 -0.0624641 -0.0363319 -0.0026444 0.0428063 0.10305 0.115201 -0.0417928 -0.0973827 -0.0952287 -0.0518536 0.226833 -0.106177 0.12771 -0.0613336 0.02912 0.0179637 -0.0355655 0.123399 -0.0716483 0.0614454 -0.114917 0.0804273 0.021497 -0.144498 -0.0754047 0.172937 0.0302177 0.00344042 -0.113833 0.0863201 -0.0241161 -0.0517021 -0.0272286 -0.0583281 0.0707257 0.0479903 0.0361097 -0.0358053 0.105215 -0.0246462 -0.00671569 -0.00160485 0.0357066 -0.119832 0.0292159 0.154179 0.00189794 -0.0250656 0.0129019 0.0117507 -0.0927659 0.159525 0.0140607 0.0478616 0.0107829 0.0515072 0.198448 -0.0741065 -0.0795144 0.165442 -0.0852699 -0.00471864 0.135604 0.0230235 -0.0974083 -0.218911 0.0622476 0.11157 0.0552303 -0.0258962 -0.000685072 0.0436592 -0.0996613 0.0598749 -0.0285769 0.0112723 
0.00101203 0.102384 -0.0527096 -0.0454649 0.0374735 0.137065 0.00681062 -0.0427866 -0.0843737 0.111009 0.0756541 0.011069 0.096658 -0.113921 -0.0117261 0.0381557 -0.0181181 0.105624 -0.0291014 0.074242 0.10796 -0.0631866 0.0814706 0.0867021 -0.0501532 0.105712 -0.0589666 -0.22129 0.198679 0.0168074 0.0734356 0.130518 -0.0443478 0.0323297 0.0387011 0.0279204 -0.0170375 0.207477 0.0685272 -0.0190079 0.00148104 -0.0774169 -0.141078 0.0765654 -0.116197 -0.0247864 0.139554 0.061824 -0.165583 -0.0918145 -0.0195916 0.0947082 -0.0624641 -0.0363319 -0.0026444 0.0428063 0.10305 0.115201 -0.0417928 -0.0973827 -0.0952287 -0.0518536 0.226833 -0.106177 0.12771 -0.0613336 0.02912 0.0179637 -0.0355655 0.123399 -0.0716483 0.0614454 -0.114917 0.0804273 0.021497 -0.144498 -0.0754047 0.172937 0.0302177 0.00344042 -0.113833 0.0863201 -0.0241161 -0.0517021 -0.0272286 -0.0583281 0.0707257 0.0479903 0.0361097 -0.0358053 0.105215 -0.0246462 -0.00671569 -0.00160485 0.0357066 -0.119832 0.0292159 0.154179 0.00189794 -0.0250656 0.0129019 0.0117507 -0.0927659 0.159525 0.0140607 0.0478616 0.0107829 0.0515072 0.198448 -0.0741065 -0.0795144 0.165442 -0.0852699 -0.00471864 0.135604 0.0230235 -0.0974083 -0.218911 0.0622476 0.11157 0.0552303 -0.0258962 -0.000685072 0.0436592 -0.0996613 0.0598749 -0.0285769 0.0112723 
0.0232078 0.0932004 -0.0710455 -0.0381461 0.0582988 0.134579 0.0100475 -0.0395953 -0.0919422 0.101349 0.0821744 0.0404107 0.102374 -0.129145 -0.0403529 0.0407698 -0.00412911 0.119016 -0.0460191 0.105961 0.127469 -0.0700327 0.0811622 0.107217 -0.0509581 0.0946868 -0.0436393 -0.224817 0.179661 0.0399066 0.0433962 0.120841 -0.0347893 0.0510671 0.0279153 0.00767683 -0.0180815 0.201919 0.0582975 -0.0347828 -0.00552601 -0.0787392 -0.116685 0.0914225 -0.123673 -0.0316942 0.154511 0.0527652 -0.175464 -0.0629925 0.00599496 0.0731925 -0.0799236 -0.0284277 0.0174745 0.036191 0.0871627 0.115168 -0.0395548 -0.100949 -0.0824063 -0.0673923 0.234062 -0.108892 0.128006 -0.092251 0.00263181 0.0172868 -0.0491558 0.117393 -0.0701493 0.053664 -0.117603 0.0623223 0.0050351 -0.127218 -0.0543808 0.183864 0.0284638 0.00505602 -0.12277 0.0848852 -0.0196823 -0.0471344 -0.032218 -0.0494802 0.072521 0.048938 0.0514364 -0.0227099 0.0922898 -0.0518462 -0.0308028 0.00618606 0.0335473 -0.111582 0.0218429 0.14787 -0.0038827 -0.0362938 0.0169405 0.0199477 -0.0903068 0.177216 0.00833387 0.0414462 -0.00219288 0.0676424 0.173095 -0.0848413 -0.075398 0.165217 -0.0827063 0.0116269 0.12853 0.0212784 -0.101161 -0.216648 0.0534858 0.123748 0.0415828 -0.00858096 -6.54566e-05 0.0471362 -0.0896458 0.0571598 -0.0225668 -0.00939028 
0.0314138 0.0912603 -0.0836729 -0.0345428 0.0642962 0.130494 0.0160922 -0.0401798 -0.101812 0.102746 0.0811095 0.0513429 0.105773 -0.128758 -0.0521235 0.0401846 0.006717 0.12471 -0.0440603 0.111924 0.130197 -0.068665 0.074621 0.110938 -0.0520704 0.0961545 -0.0397203 -0.223474 0.175212 0.0535624 0.0264198 0.125562 -0.0352556 0.0516012 0.0213779 -0.0026083 -0.0181597 0.195734 0.0543717 -0.035734 -0.00643083 -0.0744019 -0.10344 0.10211 -0.129347 -0.0294947 0.165164 0.046147 -0.175198 -0.0609072 0.0252904 0.0689021 -0.0892937 -0.0261075 0.026282 0.0341553 0.0835419 0.117218 -0.0305444 -0.099018 -0.0737588 -0.0737003 0.233543 -0.105761 0.128111 -0.108078 -0.00330602 0.0119663 -0.0479658 0.113718 -0.0675654 0.0544495 -0.111406 0.0606156 -0.00320163 -0.119282 -0.0489398 0.190445 0.0236396 -0.00127757 -0.121271 0.0902058 -0.0165985 -0.044313 -0.0324008 -0.0491933 0.0764303 0.0454715 0.0532151 -0.0245117 0.0792187 -0.0561869 -0.0426398 0.000863047 0.0335774 -0.109467 0.0272477 0.146395 -0.0035413 -0.0399833 0.0135216 0.0307538 -0.078565 0.187873 -0.00405866 0.0341983 -0.0120599 0.0769818 0.161741 -0.0860071 -0.0684405 0.16005 -0.0849226 0.0130472 0.118136 0.0165621 -0.0970107 -0.222749 0.04703 0.121539 0.0354137 -0.00142408 0.00244959 0.0435875 -0.0878131 0.0553263 -0.0259028 -0.0156284 
0.0281325 0.103313 -0.0760257 -0.0215791 0.0618102 0.122078 0.0293922 -0.047539 -0.0963547 0.113962 0.0822186 0.0466763 0.102452 -0.123377 -0.0457389 0.0397418 0.00454434 0.134055 -0.0377385 0.0997033 0.134399 -0.0792179 0.0691017 0.109406 -0.0369743 0.0869663 -0.054268 -0.221517 0.183417 0.0703971 0.0264629 0.13404 -0.0333957 0.0432932 0.0305242 -0.00815953 -0.0226345 0.19398 0.0573589 -0.0467972 -0.0110891 -0.074709 -0.095737 0.101328 -0.126265 -0.0271283 0.164506 0.0386699 -0.174201 -0.0743274 0.0297722 0.0795076 -0.0840769 -0.0338143 0.029539 0.0410215 0.0792274 0.114903 -0.0312067 -0.0963666 -0.0732724 -0.0825356 0.228001 -0.105554 0.131437 -0.0965158 -0.00725515 0.00238202 -0.0581456 0.117917 -0.0636714 0.0608422 -0.115513 0.0545106 -0.00880382 -0.117957 -0.0441326 0.182914 0.0236125 -0.00234602 -0.125777 0.0906288 -0.0222203 -0.0418766 -0.0260724 -0.0578364 0.0677295 0.0386254 0.056989 -0.0222556 0.0725151 -0.051155 -0.043961 -0.00459972 0.0323028 -0.11331 0.0265634 0.14884 0.0075717 -0.0379428 0.0177167 0.0326805 -0.0685041 0.179267 -0.00855933 0.0367249 -0.00387136 0.0764581 0.17868 -0.0858382 -0.0719555 0.154203 -0.0927748 0.000479627 0.128509 0.0176569 -0.0865576 -0.220166 0.0529831 0.125304 0.0369214 -0.0013791 -0.00513626 0.0440777 -0.0839055 0.0624919 -0.00867404 -0.0122763 
0.0322282 0.0891337 -0.0792816 -0.0222481 0.0651279 0.12192 0.0314374 -0.0346822 -0.0881526 0.107794 0.0856213 0.0534176 0.0983651 -0.127396 -0.0500927 0.032278 0.000222749 0.126955 -0.0383765 0.09262 0.138773 -0.0820792 0.0726384 0.0990088 -0.0305216 0.0905638 -0.0442282 -0.22488 0.173103 0.0597338 0.0313474 0.126828 -0.0324748 0.0431558 0.0191894 -0.0184223 -0.029071 0.197196 0.0601894 -0.0386897 0.00138994 -0.0702288 -0.109299 0.108258 -0.135715 -0.0407219 0.149707 0.0268967 -0.156559 -0.0796408 0.0318793 0.0854738 -0.0896273 -0.0311337 0.0236229 0.038081 0.0875736 0.11519 -0.0358577 -0.0928803 -0.0718576 -0.0987146 0.228592 -0.0970703 0.129147 -0.107677 -0.00616439 0.0120263 -0.0410359 0.122974 -0.0590273 0.0692221 -0.112606 0.0528224 -0.00902275 -0.118361 -0.0504233 0.18262 0.0108506 0.00942874 -0.141038 0.0861582 -0.00191437 -0.0345167 -0.0267094 -0.0592963 0.0879164 0.047902 0.0549105 -0.0438174 0.0644189 -0.0533121 -0.0467382 -0.00965835 0.0305521 -0.126403 0.0282481 0.139411 0.00275887 -0.0354374 0.00956287 0.0314019 -0.0631091 0.186425 -0.000200926 0.0253447 -0.00506136 0.0844382 0.176028 -0.0948598 -0.0736409 0.151277 -0.0991745 0.00620442 0.134745 0.0192022 -0.0884139 -0.220339 0.0590324 0.126257 0.0373798 0.0084886 -0.0125879 0.042514 -0.0736387 0.0534841 -0.00959049 0.00367642 
0.0389571 0.063604 -0.0875802 -0.0285495 0.0675189 0.129027 0.0195489 -0.0292867 -0.0770153 0.0871543 0.0913615 0.070068 0.108267 -0.131076 -0.0785478 0.0309184 -0.0138626 0.134365 -0.0642019 0.103664 0.159066 -0.0834092 0.0761956 0.110914 -0.0435199 0.0938937 -0.028584 -0.232348 0.149316 0.0592769 0.0225085 0.11417 -0.0302841 0.0526665 0.00823579 -0.0226902 -0.0440281 0.194509 0.0454212 -0.0433067 0.00137973 -0.0713399 -0.112626 0.129886 -0.137494 -0.0674891 0.145632 0.0281251 -0.154486 -0.0620596 0.036518 0.0555691 -0.0935733 -0.0223364 0.0304002 0.0365282 0.0786372 0.119431 -0.0301706 -0.109698 -0.0618634 -0.0979342 0.240788 -0.0776029 0.11715 -0.124123 -0.0143508 0.0251569 -0.0309249 0.122641 -0.05947 0.0561822 -0.102667 0.0336074 -0.0221669 -0.114671 -0.0542635 0.175584 0.00472438 0.0161757 -0.135199 0.0849375 0.000166343 -0.0419991 -0.0435546 -0.0505683 0.103577 0.0534599 0.0589682 -0.0395323 0.0628401 -0.0742975 -0.0570432 -0.00818317 0.0201281 -0.114491 0.00938716 0.1338 -0.00140079 -0.0347921 0.0233979 0.0288955 -0.0653545 0.185659 0.0092636 0.0157956 -0.0234424 0.0870428 0.148132 -0.102578 -0.0682738 0.157253 -0.0966893 0.0149727 0.129019 0.0272781 -0.0974772 -0.214361 0.0551769 0.123025 0.0337983 0.0119577 -0.0126307 0.0361342 -0.0737193 0.0489137 -0.0168369 0.00533002 
0.0389571 0.063604 -0.0875802 -0.0285495 0.0675189 0.129027 0.0195489 -0.0292867 -0.0770153 0.0871543 0.0913615 0.070068 0.108267 -0.131076 -0.0785478 0.0309184 -0.0138626 0.134365 -0.0642019 0.103664 0.159066 -0.0834092 0.0761956 0.110914 -0.0435199 0.0938937 -0.028584 -0.232348 0.149316 0.0592769 0.0225085 0.11417 -0.0302841 0.0526665 0.00823579 -0.0226902 -0.0440281 0.194509 0.0454212 -0.0433067 0.00137973 -0.0713399 -0.112626 0.129886 -0.137494 -0.0674891 0.145632 0.0281251 -0.154486 -0.0620596 0.036518 0.0555691 -0.0935733 -0.0223364 0.0304002 0.0365282 0.0786372 0.119431 -0.0301706 -0.109698 -0.0618634 -0.0979342 0.240788 -0.0776029 0.11715 -0.124123 -0.0143508 0.0251569 -0.0309249 0.122641 -0.05947 0.0561822 -0.102667 0.0336074 -0.0221669 -0.114671 -0.0542635 0.175584 0.00472438 0.0161757 -0.135199 0.0849375 0.000166343 -0.0419991 -0.0435546 -0.0505683 0.103577 0.0534599 0.0589682 -0.0395323 0.0628401 -0.0742975 -0.0570432 -0.00818317 0.0201281 -0.114491 0.00938716 0.1338 -0.00140079 -0.0347921 0.0233979 0.0288955 -0.0653545 0.185659 0.0092636 0.0157956 -0.0234424 0.0870428 0.148132 -0.102578 -0.0682738 0.157253 -0.0966893 0.0149727 0.129019 0.0272781 -0.0974772 -0.214361 0.0551769 0.123025 0.0337983 0.0119577 -0.0126307 0.0361342 -0.0737193 0.0489137 -0.0168369 0.00533002 
0.0409546 0.0508099 -0.0851764 -0.0267506 0.069221 0.132741 0.0138365 -0.026401 -0.0695279 0.0743092 0.0890347 0.0711451 0.107327 -0.127477 -0.0817379 0.0270501 -0.0210974 0.13174 -0.0722406 0.108838 0.163167 -0.0897206 0.0883312 0.119446 -0.0420803 0.088292 -0.0283612 -0.235575 0.137489 0.0472095 0.0298131 0.103407 -0.0299297 0.0565069 0.00237327 -0.0170344 -0.0513971 0.198483 0.0314574 -0.0474509 0.00410962 -0.066898 -0.119301 0.132601 -0.141401 -0.0783121 0.139313 0.0313131 -0.143768 -0.0480724 0.030167 0.0445294 -0.0902395 -0.0210009 0.0375142 0.0347783 0.0799889 0.124932 -0.0233849 -0.119658 -0.0641185 -0.090351 0.241612 -0.073977 0.11194 -0.121847 -0.0153979 0.032027 -0.029088 0.129884 -0.0587994 0.0585379 -0.0980309 0.0337337 -0.0215228 -0.116037 -0.0568146 0.171034 0.00583439 0.0205542 -0.137224 0.081706 0.000571199 -0.0492377 -0.0468215 -0.0485586 0.107127 0.0614184 0.059088 -0.0413397 0.0699488 -0.0774201 -0.051691 -0.0171321 0.0208202 -0.114734 0.00139499 0.136258 -0.00353238 -0.0348398 0.0270956 0.0258831 -0.063509 0.178172 0.0126383 0.0154971 -0.0289692 0.0807895 0.146486 -0.104817 -0.0670135 0.167363 -0.0910773 0.0165143 0.131576 0.0341125 -0.0939497 -0.211196 0.0563513 0.128043 0.0329486 0.014661 -0.0157141 0.0367894 -0.0807235 0.048808 -0.0148547 0.0146351 
0.0382639 0.045734 -0.0843871 -0.0196049 0.0674104 0.14334 0.0205238 -0.0331407 -0.0589173 0.0720543 0.0893578 0.072535 0.101882 -0.13362 -0.082038 0.0184202 -0.0377343 0.137964 -0.0705328 0.102696 0.163649 -0.0903924 0.0863775 0.126999 -0.0421591 0.0808929 -0.0397171 -0.243229 0.137571 0.049373 0.0353251 0.103107 -0.0390413 0.0528864 0.0132878 -0.00935536 -0.0585434 0.184446 0.0273096 -0.0514595 0.0107514 -0.06972 -0.130378 0.13367 -0.145009 -0.0868894 0.133982 0.0386669 -0.136131 -0.0465287 0.0219984 0.0461727 -0.0814605 -0.025183 0.0403715 0.0400692 0.0802206 0.128153 -0.0309609 -0.116369 -0.0675072 -0.0790964 0.252887 -0.0746313 0.111811 -0.116487 -0.00850665 0.0214388 -0.032639 0.1404 -0.0624314 0.0640033 -0.0973016 0.0412362 -0.0257246 -0.120666 -0.0598942 0.16339 0.00594411 0.0199769 -0.133 0.0857126 -0.00536284 -0.0531826 -0.0455891 -0.0465092 0.105404 0.0599091 0.0537286 -0.0364869 0.0848361 -0.0735581 -0.0473814 -0.0229096 0.0174762 -0.119058 -0.0042255 0.133574 0.00464949 -0.0277067 0.0398726 0.0235962 -0.0634397 0.160838 0.019337 0.0214663 -0.0201787 0.0728614 0.143643 -0.087939 -0.0656765 0.167034 -0.0844275 0.00223452 0.134046 0.0420459 -0.0828136 -0.206099 0.0640132 0.12974 0.0389881 0.00124796 -0.0159344 0.0336288 -0.090735 0.0580732 -0.0111124 0.0225148 
