0.0491824 0.0530242 -0.173278 -0.04948 0.0706714 0.182196 0.0212637 -0.0741963 -0.0519671 0.0120816 0.110041 0.0625165 0.134487 -0.0250286 -0.0709826 0.0151003 -0.123167 0.0494164 -0.0759631 0.0672515 0.179306 -0.0774435 0.0376716 0.0694991 0.036688 0.0264013 -0.0139925 -0.208131 0.0816427 0.153781 0.0152864 0.0566269 -0.0819923 -0.0131375 -0.0294263 0.0525466 -0.150562 0.0582043 0.0312903 0.0204666 0.00198623 -0.0635588 -0.0899867 0.185964 -0.135037 -0.0300934 0.141461 0.023956 -0.129939 -0.0694025 0.0124632 0.0333673 -0.0749694 -0.0272385 0.0432564 0.0488212 -0.0368096 0.213892 -0.0147935 -0.0963841 -0.0832125 -0.0529119 0.30192 -0.0452597 0.0414096 -0.0716299 0.0152677 0.0994631 0.00869625 0.0920729 0.0424441 0.135973 -0.0640665 -0.076406 0.00422414 -0.00775524 -0.105078 0.0324136 -0.0589463 0.119252 -0.0313122 0.0463035 -0.00113181 -0.0374118 -0.149278 0.05977 0.11217 -0.0265919 0.00707442 -0.0548295 0.0388425 -0.133981 -0.100273 -0.00864307 -0.0624795 -0.125071 -0.0444078 0.0721527 0.0677087 -0.0518833 0.0194119 0.0126016 0.00383044 0.094222 -0.134422 0.0929634 -0.123131 0.162935 0.0276319 -0.0876829 0.0331283 0.0945445 -0.136576 -0.0166773 0.0731797 0.110494 -0.136874 -0.0855779 0.0544186 0.132126 0.0363576 -0.0602632 -0.010101 0.0523202 -0.0917606 0.0925576 -0.0377391 0.0684385 
-0.00323186 0.0634783 -0.116023 -0.0435154 0.0728898 0.188349 0.00841308 -0.0622972 -0.0491815 0.0364787 0.113957 0.0263811 0.137806 -0.00793785 0.0246408 0.0289881 -0.101349 0.0661651 -0.035331 0.0464347 0.186517 -0.0950133 0.0741095 0.0406252 0.0675832 0.0150354 -0.0525055 -0.226559 0.101556 0.118945 0.0891936 0.0510181 -0.0237105 -0.013245 0.0194912 0.0880055 -0.10516 0.0846433 0.0436296 -0.0101472 0.0227468 -0.0640397 -0.0735388 0.156936 -0.162079 -0.0428732 0.143873 0.0108584 -0.138056 -0.117437 -0.0307026 -0.0106063 -0.0569979 -0.0412039 0.0235893 0.0881777 -0.0332912 0.186621 -0.0403275 -0.0894422 -0.127229 -0.0679857 0.259739 -0.0989728 0.13112 -0.00518276 -0.000299631 0.0870023 -0.0241788 0.102527 0.0445445 0.140676 -0.0985672 -0.117196 0.0315794 -0.0111161 -0.117369 0.0450298 -0.0395607 0.089727 -0.0882716 0.0336939 -0.000442111 -0.00982276 -0.149806 0.0523125 0.11246 -0.0101797 -0.00471264 -0.0476328 0.0490865 -0.123937 -0.0797253 -0.0151548 -0.0518413 -0.1335 -0.0679695 0.115549 0.0233855 -0.0189444 -0.0023605 -0.0151349 -0.010956 0.0486376 -0.0881014 0.120742 -0.0732129 0.119712 0.0848328 -0.103274 -0.0483089 0.0643034 -0.130474 -0.0334401 0.119232 0.0922978 -0.135319 -0.096928 0.0527735 0.164822 0.0653821 -0.082507 -0.0408239 0.0760279 -0.0615454 0.105791 -0.00281878 0.0988007 
0.0255202 0.0494944 -0.145595 -0.0787437 0.0846331 0.191188 0.020106 -0.0285552 -0.0575791 0.0270099 0.113929 0.0512792 0.163827 -0.0175632 -0.0269998 0.00469282 -0.0930049 0.0664835 -0.0770053 0.0707066 0.191028 -0.0817183 0.0516739 0.0357415 0.0255796 0.0206736 -0.0282577 -0.207052 0.0948264 0.120719 0.0528767 0.0426828 -0.0388922 8.55769e-05 -0.0040124 0.0563101 -0.1114 0.083065 0.0332364 -0.0115891 0.0290485 -0.0644958 -0.0827848 0.18433 -0.175514 -0.0566274 0.123886 0.0310103 -0.141528 -0.0940914 -0.0267522 -0.0106438 -0.0811164 -0.024878 0.0159638 0.0676793 -0.0507005 0.190893 -0.0462755 -0.104623 -0.110987 -0.0686558 0.280592 -0.0689494 0.0877849 -0.0422045 -0.000110674 0.106938 -0.00950623 0.0684447 0.0442271 0.112028 -0.0741994 -0.126077 0.00957212 0.003995 -0.115779 0.0397041 -0.029554 0.0972302 -0.0790669 0.0256979 0.0177972 -0.000825852 -0.148011 0.0516861 0.139352 0.00284865 0.0243541 -0.0448851 0.048588 -0.149058 -0.090749 0.000126666 -0.0688622 -0.146337 -0.063386 0.092178 0.00739073 -0.0358647 0.0184606 0.00799807 -0.00825241 0.0768876 -0.10203 0.104082 -0.101181 0.14624 0.051549 -0.104672 -0.00886262 0.0667229 -0.149809 0.00446282 0.0875963 0.0892598 -0.153185 -0.092949 0.0446392 0.147784 0.0418562 -0.0836864 -0.0396628 0.068603 -0.0585725 0.0807325 -0.0356438 0.0762534 
0.00558104 0.0531739 -0.137597 -0.0611441 0.0912131 0.16427 0.0282181 -0.0453152 -0.0442695 0.0439521 0.114287 0.0411837 0.150626 0.0208619 0.00388357 0.000161629 -0.054536 0.0744291 -0.0238442 0.0615278 0.181268 -0.0998903 0.0665412 0.0240227 0.0540199 0.0207562 -0.0360644 -0.209338 0.121286 0.129079 0.083564 0.0451856 0.00224975 -0.0287209 0.0203104 0.0654173 -0.0953382 0.118107 0.0442581 -0.0357416 0.0121876 -0.0357037 -0.091299 0.163865 -0.181344 -0.0439897 0.113284 0.00994566 -0.119806 -0.135411 -0.0581093 0.011866 -0.0499079 -0.0454381 0.00744876 0.0856244 -0.0394265 0.193354 -0.0677026 -0.0835256 -0.125357 -0.0926402 0.272768 -0.0978514 0.129735 -0.0138294 -0.00535399 0.09746 -0.0297321 0.0711786 0.0552129 0.115608 -0.101033 -0.141312 0.00727221 0.00483473 -0.104704 0.0387004 -0.0245549 0.0749767 -0.123467 0.0297342 0.00479305 0.00634958 -0.114889 0.00896864 0.119461 0.00869337 0.0270874 -0.065084 0.0412889 -0.121493 -0.0707483 0.000333466 -0.0227305 -0.167634 -0.0553197 0.108088 0.00778376 -0.021248 -0.000413903 -0.000448124 -0.0102366 0.0536944 -0.106511 0.120632 -0.0546834 0.102546 0.11116 -0.109224 -0.0373285 0.0471226 -0.143962 -0.00391977 0.114649 0.085751 -0.142018 -0.109007 0.0493598 0.161572 0.0324956 -0.0852782 -0.0690215 0.0699255 -0.0504097 0.0984137 -0.010611 0.0862433 
0.0201935 0.0366107 -0.139938 -0.0568052 0.0864595 0.175422 0.0355791 -0.040843 -0.0506169 0.0354375 0.110096 0.0497573 0.162707 0.000384298 -0.00967418 -0.00594642 -0.0800113 0.0760744 -0.0497826 0.0856635 0.187492 -0.111772 0.0667176 0.0405822 0.037756 0.0159058 -0.05025 -0.226065 0.0915792 0.126785 0.0658514 0.0473872 -0.0181255 -0.00937999 0.0163704 0.0631459 -0.104769 0.114521 0.0277838 -0.0485755 0.017422 -0.0560784 -0.0917528 0.168787 -0.185364 -0.054609 0.118457 0.0248207 -0.125553 -0.101981 -0.0497832 -0.0138018 -0.0508936 -0.0319857 0.0282827 0.0727239 -0.0457217 0.188204 -0.0540136 -0.103431 -0.11247 -0.0743071 0.276096 -0.0893312 0.116358 -0.0166275 -0.00476664 0.0984843 -0.0314876 0.0586102 0.0448971 0.114301 -0.0890752 -0.130877 0.00224023 0.00599126 -0.104444 0.0288953 -0.00787609 0.0941481 -0.11036 0.0159511 -0.00240272 -0.008731 -0.130603 0.0231017 0.125089 0.0121526 0.0369582 -0.0521838 0.0531028 -0.130254 -0.065277 -0.00441495 -0.0608019 -0.158213 -0.0582753 0.104093 0.0156774 -0.0332047 0.0248613 0.0054639 -0.010196 0.0544072 -0.0988893 0.114968 -0.0730377 0.119903 0.0865357 -0.0958088 -0.0277493 0.0659833 -0.143113 -0.0143235 0.103406 0.0966407 -0.1437 -0.0984289 0.0406259 0.161589 0.0300575 -0.088311 -0.0546684 0.0754665 -0.0590538 0.0961948 -0.0141088 0.0794975 
0.026401 0.0365257 -0.148774 -0.0620125 0.0776827 0.167716 0.0090536 -0.036813 -0.0705318 0.0271489 0.113168 0.0635586 0.164146 -0.0135441 -0.0473806 0.00956691 -0.078035 0.0799521 -0.0539667 0.0986824 0.197498 -0.106272 0.0722165 0.0452211 0.0252003 0.0351319 -0.016796 -0.225503 0.0893702 0.129968 0.0368037 0.0442705 -0.0115891 -0.00317917 -0.0018008 0.0454248 -0.10804 0.116415 0.0304515 -0.0366062 0.0031597 -0.0638293 -0.0802883 0.180368 -0.179076 -0.0560703 0.140453 0.0116426 -0.144614 -0.0849504 -0.0243511 -0.0117634 -0.0632837 -0.0151052 0.030661 0.0628427 -0.0246817 0.17542 -0.0419916 -0.112738 -0.09586 -0.0817219 0.282757 -0.0715853 0.104184 -0.0490611 -0.0136137 0.0951675 -0.0166382 0.064329 0.0303074 0.0968555 -0.087685 -0.127634 0.00565824 -0.000347459 -0.100471 0.0472529 -0.0198769 0.0987589 -0.105478 0.020222 0.00524511 -0.00893839 -0.137714 0.0365922 0.123037 0.0129461 0.0398017 -0.0532855 0.039424 -0.136137 -0.0824613 0.00478892 -0.0584849 -0.147245 -0.0552367 0.119641 0.0170194 -0.0462881 0.0204594 0.0104001 -0.0117928 0.0836984 -0.087554 0.101355 -0.0829832 0.140278 0.0678093 -0.116058 -0.0307041 0.0732738 -0.13824 -0.00397616 0.0924042 0.0922193 -0.146226 -0.109426 0.0420852 0.153943 0.022623 -0.075029 -0.0435851 0.0563143 -0.0605504 0.0905761 -0.0171443 0.0757802 
0.0187824 0.0264313 -0.132832 -0.0548693 0.0805724 0.166267 0.0275376 -0.0346863 -0.04133 0.0219182 0.112508 0.0604821 0.159416 -0.0117927 -0.0293623 -0.0124789 -0.0935982 0.0739385 -0.0647597 0.105127 0.187142 -0.118727 0.0719635 0.0636591 0.0258479 0.0164154 -0.0367205 -0.225778 0.0891044 0.112111 0.0634707 0.0312853 -0.0163781 -0.00619351 -0.00017284 0.0612051 -0.115089 0.121066 0.00630769 -0.0397688 0.0224784 -0.0578884 -0.106521 0.17608 -0.18637 -0.0669976 0.119556 0.0234552 -0.121138 -0.0819172 -0.0585307 -0.0203797 -0.0575423 -0.0288574 0.032386 0.0698324 -0.0457511 0.190868 -0.0499599 -0.10938 -0.109674 -0.070076 0.28353 -0.0735054 0.103423 -0.0278417 0.00146316 0.0866075 -0.0286104 0.0611959 0.0372639 0.107723 -0.0772063 -0.113231 0.0107764 -0.00326322 -0.105972 0.0400067 -0.0075684 0.0951023 -0.11326 0.0184342 -0.00684633 -0.0152394 -0.128369 0.0323674 0.126402 0.0221884 0.0366635 -0.057397 0.0608947 -0.13243 -0.0605407 -0.00955264 -0.0568665 -0.160757 -0.0664795 0.100378 0.022233 -0.0395161 0.0202884 -0.00517022 -0.0122213 0.0569131 -0.0937855 0.116299 -0.0739233 0.123109 0.0816982 -0.102615 -0.0251763 0.08457 -0.13297 -0.0109859 0.0930993 0.0985118 -0.142764 -0.101651 0.0424806 0.16238 0.0216854 -0.0791923 -0.0650564 0.0753895 -0.0744966 0.0977707 -0.0240288 0.080085 
0.0430769 0.00899101 -0.152984 -0.0571509 0.0886058 0.157446 0.0217173 -0.0332614 -0.0515113 -3.03596e-05 0.104046 0.0800404 0.166281 -0.0240552 -0.0706607 -0.00578373 -0.0953594 0.0693832 -0.0972022 0.133712 0.192147 -0.108657 0.074501 0.061143 0.00199606 0.0234003 -0.0220281 -0.226319 0.0564441 0.117784 0.0234018 0.0350237 -0.0295919 0.00913744 -0.0186839 0.0457563 -0.119073 0.125531 -0.010367 -0.0371863 0.0147941 -0.0531485 -0.0986086 0.190419 -0.18726 -0.0549942 0.129159 0.0260232 -0.120759 -0.0419404 -0.0293829 -0.0296026 -0.0805175 -0.00812126 0.0527231 0.0386349 -0.0427493 0.179896 -0.0304189 -0.119232 -0.0842344 -0.0721011 0.282665 -0.050591 0.0790785 -0.0796215 -0.0051479 0.107305 -0.00375623 0.0590315 0.0413289 0.100577 -0.0541004 -0.110277 -0.00809498 0.00728376 -0.105042 0.0475528 -0.0164764 0.104591 -0.0890064 0.0217574 -0.00899838 -0.0224226 -0.14134 0.041719 0.132741 0.0274571 0.039366 -0.0534056 0.0506075 -0.147712 -0.0764327 -0.0151188 -0.0751526 -0.148608 -0.0571108 0.0910828 0.0267328 -0.0594348 0.0242993 0.00792363 -0.00623256 0.0815784 -0.0978929 0.0873015 -0.107746 0.152907 0.0493219 -0.0960925 -0.00636005 0.095786 -0.137414 0.00858604 0.0695493 0.0992177 -0.147504 -0.106147 0.0249852 0.148654 0.00538993 -0.0452949 -0.0418198 0.0768845 -0.0690041 0.073691 -0.0337727 0.0623883 
0.0436862 -0.000686283 -0.158958 -0.0583047 0.100404 0.15007 0.0248052 -0.0338925 -0.0325314 -0.00431078 0.0967689 0.0836677 0.159678 -0.0438114 -0.0903714 -0.00163397 -0.107265 0.0750907 -0.121893 0.138553 0.193263 -0.103957 0.0626595 0.0632603 -0.00748269 0.0249307 -0.0278349 -0.225047 0.0532226 0.109685 0.0232143 0.0433267 -0.0491543 0.0087677 -0.0223404 0.0423215 -0.1276 0.114782 -0.0174205 -0.0338916 0.0272906 -0.047127 -0.102712 0.203733 -0.175862 -0.0594354 0.12218 0.0422718 -0.104898 -0.0388161 -0.0287521 -0.0325983 -0.0941907 -0.0163206 0.0527798 0.0264723 -0.0485013 0.175485 -0.0230567 -0.122035 -0.0698501 -0.0710184 0.279507 -0.0225361 0.0593756 -0.106139 -0.00373994 0.109998 0.0192561 0.0563985 0.0438064 0.104937 -0.0338204 -0.101053 -0.0253201 -0.000669145 -0.113832 0.0644777 -0.0244192 0.100095 -0.0686524 0.0433842 -0.0129535 -0.0216866 -0.136716 0.0446154 0.139433 0.041292 0.03703 -0.0596281 0.0532396 -0.137725 -0.0874178 -0.0263464 -0.0781016 -0.143771 -0.0579332 0.0743387 0.0231126 -0.0649362 0.0282918 -0.0024219 -0.00200638 0.0841997 -0.0945152 0.0726791 -0.118837 0.161704 0.0443908 -0.0754857 0.00443274 0.10267 -0.145811 0.0158389 0.0593207 0.0929366 -0.153732 -0.108987 0.0160704 0.131605 0.00111673 -0.0182653 -0.0361459 0.079393 -0.0849558 0.0563462 -0.0551646 0.054119 
0.0508449 -0.00238387 -0.150966 -0.0597656 0.102428 0.141407 0.0252709 -0.0304521 -0.0428364 -0.00169372 0.103308 0.07819 0.169285 -0.0199073 -0.0750503 -0.00484335 -0.0919859 0.069437 -0.114378 0.147569 0.192308 -0.110027 0.0727635 0.0617868 -0.00184929 0.0207742 -0.0310062 -0.215887 0.0561174 0.108225 0.0215793 0.0327864 -0.0421685 0.00592589 -0.0276504 0.0468233 -0.125933 0.132158 -0.0153811 -0.0355342 0.0190362 -0.0356283 -0.107522 0.189976 -0.183261 -0.0550495 0.116086 0.0381874 -0.0996329 -0.0380893 -0.0354139 -0.0266111 -0.0975115 -0.0100909 0.053932 0.0218453 -0.0483041 0.180655 -0.0255862 -0.115694 -0.0737958 -0.0724093 0.273329 -0.0287809 0.0627983 -0.0924985 -0.00431252 0.122694 0.0148869 0.0516959 0.0564356 0.110972 -0.0344104 -0.105124 -0.0165857 0.00812521 -0.108841 0.0576526 -0.0144052 0.10141 -0.0778215 0.0293438 -0.0102137 -0.0210014 -0.136436 0.0418889 0.139609 0.0447905 0.0423925 -0.0677649 0.0516742 -0.139345 -0.0736566 -0.0214231 -0.0779272 -0.160431 -0.0568676 0.0767473 0.0221897 -0.0655123 0.0218964 0.00110799 0.00016414 0.0820413 -0.0993226 0.083625 -0.115996 0.156574 0.0619128 -0.0898607 0.000938027 0.10273 -0.144432 0.0249606 0.0635016 0.0984337 -0.153068 -0.102567 0.00804664 0.138029 -0.010941 -0.0228503 -0.0461322 0.0851522 -0.0803833 0.0628146 -0.049494 0.0604022 
0.0487673 0.00837065 -0.140834 -0.0631283 0.10583 0.182544 0.0434172 -0.0224458 -0.0217668 -0.0209914 0.100287 0.0806893 0.154496 -0.038776 -0.0688772 -0.033254 -0.116409 0.0759782 -0.139327 0.125273 0.188281 -0.0855335 0.0420546 0.079291 -0.00469398 -0.0107385 -0.0493274 -0.198609 0.0566715 0.101909 0.0440839 0.0281793 -0.0710666 0.0213318 -0.025248 0.0607053 -0.133105 0.0757837 -0.0271253 -0.0169181 0.0527859 -0.0413983 -0.105673 0.19684 -0.178697 -0.0755317 0.109664 0.0510632 -0.106752 -0.022257 -0.0482608 -0.0268989 -0.105935 -0.0186313 0.0431332 0.039557 -0.0802602 0.20094 -0.036584 -0.107075 -0.0879524 -0.0345535 0.28201 -0.0410728 0.0386188 -0.0875855 0.0186621 0.0952237 -0.0075454 0.0755007 0.0641737 0.111181 -0.0238574 -0.0786829 -0.0215359 -0.000281768 -0.112942 0.0433377 -0.0197231 0.08633 -0.0670745 0.052242 -0.00479455 -0.0203634 -0.134237 0.0612601 0.143043 0.0263739 0.0272788 -0.0392112 0.0849128 -0.158115 -0.081493 -0.0301489 -0.0717241 -0.1507 -0.0718631 0.0538734 0.00994991 -0.0486731 0.0160664 0.00297558 -0.00174833 0.0741056 -0.112641 0.102115 -0.12091 0.151385 0.0309075 -0.0675714 0.0231957 0.0925926 -0.147053 0.0236133 0.0544468 0.088621 -0.129219 -0.100621 0.0341644 0.145263 0.0170964 -0.0417 -0.0453572 0.0917113 -0.09053 0.0533298 -0.0493286 0.0562248 
0.0178916 0.0254289 -0.125196 -0.0723433 0.0791893 0.171255 0.018522 -0.0179286 -0.0282433 -0.00962507 0.105411 0.0625827 0.156878 -0.0464304 -0.0544047 -0.0197203 -0.138963 0.0593414 -0.110511 0.119116 0.193929 -0.0991681 0.0459916 0.0519028 0.0014995 0.0154371 -0.0421053 -0.212493 0.0629015 0.0966602 0.0490952 0.00578395 -0.03637 0.0069427 -0.00442342 0.0657227 -0.120542 0.093357 -0.0136795 -0.0233128 0.0471758 -0.0670984 -0.0918308 0.200978 -0.171093 -0.0602004 0.128481 0.0301766 -0.133232 -0.0473986 -0.0665918 -0.0371556 -0.0923681 -0.00988054 0.0432094 0.0519658 -0.0759158 0.173671 -0.0496281 -0.121341 -0.0910626 -0.0569734 0.282091 -0.0337554 0.0714275 -0.0657507 0.0105471 0.0888281 0.00272422 0.0557102 0.0553078 0.0950854 -0.0422376 -0.105748 0.0126223 0.00539153 -0.129013 0.0481455 -0.0117213 0.102746 -0.0838588 0.0309899 -0.00268151 -0.00106481 -0.152032 0.0699793 0.13958 0.0276827 0.037197 -0.0381082 0.0699352 -0.154968 -0.0794987 -0.0208964 -0.0890938 -0.15359 -0.0720718 0.0786378 0.0132962 -0.0511269 0.0108113 -0.005304 -0.00473586 0.0466778 -0.0971986 0.110366 -0.100413 0.163725 0.037174 -0.0859894 -0.000753065 0.0728601 -0.15559 0.000157817 0.0667841 0.0935117 -0.147777 -0.100833 0.0362488 0.141462 0.0253327 -0.0542462 -0.0443803 0.087127 -0.0744511 0.0700818 -0.026478 0.0748746 
0.0127329 0.018195 -0.113747 -0.0663581 0.0749547 0.176583 0.00876855 -0.0211581 -0.0247954 -0.0146969 0.106963 0.0609814 0.147009 -0.0390947 -0.044317 -0.0188457 -0.137927 0.0539348 -0.0954771 0.112045 0.192128 -0.0995534 0.0523704 0.0714784 0.0119606 0.0199859 -0.034067 -0.216721 0.0732712 0.0846834 0.0698248 -0.000795189 -0.0385167 0.000493571 -0.00871291 0.0777729 -0.130787 0.0912563 -0.0134297 -0.0130596 0.0475464 -0.0598578 -0.108735 0.196769 -0.165516 -0.0703853 0.128314 0.0262665 -0.125813 -0.0542659 -0.0737766 -0.0345745 -0.0804007 -0.0216688 0.0384524 0.0618647 -0.0707135 0.195051 -0.0473197 -0.119609 -0.100247 -0.0489344 0.287939 -0.038671 0.07204 -0.052092 0.01973 0.0796569 -0.000853814 0.0698094 0.0466071 0.103677 -0.0475999 -0.0961765 0.021045 -0.00944812 -0.129289 0.0500627 -0.0110606 0.10574 -0.0873643 0.0356305 -0.00270873 -0.0142342 -0.145683 0.059335 0.138587 0.0299069 0.0258603 -0.0482556 0.0795037 -0.140642 -0.071654 -0.0162909 -0.0717937 -0.150425 -0.0721241 0.0811481 0.0173875 -0.0450634 0.0013596 -0.0149967 -0.0112266 0.0405388 -0.0993068 0.120334 -0.0939405 0.139384 0.0483281 -0.0940106 -0.0012843 0.0859767 -0.143826 -0.00872391 0.0773519 0.0978952 -0.143556 -0.104949 0.043634 0.145863 0.0287343 -0.0605775 -0.0541011 0.0791087 -0.088419 0.0833896 -0.0268159 0.0826388 
-0.00962734 0.0423533 -0.13102 -0.0555586 0.0676881 0.19488 0.0254299 -0.042484 -0.0112258 0.0370336 0.102529 0.0266086 0.137065 0.020615 0.0197321 -0.00652532 -0.107577 0.0329503 -0.0272504 0.0380769 0.16676 -0.0886754 0.0288591 0.0606573 0.0486561 0.0173651 -0.0594558 -0.207478 0.10877 0.107842 0.113776 0.0204085 -0.0492467 -0.0520557 -0.00339243 0.119664 -0.137984 0.0609079 0.00606526 0.0148035 0.0328737 -0.0249177 -0.122207 0.172072 -0.143472 -0.060462 0.114086 0.0158979 -0.0925809 -0.136912 -0.0707435 -0.00402137 -0.0464554 -0.0642734 0.0213668 0.107762 -0.0740786 0.237068 -0.0301653 -0.0876583 -0.136494 -0.04369 0.27572 -0.0868219 0.09709 0.00829059 0.0451465 0.0803187 -0.00598038 0.0712335 0.0708784 0.156712 -0.0611571 -0.105723 0.0271 0.00660117 -0.134107 0.0322785 -0.0300557 0.0778934 -0.0713187 0.0403705 -0.00641189 -0.0152762 -0.130713 0.0391909 0.131602 -0.00882496 0.00382867 -0.0743977 0.0525747 -0.104225 -0.0582912 -0.0180062 -0.0300374 -0.14369 -0.0544066 0.0654163 0.0268524 0.000801422 -0.00822531 -0.0167643 0.0031375 -0.00302735 -0.160493 0.147959 -0.083014 0.0652918 0.0748529 -0.0742237 0.00586016 0.05832 -0.128888 -0.0536903 0.0963517 0.108617 -0.130882 -0.0933203 0.0429375 0.132276 0.0477905 -0.10362 -0.0519919 0.0688646 -0.0991178 0.125102 -0.0402907 0.106063 
-0.0470146 0.0504454 -0.0756235 0.0103216 0.0594907 0.198778 0.0677168 -0.144036 0.0578501 0.0306476 0.0424308 0.0322982 0.0429514 0.0450274 0.0779158 -0.0627585 -0.120712 0.041738 0.0335253 -0.0527898 0.0719055 -0.0258987 -0.0750372 0.103281 0.0879457 -0.0171506 -0.132593 -0.148815 0.0700101 0.153498 0.144112 0.055923 -0.0834651 -0.0838709 0.0681738 0.161515 -0.130568 -0.0857989 -0.00237018 -0.0026096 0.0731732 -0.0177997 -0.0844472 0.101049 -0.0814384 -0.0177841 0.0684119 0.0319254 -0.0269332 -0.177248 -0.0511708 0.0191982 0.0760141 -0.131461 0.0646257 0.164963 -0.134528 0.2556 -0.0350166 -0.010272 -0.141579 0.0372004 0.201431 -0.107111 0.0950052 0.0778043 0.0724899 -0.00168358 -0.089968 0.0904635 0.0929906 0.159255 -0.0466229 -0.0853214 0.00615922 0.0632309 -0.117414 -0.0571266 -0.0240796 0.0364849 0.0092295 0.0946224 -0.0147896 -0.00546929 -0.0762523 -0.0193333 0.0870138 -0.0613039 -0.0624312 0.00452378 0.0493434 -0.050082 0.00865443 -0.0149525 -0.0464282 -0.0675262 -0.0478373 -0.0221813 0.0909796 0.0339342 0.0433659 0.0121176 0.00244116 -0.107872 -0.196738 0.15985 -0.0380412 -0.0496066 0.00478667 0.0598473 0.0719754 -0.00970463 -0.097028 -0.132057 0.0551009 0.105961 -0.0843004 -0.0359485 0.0227603 0.106715 0.111199 -0.156993 -0.0515141 0.0131578 -0.0962903 0.197717 -0.0203979 0.0787049 
