0.0703562 -0.0394067 -0.123823 0.0291047 0.102966 0.166934 0.0055474 -0.112421 -0.089835 -0.0809318 -0.0249083 0.154703 0.0302202 -0.0939401 -0.0582415 -0.00887052 -0.107835 0.0236163 0.00373082 0.151362 0.0971204 -0.022278 0.0963669 0.207143 0.00522585 0.0415998 -0.0145749 -0.272205 -0.0272117 0.124248 -0.011334 0.033073 -0.0859969 0.0238554 -0.00188569 0.0501072 -0.107825 0.0531203 -0.0593973 -0.000167673 0.0105808 0.00474868 -0.0634887 0.129253 -0.150138 0.0427234 0.210891 -0.00834246 -0.0848629 0.0901979 0.0721978 -0.0646198 0.0264959 -0.021391 0.188842 0.0132948 0.026784 0.238151 0.0332913 -0.0917892 -0.0368638 0.051252 0.240011 -0.100052 0.0818102 -0.142572 0.0124564 0.011522 -0.0524086 0.101395 -0.00423511 0.153269 -0.0464595 0.0344179 -0.00516895 0.0231614 -0.0751254 0.0365865 0.0219674 0.117555 0.00957722 0.0911019 -0.0466618 -0.0813508 -0.0686457 -0.0392728 0.0632536 0.00933476 -0.0413591 -0.0120032 0.0569152 -0.0616099 -0.0532314 -0.0135992 -0.0363963 -0.0317847 0.0334219 0.0779176 0.103489 -0.0586152 0.00445674 0.0127834 -0.0238647 0.077314 -0.187321 0.0337967 -0.13641 0.052288 -0.0588645 0.0114899 0.106152 0.162293 -0.0279794 -0.0754225 0.00634185 0.127705 -0.0918574 -0.118535 -0.0289948 0.147325 0.032652 0.00914954 0.0265103 -0.0243114 -0.138623 0.123286 -0.0387337 -0.026561 
0.0382602 -0.0849476 -0.122042 0.00137195 0.123064 0.140627 0.0273941 -0.0685824 -0.104323 -0.000356049 -0.0351308 0.159729 0.085365 -0.0610797 -0.0301622 -0.0309724 -0.0820495 0.0378618 0.0366585 0.192511 0.100822 -0.099592 0.0910986 0.210384 -0.00955008 0.0508283 -0.0503535 -0.266886 -0.00565189 0.105753 -0.00173694 0.0163609 -0.0723327 0.0103377 -0.00677562 0.0682023 -0.111423 0.0614249 -0.079738 -0.0567599 0.0250215 -0.00282217 -0.0578661 0.133932 -0.176418 -0.00113035 0.189322 0.0292139 -0.0471873 0.0598446 0.0325325 -0.117636 0.0078625 -0.0348907 0.198623 0.0257891 -0.00635447 0.22599 0.0254813 -0.0996966 -0.021463 0.0430907 0.219233 -0.080473 0.103424 -0.109725 -0.0133852 0.0253068 -0.0467902 0.043898 -0.00942912 0.172223 -0.0607356 0.0104887 -0.0153796 0.0496714 -0.0531032 0.0786415 0.0816952 0.0723203 -0.0417619 0.0614979 -0.044153 -0.0457361 -0.0545439 -0.0587605 0.0942401 0.0710646 0.0334633 -0.037901 0.0542807 -0.028047 -0.00810863 -0.0162327 -0.0564692 -0.0734447 0.0156498 0.093871 0.0761461 -0.063753 0.0328098 -0.00613304 -0.0166083 0.0266287 -0.171978 0.0597694 -0.13649 0.0287328 -0.0296684 0.0226452 0.0566437 0.14871 -0.0281729 -0.0834757 0.0126455 0.128942 -0.0677828 -0.126641 -0.0664632 0.158854 -0.0024901 -0.0146574 -0.00605755 -0.000146346 -0.204181 0.137711 -0.0783826 0.0016969 
0.052371 -0.0639553 -0.127906 -0.00509305 0.131722 0.129295 0.0642974 -0.0381224 -0.142076 -0.032966 -0.03998 0.176893 0.0675269 -0.0712072 -0.048605 -0.037626 -0.0697519 0.0288263 0.00794387 0.152647 0.102661 -0.0689963 0.0483343 0.177127 0.00729399 0.0514088 -0.03432 -0.241508 0.00342562 0.110326 -0.0320609 0.0316599 -0.0935422 0.0178703 -0.0380395 0.0208597 -0.129842 0.0360256 -0.0755062 -0.0212341 0.0634901 0.00805871 -0.0281024 0.162772 -0.178719 0.0274041 0.201213 -0.0249109 -0.0930426 0.0300012 0.0559148 -0.115122 -0.0294998 -0.0451521 0.171504 0.0302454 -0.0354539 0.261117 0.0320925 -0.0742311 -0.0141322 0.0278204 0.215024 -0.0594385 0.0972982 -0.126953 -0.0194612 0.0142351 -0.0421182 0.0374553 0.0110848 0.168023 -0.0301291 0.0118735 -0.0169733 0.0707769 -0.0655292 0.0653849 0.0330443 0.0612796 -0.0567889 0.0665673 -0.0218017 -0.0488599 -0.0833661 -0.0483663 0.123815 0.0289164 -0.00964228 -0.0539017 0.0287658 -0.052817 -0.064934 -0.0467326 -0.041611 -0.0419952 0.0521268 0.0614469 0.0676158 -0.0529338 -0.036969 0.00483059 0.0137561 0.0877436 -0.227244 0.0400521 -0.164776 0.105215 -0.0679613 -0.0321152 0.101356 0.129588 -0.0719208 -0.0819038 0.0118756 0.097083 -0.0888134 -0.133358 -0.0285803 0.145626 -0.00312459 0.00594079 -0.0163608 0.00239167 -0.148983 0.101952 -0.0911726 -0.0331876 
0.0240159 -0.0472161 -0.134714 0.0029224 0.113942 0.149932 0.061601 -0.0818142 -0.120028 -0.0307929 -0.0497343 0.139699 0.0625882 -0.0642514 -0.0300775 -0.0552891 -0.114948 0.0305647 0.0463114 0.127471 0.085139 -0.0763081 0.0565238 0.176194 0.0153897 0.0329594 -0.0574373 -0.264585 -0.00461756 0.124622 -0.00827735 0.0167555 -0.0892979 -0.00926564 0.0111648 0.0471826 -0.102609 -0.00125695 -0.0704972 -0.041795 0.0737082 -0.0249441 -0.015307 0.165034 -0.192532 0.0453362 0.20933 0.0049924 -0.0807469 0.0196455 0.0169589 -0.123153 0.0346453 -0.0384234 0.180391 0.0484895 -0.0145518 0.240219 0.0390886 -0.0875531 -0.0214945 0.0603727 0.215116 -0.0696506 0.100981 -0.0905652 -0.000795225 -0.0114621 -0.0312538 0.0335506 -0.0103753 0.160665 -0.0432841 -0.00160016 0.0111685 0.0675774 -0.087629 0.0567785 0.0453015 0.0676735 -0.0358403 0.0705926 -0.0440102 -0.036855 -0.0765023 -0.0174629 0.0924489 0.0149772 -0.0281123 -0.0369135 0.0624068 -0.0325316 -0.0318873 -0.0769345 -0.0774072 -0.0584196 0.0265298 0.0973175 0.101225 -0.0525851 0.0054961 0.00981313 0.0369216 0.0297642 -0.207101 0.0460754 -0.138019 0.103398 -0.0847451 0.0308725 0.104512 0.101836 -0.0495805 -0.132339 -0.0188114 0.119728 -0.0741604 -0.121531 -0.0294334 0.139057 0.0287436 -0.0370942 -0.0205446 -0.00409889 -0.188534 0.124894 -0.0982045 0.00548485 
0.0287093 -0.0315912 -0.158186 0.00235829 0.120621 0.152409 0.0513964 -0.0990742 -0.140949 0.00432615 -0.0186135 0.155493 0.0752274 -0.0403593 -0.0399835 -0.0447126 -0.0898353 0.0481554 0.067824 0.13071 0.0840463 -0.0719524 0.0415251 0.177946 0.0242016 0.0369602 -0.045935 -0.235435 0.0141583 0.158383 -0.0218971 0.00821285 -0.0957731 -0.0320821 0.00121815 0.0591497 -0.125446 -0.0396378 -0.040088 -0.0191982 0.0397325 -0.014284 -0.0188046 0.16695 -0.188944 0.0382391 0.209053 0.0096926 -0.0737022 0.00897885 0.044969 -0.0868817 0.00106616 -0.050673 0.161871 0.0530457 -0.0279168 0.25509 0.035442 -0.0435801 -0.0260333 0.0484601 0.233083 -0.0787767 0.0943136 -0.112031 -0.00418717 -0.0061613 -0.0433176 0.0367446 0.0168174 0.187459 -0.0445565 -0.0143347 -0.00167164 0.0799269 -0.0698106 0.0658112 0.0345078 0.0677357 -0.0281169 0.0599352 -0.0302774 -0.0111833 -0.0884191 -0.0129611 0.0890745 -0.00388001 -0.0137388 -0.0493517 0.0274275 -0.0290719 -0.0322016 -0.0427325 -0.0620342 -0.0809633 0.0206807 0.0854256 0.0918213 -0.0593138 0.000822742 0.0284974 0.0323359 0.0281145 -0.207844 0.0740349 -0.127559 0.0924651 -0.0744573 0.036975 0.0960859 0.0776124 -0.0361793 -0.105444 -0.031576 0.12206 -0.0608526 -0.0971065 -0.0392021 0.143721 0.0107289 -0.0642815 -0.0268529 -0.0159651 -0.198488 0.147251 -0.102987 0.0169664 
0.0125277 0.00255465 -0.167778 0.0209065 0.115495 0.156375 0.0408236 -0.134209 -0.144774 0.0291422 -0.00576008 0.142226 0.0593828 -0.0455929 -0.0364705 -0.0381733 -0.0765395 0.0758623 0.105211 0.113343 0.0727848 -0.0726414 0.028986 0.161027 0.0402279 0.0484384 -0.0579211 -0.242671 0.0282857 0.176589 -0.0086719 0.0214065 -0.083883 -0.0550446 0.0365805 0.067714 -0.107878 -0.0552818 -0.00870871 -0.0286748 0.0367203 -0.018662 -0.0023508 0.167277 -0.192223 0.0513863 0.228476 0.00541592 -0.0812453 -0.0246522 0.0478581 -0.0668953 0.0156757 -0.0577667 0.150126 0.0692335 -0.0152617 0.234271 0.0369255 -0.0364966 -0.0352047 0.0394776 0.238557 -0.0986301 0.1178 -0.107437 0.000460793 -0.0339745 -0.047315 0.0491808 0.0199162 0.181252 -0.0529299 -0.0217747 -0.00105388 0.0681715 -0.0806722 0.0817182 0.0219465 0.0488134 -0.0367314 0.0849197 -0.0328286 0.00358373 -0.0779453 -0.00928906 0.0676638 -0.0207629 -0.0174393 -0.0487311 0.0178723 -0.0140428 -0.0294118 -0.0510668 -0.048013 -0.0951578 0.0250386 0.106524 0.0869434 -0.0559561 -0.00284037 0.0433653 0.0440201 0.015841 -0.192169 0.0838422 -0.0873633 0.0835641 -0.0618246 0.062761 0.0795906 0.0472475 -0.030612 -0.117801 -0.03221 0.10134 -0.0589403 -0.117665 -0.0307622 0.125922 0.0269528 -0.0781945 -0.0238261 -0.0289194 -0.189876 0.156767 -0.0856117 0.0331752 
0.0109753 -0.0140713 -0.17375 0.00797152 0.101354 0.170938 0.0612272 -0.106383 -0.152404 0.0312214 -0.0297943 0.135267 0.0590332 -0.0307556 0.00189684 -0.0600777 -0.0795671 0.0444893 0.139377 0.087696 0.0473708 -0.0703046 0.0171179 0.132878 0.0385741 0.0550428 -0.0632881 -0.248022 0.00105208 0.163765 -0.00847471 0.0274404 -0.0787656 -0.0512174 0.0372671 0.0695278 -0.0814428 -0.0693151 -0.0123153 -0.0419905 0.0632062 -0.0324739 0.0143145 0.156145 -0.1971 0.0547445 0.217748 -0.00669619 -0.0861653 -0.0331066 0.0298582 -0.10236 0.0468999 -0.0435347 0.161403 0.0847585 -0.0274954 0.233658 0.031623 -0.041541 -0.0381435 0.0516124 0.224932 -0.124248 0.131244 -0.0542981 0.00383244 -0.0342063 -0.0444473 0.016488 0.00317644 0.175591 -0.0633093 -0.0273912 0.0107858 0.0886912 -0.0722124 0.0485895 0.0331907 0.0383895 -0.0444245 0.0656961 -0.033531 0.00147198 -0.0756065 -0.00790058 0.0768742 -0.0328583 -0.0086462 -0.0382663 0.0315806 -0.0185591 -0.0222957 -0.059465 -0.0579609 -0.0706779 0.0420848 0.0982689 0.0908633 -0.0378445 -0.00494828 0.0358523 0.0518845 -0.0128033 -0.215929 0.0875155 -0.0970212 0.0715275 -0.111816 0.0690395 0.0876108 0.0294811 -0.021525 -0.157193 -0.027296 0.0927025 -0.0441838 -0.120328 -0.021577 0.115033 0.051868 -0.105465 -0.0035162 -0.0225026 -0.176271 0.148478 -0.0802846 0.0341216 
-0.0144389 0.00951145 -0.147555 0.0105423 0.0850366 0.204741 0.071274 -0.094235 -0.0748518 -0.0161506 -0.0437093 0.0926827 0.0464576 -0.0687422 0.00281393 -0.0680835 -0.113993 0.0260124 0.0758015 0.028479 0.0684107 -0.072378 -0.0190223 0.139076 0.0543096 0.0100996 -0.10089 -0.251509 -0.0131393 0.1303 0.068068 0.0278315 -0.100386 -0.0360939 0.0544766 0.0829989 -0.0763489 -0.102907 -0.036035 -0.0401359 0.121203 -0.0419282 0.0252337 0.161053 -0.148787 0.0362639 0.195759 0.000438637 -0.0847087 -0.0643288 -0.0120476 -0.139671 0.0783654 -0.0653431 0.135885 0.110367 -0.0594671 0.225779 0.0488731 -0.0857845 -0.0567387 0.0865566 0.194303 -0.126273 0.109186 -0.02096 0.0341912 -0.0467547 -0.0373838 0.0151636 0.000894103 0.152121 -0.055295 -0.0473621 0.0235444 0.0872949 -0.111798 0.0415213 0.0138299 0.0486109 -0.0419846 0.0843499 -0.0309397 -0.0056766 -0.0876191 0.0364659 0.0921262 -0.0482005 -0.0540657 -0.0320245 0.057075 -0.0420543 -0.0203523 -0.100712 -0.067854 -0.0363347 0.0193927 0.0812108 0.0702832 -0.00657692 0.00096421 0.012063 0.0573665 -0.0105611 -0.210139 0.0745931 -0.106487 0.0801326 -0.150336 0.0808337 0.0910197 0.0136613 -0.0524179 -0.179031 -0.0223699 0.0956539 -0.0878224 -0.106968 -0.000256708 0.0994596 0.0811799 -0.0918179 -0.0153334 0.000706096 -0.167137 0.12652 -0.108097 0.0318185 
0.0054892 0.0150777 -0.175601 0.0121447 0.0975323 0.174694 0.0389991 -0.133849 -0.136412 0.0527226 -0.000866542 0.113837 0.042026 -0.0104392 0.0316788 -0.0503917 -0.0346888 0.0427317 0.183922 0.0425705 0.0294314 -0.0249059 -0.0263848 0.113306 0.0614924 0.0757023 -0.0650106 -0.228998 0.0291239 0.178591 0.0325525 0.0223293 -0.0766843 -0.0900186 0.0644442 0.0991409 -0.0846716 -0.107245 0.0320889 -0.0132611 0.0443841 0.000410515 -0.00917545 0.153655 -0.160688 0.0733888 0.203257 -0.0127913 -0.0690817 -0.0990123 0.0351789 -0.0527205 0.054138 -0.0789204 0.117557 0.104326 -0.0509844 0.242121 0.0225997 0.00219725 -0.0570544 0.0347745 0.222458 -0.137399 0.13809 -0.0649241 0.0373396 -0.0381088 -0.0319259 0.0223522 0.042235 0.182237 -0.067142 -0.0570333 -0.0022197 0.0806022 -0.0940504 0.053612 0.00611694 0.0434579 -0.0260874 0.0913662 -0.0236689 0.0113921 -0.0582811 -0.0268957 0.0710898 -0.070007 -0.0335642 -0.057236 0.00494551 0.00886083 -0.0233053 -0.0299588 -0.0262722 -0.0810808 0.0598063 0.0630032 0.0703946 -0.0246741 -0.0242134 0.0541746 0.0475962 -0.0469203 -0.237787 0.11033 -0.0581189 0.0225962 -0.08653 0.0947856 0.101436 -0.0224736 -0.03246 -0.157811 -0.0214477 0.0822638 -0.065705 -0.129758 -0.0312068 0.0853368 0.0572994 -0.117211 -0.00853451 -0.0282861 -0.14533 0.158688 -0.0676971 0.0473515 
0.0100379 0.0318047 -0.181749 0.00797775 0.0917728 0.194201 0.0544268 -0.130875 -0.134474 0.0415121 -0.0110734 0.112903 0.0528418 -0.0299908 0.0131499 -0.0447953 -0.054477 0.0463618 0.152376 0.0281659 0.045449 -0.0375271 -0.019457 0.109098 0.0560631 0.0660135 -0.0766569 -0.244105 0.0288837 0.181591 0.0249899 0.0540143 -0.0839541 -0.0764859 0.0523678 0.0725656 -0.0804684 -0.0911164 0.0376747 -0.0135516 0.0591614 -0.0206245 0.00348739 0.14737 -0.161049 0.0641572 0.208251 -0.023871 -0.0931116 -0.0994083 0.0385835 -0.0596968 0.0642834 -0.0624022 0.109044 0.10672 -0.0222042 0.239137 0.0261341 -0.0227926 -0.0559156 0.0493104 0.225323 -0.143394 0.130164 -0.0462603 0.0339635 -0.0363507 -0.0371644 0.0226531 0.0202297 0.16821 -0.0764939 -0.0452043 0.00969293 0.0842002 -0.099651 0.0349793 -0.00143455 0.047155 -0.0356697 0.093394 -0.0173011 0.0130275 -0.06571 -0.00483429 0.0775867 -0.0751155 -0.0415526 -0.0555244 0.0116441 -0.0157788 -0.0278646 -0.0388288 -0.0364765 -0.0712024 0.0528293 0.0871947 0.0772856 -0.012697 -0.0114171 0.0477563 0.0511137 0.00345649 -0.227983 0.0944297 -0.0732694 0.0578333 -0.104379 0.0735383 0.0956322 -0.00865029 -0.0421694 -0.165563 -0.0174074 0.0857619 -0.0846994 -0.122497 -0.00784914 0.0906796 0.0691167 -0.118874 -0.00510816 -0.0356214 -0.142502 0.153532 -0.0845652 0.0447644 
-0.0562446 0.0687147 -0.149777 -0.0176416 0.0502047 0.176837 0.033223 -0.160228 -0.081591 0.0509744 -0.0520365 0.0640515 0.060887 -0.0171494 0.0466075 -0.0637689 -0.09136 0.0108903 0.13314 0.0258109 -0.0118828 -0.0398219 -0.013271 0.0585763 0.00283807 0.0938308 -0.141151 -0.24538 0.0247245 0.13629 0.0677227 0.103148 -0.0652128 -0.0905522 0.0924557 0.117343 -0.0333725 -0.0175921 0.00737392 -0.0123288 0.0715336 -0.0307383 -0.0295195 0.105675 -0.142883 0.12315 0.196688 0.0160059 -0.0959853 -0.113985 -0.0398069 -0.0604002 0.111794 -0.0668684 0.100784 0.107421 -0.0151926 0.196168 0.0304291 -0.0587752 -0.0780546 0.0944625 0.190284 -0.142154 0.139514 0.00636737 0.081292 -0.0163986 -0.027491 0.00524422 0.0228036 0.121455 -0.0616625 -0.00971674 0.0488683 0.0736065 -0.163315 0.00306744 0.0374762 0.0202042 -0.016314 0.114707 -0.0688188 0.009589 -0.0443849 -0.0131676 0.0615397 -0.0651423 -0.0419136 -0.0340169 0.0397446 0.0021507 0.0540209 -0.0772307 -0.0478028 -0.0766399 0.0621553 0.105576 0.0853012 -0.00772527 0.00720787 0.0336987 0.0324196 -0.029903 -0.223511 0.091011 -0.060883 0.0361243 -0.0798469 0.127433 0.0847516 -0.00392281 -0.0558749 -0.198592 -0.0407023 0.0765442 -0.11518 -0.154418 0.000264986 0.0576781 0.0979771 -0.119239 0.0028333 -0.00109243 -0.146916 0.133381 -0.100403 0.0485081 
-0.0151027 0.0953674 -0.139469 -0.0173819 0.0735082 0.207533 0.0155465 -0.15966 -0.138907 0.0327023 -0.0300945 0.0727927 0.0460539 -0.033628 0.0626582 -0.0366671 -0.0598005 0.00837061 0.146309 0.00341274 0.00514364 0.0082964 -0.0165811 0.0734723 0.0404151 0.0912195 -0.0930675 -0.221532 0.0348274 0.144458 0.051938 0.0856696 -0.0751967 -0.0670186 0.0786316 0.103005 -0.0296047 -0.0715662 0.0549108 0.0102462 0.073297 -0.033125 0.0182532 0.102827 -0.132295 0.134743 0.226652 -0.00807617 -0.142534 -0.103019 0.016614 -0.0416708 0.0829041 -0.0579803 0.0972904 0.105538 -0.0183035 0.216531 0.0191996 -0.0312399 -0.0811927 0.0859468 0.200749 -0.163877 0.142622 -0.00846437 0.0573416 -0.0177003 -0.0448743 0.0401072 0.0147556 0.132411 -0.0863902 -0.0170281 0.057384 0.0769693 -0.138446 0.0197203 0.0103449 0.040466 -0.00560239 0.115757 -0.0252083 0.0121375 -0.0656634 -0.00223212 0.0624844 -0.0920395 -0.076361 -0.01107 0.0382726 -0.018097 -0.00410517 -0.032077 -0.0323557 -0.0461964 0.0710865 0.106987 0.0743497 -0.0200527 -0.026387 0.0503445 0.0316673 0.00989105 -0.232534 0.101671 -0.073427 0.0614176 -0.0960153 0.079574 0.103962 -0.00996901 -0.0562586 -0.166983 -0.0153699 0.0606219 -0.118357 -0.148145 0.006745 0.0853698 0.119914 -0.114717 0.0213501 -0.0164452 -0.119066 0.132032 -0.0664195 0.0333325 
0.0101311 0.0890184 -0.152468 -0.0284214 0.0773482 0.196741 0.0286054 -0.151195 -0.149364 0.00907012 -0.0320626 0.0753916 0.0477888 -0.0129887 0.0417268 -0.0390293 -0.0589065 0.0212487 0.124439 0.0433018 -0.0037496 0.0272042 0.0121519 0.0767667 -0.000922193 0.0894649 -0.0754689 -0.206013 0.0476574 0.139287 0.0176989 0.0968455 -0.0801997 -0.0539319 0.0722386 0.10408 -0.0178087 -0.0212003 0.0245198 0.0122028 0.0525429 -0.0121754 0.00883131 0.11822 -0.166982 0.141926 0.239614 0.00956488 -0.142033 -0.0392575 0.00351694 -0.0282556 0.0455496 -0.0313753 0.119564 0.0806016 -0.00712681 0.233001 0.0220032 -0.0421708 -0.0856934 0.08765 0.238029 -0.16795 0.128258 -0.032023 0.0607293 -0.0290787 -0.0561227 0.0767526 0.0121392 0.124659 -0.0626624 0.0417612 0.0426604 0.0444186 -0.121122 0.0201176 0.0175783 -0.00260955 0.0191039 0.131298 -0.0565681 -0.0244261 -0.0514993 -0.0181574 0.0364614 -0.0815847 -0.055108 0.0126391 0.0795459 -0.0334349 -0.0168429 -0.0698684 0.00869125 -0.0529691 0.0809781 0.135956 0.0825424 -0.0247176 -0.0432785 0.0650085 0.0379865 0.027935 -0.24989 0.102742 -0.0865679 0.0586988 -0.0707611 0.0670811 0.116048 0.0295018 -0.0500052 -0.13568 -0.0255472 0.0502331 -0.0571788 -0.182415 0.0222092 0.0894672 0.112922 -0.100586 0.0487035 0.0014916 -0.136458 0.100678 -0.0455686 0.0211605 
-0.024046 0.0802208 -0.124244 -0.00188373 0.0691903 0.197195 0.00940267 -0.172914 -0.0770231 -0.0151024 -0.0484507 0.0538185 0.0201009 -0.0485137 0.0515372 -0.0429284 -0.107693 -0.00240293 0.104179 0.0241536 0.00194046 0.0139736 -0.0256781 0.0619006 0.0295368 0.0919298 -0.111639 -0.227009 -0.000736649 0.121971 0.063647 0.094673 -0.0792873 -0.0540852 0.113617 0.126223 0.00245697 -0.0539876 0.0217503 -0.0320208 0.102461 -0.0326649 0.032593 0.10474 -0.120124 0.143043 0.22994 0.0179343 -0.122484 -0.0772141 -0.0302292 -0.0717389 0.110059 -0.0423862 0.147542 0.0920714 -0.0415796 0.179713 0.0269998 -0.0838055 -0.0802233 0.0929303 0.195837 -0.143543 0.126907 0.020465 0.0667418 -0.0158311 -0.0133346 0.0425577 0.0143773 0.10935 -0.0550748 -0.0129613 0.0625066 0.0567327 -0.160099 0.0141296 0.0164074 0.0271144 0.0349385 0.152362 -0.0587298 -0.0170799 -0.051678 0.0138601 0.0488793 -0.0555805 -0.0728317 0.0253091 0.0898572 -0.0212948 -0.00450985 -0.0765979 -0.0549682 -0.0284371 0.0622905 0.105029 0.0920174 -0.0326417 -0.00985418 0.031954 0.0467974 -0.0407296 -0.229 0.096012 -0.0780641 0.0524177 -0.112817 0.117408 0.114482 0.00501683 -0.0692244 -0.181563 -0.0135418 0.0475064 -0.118826 -0.165875 -0.000217585 0.0467223 0.141491 -0.0762733 0.0631057 0.00446771 -0.118994 0.1101 -0.0346285 0.0316054 
-0.0204649 0.0857074 -0.128607 -0.00921625 0.0284689 0.197741 0.0241712 -0.1544 -0.0821323 0.0128746 -0.0323995 0.0261478 0.0455522 -0.0410867 0.0643739 -0.0563754 -0.10756 -0.028714 0.108982 0.0125674 -0.0125396 0.00629044 -0.0354103 0.0642048 0.0134201 0.0966817 -0.116451 -0.229843 0.0235791 0.111172 0.0654526 0.10676 -0.0951142 -0.0627346 0.0880591 0.124526 -0.00596213 -0.0357722 0.0173066 0.00149774 0.0968835 -0.0549384 -0.01792 0.107478 -0.114726 0.138916 0.208709 0.0259998 -0.117658 -0.102475 -0.0278507 -0.0387844 0.105735 -0.0452938 0.123434 0.0896646 -0.033818 0.178322 0.0473688 -0.0861744 -0.0835926 0.0925282 0.186335 -0.129717 0.102789 0.0315142 0.112599 -0.0163311 0.00915108 0.0244053 -0.00156543 0.110735 -0.0548291 0.0145728 0.0836126 0.0334882 -0.171123 0.0208616 0.0181267 0.0527471 0.0411992 0.125711 -0.0606126 -0.0384277 -0.0391301 0.0159156 0.0621451 -0.0767251 -0.0733012 0.00127888 0.0864471 -0.0120444 0.0144658 -0.0804909 -0.0745207 -0.0501441 0.0737761 0.08821 0.108508 -0.0270448 -0.00174167 0.0447546 0.0538306 -0.0252748 -0.236346 0.090869 -0.0789093 0.0665565 -0.0931215 0.111594 0.11848 0.02149 -0.0794605 -0.206068 -0.020708 0.0583285 -0.119416 -0.174453 0.00784425 0.0355985 0.129295 -0.0977544 0.0522037 0.0201943 -0.122536 0.105389 -0.0588089 0.0502858 
0.00399364 0.150385 -0.132864 -0.055116 0.0581449 0.194781 0.0373763 -0.166022 -0.0857852 0.0203925 -0.0208978 0.0245732 0.0400984 -0.0684577 0.0706194 -0.0513124 -0.120457 -0.0427807 0.0511968 0.0333103 -0.0446178 0.0571856 -0.0328354 0.02957 -0.0152736 0.102023 -0.103487 -0.181728 0.0560329 0.104609 0.0461363 0.0936578 -0.112322 -0.0371283 0.0971527 0.115588 0.00911782 -0.0030069 0.0474745 0.0312257 0.0809827 -0.0533723 -0.0244715 0.115338 -0.124357 0.189914 0.205436 0.0678061 -0.142455 -0.0512563 -0.032635 0.0174474 0.0229745 -0.0431213 0.0999967 0.0524506 -0.0685264 0.198648 -0.00237193 -0.0495687 -0.0969073 0.0704325 0.230881 -0.122896 0.0905623 -0.0258702 0.0962987 0.0156143 -0.00959381 0.0495694 0.0308893 0.112017 -0.0394186 0.0612752 0.0762003 0.0163448 -0.168264 0.0312596 0.0248575 0.0434386 0.0757397 0.130783 -0.0587196 -0.0168182 -0.049439 -0.0160787 0.048586 -0.0758914 -0.0534283 0.0330214 0.104117 -0.0529758 5.87353e-05 -0.0654289 -0.053284 -0.0775244 0.0911256 0.0561926 0.096696 -0.0535001 -0.0349626 0.0627633 0.0188498 0.00950833 -0.25434 0.0935557 -0.090621 0.105164 -0.0486741 0.110458 0.163159 0.0436255 -0.101318 -0.108894 -0.024637 0.0373587 -0.122008 -0.162853 0.0126618 0.0506975 0.136284 -0.0688066 0.0694966 0.0610781 -0.100618 0.0527715 -0.0507215 0.00489171 
-0.00879168 0.131945 -0.111202 -0.0200488 0.0719634 0.170443 0.0604756 -0.197452 -0.0856934 0.0201241 -0.0313905 0.0369016 0.022197 -0.0222436 0.078497 -0.0590678 -0.101928 -0.0160385 0.0612416 0.0225519 -0.0670631 0.0499147 -0.0557039 0.0278783 -0.00107566 0.0907766 -0.137777 -0.15078 0.0438354 0.122619 0.0395455 0.126673 -0.114054 -0.0550877 0.106796 0.133309 -0.0103373 -0.0347928 0.0282259 0.00549637 0.0894246 -0.0328272 -0.00260478 0.0932777 -0.120349 0.208918 0.192895 0.0615257 -0.126409 -0.074329 -0.0363079 0.0153388 0.042809 -0.0639743 0.117477 0.0638829 -0.0962867 0.202946 0.00422725 -0.0167705 -0.0945257 0.0912495 0.202251 -0.117839 0.102001 0.012246 0.083937 -0.0017612 -0.0365502 0.0576904 0.0539088 0.118369 -0.015758 0.0586305 0.0540362 0.0403003 -0.151893 0.00339229 0.0177675 -0.000759282 0.0855543 0.141064 -0.083656 -0.0272551 -0.0493026 -0.0280574 0.0348444 -0.0823018 -0.0704174 0.0517743 0.100431 -0.0237573 0.00925939 -0.0783418 -0.0439155 -0.0530511 0.0934964 0.0426869 0.117754 -0.0429687 -0.0315736 0.0677982 0.0367229 -0.0294544 -0.265807 0.107924 -0.076643 0.0839539 -0.0431627 0.131933 0.160239 0.0215754 -0.0924575 -0.132322 -0.0224158 0.02464 -0.0957998 -0.145606 0.0148568 0.0460406 0.129745 -0.0802161 0.0621476 0.0535813 -0.0975147 0.0795081 -0.0340932 -0.00740078 
0.00423267 0.130358 -0.104351 -0.0105087 0.0645365 0.174222 0.0582828 -0.178562 -0.139847 0.0471013 -0.0502495 0.0204579 0.0331479 -0.0248955 0.0969847 -0.0464127 -0.0780052 -0.0097238 0.0824813 0.0210251 -0.0635035 0.0265721 -0.0445987 0.0158826 0.00413515 0.0939685 -0.163795 -0.168169 0.0362497 0.11254 0.0210983 0.165413 -0.13068 -0.0478038 0.0967937 0.119844 -0.0110777 -0.0339348 0.0459424 -0.00850195 0.081204 -0.0512374 0.00618586 0.0645135 -0.110893 0.226863 0.203663 0.0558866 -0.155768 -0.0802777 -0.00539686 0.0185257 0.0497949 -0.0599067 0.111842 0.0477205 -0.055021 0.172693 0.0347176 -0.0264062 -0.0656709 0.110486 0.16179 -0.128288 0.100496 0.0274519 0.0791809 0.0128059 -0.0311489 0.0497525 0.0346102 0.127208 -0.03016 0.0613425 0.0468007 0.03786 -0.143412 0.00517834 0.0362922 0.0128346 0.0707012 0.127771 -0.0856979 -0.0405704 -0.0454675 -0.0208982 0.0331734 -0.087474 -0.0643363 0.0460534 0.0890213 -0.00184609 0.0145733 -0.0717418 -0.0669732 -0.0394572 0.118729 0.0626003 0.105582 -0.0512104 -0.0173748 0.0780104 0.0368147 -0.00129587 -0.255833 0.0937506 -0.0824383 0.104885 -0.0394912 0.128861 0.141168 0.0277558 -0.0926107 -0.157091 -0.0126667 0.0163919 -0.104864 -0.162474 0.0126186 0.0407573 0.123974 -0.0806505 0.077544 0.050916 -0.0896898 0.0703507 -0.0331321 -0.0180007 
-0.0111544 0.0746963 -0.113386 -0.0284305 0.0532581 0.209147 0.0298678 -0.125738 -0.149657 0.061994 -0.0509004 0.0172706 0.0697147 -0.0279738 0.119912 -0.0352632 -0.0799907 -0.016321 0.112209 0.0232899 -0.0293323 -0.0122548 0.0101347 0.0513945 0.00662632 0.0959319 -0.143378 -0.235498 0.0238762 0.0700584 0.0615506 0.114866 -0.111112 -0.0512477 0.0703999 0.131486 -0.0331759 -0.0124531 0.0183617 0.00512167 0.0760047 -0.0456301 -0.0313076 0.075824 -0.128145 0.152373 0.19965 0.0433657 -0.147706 -0.0874257 -0.0140181 -0.0642238 0.0777646 -0.0636315 0.0915399 0.0716951 -0.0177845 0.201518 0.0591975 -0.060695 -0.0838643 0.119918 0.166407 -0.154266 0.131262 0.0495043 0.0782887 0.0290479 -0.0194348 0.0201069 0.00409596 0.151447 -0.056211 0.0231338 0.0623129 0.0398173 -0.160811 0.0111832 0.0545313 0.0377734 0.0245498 0.0845696 -0.0772366 -0.0486718 -0.0713901 -0.00540375 0.0647061 -0.0729471 -0.0579201 -0.00451138 0.079445 0.0124047 0.0285523 -0.0665547 -0.0626623 -0.0326242 0.0920126 0.100415 0.0774989 -0.0247097 -0.00933417 0.0330123 0.0271607 -0.0210741 -0.234986 0.0933725 -0.097972 0.0559707 -0.0530372 0.094891 0.108918 0.052583 -0.0449808 -0.196688 0.00344092 0.0577753 -0.129229 -0.153189 -0.00497655 0.0589179 0.112392 -0.11732 0.0514231 0.0377015 -0.125454 0.100144 -0.0820058 0.0202586 
0.0278973 0.124625 -0.171009 -0.0223092 0.0742901 0.197817 0.0468073 -0.169254 -0.170648 0.0823663 -0.015917 0.0339783 0.0581255 0.0123815 0.0887585 -0.0229472 -0.0173878 0.0287131 0.146508 0.0129382 -0.0536695 0.0347307 0.00619519 0.038337 -0.000401115 0.0747223 -0.113074 -0.1743 0.0779029 0.14228 0.00593291 0.141697 -0.102738 -0.0797234 0.0731041 0.109875 -0.0225601 -0.0532997 0.0643983 0.0253391 0.0224319 -0.0262318 -0.0190249 0.0746395 -0.154824 0.190835 0.197087 0.0486948 -0.140851 -0.078053 0.0286568 0.0425912 0.0411855 -0.0644947 0.05993 0.0656094 0.00487615 0.208435 0.0318892 0.0240962 -0.0897294 0.103354 0.203819 -0.178981 0.116448 -0.00510097 0.0618251 -0.00262188 -0.0623398 0.0669715 0.0267674 0.145581 -0.0645495 0.0452146 0.0318219 0.0444434 -0.109634 0.00922867 0.0156004 -0.00680498 0.0527041 0.0982357 -0.0749602 -0.0204606 -0.0392412 -0.0146225 0.00987899 -0.122194 -0.0661925 0.01362 0.0625751 0.00388045 -0.00485814 -0.0414663 0.00377563 -0.0689373 0.101676 0.104346 0.0821517 -0.0223213 -0.00674269 0.0858212 0.0380103 0.00978204 -0.241999 0.107913 -0.0543119 0.0537901 -0.0244086 0.105027 0.117437 0.00717799 -0.0196863 -0.146798 -0.0237011 0.038993 -0.0681728 -0.138322 0.0199721 0.0758853 0.100624 -0.147708 0.0485008 0.0144847 -0.114893 0.104677 -0.0593499 0.012618 
0.0194538 0.0928095 -0.213724 -0.0100122 0.0565649 0.178974 0.0586789 -0.137786 -0.112025 0.0654098 0.0512912 0.0812934 0.0928644 0.000198487 0.0171909 -0.0475119 -0.0465689 -0.0147856 0.104171 0.0621011 0.00735054 -0.0400084 -0.0299617 0.0882246 0.0202499 0.0750145 -0.0708585 -0.195556 0.074927 0.162045 0.0287103 0.09097 -0.0972722 -0.0710542 -0.000220539 0.117193 -0.065856 -0.0126319 0.0391758 0.048776 0.0487394 -0.032438 -0.0669473 0.122704 -0.150655 0.0843964 0.19012 0.0145756 -0.0940909 -0.106295 -0.00118861 0.0258067 -0.00805296 -0.0580024 0.0829756 0.0955826 -0.0783819 0.261819 0.00599282 -0.00103591 -0.108678 0.0241514 0.265387 -0.16439 0.102239 -0.0214203 0.0896795 -0.00610843 -0.0326017 0.0205205 0.0335398 0.169105 -0.0565202 0.0309919 0.0582702 0.042407 -0.0890873 0.0537776 -0.0143256 0.0423679 -0.0196627 0.0686218 -0.0417482 -0.0265763 -0.0773976 0.00776701 0.0736388 -0.0970399 -0.0254037 -0.071688 0.0365507 -0.063331 0.000960635 -0.0356606 -0.0137799 -0.124096 0.0655052 0.0351368 0.101222 -0.0233678 -0.0487003 0.0495704 0.0332307 0.0401516 -0.251231 0.143425 -0.0777551 0.0860422 -0.0482236 0.0431601 0.09519 0.0302647 -0.0672265 -0.107769 -0.0172299 0.0602818 -0.0903321 -0.132581 0.0323189 0.0894372 0.0606227 -0.115111 0.00335675 0.0462041 -0.124713 0.132758 -0.0975944 0.0372517 
0.0255238 0.090181 -0.0617092 -0.012666 0.0543149 0.205252 0.0135204 -0.126055 -0.199307 0.0104426 -0.0273663 0.0214338 0.0774151 -0.079308 -0.00107434 -0.0157118 -0.0582022 0.0572625 0.030901 0.106755 0.0388742 -0.0333347 0.0811942 0.0500912 -0.0512502 0.108303 -0.145329 -0.206595 0.122076 0.0322428 0.0149577 0.176094 -0.119752 0.0191115 0.0699118 0.0540754 -0.0175308 0.131359 0.0566495 -0.0485796 0.0581765 -0.0736988 -0.0501006 0.0190098 -0.164598 0.0653365 0.211289 0.0675459 -0.196165 -0.0102392 -0.022348 0.0388238 0.0359641 0.00678275 0.063241 -0.0046607 0.115246 0.129068 0.00694649 -0.12542 -0.0656875 0.136023 0.220812 -0.143534 0.123239 0.032848 0.0608456 -0.0228033 -0.0704514 0.0856357 -0.0704398 0.0675936 -0.0502954 0.153593 0.0472838 -0.0689312 -0.097755 0.0204559 0.0807217 0.0195089 -0.010677 0.0990804 -0.0330928 -0.0679819 -0.0137872 -0.0479424 0.0294807 0.027138 -0.0206543 0.0226233 0.172219 -0.00178486 0.0371106 -0.023427 -0.0384432 -0.105854 0.100542 0.217594 0.0393485 -0.041519 0.0268202 0.0729419 -0.0343755 0.133845 -0.0877764 0.0792632 -0.00617654 0.121071 0.075083 0.0271605 0.0329292 0.136629 -0.0595202 -0.0640045 0.0271407 0.0167096 -0.105172 -0.168206 0.0360598 0.08482 0.054022 -0.0902814 0.0657526 -0.0275962 -0.125211 0.0868443 -0.0292768 -0.00643968 
0.0599499 0.0830624 -0.116441 -0.0297042 0.119787 0.19248 0.0757249 -0.119878 -0.177994 -0.0109126 -0.015088 0.0849706 0.0843046 -0.0588046 -0.0116827 -0.0506961 -0.0802214 0.0281467 -0.00311269 0.141852 0.0454381 -0.0384365 0.062889 0.0603453 -0.023992 0.0567861 -0.127727 -0.192759 0.0853029 0.0862374 -0.017281 0.10166 -0.134715 0.00617684 0.0325879 0.0527251 -0.0644894 0.106425 0.0258089 -0.0180294 0.0690301 -0.0267244 -0.0517349 0.0663017 -0.207764 0.0981972 0.196706 0.0358429 -0.162497 0.0171159 -0.0225042 0.0253629 -0.0372726 0.000631086 0.0978155 -0.011081 0.0152426 0.228287 -0.0336783 -0.0604291 -0.0719852 0.0942978 0.270096 -0.144301 0.121572 -0.0363143 0.0280158 0.018718 -0.0815389 0.075962 0.0269106 0.145179 -0.0266968 0.119094 0.0356431 0.0206698 -0.0901702 0.0117325 0.0611689 0.0289939 -0.0283714 0.0775286 -0.0162693 -0.026672 -0.0578961 -0.0403212 0.0695648 0.0189562 -0.0168546 -0.00918789 0.128959 -0.0734995 0.0088014 -0.0382765 -0.0404673 -0.149609 0.0844048 0.133109 0.0621719 -0.0437554 -0.0261624 0.0701857 -0.0137017 0.129016 -0.179983 0.11057 -0.069206 0.163978 0.0332113 0.0113063 0.0917943 0.111737 -0.08347 -0.0153142 0.0086905 0.0551861 -0.106307 -0.118929 0.0217736 0.130582 0.0293951 -0.0646846 0.0226123 0.0206293 -0.11014 0.0930487 -0.0587553 -0.017882 
0.0684986 0.0172764 -0.160363 0.0149256 0.0910872 0.227603 0.0517623 -0.134594 -0.18826 -0.00609487 -0.0171285 0.0995149 0.0640769 -0.0548921 0.00160648 0.00144059 -0.0897748 0.019638 0.091 0.0795538 0.0638497 -0.0445557 0.0540419 0.0951427 0.0224758 0.068432 -0.092476 -0.262845 0.0116444 0.130062 -0.0127192 0.0975053 -0.134654 -0.0163146 0.0319606 0.0719433 -0.0795999 -0.0101063 0.0526101 -0.0140862 0.0382376 -0.0409942 -0.0127103 0.079191 -0.155647 0.0692989 0.22113 -0.00425521 -0.147995 -0.00778108 0.0336923 -0.0638695 0.0383978 -0.0114096 0.123391 0.0323641 0.0356691 0.238154 0.0097068 -0.039534 -0.0449234 0.0980186 0.255696 -0.178237 0.134078 -0.0146263 0.018603 0.00745911 -0.057035 0.058834 -0.0131945 0.184538 -0.0726078 0.0458122 0.0178526 0.0349791 -0.0664487 -0.00253517 0.0196717 0.0687861 0.000732209 0.0584416 -0.0392847 -0.0563935 -0.110918 0.00800629 0.0564102 -0.0521175 -0.0509867 -0.0243187 0.0878874 -0.0391426 -0.0273344 -0.0195863 -0.0454077 -0.0443425 0.0710962 0.126062 0.0851872 -0.0123301 -0.0033938 0.0263381 -0.00514169 0.061968 -0.179425 0.0972209 -0.085056 0.103482 -0.0811713 0.031704 0.0716041 0.0783053 -0.00647721 -0.130751 0.0248677 0.0986115 -0.0912793 -0.0852662 -0.00184747 0.117488 0.0539804 -0.106223 0.0619656 -0.0136512 -0.134862 0.138823 -0.0613437 0.00623843 
0.0189557 0.0749175 -0.188157 -0.0120437 0.07559 0.199347 0.0614298 -0.159436 -0.128432 0.0577672 0.0258822 0.0980254 0.0759675 0.00263251 0.0220293 -0.0117481 -0.0732772 -0.0200829 0.111725 0.0314708 0.017669 -0.0339514 -0.0282142 0.0643534 0.0440329 0.0895348 -0.0710621 -0.19889 0.0514095 0.17136 0.0211231 0.0776312 -0.11012 -0.072806 0.0188539 0.106947 -0.0823741 -0.0380077 0.0767359 0.0323706 0.0414278 -0.0298487 -0.025711 0.0908362 -0.125486 0.085298 0.180824 -0.00840451 -0.110917 -0.11544 0.0183278 -0.0144336 0.0221868 -0.0574769 0.0955703 0.0922976 -0.0666472 0.281883 -0.0237904 0.0188738 -0.0936176 0.0391239 0.265671 -0.172037 0.137963 0.0170343 0.0377749 0.0218639 -0.0539658 0.0150778 0.041649 0.193332 -0.0713093 -0.00341752 0.0528126 0.084023 -0.0736055 0.00115702 -0.00936021 0.0487693 0.00399892 0.0496518 -0.0169587 -0.00423658 -0.116834 -0.00545613 0.0782339 -0.0838589 -0.0402249 -0.0526187 0.0183736 -0.058815 -0.0024496 0.01251 -0.0301779 -0.0753334 0.0615814 0.0356142 0.105334 0.00302074 -0.0323307 0.0296572 9.38363e-05 0.0189956 -0.233464 0.142623 -0.0785655 0.0699533 -0.0776057 0.0361171 0.0918268 0.0177704 -0.0397406 -0.106767 0.0126014 0.0884827 -0.120058 -0.0523407 0.00135823 0.0956234 0.0636059 -0.138114 0.0223192 -0.00156689 -0.10884 0.176071 -0.0916915 0.023986 
0.0632041 0.0746911 -0.169687 -0.0252591 0.0931225 0.196951 0.0827839 -0.13007 -0.212215 0.0780487 -0.00721936 0.066278 0.0981718 -0.0220553 0.0528212 -0.00974572 -0.0570239 -0.0150595 0.100431 0.0726768 0.00533883 -0.0408762 0.026164 0.031437 0.0106023 0.09392 -0.121719 -0.217803 0.0647024 0.125242 -0.00799684 0.117144 -0.156554 -0.0517576 0.0270377 0.0727479 -0.0710678 0.028387 0.0985434 0.0208504 0.0273698 -0.0348271 -0.0467647 0.0662948 -0.15255 0.123347 0.190751 0.0259332 -0.140353 -0.0609831 0.0233063 0.00483435 -0.0128942 -0.037249 0.0760254 0.0163085 0.00286525 0.255174 -0.00488169 0.00946301 -0.0589666 0.0693447 0.244224 -0.170573 0.130406 -0.0065593 0.0426741 0.0488259 -0.0406965 0.0121937 0.0239211 0.213698 -0.0591591 0.0727567 0.025928 0.0387656 -0.0796421 0.00445255 0.0412835 0.0640467 0.0106237 0.0347187 -0.0404868 -0.0299847 -0.0943476 -0.0321677 0.064353 -0.0627524 -0.0168164 -0.0611756 0.059216 -0.022455 0.0108569 -0.00843689 -0.0460412 -0.0991478 0.111856 0.0830222 0.0768008 -0.0216411 -0.0334613 0.0502435 -0.00343456 0.0732345 -0.220388 0.11337 -0.081924 0.126787 -0.00601292 0.0450485 0.0927646 0.066828 -0.047168 -0.0912199 0.0137346 0.0777445 -0.114881 -0.0822376 -0.0138519 0.0944686 0.0362719 -0.109153 0.049681 0.0266948 -0.117319 0.11183 -0.0989837 -0.0040105 
0.00758827 0.0971159 -0.175905 -0.00587269 0.0792977 0.195521 0.0526023 -0.156648 -0.154886 0.0901138 0.0198213 0.0794669 0.081778 -0.00536743 0.0354181 0.00374554 -0.0467382 0.0116879 0.111726 0.0390024 0.011547 -0.0401048 -0.0300644 0.0898729 0.0434436 0.0828272 -0.0897454 -0.192576 0.0836393 0.167766 0.0197154 0.116282 -0.117084 -0.0620206 0.0161756 0.111221 -0.0806409 -0.052552 0.0660814 0.0221459 0.0425235 -0.0502699 -0.00899361 0.0891975 -0.118697 0.0892382 0.201995 0.0204358 -0.135783 -0.123838 0.0391018 -0.00843687 0.0191487 -0.0827547 0.0900413 0.0986024 -0.0621179 0.264521 0.0158965 0.00720371 -0.0953664 0.0584801 0.241362 -0.171735 0.133461 0.0272501 0.03277 -0.00783432 -0.0730589 0.0234657 0.0119357 0.186097 -0.0701239 0.0130483 0.0498262 0.060866 -0.0638376 0.0346768 0.00153877 0.0251902 0.0150758 0.0643266 -0.0351205 -0.0173457 -0.0985458 -0.0047599 0.0600468 -0.0859795 -0.0373453 -0.0289649 0.0259192 -0.029534 -0.0115881 0.00177687 -0.022774 -0.0555142 0.0658299 0.0627337 0.0976934 -0.0118335 -0.0205044 0.0360555 0.00851148 0.0290197 -0.228683 0.140433 -0.0775278 0.0680798 -0.0463488 0.0399383 0.0797668 0.0363116 -0.0381158 -0.118545 0.00873029 0.0623237 -0.108582 -0.0773212 0.00645106 0.0960735 0.0685709 -0.142662 0.0246931 0.00250521 -0.133872 0.172921 -0.0987607 0.00589659 
0.044709 0.0459072 -0.150675 0.0173728 0.125205 0.187744 0.0753229 -0.148888 -0.150866 0.0230456 -0.0172995 0.121458 0.0787915 -0.0797173 -0.022839 0.00470709 -0.0891119 0.0622202 0.0105268 0.117268 0.0690543 -0.0615361 0.02298 0.134162 0.0138041 0.0429249 -0.108942 -0.239568 0.0301982 0.158003 -0.0254874 0.125943 -0.127432 0.00793015 0.0283304 0.060293 -0.0742804 -0.00702047 0.00419106 -0.0406195 0.0743365 -0.0610696 0.0281795 0.107171 -0.166032 0.0668254 0.229417 0.0310612 -0.141323 -0.0118028 0.0571863 -0.0824288 -0.00519028 -0.0396027 0.156699 0.0407914 -0.0254352 0.220736 0.0277652 -0.0543351 -0.0491754 0.0667435 0.231549 -0.138472 0.127299 -0.0418171 -0.0171895 -0.00748674 -0.0836187 0.0458592 -0.00829569 0.170385 -0.0421431 0.0317411 0.0133504 0.0591816 -0.0630129 0.0542063 0.0235595 0.0274311 0.015492 0.0862454 -0.043732 -0.0300276 -0.106632 0.0109864 0.0691329 -0.0201093 -0.0362047 0.0141157 0.0619467 -0.0617559 -0.0467735 -0.0476154 -0.0748163 -0.0397187 0.0404796 0.105399 0.0961784 -0.0387444 0.0155245 0.0224631 0.0152222 0.0815211 -0.182568 0.0738775 -0.119757 0.136599 -0.0595061 0.0423448 0.0689963 0.0973763 -0.0435552 -0.0928628 -0.00279005 0.0697371 -0.107311 -0.0884123 -0.0223769 0.123889 0.0575123 -0.0620366 0.0391705 0.0153708 -0.151279 0.131629 -0.0894428 -0.0317646 
0.0549831 0.0890564 -0.147508 -0.0338065 0.118389 0.173334 0.071526 -0.102638 -0.193668 0.0663821 0.013207 0.0839407 0.115696 -0.0941213 -0.0160981 0.0153155 -0.0799704 0.0630138 -0.0109527 0.149927 0.0809891 -0.0630102 0.0389361 0.071522 -0.0173128 0.0670043 -0.117249 -0.217064 0.116108 0.129973 -0.0422934 0.128667 -0.133438 0.0116372 0.0219322 0.0365282 -0.0782399 0.0730181 0.0476513 -0.0317488 0.03948 -0.0810583 -0.0188574 0.107059 -0.174851 0.0704605 0.219545 0.062514 -0.187502 -0.00989431 0.0259776 -0.000572204 -0.072694 -0.0285119 0.0906591 0.0020987 -0.0122836 0.195726 -0.0162637 -0.058698 -0.0564469 0.0380969 0.265787 -0.111743 0.115318 -0.0528168 -0.0134499 0.0138821 -0.0754243 0.0309476 -0.00686263 0.154551 -0.0468217 0.0685279 0.0118625 0.00417058 -0.0617238 0.0636496 0.0516692 0.0418288 -0.00167584 0.0573518 -0.0372887 -0.0228733 -0.0872535 -0.00887363 0.064136 0.00742665 0.0240807 -1.17391e-05 0.0891894 -0.0608884 -0.0531483 -0.0153739 -0.067515 -0.109284 0.0576304 0.129862 0.057005 -0.0630598 0.00579618 0.0376452 -0.0121165 0.120856 -0.16035 0.101452 -0.0861702 0.185646 0.0444911 0.00365764 0.0578213 0.116208 -0.0904646 -0.0334803 0.0209699 0.04729 -0.115183 -0.103824 0.00744685 0.126057 0.0246116 -0.0608417 0.0420372 0.0419757 -0.130088 0.0957874 -0.070348 -0.0367667 
0.0675631 0.063679 -0.145508 -0.0166642 0.133564 0.160691 0.0988057 -0.100809 -0.14838 0.0344957 0.00122275 0.116682 0.114447 -0.0756048 -0.00540322 -0.0069231 -0.0656525 0.0344053 -0.0504787 0.13546 0.0859437 -0.0579215 0.0293864 0.112148 0.0116749 0.0315943 -0.0985963 -0.214524 0.0631134 0.155236 -0.0269775 0.122347 -0.118756 0.0333926 -0.00553497 0.0286815 -0.0798484 0.0717903 -0.000997347 -0.0219353 0.0576988 -0.0569042 -0.00635525 0.12796 -0.177661 0.0674306 0.199049 0.0378079 -0.138542 -0.00914547 0.0735426 -0.0336784 -0.0704761 -0.0426066 0.13479 0.0158568 -0.0600686 0.230536 0.00968941 -0.0598909 -0.0670248 0.00259492 0.223886 -0.112464 0.111243 -0.0816349 -0.0146772 0.037541 -0.0907557 0.0320469 0.0201524 0.165459 -0.0399533 0.0257743 0.00630279 0.0527393 -0.0621469 0.0541287 0.0298651 0.0707887 -0.00709706 0.0445858 -0.0208751 -0.024508 -0.0936161 -0.0298723 0.0979592 -0.00871296 -0.00267024 -0.00275497 0.0332991 -0.100712 -0.0603066 -0.0357518 -0.0855942 -0.0798277 0.0519226 0.0688879 0.0777312 -0.0594665 -0.00706362 0.0439505 0.00645234 0.1425 -0.210783 0.0614666 -0.150945 0.178477 0.0133058 -0.0182938 0.080832 0.125842 -0.117807 -0.0282871 0.0175045 0.0665123 -0.127241 -0.0951535 -0.0134804 0.155342 0.0352682 -0.0223444 0.0138688 0.0602614 -0.0977734 0.0822953 -0.0789588 -0.0499873 
0.0934626 0.0505067 -0.149353 -0.024305 0.130702 0.169245 0.0712465 -0.0860888 -0.144142 -0.00599217 0.00986802 0.11045 0.102352 -0.115185 -0.0893084 0.0309646 -0.0589993 0.0592129 -0.0814336 0.176096 0.129232 -0.0509548 0.0509002 0.0873329 -0.0415417 0.0631943 -0.0873486 -0.211305 0.0836892 0.118245 -0.0455807 0.135059 -0.125031 0.0607594 -0.00684588 0.003011 -0.0625221 0.126932 0.0237551 -0.0454598 0.0325304 -0.0510286 -0.00648634 0.107816 -0.151036 0.0175712 0.200781 0.046223 -0.152055 0.0484505 0.0456234 -0.0131373 -0.091065 0.00966781 0.130421 -0.0292232 0.0107233 0.188706 -0.0123475 -0.102492 -0.0392891 0.0104006 0.269718 -0.109051 0.0982721 -0.106737 -0.0288557 0.0310835 -0.0672577 0.0628683 -0.0122254 0.120088 -0.0404941 0.0832313 -0.0192258 -0.01736 -0.0289652 0.0813006 0.0264873 0.0371411 0.000898291 0.0765721 -0.00962709 -0.0441625 -0.0719998 -0.0281816 0.0802811 0.0490695 0.0340631 0.00799155 0.09306 -0.10977 -0.0843802 -0.0151745 -0.0356891 -0.0782679 0.0540757 0.119649 0.0378953 -0.0450082 0.0084765 0.0446988 -0.0388086 0.190762 -0.136305 0.0551993 -0.113817 0.171406 0.0301506 -0.0288675 0.0446862 0.154073 -0.10199 0.0250714 0.045647 0.0485093 -0.0952279 -0.116912 -0.00172009 0.129715 0.0109633 0.0164432 0.074527 0.0299891 -0.109204 0.0557529 -0.0508421 -0.0557029 
0.00297165 0.107276 -0.175258 -0.0258369 0.0903336 0.130769 0.0750529 -0.158552 -0.193685 0.128398 -0.0146208 0.0785308 0.0984832 -0.0364019 0.00304523 0.0111034 -0.0788691 0.0590745 0.0757643 0.0925902 0.00578494 -0.0592647 0.0291047 0.0199104 -0.0269645 0.118323 -0.111867 -0.219744 0.081941 0.150749 -0.058042 0.144501 -0.104337 -0.0583818 0.060627 0.0594161 -0.0422163 0.0567285 0.0495054 -0.0274673 0.013566 -0.0639997 0.00455551 0.126052 -0.180059 0.150721 0.237292 0.0477223 -0.164346 -0.0643774 0.0449178 -0.00614038 -0.0534569 -0.0387109 0.118787 0.0333841 0.00487297 0.189886 0.0279352 -0.0146123 -0.0393709 0.0187438 0.234227 -0.108562 0.167523 -0.0637722 -0.0156539 0.020794 -0.0299646 0.0436383 0.012696 0.166678 -0.028633 0.0504479 0.00527789 0.0311916 -0.095426 0.0908538 0.0342936 -0.030196 0.00927384 0.0726384 -0.0770677 0.00292333 -0.102713 -0.0386593 0.0480475 -0.0275867 0.0158121 -0.0148196 0.0343919 -0.0132306 -0.0216701 -0.0734223 -0.0485318 -0.0874359 0.0887597 0.129715 0.0998396 -0.0441473 -0.01076 0.0661825 0.0319338 0.0574188 -0.180037 0.0726689 -0.0909165 0.149396 0.0213124 0.0608416 0.0580756 0.0691992 -0.0522921 -0.0971027 0.00211766 0.0378182 -0.0747525 -0.14059 -0.0105557 0.0777796 0.0511671 -0.075797 0.0515931 0.0268305 -0.136369 0.0958133 -0.0851373 -0.00856928 
