0.0316788 -0.011424 -0.0103076 -0.00243381 0.103703 0.175266 0.0656266 -0.0896993 -0.0244119 -0.045488 -0.0325357 0.0637034 0.0707936 -0.115282 -0.0499441 -0.0758267 -0.105679 0.142856 -0.101152 0.121051 0.14397 -0.0618309 0.0460639 0.146497 -0.0297409 0.0248176 -0.16734 -0.242278 0.084179 0.0388829 0.0732262 0.14686 -0.124917 0.0534606 0.102084 0.0193982 -0.0460265 0.126594 -0.0134262 -0.138612 0.116563 -0.0533265 -0.0923347 0.0963815 -0.174138 -0.0686666 0.107087 0.0878103 -0.0880021 -0.0179752 -0.0685756 -0.0456702 0.0355375 -0.0214894 0.0960586 0.0047854 0.0246053 0.138522 -0.0301004 -0.182785 -0.0342235 0.0696345 0.19003 -0.060712 0.0775278 -0.0321925 0.0591525 -0.038586 -0.0496982 0.100236 -0.0557265 0.0659116 -0.0269412 0.0626141 -0.0616289 -0.0947798 -0.115501 0.0398485 0.0830762 0.0356682 -0.0366197 0.162274 -0.0400713 -0.087406 0.0357871 -0.0880883 0.0940222 0.109093 -0.00133152 0.0260223 0.207164 -0.0306706 0.023172 -0.0712855 -0.0757428 -0.117909 -0.00379777 0.141451 0.0315665 -0.0308531 0.0973199 0.0134948 -0.026622 0.0903042 -0.030473 0.0283611 -0.00591429 0.0743081 0.0845403 0.05709 0.00886021 0.148976 -0.126874 -0.0519541 0.0602126 0.039391 -0.117279 -0.191441 0.0129147 0.0820462 0.0517897 0.0113275 -0.0253615 0.0189595 -0.149286 0.0494016 -0.0416042 -0.0150531 
0.0346846 -0.0132142 -0.047181 -0.0236165 0.109912 0.170333 0.0613341 -0.053814 -0.00948705 -0.0757319 -0.0128515 0.0795995 0.0791945 -0.164723 -0.0665427 -0.0720689 -0.142897 0.0887066 -0.133219 0.15539 0.149526 -0.0588786 0.0501534 0.130623 -0.0506788 0.00957807 -0.119238 -0.256784 0.064952 0.0297366 0.0516655 0.0752016 -0.104064 0.0724154 0.0815052 0.0183383 -0.0313343 0.121945 -0.0503434 -0.110017 0.134705 -0.073211 -0.0849558 0.141929 -0.190659 -0.0513305 0.123661 0.0868113 -0.0923449 0.0223083 -0.0838516 -0.0729114 -0.0163034 -0.00210163 0.113479 -0.00896877 -0.00854587 0.123839 -0.045461 -0.174864 -0.0365571 0.0316891 0.213547 -0.0363211 0.083408 -0.10037 0.0414172 -0.02279 -0.0153419 0.0728212 -0.0503302 0.0528983 -0.0225112 0.0414528 -0.0298926 -0.0659418 -0.128844 0.0881122 0.0691352 0.065005 -0.0357133 0.125333 -0.030386 -0.0535185 -0.00359723 -0.0295377 0.114382 0.116111 -0.00892592 0.0271083 0.20267 -0.0853011 -0.0236553 -0.0779123 -0.101 -0.128964 -0.0190208 0.101239 0.0295493 -0.0503459 0.0671326 0.00331869 -0.0231761 0.088244 -0.0384202 0.0200289 -0.041151 0.140197 0.0387594 0.0448304 0.0224939 0.138262 -0.130874 -0.0318594 0.036181 0.0595986 -0.12781 -0.174096 0.00377086 0.0994512 0.0433377 0.0330501 -0.0257755 0.061149 -0.1297 0.0241847 -0.0568491 -0.0124717 
0.0302485 -0.00692841 0.0106943 -0.00766269 0.121824 0.17657 0.0533921 -0.0833429 -0.0445671 -0.0480404 -0.0415857 0.0562917 0.062894 -0.0917852 -0.0226524 -0.0798781 -0.0785851 0.116968 -0.102303 0.128992 0.111567 -0.0421972 0.0597474 0.107273 -0.0353469 0.0463426 -0.171252 -0.211233 0.0846029 -0.00992579 0.0858072 0.15005 -0.131625 0.0512355 0.0859823 0.0400697 -0.0317632 0.159481 -0.0176882 -0.118926 0.135371 -0.0157528 -0.106717 0.0672389 -0.190969 -0.0514121 0.102085 0.0811325 -0.0741957 -0.0237783 -0.0779132 -0.0246925 0.0148466 -0.00999688 0.0926775 -0.0117755 0.0305837 0.143999 -0.0301431 -0.179702 -0.05391 0.075571 0.178278 -0.0707211 0.0910143 -0.0170165 0.0790725 -0.00824426 -0.0343393 0.120677 -0.0249004 0.0842831 0.00205863 0.094658 -0.0426922 -0.090006 -0.134231 0.0466786 0.0809296 0.00866328 -0.0432452 0.180226 -0.0181417 -0.082744 0.0464517 -0.100837 0.107508 0.141941 -0.00724607 0.00884395 0.216636 -0.0280937 0.0430653 -0.0691325 -0.0626445 -0.138341 0.0274446 0.134018 0.01361 -0.0310085 0.0548305 0.0199326 -0.0298576 0.103471 -0.0483718 0.0442735 -0.0131166 0.0641767 0.10876 0.0449861 0.0130254 0.16321 -0.132128 -0.0124057 0.0707718 0.0106106 -0.126725 -0.209019 0.0078533 0.0664671 0.0522564 0.0308607 -0.0109248 0.021652 -0.124693 0.0384202 -0.0412746 -0.00841893 
0.0407577 -0.00463889 -0.0325052 -0.0380853 0.121058 0.172744 0.0494064 -0.0631265 -0.0397563 -0.0649329 -0.0284523 0.0642922 0.0711041 -0.122465 -0.0392796 -0.0854585 -0.102916 0.0885546 -0.114964 0.153431 0.111182 -0.0347095 0.0687464 0.0964887 -0.0541942 0.0405449 -0.125076 -0.220492 0.074762 -0.00956203 0.0616315 0.0960946 -0.115816 0.063193 0.0815097 0.0320917 -0.0215469 0.156007 -0.037702 -0.110333 0.130324 -0.0344962 -0.100743 0.12107 -0.214044 -0.0325065 0.113037 0.0963601 -0.0844946 0.0232309 -0.0891212 -0.0417443 -0.0243095 0.00286481 0.0985853 -0.0286939 0.00735222 0.139211 -0.0407386 -0.180292 -0.0464393 0.0458432 0.211915 -0.0493378 0.0889993 -0.0782484 0.0592996 0.000408507 -0.0127991 0.103863 -0.0285524 0.0689187 0.00120199 0.0792062 -0.0377111 -0.0881736 -0.138146 0.0748407 0.0802269 0.0281902 -0.0385835 0.150482 -0.0233072 -0.0682307 0.0262242 -0.0814518 0.109458 0.138413 0.00670891 0.0205368 0.216905 -0.0619512 0.0045748 -0.0829351 -0.0710404 -0.152139 0.0177707 0.119467 0.0114808 -0.0540563 0.0387104 0.0257238 -0.0252588 0.0999149 -0.0588272 0.0307454 -0.0368811 0.111269 0.0797626 0.0446867 0.0409686 0.161186 -0.13115 0.00767632 0.0454833 0.021394 -0.116873 -0.207147 0.00889695 0.0791014 0.0454534 0.0399131 -0.00432736 0.0531017 -0.118161 0.00163667 -0.0467777 -0.013011 
0.0481241 -0.0183553 -0.0438399 -0.0411052 0.123115 0.174014 0.0590816 -0.048365 -0.0170414 -0.0814607 -0.0233182 0.0735192 0.0771467 -0.134835 -0.0456774 -0.0915244 -0.121102 0.0742958 -0.131274 0.158871 0.126215 -0.0409929 0.0646864 0.106871 -0.0573974 0.0161043 -0.121498 -0.232686 0.0575001 0.00381264 0.0573889 0.0694284 -0.110435 0.0709741 0.0783016 0.0287068 -0.0230822 0.146343 -0.0506501 -0.108197 0.131662 -0.0415629 -0.105143 0.130422 -0.210908 -0.0368231 0.10255 0.0982065 -0.0779631 0.0380127 -0.0978518 -0.0542255 -0.0256221 0.00617096 0.10898 -0.027448 -0.0079563 0.139736 -0.0530287 -0.176494 -0.0421441 0.0387277 0.216083 -0.0454059 0.0818695 -0.0975166 0.0528283 0.00950661 -0.0109128 0.0886652 -0.0227787 0.0626528 -0.00871093 0.0581688 -0.0372899 -0.0674964 -0.136642 0.0722134 0.0822996 0.0531663 -0.0419345 0.132103 -0.0227857 -0.0602462 0.0148108 -0.0612938 0.116842 0.132314 0.00419335 0.0240526 0.214858 -0.0863316 -0.00519142 -0.0802554 -0.0860913 -0.150728 0.00133065 0.0950524 0.0130617 -0.0532323 0.0514224 0.0211028 -0.0280662 0.090427 -0.0586649 0.0255087 -0.0480319 0.120703 0.0579556 0.0468674 0.0445858 0.147723 -0.134284 0.00279099 0.0399822 0.0478888 -0.121302 -0.188133 0.00394058 0.0934317 0.0411631 0.0402532 -0.0156186 0.0677012 -0.11416 0.00167797 -0.0501573 -0.0112529 
0.0862704 -0.0612504 -0.0871125 -0.000950718 0.161009 0.168997 0.0815813 -0.0655518 0.059471 -0.141202 0.00456348 0.101638 0.0699945 -0.067508 -0.0868317 -0.0893852 -0.0982359 0.0744734 -0.138648 0.152629 0.185474 -0.0512132 0.0456563 0.173653 -0.0174634 -0.0664318 -0.102681 -0.207334 0.0266323 0.0846995 0.0501783 0.0285457 -0.0937382 0.053623 0.0594727 0.0458525 -0.0547583 0.0892125 -0.0791465 -0.122011 0.107359 0.020373 -0.0919291 0.115244 -0.177355 -0.0542222 0.0726749 0.0869154 -0.0179655 0.0391861 -0.106486 -0.0455278 0.0194366 -0.00924735 0.158033 0.00908499 -0.0417224 0.19116 -0.0693521 -0.160741 -0.0465196 0.0485596 0.238281 -0.0710116 0.0310166 -0.0792714 0.03121 0.041498 -0.0260739 0.0856876 0.0225674 0.0745907 -0.0322025 -0.0170567 -0.0519704 0.00816207 -0.0855945 0.0360997 0.0557754 0.0580236 -0.0318078 0.143481 -0.0230856 -0.0666093 0.00587472 -0.0114821 0.0996524 0.110077 -0.0174881 0.0280516 0.211329 -0.127151 -0.0246919 -0.0613397 -0.0597594 -0.136676 -0.0481504 0.0481019 0.0444478 -0.0468486 0.0995943 0.00573936 -0.00738703 0.0491515 -0.111409 0.0546518 -0.0738446 0.059475 0.0112507 0.045632 0.0709094 0.104616 -0.120232 -0.00125316 0.039682 0.11807 -0.112358 -0.12901 -0.015014 0.125491 0.015932 0.0370949 -0.0441731 0.063364 -0.142995 0.0677311 -0.0428614 -0.0101602 
0.0781738 -0.0262038 -0.0714223 -0.0212659 0.124241 0.185366 0.0707232 -0.0407869 0.00586116 -0.094812 0.00112894 0.0617849 0.0855485 -0.111051 -0.06469 -0.0660087 -0.0990384 0.069599 -0.143943 0.155251 0.164748 -0.0640114 0.0739847 0.151578 -0.0300657 -0.0233561 -0.114329 -0.236624 0.066045 0.0336503 0.073188 0.0615751 -0.117464 0.0656751 0.0455296 0.0250419 -0.0577782 0.147734 -0.0386759 -0.09889 0.0933568 -0.0231154 -0.114781 0.118782 -0.168954 -0.0739796 0.0872498 0.0944123 -0.0537958 0.0461216 -0.0924253 -0.032781 -0.0034116 -0.0049966 0.102268 -0.0269062 0.00607265 0.172234 -0.0333323 -0.191018 -0.0586753 0.0415124 0.233764 -0.078557 0.0280733 -0.079694 0.0504005 0.0250815 -0.0234174 0.0768119 -0.0199789 0.085257 -0.0373141 0.0495521 -0.0420536 -0.0745843 -0.0956937 0.0590619 0.0692898 0.0869183 -0.0345773 0.116618 -0.0218754 -0.0880024 0.0160857 -0.0318831 0.0950701 0.113733 0.0123061 -0.00904992 0.208984 -0.095381 -0.018124 -0.0671309 -0.0528234 -0.133054 -0.0157359 0.0974103 0.0121068 -0.0459537 0.0708134 0.00347793 -0.0286507 0.111004 -0.0851848 0.038018 -0.0660327 0.0933024 0.0721982 0.0203027 0.0380933 0.16744 -0.127378 0.00660673 0.0591988 0.0893338 -0.114637 -0.15076 0.00518448 0.118289 0.0184441 0.0348195 -0.013027 0.0675354 -0.15009 0.0211029 -0.0563797 -0.00615835 
0.0881895 -0.0741263 -0.0461371 -0.00717678 0.159648 0.170602 0.0904936 -0.0717803 0.0404703 -0.114963 -0.0137042 0.071989 0.0940946 -0.0812893 -0.0489994 -0.0821095 -0.107567 0.0882274 -0.143419 0.139003 0.188131 -0.0371063 0.0468868 0.171772 -0.026192 -0.0635734 -0.152063 -0.239605 0.0172104 0.0858692 0.0595281 0.0452774 -0.121575 0.0594895 0.0954498 0.0369636 -0.0423762 0.0886917 -0.0454783 -0.127606 0.0986468 0.00100633 -0.101615 0.0947914 -0.169949 -0.0564176 0.0533527 0.112327 -0.00608208 0.031616 -0.0882031 -0.0662648 0.0387747 -0.00249901 0.142628 -0.0165326 -0.00831833 0.158576 -0.0543876 -0.159801 -0.0237776 0.0539733 0.188507 -0.0618475 0.0341687 -0.0941179 0.0471715 0.0463613 -0.0146028 0.0559375 0.00976808 0.0839766 -0.0353433 -0.0311206 -0.0738939 -0.00358099 -0.105175 0.0306176 0.0846681 0.100108 0.0068272 0.124832 -0.024232 -0.0565094 0.0135914 -0.0255577 0.109145 0.113648 -0.0282727 0.0243447 0.208311 -0.0913543 0.00230359 -0.0517481 -0.121989 -0.130876 -0.0512358 0.0579346 0.0402904 -0.0392179 0.138758 0.018097 -0.0211604 0.0476631 -0.0646288 0.0156664 -0.0625159 0.0632281 0.0388974 0.085271 0.0480511 0.0976494 -0.13164 -0.0211278 0.0336395 0.143763 -0.130899 -0.109454 -0.0684896 0.109217 0.018375 0.0295234 -0.0423629 0.0641619 -0.147132 0.057321 -0.0615028 -0.00762958 
0.0810761 -0.0246892 -0.0607861 -0.0151186 0.151751 0.168071 0.0731323 -0.0634059 0.00854728 -0.0876727 -0.0012045 0.0691214 0.0932759 -0.0925608 -0.0489064 -0.0946465 -0.0933143 0.0766947 -0.129488 0.159667 0.163419 -0.0543786 0.0476069 0.144344 -0.00517608 -0.0327552 -0.128766 -0.211196 0.0617484 0.0619827 0.0678835 0.0516861 -0.116164 0.058605 0.0700954 0.0304393 -0.0476169 0.113796 -0.0368094 -0.129725 0.113628 -0.0187461 -0.0938827 0.130008 -0.197381 -0.0562775 0.0787585 0.113585 -0.0329501 0.0227104 -0.0843298 -0.0202358 -0.00427451 -0.0119022 0.131887 -0.0299345 -0.0299635 0.15477 -0.0428294 -0.18628 -0.0481512 0.0260772 0.213006 -0.0473535 0.0348058 -0.0839968 0.0495242 0.0341664 -0.018896 0.0664625 0.00870667 0.0917081 -0.024489 0.00865126 -0.0477639 -0.0411336 -0.113501 0.0580552 0.0829094 0.100087 -0.0238924 0.124937 9.69546e-05 -0.0543056 0.0304858 -0.0486298 0.110549 0.131397 0.0123345 0.0108162 0.197286 -0.0889347 -0.0133514 -0.0598193 -0.103242 -0.1751 -0.0194522 0.0783821 0.0190462 -0.0725865 0.0888088 0.0364355 0.000293704 0.0794921 -0.0982224 0.0415808 -0.058059 0.108293 0.0895002 0.0538318 0.0624851 0.123901 -0.159808 0.013915 0.0407361 0.0840642 -0.125958 -0.146519 -0.0203261 0.112663 0.0210123 0.034705 -0.0383569 0.0670239 -0.134975 0.0272728 -0.0383919 0.00383098 
0.0975045 -0.0627197 -0.0503069 -0.0151688 0.153293 0.191877 0.0840915 -0.0483755 0.0467767 -0.104533 0.0130761 0.0695838 0.101817 -0.0862411 -0.0561811 -0.0578426 -0.0880676 0.0867937 -0.166996 0.122568 0.207899 -0.0453216 0.058051 0.168052 -0.018105 -0.0568051 -0.135479 -0.237423 0.0413775 0.0666856 0.0855161 0.0643619 -0.120713 0.0700893 0.0603325 0.0283643 -0.0562576 0.112114 -0.0203972 -0.100969 0.0970664 -0.000488332 -0.124032 0.0933662 -0.155476 -0.0947889 0.0399596 0.0997952 -0.0197229 0.0132792 -0.0776669 -0.0380144 0.0105187 -0.00657757 0.107617 -0.0127064 0.00318856 0.171626 -0.0586496 -0.162051 -0.0462249 0.0296277 0.203807 -0.0803842 0.0252668 -0.0896462 0.0474896 0.0713653 -0.0150106 0.079034 0.00782547 0.0943736 -0.0533421 -0.024653 -0.0647675 -0.0301204 -0.0991861 0.0436732 0.0566027 0.108609 -0.0205443 0.124453 0.000624689 -0.0661969 0.00238104 -0.014899 0.124501 0.107507 -0.0253392 -0.0046546 0.195997 -0.112034 -0.0186181 -0.035815 -0.09135 -0.129818 -0.0498788 0.0558182 0.0147955 -0.0269242 0.12026 9.12212e-05 -0.0394308 0.0948557 -0.0533317 0.0209839 -0.0713393 0.0644143 0.06039 0.0322731 0.0202796 0.124159 -0.137316 0.00255395 0.0751616 0.130374 -0.145406 -0.116482 -0.0353517 0.124499 0.0270342 0.0326051 -0.0380264 0.0675407 -0.13303 0.0459488 -0.0633783 0.00558348 
0.0880179 -0.0117091 -0.089152 0.0191788 0.137916 0.181045 0.105463 -0.0875487 0.0092358 -0.0797639 -0.0153171 0.0652706 0.0806918 -0.100878 -0.0532642 -0.0582174 -0.0596126 0.087735 -0.114741 0.146937 0.152882 -0.0605829 0.0490303 0.190566 -0.0186792 -0.0465389 -0.155638 -0.248171 0.0710702 0.0932741 0.0690962 0.114416 -0.122509 0.0499102 0.0705491 0.0235913 -0.0355557 0.11226 -0.0361351 -0.11575 0.098524 -0.0158997 -0.0869547 0.0885963 -0.155377 -0.0328328 0.103211 0.0969179 -0.0478072 0.0148746 -0.0682083 -0.029857 0.0483705 -0.0321329 0.119054 0.00100935 0.00864305 0.176273 -0.0108171 -0.169574 -0.0581606 0.0686439 0.204064 -0.12315 0.0332855 -0.0605878 0.0560205 -0.00723395 -0.0562858 0.0548315 -0.027309 0.0835056 -0.0528346 0.0416769 -0.050918 -0.0386632 -0.0774471 0.0572471 0.0718495 0.0694163 -0.0155756 0.144899 -0.0512785 -0.0935364 0.0449907 -0.0306924 0.0661326 0.0661999 -0.0242884 0.00842396 0.198968 -0.0733192 -0.0109536 -0.0731205 -0.0517773 -0.115564 0.000751718 0.0950251 0.0423935 -0.0423125 0.10654 0.00985763 -0.00720753 0.110569 -0.118507 0.0305083 -0.0507431 0.0723934 0.0594504 0.0688664 0.0461279 0.133533 -0.117289 -0.0445189 0.0329362 0.0952793 -0.127457 -0.157409 -0.0226055 0.117688 0.0234867 0.0270643 -0.0213859 0.0669535 -0.170116 0.0548051 -0.0756186 -0.033811 
0.058274 -0.000709674 -0.0695175 0.0298074 0.121832 0.179594 0.0848744 -0.108363 0.0184464 -0.0936149 -0.0226085 0.0505956 0.068781 -0.0855237 -0.0583001 -0.0461759 -0.0732201 0.086055 -0.103856 0.124484 0.167938 -0.0729439 0.0448883 0.19252 0.00450976 -0.0428292 -0.166839 -0.246799 0.0764316 0.0970726 0.0955244 0.121707 -0.116669 0.0372194 0.0778714 0.0392157 -0.0394669 0.102232 -0.0298216 -0.117679 0.0950769 -0.0129593 -0.0696508 0.0800574 -0.122388 -0.0373912 0.121705 0.0819306 -0.0538417 -0.0110775 -0.0846123 -0.0364569 0.0840373 -0.0378423 0.119928 0.0215107 0.0191367 0.180373 -0.000927671 -0.190618 -0.0626499 0.0913965 0.196727 -0.121074 0.0335123 -0.0182684 0.0641214 -0.0202881 -0.0572688 0.0648235 -0.0367601 0.0778255 -0.0585419 0.0340352 -0.0319432 -0.0405051 -0.0849817 0.0444699 0.0625211 0.0661478 -0.0140837 0.159114 -0.0558919 -0.0989254 0.0360012 -0.0215185 0.0511113 0.0588904 -0.0379195 0.00604528 0.201762 -0.0607643 0.00257509 -0.0762053 -0.0455465 -0.0942533 -0.0103049 0.121982 0.0489357 -0.0321461 0.104581 -0.00687942 -0.00750964 0.0961417 -0.116994 0.0465978 -0.0424893 0.0591986 0.056504 0.0581337 0.0315117 0.128992 -0.123588 -0.0670612 0.0439237 0.101083 -0.134029 -0.153612 -0.0116441 0.110805 0.0339021 0.0239604 -0.0233546 0.0453375 -0.189999 0.0788327 -0.0681862 -0.0207612 
0.0371235 -0.00109578 -0.0688554 0.0152665 0.0965223 0.175575 0.0478656 -0.100331 -0.0137848 -0.0724774 -0.0279136 0.0322167 0.0633348 -0.0874539 -0.0460667 -0.0456976 -0.0946731 0.0775048 -0.0581175 0.124016 0.147607 -0.0827913 0.075366 0.151346 0.000631832 0.00814991 -0.151495 -0.258493 0.0817361 0.0547414 0.101483 0.106526 -0.111534 0.0124236 0.0831775 0.0470527 -0.0464653 0.133427 -0.0125422 -0.115957 0.0843534 -0.0191166 -0.0868641 0.0991922 -0.143376 -0.0431047 0.140287 0.0780717 -0.0601216 -0.00799141 -0.0992202 -0.0337416 0.0789494 -0.0223691 0.107842 0.00221474 0.0540652 0.165433 0.00923012 -0.213677 -0.0593021 0.0842423 0.21603 -0.0989897 0.0471394 -0.011246 0.0752469 -0.0184909 -0.0221521 0.0720114 -0.0464576 0.0915907 -0.0480031 0.0608516 -0.0215601 -0.0827051 -0.112552 0.048019 0.0719981 0.0710692 -0.022815 0.152333 -0.0539037 -0.102767 0.0373347 -0.043819 0.0495452 0.0843446 -0.00441445 -0.0254248 0.200758 -0.023532 0.0164207 -0.0935268 -0.0384578 -0.119753 0.00937783 0.16694 0.0354442 -0.0408318 0.0747846 -0.00639154 -0.0010253 0.0791516 -0.101175 0.0549924 -0.0254903 0.0614535 0.0849405 0.0543435 0.0251803 0.148064 -0.115709 -0.0718386 0.0536622 0.0822034 -0.114924 -0.177875 0.00413307 0.0876891 0.0361094 0.0119147 -0.00308141 0.0281702 -0.196568 0.0629737 -0.0523445 0.0186873 
0.0424747 -0.0131294 -0.0724758 0.0254011 0.108584 0.188957 0.0542524 -0.102127 -0.00599788 -0.0731792 -0.0234049 0.0429116 0.0563609 -0.0889041 -0.045432 -0.0431259 -0.091162 0.0897473 -0.0567583 0.113971 0.155196 -0.0825093 0.0702363 0.16669 0.0125694 -0.00424662 -0.151317 -0.264005 0.0723252 0.0625668 0.109055 0.105758 -0.115243 0.0136602 0.0820356 0.0517244 -0.0558147 0.104217 -0.0128922 -0.117542 0.0915729 -0.0167608 -0.0831312 0.0985014 -0.143297 -0.0551178 0.135211 0.0745315 -0.0526756 -0.0123962 -0.0890391 -0.0423563 0.0822737 -0.0315156 0.111295 0.0143348 0.0483445 0.176672 0.00723644 -0.200506 -0.0612632 0.0872775 0.216408 -0.111805 0.0509065 -0.0116796 0.0675301 -0.0207733 -0.030444 0.0857045 -0.0427344 0.103611 -0.0547748 0.0469444 -0.0309462 -0.0728246 -0.104174 0.0498866 0.0622473 0.0648627 -0.0268085 0.158617 -0.0493461 -0.101031 0.0319584 -0.0373625 0.054548 0.0776429 -0.0168041 -0.0217916 0.199859 -0.0261187 0.00634332 -0.090629 -0.0328285 -0.109892 0.000415843 0.156684 0.0351534 -0.0321163 0.0824029 -0.0128286 -0.00188657 0.0698287 -0.0962476 0.0578728 -0.0260387 0.0451886 0.0702347 0.0584886 0.0193695 0.139954 -0.103003 -0.0804764 0.0614532 0.0855133 -0.111044 -0.170025 0.00399671 0.0964584 0.0443954 0.00514672 -0.00661949 0.0250413 -0.198504 0.0761402 -0.0518519 0.0221333 
0.0821323 0.0105199 -0.0829824 0.0120792 0.137373 0.180602 0.111169 -0.0831694 0.00711407 -0.0621477 -0.0146697 0.048456 0.083695 -0.113704 -0.0454509 -0.0545221 -0.073686 0.0933016 -0.124972 0.14219 0.150455 -0.0623407 0.0464806 0.172621 -0.0168876 -0.0524515 -0.168554 -0.243507 0.0851119 0.0892258 0.0704129 0.118716 -0.128826 0.0492631 0.0763524 0.0177847 -0.0369687 0.110756 -0.0305107 -0.119092 0.0959959 -0.0285998 -0.0814035 0.0944512 -0.155162 -0.0295677 0.102029 0.109117 -0.0588112 0.0144152 -0.0711117 -0.0211436 0.0357707 -0.0370472 0.108631 -0.00635393 0.00955257 0.161733 -0.00752724 -0.173933 -0.0573219 0.063395 0.201539 -0.110689 0.027764 -0.0576345 0.0523445 -0.00532982 -0.0537405 0.0553679 -0.0255076 0.088461 -0.048556 0.0467093 -0.052488 -0.0492078 -0.0859594 0.0604991 0.0724418 0.06733 -0.00751716 0.142849 -0.055137 -0.0858896 0.0436341 -0.0238615 0.0611814 0.0693969 -0.0109287 0.0139953 0.202785 -0.0683138 -0.0221085 -0.0789022 -0.0584889 -0.118876 -0.00491156 0.100604 0.0361274 -0.0484736 0.108337 0.00813119 -0.00348233 0.107352 -0.115121 0.0296953 -0.0487107 0.0892062 0.0792127 0.0737313 0.0458074 0.138374 -0.125408 -0.0438209 0.0394357 0.0889355 -0.12597 -0.152901 -0.0146017 0.113136 0.0286089 0.0300826 -0.0132639 0.0779527 -0.171696 0.0412287 -0.0708711 -0.032522 
0.0431932 0.00749909 -0.0713108 0.0188742 0.111268 0.179182 0.0605276 -0.101148 -0.00628085 -0.0821019 -0.030422 0.0354835 0.0718101 -0.0813246 -0.0440037 -0.0490699 -0.0726123 0.0802603 -0.0810211 0.132968 0.151342 -0.0800744 0.068016 0.170132 0.00297788 -0.0225482 -0.163811 -0.24799 0.0828734 0.0701209 0.104863 0.115384 -0.109633 0.0232696 0.0771421 0.0502008 -0.0402594 0.122159 -0.0300391 -0.115754 0.0908788 -0.0135273 -0.0782881 0.0886078 -0.138397 -0.0302885 0.136616 0.0828064 -0.0614292 -0.00761888 -0.0960233 -0.0373343 0.0787543 -0.0323374 0.107186 0.011869 0.0329985 0.171832 0.01446 -0.206272 -0.0667869 0.0958402 0.199536 -0.117853 0.0423287 -0.0153009 0.0724865 -0.0198026 -0.0453693 0.0642161 -0.0380814 0.0824093 -0.0528605 0.0476358 -0.0209958 -0.0596037 -0.100888 0.0508268 0.0707607 0.0640845 -0.0239019 0.153711 -0.0589067 -0.100091 0.0419098 -0.0289212 0.0458361 0.0690363 -0.0220818 -0.01048 0.199572 -0.0427946 0.0137212 -0.0897059 -0.0359592 -0.11007 0.00114781 0.153205 0.0329779 -0.038299 0.0801002 -0.00432363 -0.00236196 0.0944605 -0.119267 0.0566414 -0.0385041 0.0634628 0.0759613 0.0548471 0.025976 0.137873 -0.121635 -0.0652281 0.0395518 0.084053 -0.127244 -0.174 -0.00328269 0.103885 0.0326307 0.0175069 -0.018115 0.043447 -0.19365 0.0643063 -0.0662713 -0.00357242 
0.0794769 -0.0123926 -0.0756483 0.0284096 0.140913 0.184974 0.108288 -0.102544 0.0174121 -0.0954974 -0.0233613 0.0658275 0.0758184 -0.0883649 -0.0550261 -0.0582021 -0.055231 0.0946699 -0.116464 0.131379 0.16322 -0.0557103 0.040455 0.197304 -0.00994459 -0.0584164 -0.171313 -0.24166 0.063678 0.105653 0.0782507 0.127402 -0.123304 0.0542275 0.0794935 0.0291806 -0.0277905 0.0975292 -0.0318755 -0.118553 0.106328 -0.0071936 -0.070685 0.0655768 -0.140878 -0.0340677 0.10228 0.0887242 -0.0442695 0.00117103 -0.0693415 -0.0351973 0.0697875 -0.030278 0.123488 0.0160861 0.0157062 0.178505 -0.012461 -0.166997 -0.0570963 0.0902357 0.187222 -0.137152 0.0371457 -0.0419661 0.0563117 -0.0123068 -0.0671181 0.0638294 -0.0274851 0.0783233 -0.0588721 0.0350801 -0.048832 -0.0210127 -0.0718835 0.0443725 0.0675193 0.0558673 -0.0156561 0.15645 -0.0461707 -0.0886024 0.0409903 -0.0242485 0.0649539 0.0580066 -0.0456103 0.016344 0.204171 -0.0783921 0.00301378 -0.0694505 -0.0515522 -0.0997946 -0.00915125 0.100096 0.0478893 -0.0275682 0.113575 0.0089123 -0.0118756 0.115024 -0.110747 0.0293365 -0.0496206 0.0614251 0.0431073 0.0720304 0.0351929 0.116647 -0.11939 -0.0516554 0.0326789 0.102324 -0.12904 -0.149563 -0.0279561 0.119826 0.0331289 0.0285539 -0.0290481 0.0548432 -0.176414 0.0691874 -0.078515 -0.0370784 
0.0475566 -0.036014 -0.109633 0.0101493 0.125046 0.118429 0.0686778 -0.1201 0.0246122 -0.102634 -0.0421348 0.0825617 0.0718855 -0.0555346 -0.0745716 -0.0525216 -0.0947643 0.0403046 -0.0648773 0.165982 0.146579 -0.092396 0.0745088 0.134618 -0.00655179 0.0190074 -0.117064 -0.255381 0.0491197 0.0963302 0.0544085 0.102013 -0.0695886 0.01276 0.0796438 0.0272438 -0.0293529 0.183187 -0.0383981 -0.146057 0.0770766 0.00385913 -0.0681705 0.102343 -0.157126 -0.000340995 0.130435 0.0581761 -0.0285549 0.007059 -0.112216 -0.0549879 0.0813397 -0.0096917 0.165478 -0.00317149 0.0141518 0.176292 -0.0291894 -0.198892 -0.0385445 0.0346492 0.229852 -0.0804116 0.067446 -0.0344712 0.0381116 0.0193541 -0.0122966 0.0326871 -0.0260657 0.0714486 -0.0514472 0.0232686 -0.0281606 -0.0230622 -0.0907158 0.0235022 0.0728667 0.0703993 -0.0297802 0.142124 -0.0667747 -0.0889115 0.036435 -0.0761895 0.0599774 0.107417 0.0126504 -0.0180307 0.178826 -0.0605178 0.0114994 -0.0838201 -0.0475653 -0.127451 0.0133002 0.130123 0.0831212 -0.0605067 0.0720934 -0.0177349 0.00566036 0.0725822 -0.143551 0.0363924 -0.0523217 0.0763385 0.0578321 0.0482574 0.0504212 0.13127 -0.130598 -0.0473512 0.042828 0.100677 -0.129587 -0.16892 -0.0211706 0.100902 0.0143912 0.0596818 -0.0140199 0.0441864 -0.170607 0.0631132 -0.0510802 -0.0107224 
0.0382148 -0.0456756 -0.096571 -0.0019325 0.135793 0.129182 0.0741402 -0.0941319 0.0257806 -0.0948181 -0.0344434 0.0863959 0.0693717 -0.0977196 -0.0791251 -0.0781107 -0.129592 0.0712716 -0.0839616 0.183227 0.145795 -0.0872348 0.0618093 0.136585 -0.0328403 -0.00581822 -0.126546 -0.253939 0.0370565 0.0782691 0.0380433 0.0536924 -0.0785382 0.0194731 0.0967724 0.0342814 -0.0392619 0.13388 -0.0677646 -0.149966 0.0993927 -0.0154382 -0.0715465 0.127234 -0.183781 -0.0106423 0.122795 0.085975 -0.0307436 0.0351364 -0.124762 -0.0742974 0.0450571 -0.0082115 0.165291 -0.00307596 -0.00988553 0.149 -0.0458472 -0.17767 -0.0248982 0.0440371 0.23147 -0.0500845 0.0697968 -0.0777721 0.0247592 -0.00124826 -0.0112755 0.0362867 -0.01666 0.0674073 -0.0316038 0.016767 -0.0440508 -0.0180215 -0.104431 0.0495359 0.0853122 0.0522061 -0.0305285 0.135809 -0.0708168 -0.0586181 0.0199045 -0.0401257 0.072964 0.124862 0.0189048 0.00786107 0.200033 -0.0645935 0.00211421 -0.0948513 -0.0700961 -0.140221 -0.0175557 0.11152 0.0658626 -0.0633789 0.0879326 -0.00646012 0.00663185 0.0321273 -0.103556 0.04146 -0.0414361 0.0900638 0.0397299 0.0844261 0.0540507 0.110092 -0.114247 -0.0482514 0.019936 0.102555 -0.103262 -0.158688 -0.0265477 0.100589 0.0139135 0.041498 -0.0275688 0.0566903 -0.17832 0.058317 -0.0537813 -0.00737853 
0.0178396 0.0240927 -0.0689432 0.0288633 0.11831 0.12746 0.0902878 -0.122886 0.0174685 -0.0405716 -0.0308855 0.0553682 0.0674332 -0.0892765 -0.0445867 -0.0448201 -0.105006 0.089824 -0.0734271 0.166317 0.129784 -0.108105 0.0517378 0.139239 -0.00248239 -0.00702034 -0.179865 -0.240647 0.0956927 0.0973724 0.0635669 0.139042 -0.0750517 0.0126403 0.101758 0.0347922 -0.0267892 0.143925 -0.0313329 -0.166774 0.0892784 -0.0419215 -0.0460148 0.0809004 -0.156293 -0.00270181 0.137263 0.0803723 -0.0605868 -0.00342833 -0.118508 -0.0339419 0.0665454 -0.0333909 0.149431 0.0141639 -0.00087652 0.135439 -0.0304167 -0.176064 -0.0553138 0.0489026 0.212256 -0.0884 0.0681878 0.00764096 0.0264863 -0.0332619 -0.0628946 0.044672 -0.0366212 0.0768834 -0.056966 0.0556214 -0.0170327 -0.0476668 -0.0813606 0.0453594 0.0831612 0.0323929 -0.0312341 0.152469 -0.0871818 -0.0730237 0.0503913 -0.0485844 0.0284755 0.0974859 0.0292247 0.0212595 0.195078 -0.0352548 0.00479553 -0.0862949 -0.0504433 -0.129146 -0.00786558 0.143478 0.0738876 -0.0626191 0.0902363 -0.0233753 0.00745735 0.0441066 -0.114196 0.0700522 -0.00339569 0.0771877 0.109485 0.0736786 0.0155205 0.12905 -0.119419 -0.0783024 0.0598083 0.0629866 -0.097819 -0.167225 0.00805629 0.110987 0.0427958 0.0322047 -0.0132372 0.0626335 -0.188065 0.0820376 -0.0174006 -0.0107729 
0.0714056 -0.0410029 -0.0993966 -0.0193728 0.12478 0.129292 0.0980211 -0.0490617 0.00653672 -0.087546 -0.022313 0.0648823 0.102466 -0.10644 -0.0785738 -0.0655224 -0.103112 0.0603047 -0.134206 0.189365 0.154755 -0.0908173 0.0677497 0.122373 -0.0602016 -0.0150503 -0.141302 -0.248908 0.0549528 0.0585818 0.0214599 0.0918247 -0.0970335 0.0544223 0.0525375 0.00807319 -0.0404302 0.171067 -0.0681916 -0.134379 0.0888239 -0.0290632 -0.095618 0.116993 -0.174626 -0.0162106 0.0934251 0.0965784 -0.0515254 0.0410732 -0.116329 -0.0617283 0.00965898 -0.000497388 0.126935 -0.0305112 0.00459236 0.138093 -0.0310664 -0.176187 -0.0184685 0.0398852 0.213348 -0.0479425 0.04148 -0.0886032 0.0327373 0.0244975 -0.00174619 0.0180988 -0.0292468 0.0552207 -0.0288529 0.0406026 -0.0519403 -0.0384263 -0.0896792 0.0541193 0.0814738 0.0638806 -0.0320746 0.104517 -0.0726917 -0.0797227 0.016921 -0.0225404 0.0849812 0.10968 0.017976 -0.00370353 0.208332 -0.0856289 -0.0143325 -0.0900131 -0.0748335 -0.129355 -0.00883431 0.0920584 0.04889 -0.058888 0.0897403 -0.0037795 -0.00860355 0.097389 -0.0944656 0.013869 -0.0635678 0.131006 0.0585701 0.047483 0.0440936 0.143169 -0.132638 -0.028015 0.0295213 0.0965803 -0.115688 -0.161276 -0.0144001 0.102564 -0.00921274 0.0578334 -0.0171646 0.0926441 -0.160186 0.0162567 -0.0798513 -0.0334864 
