0.0870988 -0.077763 0.0696538 0.0444701 0.0918768 0.177159 0.0664279 -0.0709461 -0.058829 -0.0911746 -0.082502 0.0431134 0.0996029 0.0648096 0.175911 -0.145214 -0.0715969 -0.0273111 -0.0412709 0.0706762 0.0333324 -0.0428439 0.153954 0.171799 0.0417941 -0.116462 -0.136553 -0.190694 -0.141185 0.0444871 0.0701716 0.0552716 -0.0786904 0.105686 0.0238754 0.0692366 0.0134023 0.107914 -0.0834955 -0.0498723 0.0900834 -0.0422106 -0.0634978 -0.0583838 -0.196244 -0.0156708 0.0352189 0.0382416 0.0188321 0.0987457 0.0421443 -0.161671 0.119783 0.0429281 0.144885 0.00684549 -0.00813337 0.162773 0.0348355 -0.0946782 -0.058699 0.119219 -0.0124404 -0.19284 0.100953 0.0637569 0.0783677 0.0374295 -0.136286 0.0437995 -0.015579 0.12873 -0.0350749 0.00139491 0.029735 0.0512963 -0.0427996 -0.147354 0.133812 0.169759 -0.0172353 -0.036236 -0.0117274 -0.083625 -0.0052825 -0.0827394 0.0760839 0.0118279 -0.076254 0.0498421 0.102292 -0.100404 0.149945 -0.0345359 -0.19662 -0.0616353 -0.015592 0.0473306 0.107904 0.00971799 0.0774601 0.0366788 -0.0218659 0.0499869 -0.0686088 -0.00508165 -0.124939 0.00419067 -0.0397902 0.0320678 0.0348297 0.135948 -0.0387584 -0.0624011 -0.0179399 0.121503 -0.0729954 -0.013228 -0.0938487 0.180785 0.060573 -0.0443361 -0.0769989 0.0509973 -0.0152622 0.0632107 -0.0347683 0.00165206 
0.0870988 -0.077763 0.0696538 0.0444701 0.0918768 0.177159 0.0664279 -0.0709461 -0.058829 -0.0911746 -0.082502 0.0431134 0.0996029 0.0648096 0.175911 -0.145214 -0.0715969 -0.0273111 -0.0412709 0.0706762 0.0333324 -0.0428439 0.153954 0.171799 0.0417941 -0.116462 -0.136553 -0.190694 -0.141185 0.0444871 0.0701716 0.0552716 -0.0786904 0.105686 0.0238754 0.0692366 0.0134023 0.107914 -0.0834955 -0.0498723 0.0900834 -0.0422106 -0.0634978 -0.0583838 -0.196244 -0.0156708 0.0352189 0.0382416 0.0188321 0.0987457 0.0421443 -0.161671 0.119783 0.0429281 0.144885 0.00684549 -0.00813337 0.162773 0.0348355 -0.0946782 -0.058699 0.119219 -0.0124404 -0.19284 0.100953 0.0637569 0.0783677 0.0374295 -0.136286 0.0437995 -0.015579 0.12873 -0.0350749 0.00139491 0.029735 0.0512963 -0.0427996 -0.147354 0.133812 0.169759 -0.0172353 -0.036236 -0.0117274 -0.083625 -0.0052825 -0.0827394 0.0760839 0.0118279 -0.076254 0.0498421 0.102292 -0.100404 0.149945 -0.0345359 -0.19662 -0.0616353 -0.015592 0.0473306 0.107904 0.00971799 0.0774601 0.0366788 -0.0218659 0.0499869 -0.0686088 -0.00508165 -0.124939 0.00419067 -0.0397902 0.0320678 0.0348297 0.135948 -0.0387584 -0.0624011 -0.0179399 0.121503 -0.0729954 -0.013228 -0.0938487 0.180785 0.060573 -0.0443361 -0.0769989 0.0509973 -0.0152622 0.0632107 -0.0347683 0.00165206 
0.0870988 -0.077763 0.0696538 0.0444701 0.0918768 0.177159 0.0664279 -0.0709461 -0.058829 -0.0911746 -0.082502 0.0431134 0.0996029 0.0648096 0.175911 -0.145214 -0.0715969 -0.0273111 -0.0412709 0.0706762 0.0333324 -0.0428439 0.153954 0.171799 0.0417941 -0.116462 -0.136553 -0.190694 -0.141185 0.0444871 0.0701716 0.0552716 -0.0786904 0.105686 0.0238754 0.0692366 0.0134023 0.107914 -0.0834955 -0.0498723 0.0900834 -0.0422106 -0.0634978 -0.0583838 -0.196244 -0.0156708 0.0352189 0.0382416 0.0188321 0.0987457 0.0421443 -0.161671 0.119783 0.0429281 0.144885 0.00684549 -0.00813337 0.162773 0.0348355 -0.0946782 -0.058699 0.119219 -0.0124404 -0.19284 0.100953 0.0637569 0.0783677 0.0374295 -0.136286 0.0437995 -0.015579 0.12873 -0.0350749 0.00139491 0.029735 0.0512963 -0.0427996 -0.147354 0.133812 0.169759 -0.0172353 -0.036236 -0.0117274 -0.083625 -0.0052825 -0.0827394 0.0760839 0.0118279 -0.076254 0.0498421 0.102292 -0.100404 0.149945 -0.0345359 -0.19662 -0.0616353 -0.015592 0.0473306 0.107904 0.00971799 0.0774601 0.0366788 -0.0218659 0.0499869 -0.0686088 -0.00508165 -0.124939 0.00419067 -0.0397902 0.0320678 0.0348297 0.135948 -0.0387584 -0.0624011 -0.0179399 0.121503 -0.0729954 -0.013228 -0.0938487 0.180785 0.060573 -0.0443361 -0.0769989 0.0509973 -0.0152622 0.0632107 -0.0347683 0.00165206 
0.0870988 -0.077763 0.0696538 0.0444701 0.0918768 0.177159 0.0664279 -0.0709461 -0.058829 -0.0911746 -0.082502 0.0431134 0.0996029 0.0648096 0.175911 -0.145214 -0.0715969 -0.0273111 -0.0412709 0.0706762 0.0333324 -0.0428439 0.153954 0.171799 0.0417941 -0.116462 -0.136553 -0.190694 -0.141185 0.0444871 0.0701716 0.0552716 -0.0786904 0.105686 0.0238754 0.0692366 0.0134023 0.107914 -0.0834955 -0.0498723 0.0900834 -0.0422106 -0.0634978 -0.0583838 -0.196244 -0.0156708 0.0352189 0.0382416 0.0188321 0.0987457 0.0421443 -0.161671 0.119783 0.0429281 0.144885 0.00684549 -0.00813337 0.162773 0.0348355 -0.0946782 -0.058699 0.119219 -0.0124404 -0.19284 0.100953 0.0637569 0.0783677 0.0374295 -0.136286 0.0437995 -0.015579 0.12873 -0.0350749 0.00139491 0.029735 0.0512963 -0.0427996 -0.147354 0.133812 0.169759 -0.0172353 -0.036236 -0.0117274 -0.083625 -0.0052825 -0.0827394 0.0760839 0.0118279 -0.076254 0.0498421 0.102292 -0.100404 0.149945 -0.0345359 -0.19662 -0.0616353 -0.015592 0.0473306 0.107904 0.00971799 0.0774601 0.0366788 -0.0218659 0.0499869 -0.0686088 -0.00508165 -0.124939 0.00419067 -0.0397902 0.0320678 0.0348297 0.135948 -0.0387584 -0.0624011 -0.0179399 0.121503 -0.0729954 -0.013228 -0.0938487 0.180785 0.060573 -0.0443361 -0.0769989 0.0509973 -0.0152622 0.0632107 -0.0347683 0.00165206 
0.0870988 -0.077763 0.0696538 0.0444701 0.0918768 0.177159 0.0664279 -0.0709461 -0.058829 -0.0911746 -0.082502 0.0431134 0.0996029 0.0648096 0.175911 -0.145214 -0.0715969 -0.0273111 -0.0412709 0.0706762 0.0333324 -0.0428439 0.153954 0.171799 0.0417941 -0.116462 -0.136553 -0.190694 -0.141185 0.0444871 0.0701716 0.0552716 -0.0786904 0.105686 0.0238754 0.0692366 0.0134023 0.107914 -0.0834955 -0.0498723 0.0900834 -0.0422106 -0.0634978 -0.0583838 -0.196244 -0.0156708 0.0352189 0.0382416 0.0188321 0.0987457 0.0421443 -0.161671 0.119783 0.0429281 0.144885 0.00684549 -0.00813337 0.162773 0.0348355 -0.0946782 -0.058699 0.119219 -0.0124404 -0.19284 0.100953 0.0637569 0.0783677 0.0374295 -0.136286 0.0437995 -0.015579 0.12873 -0.0350749 0.00139491 0.029735 0.0512963 -0.0427996 -0.147354 0.133812 0.169759 -0.0172353 -0.036236 -0.0117274 -0.083625 -0.0052825 -0.0827394 0.0760839 0.0118279 -0.076254 0.0498421 0.102292 -0.100404 0.149945 -0.0345359 -0.19662 -0.0616353 -0.015592 0.0473306 0.107904 0.00971799 0.0774601 0.0366788 -0.0218659 0.0499869 -0.0686088 -0.00508165 -0.124939 0.00419067 -0.0397902 0.0320678 0.0348297 0.135948 -0.0387584 -0.0624011 -0.0179399 0.121503 -0.0729954 -0.013228 -0.0938487 0.180785 0.060573 -0.0443361 -0.0769989 0.0509973 -0.0152622 0.0632107 -0.0347683 0.00165206 
0.0870988 -0.077763 0.0696538 0.0444701 0.0918768 0.177159 0.0664279 -0.0709461 -0.058829 -0.0911746 -0.082502 0.0431134 0.0996029 0.0648096 0.175911 -0.145214 -0.0715969 -0.0273111 -0.0412709 0.0706762 0.0333324 -0.0428439 0.153954 0.171799 0.0417941 -0.116462 -0.136553 -0.190694 -0.141185 0.0444871 0.0701716 0.0552716 -0.0786904 0.105686 0.0238754 0.0692366 0.0134023 0.107914 -0.0834955 -0.0498723 0.0900834 -0.0422106 -0.0634978 -0.0583838 -0.196244 -0.0156708 0.0352189 0.0382416 0.0188321 0.0987457 0.0421443 -0.161671 0.119783 0.0429281 0.144885 0.00684549 -0.00813337 0.162773 0.0348355 -0.0946782 -0.058699 0.119219 -0.0124404 -0.19284 0.100953 0.0637569 0.0783677 0.0374295 -0.136286 0.0437995 -0.015579 0.12873 -0.0350749 0.00139491 0.029735 0.0512963 -0.0427996 -0.147354 0.133812 0.169759 -0.0172353 -0.036236 -0.0117274 -0.083625 -0.0052825 -0.0827394 0.0760839 0.0118279 -0.076254 0.0498421 0.102292 -0.100404 0.149945 -0.0345359 -0.19662 -0.0616353 -0.015592 0.0473306 0.107904 0.00971799 0.0774601 0.0366788 -0.0218659 0.0499869 -0.0686088 -0.00508165 -0.124939 0.00419067 -0.0397902 0.0320678 0.0348297 0.135948 -0.0387584 -0.0624011 -0.0179399 0.121503 -0.0729954 -0.013228 -0.0938487 0.180785 0.060573 -0.0443361 -0.0769989 0.0509973 -0.0152622 0.0632107 -0.0347683 0.00165206 
0.0870988 -0.077763 0.0696538 0.0444701 0.0918768 0.177159 0.0664279 -0.0709461 -0.058829 -0.0911746 -0.082502 0.0431134 0.0996029 0.0648096 0.175911 -0.145214 -0.0715969 -0.0273111 -0.0412709 0.0706762 0.0333324 -0.0428439 0.153954 0.171799 0.0417941 -0.116462 -0.136553 -0.190694 -0.141185 0.0444871 0.0701716 0.0552716 -0.0786904 0.105686 0.0238754 0.0692366 0.0134023 0.107914 -0.0834955 -0.0498723 0.0900834 -0.0422106 -0.0634978 -0.0583838 -0.196244 -0.0156708 0.0352189 0.0382416 0.0188321 0.0987457 0.0421443 -0.161671 0.119783 0.0429281 0.144885 0.00684549 -0.00813337 0.162773 0.0348355 -0.0946782 -0.058699 0.119219 -0.0124404 -0.19284 0.100953 0.0637569 0.0783677 0.0374295 -0.136286 0.0437995 -0.015579 0.12873 -0.0350749 0.00139491 0.029735 0.0512963 -0.0427996 -0.147354 0.133812 0.169759 -0.0172353 -0.036236 -0.0117274 -0.083625 -0.0052825 -0.0827394 0.0760839 0.0118279 -0.076254 0.0498421 0.102292 -0.100404 0.149945 -0.0345359 -0.19662 -0.0616353 -0.015592 0.0473306 0.107904 0.00971799 0.0774601 0.0366788 -0.0218659 0.0499869 -0.0686088 -0.00508165 -0.124939 0.00419067 -0.0397902 0.0320678 0.0348297 0.135948 -0.0387584 -0.0624011 -0.0179399 0.121503 -0.0729954 -0.013228 -0.0938487 0.180785 0.060573 -0.0443361 -0.0769989 0.0509973 -0.0152622 0.0632107 -0.0347683 0.00165206 
0.0870988 -0.077763 0.0696538 0.0444701 0.0918768 0.177159 0.0664279 -0.0709461 -0.058829 -0.0911746 -0.082502 0.0431134 0.0996029 0.0648096 0.175911 -0.145214 -0.0715969 -0.0273111 -0.0412709 0.0706762 0.0333324 -0.0428439 0.153954 0.171799 0.0417941 -0.116462 -0.136553 -0.190694 -0.141185 0.0444871 0.0701716 0.0552716 -0.0786904 0.105686 0.0238754 0.0692366 0.0134023 0.107914 -0.0834955 -0.0498723 0.0900834 -0.0422106 -0.0634978 -0.0583838 -0.196244 -0.0156708 0.0352189 0.0382416 0.0188321 0.0987457 0.0421443 -0.161671 0.119783 0.0429281 0.144885 0.00684549 -0.00813337 0.162773 0.0348355 -0.0946782 -0.058699 0.119219 -0.0124404 -0.19284 0.100953 0.0637569 0.0783677 0.0374295 -0.136286 0.0437995 -0.015579 0.12873 -0.0350749 0.00139491 0.029735 0.0512963 -0.0427996 -0.147354 0.133812 0.169759 -0.0172353 -0.036236 -0.0117274 -0.083625 -0.0052825 -0.0827394 0.0760839 0.0118279 -0.076254 0.0498421 0.102292 -0.100404 0.149945 -0.0345359 -0.19662 -0.0616353 -0.015592 0.0473306 0.107904 0.00971799 0.0774601 0.0366788 -0.0218659 0.0499869 -0.0686088 -0.00508165 -0.124939 0.00419067 -0.0397902 0.0320678 0.0348297 0.135948 -0.0387584 -0.0624011 -0.0179399 0.121503 -0.0729954 -0.013228 -0.0938487 0.180785 0.060573 -0.0443361 -0.0769989 0.0509973 -0.0152622 0.0632107 -0.0347683 0.00165206 
0.0870988 -0.077763 0.0696538 0.0444701 0.0918768 0.177159 0.0664279 -0.0709461 -0.058829 -0.0911746 -0.082502 0.0431134 0.0996029 0.0648096 0.175911 -0.145214 -0.0715969 -0.0273111 -0.0412709 0.0706762 0.0333324 -0.0428439 0.153954 0.171799 0.0417941 -0.116462 -0.136553 -0.190694 -0.141185 0.0444871 0.0701716 0.0552716 -0.0786904 0.105686 0.0238754 0.0692366 0.0134023 0.107914 -0.0834955 -0.0498723 0.0900834 -0.0422106 -0.0634978 -0.0583838 -0.196244 -0.0156708 0.0352189 0.0382416 0.0188321 0.0987457 0.0421443 -0.161671 0.119783 0.0429281 0.144885 0.00684549 -0.00813337 0.162773 0.0348355 -0.0946782 -0.058699 0.119219 -0.0124404 -0.19284 0.100953 0.0637569 0.0783677 0.0374295 -0.136286 0.0437995 -0.015579 0.12873 -0.0350749 0.00139491 0.029735 0.0512963 -0.0427996 -0.147354 0.133812 0.169759 -0.0172353 -0.036236 -0.0117274 -0.083625 -0.0052825 -0.0827394 0.0760839 0.0118279 -0.076254 0.0498421 0.102292 -0.100404 0.149945 -0.0345359 -0.19662 -0.0616353 -0.015592 0.0473306 0.107904 0.00971799 0.0774601 0.0366788 -0.0218659 0.0499869 -0.0686088 -0.00508165 -0.124939 0.00419067 -0.0397902 0.0320678 0.0348297 0.135948 -0.0387584 -0.0624011 -0.0179399 0.121503 -0.0729954 -0.013228 -0.0938487 0.180785 0.060573 -0.0443361 -0.0769989 0.0509973 -0.0152622 0.0632107 -0.0347683 0.00165206 
0.0870988 -0.077763 0.0696538 0.0444701 0.0918768 0.177159 0.0664279 -0.0709461 -0.058829 -0.0911746 -0.082502 0.0431134 0.0996029 0.0648096 0.175911 -0.145214 -0.0715969 -0.0273111 -0.0412709 0.0706762 0.0333324 -0.0428439 0.153954 0.171799 0.0417941 -0.116462 -0.136553 -0.190694 -0.141185 0.0444871 0.0701716 0.0552716 -0.0786904 0.105686 0.0238754 0.0692366 0.0134023 0.107914 -0.0834955 -0.0498723 0.0900834 -0.0422106 -0.0634978 -0.0583838 -0.196244 -0.0156708 0.0352189 0.0382416 0.0188321 0.0987457 0.0421443 -0.161671 0.119783 0.0429281 0.144885 0.00684549 -0.00813337 0.162773 0.0348355 -0.0946782 -0.058699 0.119219 -0.0124404 -0.19284 0.100953 0.0637569 0.0783677 0.0374295 -0.136286 0.0437995 -0.015579 0.12873 -0.0350749 0.00139491 0.029735 0.0512963 -0.0427996 -0.147354 0.133812 0.169759 -0.0172353 -0.036236 -0.0117274 -0.083625 -0.0052825 -0.0827394 0.0760839 0.0118279 -0.076254 0.0498421 0.102292 -0.100404 0.149945 -0.0345359 -0.19662 -0.0616353 -0.015592 0.0473306 0.107904 0.00971799 0.0774601 0.0366788 -0.0218659 0.0499869 -0.0686088 -0.00508165 -0.124939 0.00419067 -0.0397902 0.0320678 0.0348297 0.135948 -0.0387584 -0.0624011 -0.0179399 0.121503 -0.0729954 -0.013228 -0.0938487 0.180785 0.060573 -0.0443361 -0.0769989 0.0509973 -0.0152622 0.0632107 -0.0347683 0.00165206 
0.0870988 -0.077763 0.0696538 0.0444701 0.0918768 0.177159 0.0664279 -0.0709461 -0.058829 -0.0911746 -0.082502 0.0431134 0.0996029 0.0648096 0.175911 -0.145214 -0.0715969 -0.0273111 -0.0412709 0.0706762 0.0333324 -0.0428439 0.153954 0.171799 0.0417941 -0.116462 -0.136553 -0.190694 -0.141185 0.0444871 0.0701716 0.0552716 -0.0786904 0.105686 0.0238754 0.0692366 0.0134023 0.107914 -0.0834955 -0.0498723 0.0900834 -0.0422106 -0.0634978 -0.0583838 -0.196244 -0.0156708 0.0352189 0.0382416 0.0188321 0.0987457 0.0421443 -0.161671 0.119783 0.0429281 0.144885 0.00684549 -0.00813337 0.162773 0.0348355 -0.0946782 -0.058699 0.119219 -0.0124404 -0.19284 0.100953 0.0637569 0.0783677 0.0374295 -0.136286 0.0437995 -0.015579 0.12873 -0.0350749 0.00139491 0.029735 0.0512963 -0.0427996 -0.147354 0.133812 0.169759 -0.0172353 -0.036236 -0.0117274 -0.083625 -0.0052825 -0.0827394 0.0760839 0.0118279 -0.076254 0.0498421 0.102292 -0.100404 0.149945 -0.0345359 -0.19662 -0.0616353 -0.015592 0.0473306 0.107904 0.00971799 0.0774601 0.0366788 -0.0218659 0.0499869 -0.0686088 -0.00508165 -0.124939 0.00419067 -0.0397902 0.0320678 0.0348297 0.135948 -0.0387584 -0.0624011 -0.0179399 0.121503 -0.0729954 -0.013228 -0.0938487 0.180785 0.060573 -0.0443361 -0.0769989 0.0509973 -0.0152622 0.0632107 -0.0347683 0.00165206 
0.0870988 -0.077763 0.0696538 0.0444701 0.0918768 0.177159 0.0664279 -0.0709461 -0.058829 -0.0911746 -0.082502 0.0431134 0.0996029 0.0648096 0.175911 -0.145214 -0.0715969 -0.0273111 -0.0412709 0.0706762 0.0333324 -0.0428439 0.153954 0.171799 0.0417941 -0.116462 -0.136553 -0.190694 -0.141185 0.0444871 0.0701716 0.0552716 -0.0786904 0.105686 0.0238754 0.0692366 0.0134023 0.107914 -0.0834955 -0.0498723 0.0900834 -0.0422106 -0.0634978 -0.0583838 -0.196244 -0.0156708 0.0352189 0.0382416 0.0188321 0.0987457 0.0421443 -0.161671 0.119783 0.0429281 0.144885 0.00684549 -0.00813337 0.162773 0.0348355 -0.0946782 -0.058699 0.119219 -0.0124404 -0.19284 0.100953 0.0637569 0.0783677 0.0374295 -0.136286 0.0437995 -0.015579 0.12873 -0.0350749 0.00139491 0.029735 0.0512963 -0.0427996 -0.147354 0.133812 0.169759 -0.0172353 -0.036236 -0.0117274 -0.083625 -0.0052825 -0.0827394 0.0760839 0.0118279 -0.076254 0.0498421 0.102292 -0.100404 0.149945 -0.0345359 -0.19662 -0.0616353 -0.015592 0.0473306 0.107904 0.00971799 0.0774601 0.0366788 -0.0218659 0.0499869 -0.0686088 -0.00508165 -0.124939 0.00419067 -0.0397902 0.0320678 0.0348297 0.135948 -0.0387584 -0.0624011 -0.0179399 0.121503 -0.0729954 -0.013228 -0.0938487 0.180785 0.060573 -0.0443361 -0.0769989 0.0509973 -0.0152622 0.0632107 -0.0347683 0.00165206 
0.0870988 -0.077763 0.0696538 0.0444701 0.0918768 0.177159 0.0664279 -0.0709461 -0.058829 -0.0911746 -0.082502 0.0431134 0.0996029 0.0648096 0.175911 -0.145214 -0.0715969 -0.0273111 -0.0412709 0.0706762 0.0333324 -0.0428439 0.153954 0.171799 0.0417941 -0.116462 -0.136553 -0.190694 -0.141185 0.0444871 0.0701716 0.0552716 -0.0786904 0.105686 0.0238754 0.0692366 0.0134023 0.107914 -0.0834955 -0.0498723 0.0900834 -0.0422106 -0.0634978 -0.0583838 -0.196244 -0.0156708 0.0352189 0.0382416 0.0188321 0.0987457 0.0421443 -0.161671 0.119783 0.0429281 0.144885 0.00684549 -0.00813337 0.162773 0.0348355 -0.0946782 -0.058699 0.119219 -0.0124404 -0.19284 0.100953 0.0637569 0.0783677 0.0374295 -0.136286 0.0437995 -0.015579 0.12873 -0.0350749 0.00139491 0.029735 0.0512963 -0.0427996 -0.147354 0.133812 0.169759 -0.0172353 -0.036236 -0.0117274 -0.083625 -0.0052825 -0.0827394 0.0760839 0.0118279 -0.076254 0.0498421 0.102292 -0.100404 0.149945 -0.0345359 -0.19662 -0.0616353 -0.015592 0.0473306 0.107904 0.00971799 0.0774601 0.0366788 -0.0218659 0.0499869 -0.0686088 -0.00508165 -0.124939 0.00419067 -0.0397902 0.0320678 0.0348297 0.135948 -0.0387584 -0.0624011 -0.0179399 0.121503 -0.0729954 -0.013228 -0.0938487 0.180785 0.060573 -0.0443361 -0.0769989 0.0509973 -0.0152622 0.0632107 -0.0347683 0.00165206 
0.0870988 -0.077763 0.0696538 0.0444701 0.0918768 0.177159 0.0664279 -0.0709461 -0.058829 -0.0911746 -0.082502 0.0431134 0.0996029 0.0648096 0.175911 -0.145214 -0.0715969 -0.0273111 -0.0412709 0.0706762 0.0333324 -0.0428439 0.153954 0.171799 0.0417941 -0.116462 -0.136553 -0.190694 -0.141185 0.0444871 0.0701716 0.0552716 -0.0786904 0.105686 0.0238754 0.0692366 0.0134023 0.107914 -0.0834955 -0.0498723 0.0900834 -0.0422106 -0.0634978 -0.0583838 -0.196244 -0.0156708 0.0352189 0.0382416 0.0188321 0.0987457 0.0421443 -0.161671 0.119783 0.0429281 0.144885 0.00684549 -0.00813337 0.162773 0.0348355 -0.0946782 -0.058699 0.119219 -0.0124404 -0.19284 0.100953 0.0637569 0.0783677 0.0374295 -0.136286 0.0437995 -0.015579 0.12873 -0.0350749 0.00139491 0.029735 0.0512963 -0.0427996 -0.147354 0.133812 0.169759 -0.0172353 -0.036236 -0.0117274 -0.083625 -0.0052825 -0.0827394 0.0760839 0.0118279 -0.076254 0.0498421 0.102292 -0.100404 0.149945 -0.0345359 -0.19662 -0.0616353 -0.015592 0.0473306 0.107904 0.00971799 0.0774601 0.0366788 -0.0218659 0.0499869 -0.0686088 -0.00508165 -0.124939 0.00419067 -0.0397902 0.0320678 0.0348297 0.135948 -0.0387584 -0.0624011 -0.0179399 0.121503 -0.0729954 -0.013228 -0.0938487 0.180785 0.060573 -0.0443361 -0.0769989 0.0509973 -0.0152622 0.0632107 -0.0347683 0.00165206 
