0.0362781 0.0622377 -0.0337894 -0.0362243 -0.0118875 0.0650392 -0.0970327 -0.0646933 0.00680246 -0.128853 -0.0548451 0.0811837 -0.00983713 -0.0323007 -0.114826 0.0252028 -0.0926965 -0.0489633 -0.113289 0.0808005 0.103045 0.0306098 0.110806 0.0423216 -0.0218991 0.0962223 0.0636322 -0.147994 -0.0925115 0.0664782 -0.0392437 0.0175859 0.027366 0.0855535 -0.037046 -0.0100784 -0.0477092 0.274238 -0.0774732 0.0412868 -0.116687 0.0144255 -0.0308852 0.0831165 0.00214869 0.0696655 0.155274 -0.0817328 -0.116639 0.153344 0.123277 0.0350022 -0.0130187 0.064965 0.171754 -0.038648 0.0594 0.0981981 0.0508066 -0.200566 -0.0101586 -0.0647061 0.134514 -0.0231833 0.0493874 -0.188865 -0.00383752 0.127759 -0.00869593 0.193757 0.0429452 0.00860449 -0.0192997 0.0179507 0.00369826 -0.0166254 -0.0894408 -0.0262244 -0.029574 0.107276 -0.0141184 0.0953883 -0.0109706 -0.0745974 -0.0869564 -0.132589 0.0332572 0.0264113 0.0651774 0.038373 -0.069624 -0.142218 -0.0360438 -0.0162037 0.00982247 0.0440819 0.0719181 0.072301 0.0656476 -0.0537535 -0.0300641 0.0732163 -0.0672522 0.141468 -0.144619 -0.0813642 -0.194969 0.0151927 -0.0141524 -0.129562 0.0888292 0.194485 -0.128783 0.0410294 0.0605974 0.0737669 -0.0922644 -0.169877 0.0124559 0.0798851 0.0532659 0.165166 0.0902845 -0.0331985 0.0808146 -0.0137252 0.135178 -0.043562 
0.0686692 0.0137472 -0.0354366 -0.0524017 -0.0196016 0.109885 -0.0737453 -0.0248349 -0.040575 -0.146352 -0.046063 0.074947 0.0338827 -0.0711478 -0.105137 0.012506 -0.149401 -0.0532516 -0.136075 0.137014 0.102442 0.0238414 0.135068 0.0614661 -0.08497 0.0701588 0.0503772 -0.171671 -0.093864 0.0408759 -0.0758997 -0.0232258 0.00339537 0.104808 -0.0260275 0.00152998 -0.0496001 0.249372 -0.119547 0.0150197 -0.113422 -0.0323088 -0.0483363 0.0998999 -0.0483397 0.0385061 0.161567 -0.0292901 -0.158845 0.232669 0.073203 -0.0449727 -0.0126279 0.0964224 0.176992 -0.054572 0.041923 0.100436 0.0232171 -0.205328 -0.0160282 -0.00159392 0.179543 -0.0267564 0.0514161 -0.157432 -0.00373219 0.0886734 -0.0416944 0.13166 0.000572085 -0.0149419 -0.00839717 0.0443757 0.00765599 -0.0284444 -0.0660688 -0.0576128 0.024993 0.124886 0.0399916 0.018297 -0.0497847 -0.108099 -0.0988426 -0.0791644 0.0185795 0.0337038 0.0699805 0.0949846 0.0274523 -0.156214 -0.0532233 0.00316098 -0.0361324 0.0571776 0.0420058 0.0891307 0.0639458 -0.0420128 0.0140625 0.0583979 -0.0839881 0.0861303 -0.124807 -0.0415154 -0.176062 0.0428829 -0.0423748 -0.103408 0.0989832 0.219043 -0.0755796 0.0135159 0.0394469 0.102405 -0.0684256 -0.107602 0.00711871 0.0952457 0.0238048 0.0842946 0.115644 -0.0144888 0.0523249 0.000427878 0.125248 -0.0566734 
0.0605791 0.00933649 -0.0545735 -0.0338971 -0.0429615 0.086104 -0.0790607 -0.0385905 -0.0575029 -0.112991 -0.010517 0.0886626 0.0435103 -0.0707131 -0.120536 0.0195031 -0.134436 -0.0368459 -0.108183 0.142739 0.0848016 -0.00199545 0.139303 0.0994127 -0.0777168 0.107894 0.102799 -0.178318 -0.0728899 0.0369015 -0.0933573 -0.00308315 0.0171595 0.0992946 -0.0630495 -0.0210187 -0.051133 0.259441 -0.105876 0.0372228 -0.100687 -0.0550776 -0.0534933 0.115716 -0.0668726 0.00837849 0.184349 -0.048421 -0.154547 0.202571 0.0941194 -0.0461966 -0.0211796 0.103727 0.168006 -0.0344501 0.0624768 0.104478 0.0527356 -0.204971 -0.0207032 -0.0337369 0.19026 -0.0131732 0.0399821 -0.134031 0.00980862 0.0572233 -0.0187197 0.124394 -0.0422919 -0.0194507 -0.0130145 0.0744012 0.0461219 -0.0641418 -0.0632597 -0.0208148 0.00475078 0.110793 0.018261 0.0329036 -0.0408009 -0.131582 -0.0990958 -0.0576278 0.0305771 0.0193751 0.0633515 0.0518687 0.0149327 -0.142144 -0.0436397 -0.016388 -0.0243892 0.0377617 0.0335285 0.107861 0.098312 -0.0639477 -0.0129813 0.0415214 -0.050447 0.132656 -0.100663 -0.0473519 -0.168491 0.0643167 -0.047895 -0.137317 0.0768052 0.246216 -0.0531261 0.00128929 0.0294019 0.0750471 -0.0647689 -0.142976 0.0263991 0.0800526 0.0318419 0.0775678 0.0971949 -0.0223297 0.0213322 0.0117008 0.0887471 -0.0309347 
0.0540624 0.0164715 -0.0698421 -0.0426551 -0.0398268 0.0959488 -0.0903797 -0.0443778 -0.0356554 -0.140278 -0.0148759 0.0804543 0.0395961 -0.0794541 -0.128742 0.0139384 -0.151316 -0.0507295 -0.109434 0.1576 0.0926393 -0.00413565 0.140851 0.0665593 -0.0829712 0.0952627 0.0850346 -0.184903 -0.0855523 0.0406211 -0.0718266 -0.0230621 0.0237216 0.0936893 -0.0356335 0.00419851 -0.0353244 0.258296 -0.10014 0.0220727 -0.107285 -0.0574741 -0.0463274 0.119798 -0.0651379 0.0148761 0.185949 -0.0387867 -0.147542 0.226703 0.0514567 -0.0422389 -0.0209265 0.115445 0.17275 -0.0454928 0.0536196 0.0902999 0.0199517 -0.208128 -0.0282868 -0.0275776 0.213037 -0.0272036 0.0470016 -0.152911 0.0103839 0.0596875 -0.0201213 0.121734 -0.024594 -0.024895 -0.0195393 0.0662305 0.0385043 -0.0592582 -0.065322 -0.0276009 0.00676627 0.123015 0.0153653 0.0259858 -0.0501918 -0.108736 -0.105477 -0.0412351 0.0149283 0.0296246 0.0770031 0.0583229 0.0328473 -0.159765 -0.0408432 -0.0139518 -0.0201171 0.0205573 0.02727 0.115054 0.0778537 -0.0596365 -0.0155881 0.0404432 -0.0681232 0.107293 -0.0946099 -0.0231377 -0.153651 0.0717062 -0.047592 -0.108667 0.0655583 0.216979 -0.0628141 0.0133088 0.0238423 0.0876404 -0.0479086 -0.134464 0.0351328 0.0908202 0.027701 0.0779546 0.110058 -0.00911179 0.021722 -9.19201e-05 0.109927 -0.0199543 
0.0593447 -0.0262008 -0.0504397 -0.0457773 -0.0260418 0.0963833 -0.0758009 -0.0557164 -0.0419857 -0.154763 -0.0352226 0.0913024 0.0414543 -0.0869929 -0.110902 0.00338733 -0.180237 -0.0489271 -0.107192 0.153522 0.0983481 0.0136776 0.146731 0.0722232 -0.0930653 0.0957731 0.0677363 -0.211191 -0.10015 0.0505869 -0.0779851 -0.0145431 0.00678912 0.0931478 -0.00915583 -0.00260803 -0.0394006 0.247533 -0.0922331 0.0110725 -0.0970817 -0.0565693 -0.0570433 0.118178 -0.0777585 0.0143149 0.174541 -0.0240014 -0.131808 0.221058 0.0445757 -0.0824202 0.0102511 0.11549 0.178548 -0.0521164 0.0562508 0.107236 -0.00881392 -0.19081 -0.00707202 -0.00876464 0.20888 -0.00740123 0.0584464 -0.149793 0.0134488 0.0545248 -0.0160638 0.0926551 -0.0416968 -0.0204294 -0.0164366 0.0603153 0.0237349 -0.0530501 -0.0742733 -0.0683377 0.027033 0.148241 0.0474268 0.018086 -0.0656911 -0.116717 -0.104331 -0.0591137 0.0244115 0.0356982 0.047729 0.0658991 0.0612052 -0.142475 -0.0357389 -0.00179787 -0.0580113 0.0327819 0.0123318 0.102584 0.0987736 -0.0451735 0.00921282 0.025246 -0.0780068 0.0883981 -0.0810122 -0.0428509 -0.155331 0.0725263 -0.0581079 -0.0819151 0.0811989 0.213629 -0.065653 -0.00599293 0.0138902 0.117833 -0.0573821 -0.108064 0.0092605 0.0918738 0.0276056 0.0709098 0.103046 -0.0164401 0.0124578 0.00910005 0.0844226 -0.0327363 
0.0833254 -0.0252299 -0.0471269 -0.0440625 -0.00698147 0.116139 -0.0604039 -0.052329 -0.0466236 -0.15259 -0.0216597 0.0865414 0.0494913 -0.102858 -0.09911 0.017129 -0.171024 -0.0271824 -0.120015 0.144057 0.130857 0.0348737 0.137038 0.0811509 -0.0869914 0.086517 0.0492856 -0.225592 -0.0740945 0.0678655 -0.0757629 0.00891868 -0.0127859 0.10268 0.00763075 -0.012104 -0.0361407 0.22988 -0.0647087 0.00390569 -0.0823074 -0.0533355 -0.0542368 0.124827 -0.0837045 0.00259173 0.172865 -0.0150864 -0.136283 0.205368 0.0544296 -0.0727162 0.00464686 0.112853 0.169687 -0.0572086 0.0691519 0.103309 -0.0172273 -0.192529 -0.00828756 -0.0153911 0.20851 -0.0100947 0.0469188 -0.156825 0.0148616 0.050079 -0.00718758 0.0893254 -0.0427526 -0.0115767 -0.0244093 0.0501523 0.00682392 -0.0671223 -0.0815452 -0.0615456 0.0234139 0.160018 0.0683752 0.0389518 -0.0517889 -0.11569 -0.0895845 -0.0480327 0.03339 0.032258 0.0332824 0.071677 0.0802261 -0.141497 -0.0688667 0.00434065 -0.0734866 0.0250887 0.00529457 0.109935 0.0863294 -0.0455292 0.0295811 0.0286303 -0.0680495 0.106576 -0.0786541 -0.0500444 -0.148035 0.0854303 -0.0379834 -0.0749065 0.079015 0.207471 -0.0902086 -0.00544968 0.026557 0.119815 -0.0648805 -0.118082 -0.000989 0.0920616 0.0396449 0.073518 0.109411 -0.00866098 0.00333671 0.0027592 0.0906008 -0.0298665 
0.0728634 -0.024532 -0.0494698 -0.0360624 0.00298213 0.095481 -0.0582997 -0.0589339 -0.0256452 -0.146498 -0.0290637 0.0986793 0.0297458 -0.114875 -0.122741 0.0134436 -0.173101 -0.0173052 -0.125537 0.158435 0.121995 0.0322338 0.12456 0.0844063 -0.0895907 0.0976859 0.0536048 -0.217524 -0.0744259 0.0620604 -0.0833897 -0.000885867 -0.0223028 0.0894737 0.0102029 -0.0199104 -0.0471594 0.237734 -0.0792609 -0.00699269 -0.0862834 -0.0402115 -0.0635957 0.134722 -0.0777104 0.0013546 0.16593 -0.00614834 -0.116697 0.207656 0.0549076 -0.0631511 -0.0045909 0.0949738 0.182112 -0.0695671 0.0548154 0.0991135 -0.0116532 -0.199663 0.00348178 -0.0321813 0.216533 0.0140677 0.0441745 -0.17795 0.010853 0.0493635 0.00123648 0.0918595 -0.0306934 -0.00382519 -0.00104982 0.0562923 -0.0159968 -0.0692953 -0.0861135 -0.0390948 0.0234903 0.151326 0.0723913 0.0603617 -0.055551 -0.113318 -0.0735651 -0.081095 0.0352181 0.0591423 0.0563412 0.0634632 0.065268 -0.119902 -0.067505 0.001089 -0.0623925 0.0163407 0.0177108 0.0884272 0.0851874 -0.0630108 0.0302997 0.0267692 -0.0705896 0.0868621 -0.0861785 -0.053807 -0.139527 0.0701309 -0.0265654 -0.0517476 0.097264 0.218253 -0.0877177 0.00697399 0.0239985 0.107739 -0.0744154 -0.116629 -0.0155409 0.0671511 0.0204134 0.100196 0.109801 -0.0168709 0.00185368 0.00578027 0.0896802 -0.0463146 
0.0434523 -0.0128277 -0.0372528 -0.0478882 0.0174994 0.0626888 -0.10784 -0.0578217 -0.0281334 -0.129979 -0.0463913 0.0745012 0.0178782 -0.0562077 -0.105655 0.0287085 -0.12815 -0.0165249 -0.0921462 0.138115 0.134171 -0.00589289 0.147387 0.0326057 -0.0316319 0.130515 0.0592646 -0.204809 -0.0913397 0.0264645 -0.0356402 0.00145553 0.00748748 0.0814516 0.00820321 -0.00221407 -0.0470336 0.286177 -0.0496371 -0.0269522 -0.0963934 -0.00416239 -0.0420766 0.126148 -0.0588522 0.0220839 0.164822 -0.0354919 -0.106854 0.166238 0.0505486 -0.04516 -0.0145773 0.0884371 0.176416 -0.0703168 0.0794756 0.0882638 0.0198684 -0.229765 0.0174207 -0.0668327 0.173645 0.0158411 0.0706032 -0.174557 -0.0170518 0.117039 0.0443084 0.142131 0.00388917 0.0220259 -0.00729142 0.014368 -0.0231027 -0.0723631 -0.102506 -0.00814328 0.0134454 0.12265 0.000168952 0.0866289 -0.0303597 -0.0938982 -0.0907529 -0.125859 0.0486801 0.0961821 0.0966447 0.0158323 0.0144718 -0.103769 -0.0354162 -0.0287543 -0.0240158 0.00558891 0.0375207 0.125076 0.043678 -0.0792601 -0.0190582 0.030277 -0.0629737 0.101738 -0.0760816 -0.0639571 -0.156989 0.0460901 0.0185102 -0.0951399 0.0580209 0.207551 -0.121133 0.0411317 0.0664426 0.0764237 -0.0802765 -0.174208 -0.0103215 0.0591255 0.0317182 0.159557 0.099932 -0.0162358 0.0179357 -0.0290561 0.114029 -0.0174158 
0.0513903 0.0038674 -0.0346339 -0.04083 0.0245406 0.0611747 -0.0914514 -0.0338857 0.0197763 -0.159924 -0.0678145 0.0847723 -0.00716495 -0.0887899 -0.127069 0.0502717 -0.123923 -0.0206464 -0.139509 0.117812 0.152363 0.0302169 0.135416 0.0250139 -0.0508631 0.0818685 0.0505943 -0.193778 -0.0981238 0.0585323 -0.0570006 0.0192109 0.0390839 0.100341 0.00667281 -0.0347205 -0.0282746 0.262613 -0.085569 -0.0297923 -0.110371 -0.00315821 -0.0168561 0.106122 -0.0214481 0.0434867 0.15389 -0.0591277 -0.125044 0.187744 0.0675025 -0.045247 0.00579293 0.0777104 0.172024 -0.0604276 0.0767545 0.0566041 0.00233424 -0.212886 0.0181654 -0.0625407 0.14537 0.00781138 0.0624922 -0.19473 -0.044 0.105334 0.00484132 0.140433 0.00365512 -0.0237875 -0.0245818 -0.0111344 -0.037722 -0.0277928 -0.0747244 -0.0348853 -0.0109645 0.107605 0.0168896 0.0879736 -0.0476537 -0.0770055 -0.0665175 -0.102301 0.0166144 0.0647567 0.0719078 0.0735278 0.00266867 -0.129467 -0.0965178 -0.0071218 -0.00643418 0.0722651 0.0257387 0.0966005 0.0411175 -0.0460274 0.0128608 0.0163546 -0.0752577 0.0950033 -0.0970329 -0.0892696 -0.163825 0.0275656 -0.0162901 -0.100017 0.0674633 0.185735 -0.116652 0.0242561 0.0715878 0.0856158 -0.0835783 -0.145227 0.00163016 0.0782953 0.0371808 0.179597 0.113622 -0.016452 0.0725271 -0.0324008 0.14653 -0.0661478 
0.0500306 0.00721344 -0.039275 -0.0367903 0.0306401 0.0538196 -0.104935 -0.0502268 -0.00703165 -0.154756 -0.0584918 0.0783779 0.00725528 -0.0579554 -0.12028 0.0512216 -0.101796 -0.00855126 -0.116015 0.122005 0.165689 0.00882329 0.142477 0.0343848 -0.0239868 0.0906018 0.04839 -0.19457 -0.0886941 0.0667064 -0.0405226 0.0256704 0.03295 0.0933377 0.000236946 -0.0234027 -0.040349 0.267985 -0.0599293 -0.0285541 -0.112563 0.0106546 -0.00636649 0.115893 -0.0286902 0.0365604 0.171327 -0.0625269 -0.11632 0.168073 0.0715433 -0.041757 -0.000595734 0.077635 0.169802 -0.0622521 0.0859958 0.0734753 0.0232458 -0.226415 0.0199271 -0.063035 0.142999 0.00866361 0.0543801 -0.186982 -0.0361591 0.110715 0.0214886 0.142477 0.0102457 -0.000341495 -0.0265469 -0.011638 -0.0334765 -0.0456488 -0.0821363 -0.0232907 -0.00948407 0.117613 0.00163524 0.100112 -0.0379157 -0.0835818 -0.0736952 -0.103645 0.0213576 0.065336 0.0758763 0.0364339 -0.00364416 -0.117895 -0.0781379 -0.0221436 -0.00176251 0.0479497 0.0233671 0.128453 0.029355 -0.0607681 -0.010817 0.0213494 -0.0591628 0.123498 -0.100549 -0.0775895 -0.171505 0.0440409 0.00931872 -0.112572 0.0534948 0.184681 -0.135825 0.0371714 0.0682153 0.0809694 -0.0779726 -0.169563 0.0023517 0.0789944 0.0331408 0.185301 0.0989727 -0.0170947 0.0406824 -0.0395168 0.131334 -0.043429 
0.0419416 0.0273688 -0.033223 -0.0397281 0.0184555 0.0459038 -0.109764 -0.0419346 0.0057729 -0.170348 -0.0572279 0.0838011 -0.00656562 -0.0643298 -0.123983 0.038585 -0.0981211 -0.0195995 -0.111294 0.108535 0.160513 0.0336988 0.126893 0.0272368 -0.0162646 0.0841508 0.0693635 -0.175859 -0.0923779 0.0795885 -0.0436803 0.0054455 0.0599841 0.094206 -4.74024e-05 -0.0357097 -0.0249142 0.252625 -0.0659471 -0.0157379 -0.105489 0.00832057 0.0132648 0.125533 -0.0262193 0.0474456 0.176904 -0.088483 -0.117753 0.16747 0.0834581 -0.0283278 0.00353398 0.082677 0.168987 -0.0554688 0.0726947 0.0590756 0.0175815 -0.224087 0.0120224 -0.0794208 0.129814 0.0132533 0.0478287 -0.201944 -0.0309918 0.0922474 0.0157574 0.141708 0.0195559 -0.0225318 -0.0295358 -0.0267098 -0.01542 -0.0283479 -0.0873533 -0.0270568 -0.0214573 0.125148 -0.00646781 0.104008 -0.0193508 -0.0594051 -0.0613012 -0.0975022 0.018173 0.0499719 0.0637443 0.0462389 -0.0268342 -0.134004 -0.0911685 -0.0196754 -0.00383061 0.0462573 0.0255008 0.120894 0.0299991 -0.0648454 -0.0241883 0.0354857 -0.0470864 0.129644 -0.114502 -0.0832168 -0.168496 0.0497547 -0.0125293 -0.123623 0.0630485 0.157856 -0.149906 0.0395721 0.0526834 0.0735402 -0.0765709 -0.175635 0.00992543 0.0834147 0.0425124 0.187999 0.0894509 -0.0244424 0.0695034 -0.0441531 0.152663 -0.0409484 
0.0560572 0.0169384 -0.0350634 -0.0571569 0.0257921 0.0701824 -0.1106 -0.0418246 -0.000978953 -0.165846 -0.0264342 0.0839916 0.0127204 -0.0493712 -0.12825 0.0360399 -0.0989439 0.00515625 -0.128097 0.105354 0.174676 0.0385226 0.129423 0.0302105 -0.0265702 0.0902491 0.0679684 -0.167525 -0.0791196 0.0691826 -0.0373321 -0.00103985 0.0371449 0.0947882 -0.000710381 -0.0269689 -0.0413007 0.257211 -0.0403228 -0.00317702 -0.109548 0.0235367 -0.0128495 0.129888 -0.0406538 0.00603282 0.160556 -0.0742328 -0.115109 0.170698 0.0669461 -0.0193251 -0.0253571 0.0962747 0.145699 -0.0592616 0.0779933 0.0842977 -0.00114587 -0.226137 0.00248537 -0.0747153 0.166223 0.0103237 0.0312545 -0.194486 -0.0211145 0.112458 0.0267198 0.157777 0.0348957 -0.00622312 -0.019325 -0.014005 -0.0270515 -0.0528256 -0.0970902 -0.0350386 -0.0225794 0.114029 -0.00479337 0.115543 -0.00691239 -0.068151 -0.0776982 -0.0888664 0.0365322 0.0568009 0.0759043 0.0321133 -0.000580036 -0.147626 -0.0790049 -0.0119525 0.00877466 0.0158179 0.00680453 0.129146 0.0114979 -0.0577659 -0.0247388 0.0347018 -0.0543165 0.139403 -0.092877 -0.0623577 -0.165068 0.0432116 0.00289731 -0.131306 0.0566394 0.165667 -0.146253 0.0688346 0.0655382 0.0774436 -0.071865 -0.170974 0.0166271 0.076136 0.0411424 0.168997 0.0901368 -0.0225531 0.0483711 -0.04792 0.140086 -0.0197231 
0.060816 -0.000304025 -0.0473017 -0.0369713 0.0331547 0.0609563 -0.0964926 -0.0573072 -0.0226234 -0.153757 -0.0278047 0.101929 0.02291 -0.0569348 -0.137546 0.0424837 -0.0895721 0.00786743 -0.109909 0.137627 0.172661 0.00792048 0.127075 0.0476922 -0.0301274 0.105185 0.0639588 -0.186572 -0.0784113 0.0851044 -0.0617387 0.0146819 0.0370798 0.0983226 0.00244361 -0.0314544 -0.0323503 0.262494 -0.0411046 -0.0380304 -0.108351 0.00827352 0.00440606 0.123949 -0.0485642 0.00823443 0.183011 -0.0710262 -0.125389 0.165944 0.0700483 -0.0521797 -0.0139893 0.0943202 0.175812 -0.0553492 0.0632672 0.0885926 -0.00620673 -0.221315 0.0127889 -0.0756932 0.177917 -0.00417236 0.0609998 -0.174194 -0.0395309 0.0939723 0.0048024 0.125803 0.0093291 -0.011063 -0.0301364 -0.011292 -0.0292595 -0.0456432 -0.0651564 -0.0223527 -0.0041417 0.109089 -0.00828804 0.101596 -0.0229397 -0.0830694 -0.076608 -0.0982606 0.0307717 0.0634497 0.0844491 0.0428216 0.00686679 -0.141884 -0.0803139 0.000823147 -0.000598196 0.0281803 0.0148233 0.129313 0.0286289 -0.0628405 -0.016527 0.0294236 -0.0617282 0.134647 -0.0962291 -0.0523423 -0.1525 0.049962 -0.00285079 -0.126196 0.0490773 0.172896 -0.129782 0.0565499 0.0672823 0.0721528 -0.0762583 -0.164599 0.00303584 0.0792455 0.0251509 0.163338 0.0946862 -0.0241647 0.0414649 -0.0212769 0.132227 -0.0446946 
0.0567305 0.00486637 -0.0530322 -0.0307613 0.0484027 0.0537379 -0.0996893 -0.0495567 -0.0279436 -0.125425 -0.0416262 0.0998868 0.0091433 -0.069076 -0.125182 0.061238 -0.0722913 0.0201965 -0.106312 0.140822 0.154021 0.0166959 0.135391 0.0644819 -0.0276712 0.102412 0.0670397 -0.192399 -0.0725388 0.073461 -0.0609781 0.026297 0.0289491 0.0944631 -0.00574119 -0.0306627 -0.0372904 0.251566 -0.0587504 -0.0270633 -0.105874 0.0185967 0.00340537 0.129711 -0.0489952 0.0233007 0.187551 -0.0580503 -0.117408 0.168447 0.0997056 -0.0540941 -0.0266197 0.0710306 0.175512 -0.0582772 0.0735183 0.0823581 0.0306358 -0.214862 0.0148418 -0.0768699 0.152818 -0.000570126 0.0597413 -0.198902 -0.0460711 0.0941953 0.0108352 0.137464 0.00687229 0.0127005 -0.0169482 -0.00509412 -0.0390574 -0.0494232 -0.0709268 0.0167528 -0.00727575 0.0914486 0.00801445 0.119166 -0.0318588 -0.0848172 -0.0654649 -0.107921 0.0257169 0.0702324 0.0835366 0.0389552 -0.0126488 -0.111148 -0.095762 -0.0147046 0.0113969 0.0435659 0.0261328 0.123427 0.0204044 -0.072547 -0.0185947 0.0214533 -0.0511097 0.131623 -0.10777 -0.0729911 -0.16736 0.0332281 0.00817333 -0.108755 0.0586713 0.196672 -0.111896 0.0512042 0.0573516 0.056198 -0.0815684 -0.179733 -0.0160159 0.0688388 0.0276441 0.184104 0.100486 -0.0209799 0.0282715 -0.028168 0.111989 -0.0590656 
0.0676155 0.00943067 -0.0761947 -0.0420671 0.0228019 0.0778282 -0.0873131 -0.0544429 -0.0761986 -0.094831 -0.0149195 0.0949213 0.0332237 -0.0712307 -0.12088 0.0565958 -0.0619044 0.014795 -0.0872912 0.151899 0.109976 0.0172491 0.118808 0.0846079 -0.0587098 0.141987 0.0932445 -0.18946 -0.0455986 0.0460007 -0.0802984 0.0369305 -0.00269563 0.0972 -0.0232216 -0.0238104 -0.0243383 0.2487 -0.0477337 -0.00274363 -0.0868845 -0.0129395 -0.00895364 0.141002 -0.0628615 0.0201662 0.209529 -0.0373488 -0.157534 0.158304 0.100089 -0.071943 -0.049874 0.0827946 0.163302 -0.0493914 0.0567431 0.111846 0.0468987 -0.207847 0.00572341 -0.0594814 0.187616 -0.0246825 0.0654228 -0.169487 -0.0195938 0.0695359 0.0101508 0.118508 -0.0293664 0.00244764 -0.00771307 0.0399467 -0.00931039 -0.0853702 -0.0621078 0.0515736 0.00257606 0.0647186 0.0190431 0.11042 -0.0389673 -0.119485 -0.0830534 -0.0989777 0.0374273 0.0498204 0.0731641 0.037104 0.0129765 -0.114464 -0.0796061 -0.0178427 0.013705 0.039957 0.0497868 0.12385 0.0343929 -0.0723745 -0.0396384 0.0299549 -0.0563492 0.157476 -0.104803 -0.0538942 -0.162072 0.0556827 -0.0219055 -0.114177 0.0705169 0.22095 -0.0770202 0.0464979 0.0355439 0.0281386 -0.0936054 -0.196307 -0.015626 0.0459214 0.024786 0.138373 0.114461 -0.0125359 0.00607277 -0.0219973 0.0604772 -0.0686446 
0.0648865 0.0257083 -0.123582 -0.0471422 0.0141208 0.0937406 -0.0829702 -0.0632068 -0.0640216 -0.0865326 0.00802017 0.0844221 0.0510815 -0.0837273 -0.114654 0.0498209 -0.0781823 -0.00630986 -0.0802979 0.175222 0.0946915 0.000333184 0.119177 0.0849497 -0.0701119 0.129905 0.10132 -0.204214 -0.032576 0.0503113 -0.0663504 0.0336055 0.007336 0.0892984 -0.0201821 0.0102533 -0.00264206 0.232005 -0.0599461 -0.010148 -0.0768867 -0.0492774 -0.0209779 0.162767 -0.081601 0.0385146 0.226015 -0.00367134 -0.169273 0.154525 0.0550318 -0.0734523 -0.0478138 0.0805391 0.161992 -0.0359867 0.0277758 0.109119 0.0332206 -0.199907 -0.0219601 -0.0525423 0.229885 -0.0422778 0.067753 -0.152667 -0.00719501 0.0601481 0.00896585 0.0953501 -0.0462581 -0.00803925 -0.0254106 0.0350018 0.0254395 -0.0857223 -0.0610983 0.073392 1.8818e-05 0.0718899 0.0217719 0.0929348 -0.0701703 -0.121842 -0.0920374 -0.0488568 0.0225216 0.0361824 0.0642522 0.0475673 0.0488117 -0.130392 -0.0836361 -0.0233724 0.00449295 0.0217278 0.035576 0.123881 0.0549452 -0.0845933 -0.0316601 0.0148695 -0.0504857 0.12862 -0.115952 -0.0201004 -0.155599 0.0815897 -0.03331 -0.0942654 0.0669336 0.219738 -0.0628644 0.0269694 0.0213727 0.0317125 -0.0952348 -0.198977 0.00451765 0.0652646 0.0312469 0.10165 0.116651 0.0267174 -0.0172056 -0.0140181 0.0460224 -0.0577604 
0.0660215 -0.00187313 -0.0717027 -0.0363445 0.0328922 0.0830062 -0.0878131 -0.0560448 -0.0716768 -0.112903 -0.0082768 0.108381 0.0261283 -0.0679216 -0.130452 0.0499666 -0.071862 0.0165881 -0.0896466 0.145876 0.126629 -0.00411771 0.135413 0.065121 -0.0466059 0.138096 0.0763766 -0.199165 -0.0591573 0.0382414 -0.0661751 0.0399396 0.00187711 0.101074 -0.0310309 -0.0205728 -0.0403278 0.262076 -0.0293026 -0.000769592 -0.0793335 -0.00134359 -0.0207771 0.121213 -0.0721656 0.00179965 0.197649 -0.0612911 -0.146097 0.155948 0.0821304 -0.0581008 -0.054343 0.0927812 0.154761 -0.0506383 0.0792654 0.120201 0.0197838 -0.192073 0.00160481 -0.0587963 0.196844 -0.0352378 0.0783834 -0.166361 -0.0266538 0.0850452 0.00984332 0.143692 -0.0143689 0.0191758 -0.0152254 0.0529195 -0.0115789 -0.0835788 -0.0617078 0.0295809 -0.0118656 0.0665601 -0.0217481 0.108597 -0.0206417 -0.106979 -0.0993867 -0.0890353 0.0515669 0.059438 0.069607 0.0129073 0.0214144 -0.126706 -0.064942 -0.0192399 0.0259947 0.0186958 0.0406647 0.132715 0.0242103 -0.0561252 -0.0530476 0.0225084 -0.064609 0.168983 -0.0778045 -0.0457296 -0.151384 0.0638266 -0.01149 -0.128963 0.0423346 0.211156 -0.0803295 0.0552631 0.0589362 0.0364482 -0.078537 -0.193594 0.0117289 0.0667535 0.0277149 0.143455 0.100858 -0.0179774 0.0112234 -0.019288 0.072858 -0.04399 
0.0565688 0.00593064 -0.0630497 -0.0397495 0.0308368 0.0784531 -0.104637 -0.0547826 -0.0550125 -0.131008 -0.0319936 0.0927207 0.0186791 -0.0687384 -0.129863 0.0638373 -0.087158 0.00420548 -0.106378 0.1371 0.139542 -0.00261931 0.142557 0.0540808 -0.0386062 0.119324 0.0630388 -0.197085 -0.0741591 0.0406435 -0.0523943 0.0348647 0.00272327 0.0995066 -0.023414 -0.0123649 -0.049124 0.258904 -0.0415056 -0.0022419 -0.100493 0.00365256 -0.012833 0.116103 -0.0409713 0.0177261 0.193204 -0.0554916 -0.144783 0.170845 0.0798354 -0.0632063 -0.0380598 0.0824217 0.153692 -0.0570707 0.0800957 0.110386 0.0308482 -0.20555 0.00928946 -0.0436535 0.17822 -0.0234259 0.0693072 -0.173548 -0.0351238 0.0994095 0.00742274 0.144021 -0.00697016 0.0173693 -0.0139067 0.0336895 -0.0212697 -0.0723327 -0.0681785 0.00706878 -0.0129401 0.0858926 -0.00222667 0.099328 -0.0363079 -0.105008 -0.108043 -0.0878477 0.0329282 0.0551203 0.0708745 0.02313 0.0109272 -0.122731 -0.0719354 -0.0184112 0.0244076 0.0495774 0.0337253 0.13164 0.0182084 -0.0506318 -0.042114 0.0134711 -0.0740297 0.153184 -0.0877223 -0.0538246 -0.168569 0.054634 -0.012308 -0.121695 0.0482049 0.210533 -0.0905188 0.0513956 0.0598328 0.0539593 -0.0834095 -0.172722 0.00870038 0.0694609 0.0255423 0.156506 0.108874 -0.0201252 0.0170126 -0.0276537 0.0821016 -0.0545508 
0.061264 -0.0144977 -0.0704315 -0.0541759 0.0320098 0.100378 -0.0872642 -0.0429272 -0.0769046 -0.116145 0.00236488 0.106361 0.0379353 -0.0669404 -0.121485 0.0407284 -0.0819499 0.00648878 -0.0918075 0.149518 0.125507 -0.00838692 0.122781 0.0686357 -0.0513777 0.150161 0.0797589 -0.200814 -0.0523957 0.0151084 -0.050204 0.0264294 -0.00953242 0.101662 -0.0373984 -0.00122441 -0.0422996 0.252333 -0.0304257 0.00504002 -0.0530369 -0.00908759 -0.0288214 0.132673 -0.0765046 -0.0123837 0.19883 -0.0501805 -0.155894 0.139649 0.0557917 -0.0829369 -0.0642196 0.0936321 0.151283 -0.0398156 0.0501773 0.144749 0.00931406 -0.193253 -0.00480066 -0.0488123 0.217124 -0.0366378 0.0834546 -0.146961 -0.0161912 0.085426 0.0193432 0.132498 -0.0172363 0.0221677 -0.00968139 0.0515807 0.0049241 -0.0905568 -0.067777 0.042233 -0.00602546 0.0611107 -0.0272241 0.103998 -0.0138075 -0.111114 -0.11848 -0.0762141 0.0753387 0.0694299 0.0629464 0.00594727 0.0427672 -0.135791 -0.0588063 -0.0174521 0.0175581 0.0125959 0.0376633 0.125511 0.0189372 -0.0525096 -0.0670387 0.0129958 -0.0734377 0.161194 -0.0772694 -0.0217832 -0.156192 0.0708312 -0.0297837 -0.138022 0.043044 0.210333 -0.0830955 0.0557147 0.0611803 0.0339788 -0.0904427 -0.195287 0.0103722 0.0659528 0.0286835 0.125565 0.0967291 -0.00859748 -0.00424387 -0.0127431 0.0479921 -0.0377808 
0.0619283 0.00233199 -0.0882941 -0.047245 -0.00108604 0.0898345 -0.0844345 -0.0339826 -0.0890024 -0.0861996 0.00541202 0.0920106 0.0439775 -0.0785921 -0.113941 0.0429047 -0.0747977 -0.0047335 -0.0613093 0.154595 0.101503 -0.00396883 0.112238 0.0816625 -0.064129 0.161193 0.104714 -0.204561 -0.0346695 0.0251212 -0.0759765 0.0325144 0.00217229 0.0966103 -0.0377425 -0.0117059 -0.0124809 0.248927 -0.0416622 0.002614 -0.0609516 -0.0400466 -0.022975 0.143557 -0.0768133 0.00685541 0.219799 -0.0447088 -0.171669 0.137272 0.0701062 -0.0790263 -0.051533 0.0999952 0.160462 -0.0333161 0.0522051 0.113951 0.0311408 -0.206572 -0.003624 -0.0601203 0.213251 -0.0379296 0.0753159 -0.137254 -0.000139915 0.0547084 0.025056 0.10461 -0.0530504 -0.00145813 -0.0200399 0.0570243 0.0276607 -0.0996823 -0.0601018 0.0689105 0.00331267 0.0615058 -0.011298 0.0984712 -0.0323575 -0.124226 -0.092338 -0.0708001 0.0554401 0.0524978 0.0706342 0.0199533 0.037989 -0.1241 -0.0688234 -0.020598 0.00632951 0.0191226 0.0535011 0.131444 0.0459457 -0.0699604 -0.055118 0.0196163 -0.0548374 0.156109 -0.0923976 -0.0291682 -0.147989 0.0741466 -0.0424438 -0.131031 0.0525963 0.219084 -0.0705195 0.0237066 0.0434251 0.021285 -0.0861495 -0.218166 0.00728672 0.0480585 0.0295569 0.110265 0.114225 -0.00180504 -0.00562094 -0.00925978 0.050731 -0.0429322 
0.0610145 -0.00230041 -0.0949346 -0.0409552 0.0246426 0.0860284 -0.0844089 -0.0542412 -0.081525 -0.0991857 -0.0117473 0.0996876 0.0350726 -0.0772812 -0.12694 0.0466477 -0.0770661 0.00681347 -0.0781157 0.162498 0.100745 -0.00793968 0.119422 0.0766963 -0.0583629 0.150702 0.0907747 -0.199393 -0.0497604 0.0266558 -0.073129 0.0378934 -0.0110023 0.0938696 -0.0329329 -0.00718263 -0.0279255 0.240697 -0.0492934 -0.00683493 -0.0588229 -0.0218336 -0.013153 0.144555 -0.0763426 0.0135413 0.216026 -0.0317402 -0.156833 0.149587 0.0705115 -0.0859746 -0.0530766 0.0870283 0.166248 -0.0458941 0.0483279 0.12092 0.0381618 -0.204302 0.00385316 -0.0453621 0.209833 -0.0288448 0.0746306 -0.149697 -0.0140936 0.0677574 0.0219852 0.113694 -0.0372029 0.0138246 -0.00279126 0.0559493 0.00481368 -0.0887527 -0.0629173 0.0603308 -0.00137794 0.0528626 0.00151911 0.111947 -0.0400613 -0.121493 -0.100522 -0.0775612 0.0500707 0.0646058 0.0692931 0.0217407 0.036712 -0.116188 -0.0699035 -0.0313702 0.0120268 0.025862 0.051074 0.125899 0.0382494 -0.0724377 -0.0531103 0.0150866 -0.0527495 0.15126 -0.0982828 -0.0340272 -0.16071 0.0744582 -0.0399854 -0.108633 0.0652063 0.22249 -0.0682755 0.0394592 0.0350587 0.0198896 -0.0915058 -0.202604 -3.89592e-05 0.0459553 0.0235085 0.128905 0.115131 -0.00703393 -0.0145775 -0.0163972 0.0390898 -0.0568552 
0.0617645 -0.00531516 -0.0922964 -0.0478863 0.0391986 0.0840143 -0.0807251 -0.0613828 -0.0674086 -0.0968256 -0.0206635 0.103736 0.0375796 -0.0804996 -0.130981 0.0484717 -0.092803 0.0171385 -0.0956959 0.166664 0.109435 -0.00409222 0.130128 0.0664189 -0.064189 0.139596 0.0747905 -0.204335 -0.0580912 0.0363664 -0.0767902 0.0317206 -0.0140771 0.0865651 -0.0174497 -0.00968019 -0.0419283 0.24696 -0.0532375 -0.0120311 -0.0743527 -0.0120661 -0.0230015 0.145607 -0.0840467 0.0163357 0.201726 -0.0191171 -0.142779 0.166874 0.0706105 -0.0805539 -0.0575406 0.0808286 0.166474 -0.0586107 0.0552799 0.117126 0.0290214 -0.199125 0.00732263 -0.049261 0.210951 -0.0149097 0.0756454 -0.175869 -0.0281415 0.0858011 0.0200038 0.119457 -0.0172514 0.0250591 0.00356478 0.0449555 -0.0200266 -0.0756265 -0.0733819 0.0442165 0.00278607 0.0626439 0.0165402 0.10745 -0.0446496 -0.107284 -0.101813 -0.0880599 0.0483995 0.0725193 0.0792335 0.0260038 0.0294705 -0.111275 -0.0721182 -0.0289032 0.00413944 0.0183656 0.0407684 0.122436 0.0340908 -0.0746997 -0.0324573 0.0162536 -0.0573947 0.132481 -0.0952101 -0.0427533 -0.1619 0.0705151 -0.0218397 -0.0883238 0.0694472 0.220652 -0.0704723 0.0457016 0.0357281 0.038461 -0.0913224 -0.180187 -0.0121353 0.0520467 0.0189552 0.134767 0.113444 -0.00724883 -0.0148837 -0.0179141 0.0453557 -0.0551288 
0.0728819 -0.0177636 -0.09462 -0.0359993 0.0365451 0.0943835 -0.0733939 -0.0564388 -0.0942438 -0.0880526 -0.0131629 0.111713 0.051859 -0.0690783 -0.123917 0.0505244 -0.0882285 0.0186229 -0.0741038 0.178315 0.118026 -0.0235605 0.140187 0.0914991 -0.0564573 0.131374 0.0765874 -0.207334 -0.0465864 0.0515467 -0.0877951 0.0307066 -0.0126519 0.0868922 -0.0306542 -0.00562938 -0.0492605 0.23574 -0.0517221 -0.0216523 -0.0838363 -0.0250425 -0.0194756 0.133581 -0.0935051 0.00398648 0.211696 -0.0240533 -0.151307 0.169703 0.0787276 -0.0842959 -0.0490413 0.0844384 0.176757 -0.0509496 0.0592585 0.129256 0.0275465 -0.193954 0.00309888 -0.038267 0.221734 -0.0315976 0.0780799 -0.146673 -0.035896 0.0726116 -0.00330702 0.11558 -0.0352875 0.0311855 -0.0175233 0.0472679 -0.00790648 -0.0707522 -0.0461286 0.0390009 0.0165489 0.0716554 0.00826781 0.0811854 -0.0430892 -0.116389 -0.101227 -0.0797822 0.0410995 0.0691354 0.0812001 0.03057 0.0383624 -0.112108 -0.0720675 -0.00885365 -0.00126369 0.0160339 0.0358011 0.139517 0.0484534 -0.0731036 -0.0199951 0.0174218 -0.0593183 0.132927 -0.0963142 -0.0193534 -0.156773 0.0693797 -0.019556 -0.105369 0.0560568 0.226802 -0.0545071 0.0295887 0.0457245 0.0509757 -0.0741855 -0.167403 -0.00468995 0.0790067 0.0130472 0.101482 0.108853 -0.0160308 -0.0319203 0.0128817 0.0553435 -0.047189 
0.0550447 0.0148943 -0.088138 -0.0492978 0.00946086 0.0929769 -0.094751 -0.0450463 -0.0853792 -0.0834491 0.00417611 0.0816662 0.0472535 -0.0767897 -0.106461 0.0502138 -0.0945144 -0.00198092 -0.0606112 0.166249 0.115543 -0.0182096 0.130613 0.0789089 -0.0489779 0.142518 0.0977379 -0.205349 -0.0255883 0.0359026 -0.0624747 0.0174344 0.00723651 0.0853736 -0.0291633 0.00303944 -0.0232768 0.242445 -0.0439382 -0.00570891 -0.074435 -0.0477559 -0.0168196 0.150774 -0.0848265 0.012072 0.229008 -0.0302516 -0.16864 0.149107 0.0619391 -0.0702299 -0.0552347 0.092815 0.163291 -0.0374084 0.0536847 0.10912 0.0296311 -0.210714 -0.00938691 -0.0581316 0.220295 -0.0290504 0.0749984 -0.14028 -0.0129416 0.0566637 0.0194835 0.11531 -0.0463123 0.0141163 -0.0285887 0.0452955 0.0305151 -0.0981851 -0.0639275 0.07044 0.00812865 0.0785182 -0.00269177 0.0890154 -0.0392045 -0.110703 -0.0944167 -0.0606571 0.0378895 0.0625414 0.0793966 0.0270206 0.0413641 -0.116751 -0.0744568 -0.0202039 0.000288823 0.00403695 0.0360674 0.153432 0.0481091 -0.0805721 -0.0478964 0.0149143 -0.0496146 0.135886 -0.0942419 -0.0115913 -0.149076 0.0825333 -0.0114674 -0.124108 0.0440697 0.22058 -0.0744847 0.0248041 0.0471414 0.0334472 -0.0761049 -0.201451 0.0078051 0.070871 0.0326889 0.103791 0.107483 0.00114916 -0.0257175 -0.00303401 0.0677962 -0.0255417 
0.0643116 5.99903e-05 -0.0938035 -0.0435581 0.0400881 0.0972051 -0.0813902 -0.0594837 -0.0785047 -0.0867131 -0.00617732 0.0977965 0.0366614 -0.0827706 -0.112428 0.0545661 -0.0961502 0.016725 -0.0757619 0.166055 0.115375 -0.00741015 0.129582 0.0812402 -0.0484355 0.138187 0.0825518 -0.211659 -0.0357818 0.0413994 -0.0639507 0.0263138 -0.0133158 0.0840919 -0.0188657 0.00339167 -0.0397754 0.231319 -0.0427037 -0.0114785 -0.0688749 -0.0251301 -0.0181295 0.153586 -0.0905159 0.0113833 0.2171 -0.0194304 -0.15152 0.154693 0.0674383 -0.076856 -0.0605176 0.07856 0.169491 -0.0455817 0.0519164 0.126395 0.027751 -0.195684 -0.00635464 -0.0536066 0.225325 -0.025832 0.0781019 -0.160939 -0.026488 0.0697035 0.0177421 0.126371 -0.0291519 0.0368113 -0.0127108 0.0466622 -0.00122174 -0.0899932 -0.0694558 0.064923 0.00302306 0.0681516 0.013509 0.106217 -0.0423776 -0.109474 -0.098616 -0.0761682 0.0442328 0.0694453 0.074313 0.0284687 0.0432249 -0.107811 -0.0828497 -0.0270858 0.00746677 0.0107086 0.0356212 0.137417 0.0429111 -0.0773291 -0.0415298 0.0112021 -0.0505334 0.127462 -0.0998849 -0.0230208 -0.155277 0.073107 -0.00795185 -0.099412 0.0590232 0.223056 -0.0672322 0.0324022 0.0496104 0.0381632 -0.0791795 -0.190128 -0.00482414 0.0668675 0.0335914 0.117183 0.111362 -0.00193293 -0.0338231 -0.00555543 0.0561687 -0.0384243 
0.0591152 -0.00254067 -0.0923799 -0.0450323 0.0371747 0.101564 -0.0829558 -0.0615534 -0.0650587 -0.0927571 0.00120465 0.0966922 0.0341169 -0.0804583 -0.114642 0.0478185 -0.106235 0.0152573 -0.0743163 0.161654 0.119242 -0.0117607 0.128679 0.0778569 -0.0484102 0.141348 0.0827989 -0.214576 -0.0354189 0.0357325 -0.0538247 0.0210967 -0.00953992 0.0814407 -0.0136785 0.0111234 -0.0364865 0.236137 -0.04052 -0.0135511 -0.0615282 -0.0241579 -0.0261022 0.153686 -0.093204 0.002006 0.214195 -0.0213013 -0.148483 0.149132 0.0479423 -0.0752828 -0.0600449 0.084424 0.170617 -0.0394605 0.0502554 0.129805 0.012913 -0.197748 -0.0105774 -0.0554788 0.237904 -0.0282752 0.0826354 -0.152903 -0.0221368 0.0700257 0.0239975 0.134983 -0.0282322 0.0364453 -0.014935 0.0490282 0.00372353 -0.0968673 -0.0732026 0.0649415 0.00116717 0.0607629 0.00264237 0.11252 -0.0419269 -0.109487 -0.101614 -0.072089 0.0486647 0.0759008 0.0753058 0.0248636 0.0565409 -0.113922 -0.0746427 -0.0317847 0.0118479 -0.000236837 0.0302771 0.139147 0.0462065 -0.0720269 -0.0446141 0.00596754 -0.0517146 0.117979 -0.0914758 -0.0132442 -0.148702 0.0683359 -0.00866386 -0.100413 0.0521012 0.218946 -0.0673614 0.030426 0.0582236 0.0398951 -0.0718913 -0.195868 0.00495902 0.0669453 0.0402209 0.114949 0.109467 0.0007825 -0.0375361 -0.00226787 0.0610375 -0.0259926 
0.0612459 0.00886832 -0.0965678 -0.0471463 0.0287437 0.0936306 -0.0927125 -0.0646658 -0.0611783 -0.0948016 0.0114105 0.0891683 0.03251 -0.0634063 -0.113166 0.0453276 -0.0871017 0.0112921 -0.0626329 0.155829 0.117402 -0.00510171 0.126539 0.0721403 -0.0423392 0.146488 0.0991958 -0.204925 -0.0309508 0.0417544 -0.04809 0.0186567 0.00377071 0.0763113 -0.0142363 0.0116483 -0.0260625 0.247187 -0.0316312 -0.00843063 -0.0740588 -0.0173879 -0.0297659 0.15512 -0.0884518 0.0109638 0.214133 -0.0290718 -0.148303 0.13797 0.0496418 -0.0527421 -0.0560214 0.0870974 0.163935 -0.0371262 0.0537074 0.125742 0.0148831 -0.201445 -0.0139871 -0.0688778 0.237219 -0.0337846 0.0766038 -0.155281 -0.0118176 0.0742106 0.0312458 0.140515 -0.0224784 0.0275871 -0.0223212 0.0406749 0.00897922 -0.103435 -0.074866 0.0690778 -0.00595961 0.064322 -0.00709367 0.118145 -0.0392699 -0.111468 -0.0933827 -0.077701 0.0422731 0.0673418 0.0776186 0.0176293 0.0468071 -0.116828 -0.0701203 -0.0287905 0.0237857 -0.00985887 0.0357979 0.142498 0.0471889 -0.0784057 -0.0551092 0.0165208 -0.0487119 0.128414 -0.0965465 -0.0134511 -0.143427 0.0618739 0.00166344 -0.111202 0.0514461 0.211526 -0.0772379 0.0401375 0.0580224 0.0342054 -0.0743162 -0.212776 0.00850096 0.0628044 0.0408514 0.11894 0.105422 0.00221963 -0.0259109 -0.0099304 0.0706912 -0.0209992 
0.0554301 -0.00121064 -0.0899178 -0.0470405 0.0532191 0.0909409 -0.0842603 -0.0699607 -0.0629886 -0.0905046 -0.00499161 0.0963986 0.0391708 -0.072926 -0.117277 0.0531485 -0.0993676 0.0275793 -0.0839128 0.166795 0.132203 -0.0228287 0.135913 0.0711995 -0.039776 0.135299 0.064554 -0.214107 -0.034381 0.0417935 -0.0455699 0.0288791 -0.0113145 0.0772787 -0.0100899 0.0102204 -0.045905 0.246613 -0.031793 -0.0204201 -0.0664367 -0.0111716 -0.0239695 0.14805 -0.0918907 0.00202112 0.207504 -0.0167137 -0.13654 0.142711 0.0468023 -0.0690114 -0.0624202 0.0762867 0.165956 -0.0457242 0.0588965 0.128638 0.0142619 -0.200146 -0.00543709 -0.0575167 0.228563 -0.0213536 0.0820063 -0.161594 -0.0308781 0.0861248 0.0251482 0.134005 -0.0145016 0.0470654 -0.0140149 0.0410136 -0.0109964 -0.0907748 -0.078597 0.062557 0.00229376 0.0634528 -0.00365041 0.118684 -0.0390616 -0.0983837 -0.10264 -0.0779919 0.0501712 0.0863124 0.0827452 0.0126902 0.0460456 -0.107466 -0.0679347 -0.0341209 0.0113946 -0.00974101 0.0245351 0.14514 0.0351431 -0.0756254 -0.0413219 0.00501016 -0.0524334 0.128347 -0.0875807 -0.0173716 -0.150045 0.0715393 0.0156356 -0.096465 0.0431477 0.215136 -0.0828743 0.0462533 0.0601549 0.0446281 -0.0796481 -0.192988 -0.00310751 0.0707012 0.0331189 0.130727 0.0987569 0.000367639 -0.045089 -0.00711135 0.0530862 -0.0257605 
0.0566883 0.00677083 -0.101247 -0.0483347 0.0365868 0.0898723 -0.0879115 -0.0633177 -0.0722685 -0.0767396 0.00508248 0.0971912 0.0410004 -0.0672539 -0.109431 0.0497517 -0.0861657 0.0199972 -0.0639812 0.163696 0.111886 -0.0100569 0.131839 0.080351 -0.0459115 0.145288 0.095908 -0.208768 -0.0268913 0.0439553 -0.0563536 0.0250111 0.00309848 0.0734282 -0.0209155 0.00873225 -0.032856 0.242566 -0.0404967 -0.00524914 -0.0689087 -0.0199771 -0.0269138 0.158398 -0.100639 0.0121329 0.218194 -0.0233769 -0.145921 0.137347 0.0620267 -0.0634706 -0.0628959 0.0790236 0.165292 -0.0360912 0.0557075 0.126447 0.0261704 -0.195892 -0.0156557 -0.0675836 0.230624 -0.0271643 0.0801938 -0.159798 -0.0201938 0.074425 0.0268303 0.132037 -0.0231648 0.035985 -0.017256 0.0398182 0.00985215 -0.092093 -0.0776444 0.077504 -0.00286718 0.0584477 -0.00322855 0.116132 -0.0398086 -0.104293 -0.0967134 -0.0741953 0.0478233 0.0704193 0.0759771 0.0154537 0.0347701 -0.108717 -0.0728749 -0.0331077 0.0152151 -0.00934098 0.0335267 0.144477 0.0475639 -0.08353 -0.0493317 0.01293 -0.0418681 0.130769 -0.100853 -0.0191379 -0.152165 0.0668678 0.00259562 -0.107132 0.0509025 0.218118 -0.0698315 0.0356533 0.048676 0.033726 -0.0803676 -0.208462 -0.00105637 0.0665855 0.0388356 0.114462 0.0998828 0.000965963 -0.0380248 -0.00311034 0.0526609 -0.0228441 
0.064939 0.0298941 -0.102774 -0.0494363 0.0283215 0.0935954 -0.0848096 -0.0621964 -0.0762741 -0.072157 -5.07131e-05 0.0897915 0.0341182 -0.0706131 -0.108588 0.0401588 -0.0728957 0.0211436 -0.0565518 0.161375 0.0988412 0.00855711 0.123726 0.0808098 -0.0527472 0.13447 0.105558 -0.192886 -0.0225446 0.0531666 -0.0731595 0.0130617 0.00936774 0.0756414 -0.00883643 -0.0020794 -0.0140696 0.234602 -0.0522409 -0.0115857 -0.082165 -0.0263309 -0.0159724 0.161394 -0.103238 0.0347871 0.22321 -0.017848 -0.158628 0.15552 0.0801372 -0.0430725 -0.0599191 0.0816827 0.171225 -0.0416448 0.0560581 0.107939 0.0341087 -0.202943 -0.0121168 -0.0677962 0.223352 -0.0349025 0.0750275 -0.172733 -0.017266 0.0596977 0.0123907 0.140244 -0.0248681 0.019913 -0.019576 0.0400724 0.0084378 -0.0876382 -0.0719101 0.0831671 0.00663922 0.0546843 0.00678282 0.116176 -0.0403769 -0.101127 -0.0735725 -0.0873136 0.0280778 0.0604863 0.0848591 0.0439676 0.0290736 -0.112097 -0.0795003 -0.0323909 0.0161766 -0.0108793 0.0478318 0.144923 0.049943 -0.092916 -0.0368592 0.0405581 -0.035504 0.126848 -0.113416 -0.0265383 -0.146563 0.0619112 -0.00180248 -0.0963253 0.0715104 0.211395 -0.0657655 0.0371809 0.0371208 0.0256867 -0.0741291 -0.212641 -0.00437832 0.0652863 0.0399984 0.10842 0.108786 -0.00291937 -0.0198611 -0.009799 0.0746245 -0.035336 
0.0539664 0.0150214 -0.0933854 -0.0433692 0.0503064 0.0746511 -0.0915671 -0.0781765 -0.0342596 -0.113545 -0.0193269 0.0926451 0.0178925 -0.0757438 -0.126995 0.0367169 -0.0974875 0.0104073 -0.0967937 0.16849 0.1065 0.00155549 0.128856 0.0601092 -0.0424869 0.124665 0.0788841 -0.187831 -0.0520742 0.0358936 -0.0476016 0.0130319 -0.00213082 0.0747452 -0.00436355 0.00591649 -0.0325947 0.245328 -0.0614528 -0.0209275 -0.0670042 -0.000928738 -0.0205442 0.161509 -0.0908984 0.02896 0.199958 -0.0112386 -0.119958 0.167381 0.0480458 -0.0535389 -0.0586338 0.0713788 0.175679 -0.0613249 0.0405835 0.110355 0.0297337 -0.208404 -0.00819715 -0.0603889 0.214458 -0.0062537 0.0639492 -0.185784 -0.0179187 0.0829338 0.0306729 0.141645 0.0023015 0.0335195 0.00804275 0.0434881 -0.0127054 -0.0825256 -0.0892097 0.0587066 -0.00556938 0.0658983 0.0165281 0.129729 -0.0445891 -0.0963825 -0.0818046 -0.0936032 0.0340918 0.0863977 0.0830461 0.0278814 0.0367803 -0.105993 -0.07187 -0.0505638 0.0159709 -0.00951352 0.0352575 0.123987 0.0351417 -0.0957692 -0.0477079 0.0193622 -0.0358666 0.112423 -0.113002 -0.0338197 -0.155985 0.0674793 0.00910229 -0.0746072 0.0805495 0.214297 -0.0883384 0.0605886 0.0339327 0.0294492 -0.0833731 -0.194207 -0.00632762 0.0540246 0.0305511 0.157158 0.102878 0.003829 -0.0205588 -0.0312701 0.0685844 -0.0400116 
0.0534718 0.0137052 -0.0852631 -0.0464681 0.0501056 0.079342 -0.0892167 -0.0753363 -0.0335845 -0.119599 -0.0229239 0.0901413 0.015177 -0.0818706 -0.117171 0.0344022 -0.108378 0.00497929 -0.098376 0.164647 0.107285 0.00894474 0.128414 0.0579453 -0.0417658 0.12251 0.0764432 -0.19223 -0.0543207 0.0335508 -0.044261 0.0076748 -0.00244717 0.0798421 0.00513715 0.00704955 -0.0263855 0.242792 -0.0610781 -0.0224087 -0.0612367 -0.00495666 -0.0160005 0.163 -0.0930844 0.0306223 0.201543 -0.0106951 -0.123458 0.170809 0.0432106 -0.0632452 -0.0545998 0.0741884 0.179006 -0.0601641 0.0353716 0.110937 0.0224225 -0.209313 -0.0106463 -0.0591852 0.21319 -0.00713847 0.0692875 -0.182572 -0.0175851 0.0789299 0.0279168 0.138701 -0.000488457 0.03099 0.00721794 0.0409384 -0.00873522 -0.0825522 -0.0930637 0.0522718 -0.00109681 0.0715485 0.0225702 0.126731 -0.0454455 -0.0954126 -0.0824639 -0.0940539 0.0346254 0.0858406 0.078637 0.0369947 0.0453377 -0.10937 -0.0754756 -0.0509445 0.00788131 -0.00343143 0.0330375 0.123378 0.0365464 -0.0909728 -0.0482212 0.0163894 -0.0377868 0.105063 -0.113422 -0.0341864 -0.156902 0.0688412 0.00501477 -0.0728684 0.0838174 0.21341 -0.0909705 0.056153 0.0357364 0.0331766 -0.0829464 -0.19111 -0.00785274 0.0563519 0.0382803 0.154645 0.106347 0.00742617 -0.015489 -0.0334263 0.0747546 -0.0416385 
0.0696353 0.0239969 -0.0981934 -0.0433292 0.0336885 0.0792445 -0.0938334 -0.0728541 -0.0355338 -0.112247 -0.0161077 0.0864821 0.0186536 -0.0755983 -0.102863 0.0494898 -0.0891495 -0.012119 -0.0900037 0.172864 0.08789 0.0389023 0.12965 0.0772069 -0.0552889 0.108623 0.11089 -0.17662 -0.0532307 0.057494 -0.0736167 0.00312434 0.0229567 0.0911706 0.00224288 0.0100327 0.00484705 0.223299 -0.0810142 -0.0216655 -0.0916437 -0.0220029 0.00046907 0.157651 -0.0874579 0.0533894 0.209562 -0.000935282 -0.136461 0.199286 0.0686758 -0.0633076 -0.0375681 0.0818813 0.190992 -0.0558489 0.0251513 0.089351 0.0310153 -0.201521 -0.0209345 -0.0592787 0.202803 -0.0237073 0.0568404 -0.177657 -0.020493 0.0662953 0.00606095 0.121942 -0.0216748 0.000742509 -0.00787196 0.0212842 0.0107553 -0.0673757 -0.0652373 0.0505916 0.000715441 0.0801491 0.0651084 0.107768 -0.063013 -0.105802 -0.0636564 -0.0809696 -0.00388636 0.0552356 0.072883 0.0865726 0.0420175 -0.121802 -0.103305 -0.0230148 0.00123629 0.0296262 0.0292146 0.112405 0.0607048 -0.0962115 -0.02285 0.0212024 -0.0366525 0.0891689 -0.135095 -0.0383774 -0.162106 0.0503402 -0.0212362 -0.0694996 0.0998098 0.219039 -0.0606676 0.0444544 0.0166157 0.0343573 -0.079673 -0.179347 -0.0196993 0.0637802 0.043954 0.131625 0.12919 0.0139423 0.00415827 -0.0265464 0.0951654 -0.0646599 
0.0750193 0.0268131 -0.109151 -0.0479753 0.0253936 0.0827145 -0.0964552 -0.067739 -0.0589465 -0.0859583 -0.00608324 0.080236 0.038583 -0.0584766 -0.0853376 0.056459 -0.0642237 -0.00403925 -0.0736562 0.175448 0.0829109 0.0368204 0.135301 0.0786396 -0.0584547 0.118481 0.110971 -0.183044 -0.0444418 0.0629045 -0.0750196 0.0205027 0.0286847 0.0912879 -0.00233972 0.0162062 0.0105421 0.231563 -0.0658446 -0.0172182 -0.104487 -0.0247932 -0.00330676 0.154749 -0.0932163 0.0514778 0.214832 -9.27803e-05 -0.14368 0.189311 0.0807683 -0.0592865 -0.0421138 0.0874802 0.180181 -0.0504497 0.036158 0.0898834 0.044033 -0.200662 -0.0287963 -0.0657301 0.201742 -0.0421248 0.0576865 -0.168973 -0.0163439 0.0719021 0.00464564 0.114407 -0.0252408 0.00154586 -0.0194575 0.0173682 0.0135678 -0.0742671 -0.0630674 0.0563395 0.0054217 0.0769059 0.0587198 0.100592 -0.0636738 -0.111869 -0.0650383 -0.0786076 -0.00195688 0.0419552 0.0803368 0.078255 0.0313977 -0.12241 -0.0959657 -0.0186565 0.00323996 0.0258293 0.0327717 0.126354 0.0552047 -0.0969447 -0.023726 0.0298824 -0.0366906 0.105679 -0.134716 -0.0343199 -0.163674 0.0442494 -0.0131851 -0.0781836 0.0836394 0.219945 -0.0578617 0.0409624 0.018522 0.0291629 -0.0755609 -0.197409 -0.0197994 0.0650281 0.0486624 0.112865 0.134815 0.0191331 -0.000666651 -0.0283509 0.0902441 -0.0560188 
0.0733073 0.00908003 -0.110765 -0.0357614 0.0424512 0.0654421 -0.0997032 -0.0754868 -0.048293 -0.0908448 -0.0164483 0.0909004 0.0337037 -0.0501957 -0.0922925 0.0610153 -0.0582784 0.00292322 -0.0697448 0.179665 0.0944799 0.0267343 0.14409 0.0870908 -0.0467131 0.110405 0.110909 -0.188668 -0.0563177 0.0751091 -0.0771983 0.0230973 0.0358189 0.0841437 -0.00189263 0.0135164 0.00150022 0.228634 -0.0746059 -0.0314878 -0.109896 -0.0103246 -0.000894218 0.153234 -0.0911047 0.05862 0.211131 -0.00262023 -0.125783 0.185649 0.0863756 -0.0651733 -0.0293431 0.0754453 0.191445 -0.0518871 0.0421289 0.085617 0.0481246 -0.197376 -0.0146141 -0.0676338 0.186777 -0.028702 0.0586961 -0.180454 -0.0295902 0.0824238 0.0123657 0.117096 -0.0206858 0.00939208 -0.0214305 -0.00174895 -0.00173274 -0.0604462 -0.0597294 0.0569768 0.00337311 0.080201 0.0543755 0.108192 -0.0715603 -0.110523 -0.0597819 -0.0859405 -0.00640394 0.0513982 0.076754 0.0722279 0.021535 -0.106555 -0.0990735 -0.0192105 0.00411933 0.0311358 0.0258494 0.123871 0.0615706 -0.104182 -0.0136949 0.0194685 -0.0298986 0.0958473 -0.136924 -0.045479 -0.169296 0.0343591 -0.00718718 -0.0712842 0.0814039 0.21813 -0.0579718 0.0367922 0.0197631 0.036619 -0.078263 -0.196272 -0.0296345 0.0702171 0.0399664 0.133184 0.122749 0.0143004 -0.00756494 -0.0242697 0.0881744 -0.0600472 
0.0717588 0.00636246 -0.0979871 -0.033926 0.0538033 0.0576258 -0.0894423 -0.0826965 -0.0321413 -0.0954854 -0.0231113 0.0959885 0.0295833 -0.0611221 -0.0962268 0.0576436 -0.0706831 0.00690454 -0.0823383 0.180095 0.103775 0.0374737 0.132037 0.0862931 -0.0460374 0.107721 0.100068 -0.187449 -0.0509601 0.0862558 -0.079393 0.0236692 0.0304034 0.0828167 0.016948 0.00361686 0.00556406 0.2263 -0.0733758 -0.0477074 -0.103421 -0.00761344 0.00487509 0.157825 -0.0923123 0.055985 0.204036 0.0044126 -0.113409 0.183149 0.0819277 -0.0657232 -0.026149 0.0706627 0.202024 -0.0589979 0.0310732 0.0794427 0.0339615 -0.200242 -0.00744077 -0.078661 0.185041 -0.00929733 0.0576561 -0.188939 -0.0335074 0.0768384 0.0155539 0.109047 -0.0181689 0.00852946 -0.0158272 -0.00682929 -0.0158688 -0.0564126 -0.0645458 0.0537711 0.00958218 0.0858715 0.0720059 0.117077 -0.0699029 -0.10106 -0.0432511 -0.100987 -0.00495333 0.0655048 0.0801018 0.0813878 0.0265885 -0.100666 -0.107308 -0.0160405 -0.0116816 0.0264403 0.0199489 0.114137 0.0663461 -0.108698 -0.000117262 0.0196904 -0.0267632 0.082923 -0.138037 -0.0537035 -0.163174 0.0355824 0.00416219 -0.0551979 0.0898243 0.211555 -0.0747263 0.0413834 0.0198059 0.0400038 -0.0804966 -0.186597 -0.0442911 0.0643785 0.0393401 0.148207 0.12128 0.0131046 -0.00736362 -0.0246425 0.0955765 -0.0664476 
0.0772199 -0.00709426 -0.0899596 -0.0343381 0.0589377 0.0646229 -0.0918455 -0.0870372 -0.0380937 -0.101453 -0.014346 0.102778 0.0388252 -0.057898 -0.096917 0.0622926 -0.0849313 0.0190303 -0.0827917 0.180739 0.124505 0.0417089 0.141687 0.0963728 -0.0458673 0.103688 0.101554 -0.194196 -0.0472491 0.1042 -0.0878117 0.0214982 0.0331246 0.0858 0.0219209 0.00148634 0.00367516 0.213354 -0.0603095 -0.0501534 -0.106009 -0.0131331 0.00640835 0.153453 -0.103974 0.0356089 0.206084 0.00491587 -0.110128 0.187299 0.0818758 -0.0739293 -0.0190494 0.0820785 0.201558 -0.0567459 0.0460097 0.0788462 0.018101 -0.196783 -0.00629232 -0.0750827 0.192993 -0.00388903 0.0530067 -0.180953 -0.0385584 0.0728973 0.0127037 0.104305 -0.0281212 0.00745231 -0.024308 -0.0164395 -0.0145289 -0.0558095 -0.0614475 0.0371882 0.011689 0.0984933 0.0848362 0.111576 -0.0638074 -0.0966367 -0.0448404 -0.0862612 -0.00506764 0.0659871 0.0729806 0.08721 0.0391968 -0.103591 -0.112801 -0.000312804 -0.0282101 0.02248 -0.00605188 0.13089 0.0743394 -0.103587 0.0188952 0.0139004 -0.0267425 0.0813123 -0.119799 -0.0481482 -0.157463 0.0396571 0.00341959 -0.0585579 0.0788033 0.206584 -0.0704942 0.038302 0.0199219 0.0570453 -0.0730104 -0.167106 -0.0487574 0.0741342 0.0438794 0.131793 0.117733 0.00190652 -0.020494 -0.00832919 0.0990046 -0.0533383 
0.0814162 -0.0151106 -0.100441 -0.0319101 0.0676559 0.0669033 -0.0835837 -0.0897769 -0.0468599 -0.0912857 -0.0211031 0.106664 0.045931 -0.0491818 -0.0951819 0.0672105 -0.0700688 0.0270218 -0.0835436 0.181371 0.120555 0.0270274 0.154368 0.0888856 -0.0494225 0.106027 0.0889838 -0.20202 -0.054007 0.0962824 -0.0869605 0.0448418 0.0278159 0.0852681 0.0167447 0.000107174 0.000405272 0.229463 -0.0572024 -0.0553831 -0.106198 -0.00435782 -5.32402e-05 0.140869 -0.11147 0.0355569 0.19992 0.0037064 -0.109083 0.181792 0.0860368 -0.0812868 -0.0217938 0.0810818 0.195589 -0.0593804 0.0580888 0.0866173 0.0228549 -0.190478 -0.00417052 -0.0696217 0.18919 -0.0192701 0.0682737 -0.17468 -0.0465527 0.0880883 0.00928752 0.108059 -0.0275811 0.0169128 -0.024086 -0.0112321 -0.0246976 -0.0534284 -0.0566882 0.0336123 0.0108459 0.0833778 0.0705538 0.108514 -0.0697524 -0.104072 -0.0521254 -0.0934243 0.000143833 0.0675037 0.0721446 0.0749639 0.0361046 -0.101872 -0.103948 -0.00689427 -0.0188027 0.0260409 0.00202051 0.13362 0.0682989 -0.0944443 0.0182391 0.00919342 -0.0310894 0.0949647 -0.113058 -0.0537676 -0.162947 0.0368635 0.00673111 -0.0609767 0.0675787 0.214078 -0.0616429 0.039477 0.0279974 0.0516379 -0.0775114 -0.1699 -0.0462171 0.07706 0.0411133 0.133401 0.118182 0.00434353 -0.0184757 -0.0125445 0.0841878 -0.0585582 
