{
  "descriptor": [
    -0.1181320920586586,
    0.12519264221191406,
    0.09309078007936478,
    -0.0672602429986,
    -0.07607022672891617,
    -0.06557002663612366,
    -0.0767371729016304,
    -0.09452524036169052,
    0.1979379802942276,
    -0.09889858216047287,
    0.09852170944213867,
    0.0594106987118721,
    -0.17591606080532074,
    -0.0042077358812093735,
    -0.07860185950994492,
    0.09152240306138992,
    -0.1456284373998642,
    -0.12267404049634933,
    -0.12904991209506989,
    -0.14017310738563538,
    0.0051609231159091,
    0.0863071084022522,
    0.019409261643886566,
    -0.07343854010105133,
    -0.16884969174861908,
    -0.26008281111717224,
    -0.07973678410053253,
    -0.10462216287851334,
    0.09057573229074478,
    -0.1111888661980629,
    -0.04482218995690346,
    -0.03734901174902916,
    -0.23201674222946167,
    -0.07456813752651215,
    0.0021614355500787497,
    0.03253501281142235,
    -0.037603650242090225,
    -0.0340435691177845,
    0.20267751812934875,
    0.056028466671705246,
    -0.1993638277053833,
    0.06470789760351181,
    0.08701412379741669,
    0.19367146492004395,
    0.24449357390403748,
    -0.02818354032933712,
    -0.03849184513092041,
    -0.09945117682218552,
    0.17268218100070953,
    -0.20780248939990997,
    0.14580228924751282,
    0.1693386286497116,
    0.1437922716140747,
    0.14358416199684143,
    0.12527047097682953,
    -0.10101968050003052,
    0.02206510864198208,
    0.057713668793439865,
    -0.15589359402656555,
    0.05766326189041138,
    0.1447678506374359,
    -0.006192637141793966,
    -0.11317753046751022,
    0.025025075301527977,
    0.08723719418048859,
    0.11914438009262085,
    -0.09764592349529266,
    -0.1842479109764099,
    0.13693606853485107,
    -0.15054798126220703,
    -0.04008837416768074,
    0.07292857021093369,
    -0.04380760341882706,
    -0.07987260818481445,
    -0.24513396620750427,
    0.07569893449544907,
    0.3801676332950592,
    0.13469457626342773,
    -0.17398014664649963,
    0.017164815217256546,
    -0.13481269776821136,
    -0.09735573083162308,
    0.006384729873389006,
    -0.0002079889818560332,
    -0.1282956600189209,
    0.0034091253764927387,
    -0.012911361642181873,
    0.05612052604556084,
    0.1647176742553711,
    0.047589369118213654,
    -0.04849192872643471,
    0.16691207885742188,
    0.02409970574080944,
    0.040167197585105896,
    0.017109990119934082,
    0.12943550944328308,
    -0.21749377250671387,
    -0.06613314151763916,
    -0.11069586127996445,
    -0.07747890800237656,
    0.1241731345653534,
    -0.07133926451206207,
    -0.031094444915652275,
    0.16021881997585297,
    -0.16698919236660004,
    0.2621787190437317,
    0.005972662940621376,
    -0.023668203502893448,
    0.008922046981751919,
    0.05206670984625816,
    -0.05130708962678909,
    0.0006984794745221734,
    0.1118580549955368,
    -0.14249829947948456,
    0.2751142680644989,
    0.09906386584043503,
    -0.041330158710479736,
    0.07860666513442993,
    0.10678840428590775,
    0.023241955786943436,
    -0.006061594467610121,
    0.0371641106903553,
    -0.11114667356014252,
    -0.1724049597978592,
    -0.02100098878145218,
    -0.03429202362895012,
    0.06574051082134247,
    0.05755746737122536
  ]
}