{
  "descriptor": [
    -0.03981005772948265,
    0.08922955393791199,
    0.10767371952533722,
    -0.045890357345342636,
    -0.13731162250041962,
    0.029557066038250923,
    -0.09877870976924896,
    -0.02803965099155903,
    0.1328514963388443,
    -0.17217537760734558,
    0.17845498025417328,
    -0.044623881578445435,
    -0.2231711745262146,
    0.1073082685470581,
    -0.034456148743629456,
    0.1624378114938736,
    -0.16249749064445496,
    -0.16068623960018158,
    -0.05484865978360176,
    -0.05601442977786064,
    -0.0003891380038112402,
    0.10046354681253433,
    0.015699295327067375,
    0.06829734146595001,
    -0.13504664599895477,
    -0.36062559485435486,
    -0.06894800812005997,
    -0.05264780670404434,
    0.06290457397699356,
    -0.08570760488510132,
    -0.07333286106586456,
    0.05159841477870941,
    -0.11260410398244858,
    0.052083782851696014,
    0.09600625932216644,
    0.06625336408615112,
    -0.06859137117862701,
    -0.16420342028141022,
    0.26298367977142334,
    0.11342077702283859,
    -0.22298094630241394,
    -0.0028990227729082108,
    0.062193021178245544,
    0.24649250507354736,
    0.20391523838043213,
    -0.027402561157941818,
    0.05401698499917984,
    -0.09435969591140747,
    0.14642567932605743,
    -0.2727864980697632,
    0.024500427767634392,
    0.20469285547733307,
    0.06652076542377472,
    0.06773454695940018,
    0.06483571231365204,
    -0.14106158912181854,
    -0.01603543944656849,
    0.14633017778396606,
    -0.13855110108852386,
    0.048403386026620865,
    0.07144772261381149,
    -0.06520684063434601,
    -0.041538335382938385,
    -0.06379422545433044,
    0.16090944409370422,
    0.09820633381605148,
    -0.1315600425004959,
    -0.15100592374801636,
    0.2103719562292099,
    -0.1533348560333252,
    -0.09538470208644867,
    0.04989880695939064,
    -0.11388202756643295,
    -0.1841357946395874,
    -0.18220432102680206,
    0.03170686587691307,
    0.35292935371398926,
    0.15835176408290863,
    -0.13239125907421112,
    0.07284379005432129,
    0.032308731228113174,
    -0.03969518095254898,
    0.011124871671199799,
    0.17793963849544525,
    -0.10969490557909012,
    -0.009780997410416603,
    -0.019875703379511833,
    0.04456840083003044,
    0.2213684767484665,
    0.014166420325636864,
    0.014321824535727501,
    0.20913530886173248,
    0.0024312008172273636,
    0.03426305949687958,
    0.09130009263753891,
    0.06660919636487961,
    -0.13766878843307495,
    -0.06861161440610886,
    -0.19761402904987335,
    -0.037320878356695175,
    -0.023917971178889275,
    -0.05617474392056465,
    -0.02645345777273178,
    0.14286506175994873,
    -0.19541668891906738,
    0.14696194231510162,
    -0.07691863179206848,
    -0.11715306341648102,
    -0.013281772844493389,
    0.007375339511781931,
    -0.08172594755887985,
    -0.016083864495158195,
    0.13573473691940308,
    -0.2014591246843338,
    0.07434254139661789,
    0.16128671169281006,
    0.08334245532751083,
    0.1463274210691452,
    0.1422768235206604,
    0.04112763702869415,
    0.060370076447725296,
    -0.038934241980314255,
    -0.1842476725578308,
    -0.11757683753967285,
    0.03684078902006149,
    -0.01745462603867054,
    -0.023391995579004288,
    -0.025598101317882538
  ]
}