{
  "descriptor": [
    -0.0862618237733841,
    0.07286902517080307,
    0.1310354322195053,
    -0.06664662063121796,
    -0.14127126336097717,
    0.011605774983763695,
    -0.04010367393493652,
    -0.017477937042713165,
    0.15110529959201813,
    -0.1265987604856491,
    0.18043240904808044,
    -0.038575202226638794,
    -0.21116653084754944,
    0.05610143765807152,
    -0.0475216843187809,
    0.1274227648973465,
    -0.12469866126775742,
    -0.16390609741210938,
    -0.04028436914086342,
    -0.06862760335206985,
    0.02957548201084137,
    0.1098441481590271,
    -0.01210725400596857,
    0.0861511081457138,
    -0.1367482841014862,
    -0.34869739413261414,
    -0.07593271881341934,
    -0.07896947115659714,
    -0.016309663653373718,
    -0.1232544407248497,
    -0.052300482988357544,
    0.10350469499826431,
    -0.12233317643404007,
    0.01423231977969408,
    0.04635968059301376,
    0.05734242871403694,
    -0.03491177782416344,
    -0.09157975018024445,
    0.24358713626861572,
    0.07758300751447678,
    -0.2273283451795578,
    -0.032157424837350845,
    0.08792202174663544,
    0.2748335003852844,
    0.14608940482139587,
    -0.02650456316769123,
    -0.005854859482496977,
    -0.011024425737559795,
    0.13425031304359436,
    -0.29489555954933167,
    0.0281954575330019,
    0.2140716165304184,
    0.02841339446604252,
    0.10473404824733734,
    0.09330779314041138,
    -0.107401542365551,
    -0.002444296609610319,
    0.09143304824829102,
    -0.09443824738264084,
    0.05136919766664505,
    0.031238436698913574,
    -0.1127552017569542,
    -0.00722065893933177,
    -0.09823040664196014,
    0.16373006999492645,
    0.0849192813038826,
    -0.10071440786123276,
    -0.11985321342945099,
    0.11312542855739594,
    -0.14793770015239716,
    -0.12815283238887787,
    0.08217521011829376,
    -0.12441574782133102,
    -0.12797775864601135,
    -0.22138604521751404,
    0.05225702375173569,
    0.4122326374053955,
    0.1324530392885208,
    -0.13194651901721954,
    0.059773337095975876,
    -0.02434038184583187,
    -0.07516437768936157,
    0.016871195286512375,
    0.113375723361969,
    -0.09855203330516815,
    0.05554959923028946,
    -0.03178698569536209,
    0.06303098052740097,
    0.2263137549161911,
    0.03328314796090126,
    0.008179767988622189,
    0.21613971889019012,
    -0.01131152082234621,
    0.08547189086675644,
    0.08799230307340622,
    0.07577671855688095,
    -0.07445859909057617,
    -0.05569497495889664,
    -0.14036594331264496,
    0.03320588544011116,
    0.006214630324393511,
    -0.10921633243560791,
    -0.03577636554837227,
    0.12248066812753677,
    -0.23442532122135162,
    0.13601718842983246,
    -0.03615627810359001,
    -0.07088325917720795,
    -0.036058299243450165,
    0.06288852542638779,
    -0.09730378538370132,
    -0.0020168775226920843,
    0.1368345320224762,
    -0.2209726870059967,
    0.11472092568874359,
    0.15214534103870392,
    0.026342464610934258,
    0.1322306990623474,
    0.07931099832057953,
    0.032105207443237305,
    -0.021381517872214317,
    -0.05925735458731651,
    -0.11657720804214478,
    -0.11301732063293457,
    0.08567823469638824,
    -0.012032377533614635,
    -0.014007319696247578,
    -0.0009447946213185787
  ]
}