{
  "descriptor": [
    -0.17107726633548737,
    0.05026722699403763,
    0.10089835524559021,
    -0.058054953813552856,
    -0.1588398814201355,
    -0.0019135280745103955,
    -0.03155810758471489,
    -0.09009349346160889,
    0.10886253416538239,
    -0.1454116851091385,
    0.16102176904678345,
    -0.06423782557249069,
    -0.2108498364686966,
    0.12670743465423584,
    -0.039433080703020096,
    0.10890206694602966,
    -0.1730869859457016,
    -0.15539668500423431,
    -0.08554931730031967,
    -0.12092076987028122,
    0.005589362699538469,
    0.06979585438966751,
    -0.05710667371749878,
    0.0650784969329834,
    -0.13746829330921173,
    -0.33224835991859436,
    -0.08918096870183945,
    -0.08199864625930786,
    0.07328779250383377,
    -0.014030655845999718,
    -0.06673366576433182,
    -0.009037096984684467,
    -0.10785388201475143,
    0.01817222870886326,
    0.0701000764966011,
    0.09447343647480011,
    -0.027532346546649933,
    -0.03591187298297882,
    0.22924897074699402,
    0.009378849528729916,
    -0.1975620985031128,
    0.029456306248903275,
    0.11660482734441757,
    0.22943377494812012,
    0.19258897006511688,
    0.08410768955945969,
    -0.004092843737453222,
    -0.10248783230781555,
    0.12703289091587067,
    -0.26694950461387634,
    0.06632134318351746,
    0.18365657329559326,
    0.09126434475183487,
    0.0923042893409729,
    0.09545167535543442,
    -0.22066794335842133,
    -0.04166187345981598,
    0.08828476816415787,
    -0.09888872504234314,
    0.09802429378032684,
    0.0591776967048645,
    -0.046715009957551956,
    0.0009483213070780039,
    -0.0917784720659256,
    0.1666382998228073,
    0.08911272138357162,
    -0.11912091821432114,
    -0.16665813326835632,
    0.15055014193058014,
    -0.2224835604429245,
    -0.09634875506162643,
    0.06465867906808853,
    -0.10916278511285782,
    -0.18770132958889008,
    -0.23317889869213104,
    0.057836391031742096,
    0.3895455300807953,
    0.19708973169326782,
    -0.15978454053401947,
    0.008547913283109665,
    0.017912162467837334,
    -0.04740006476640701,
    0.1277206838130951,
    0.08979232609272003,
    -0.0852099359035492,
    -0.04244193062186241,
    -0.05544949695467949,
    0.019160961732268333,
    0.23197074234485626,
    -0.00812359619885683,
    0.008186318911612034,
    0.19290460646152496,
    0.00733674131333828,
    0.1063835397362709,
    0.021580472588539124,
    0.09275376051664352,
    -0.1519245207309723,
    -0.008711238391697407,
    -0.16263903677463531,
    0.009243310429155827,
    0.012125707231462002,
    0.004907683935016394,
    0.03071543388068676,
    0.12309610098600388,
    -0.17441324889659882,
    0.15146416425704956,
    -0.0826508030295372,
    -0.06518416106700897,
    -0.09342990070581436,
    0.028086435049772263,
    -0.10881444811820984,
    0.013069613836705685,
    0.19345997273921967,
    -0.1990237832069397,
    0.15652254223823547,
    0.22884882986545563,
    0.005598215386271477,
    0.14166781306266785,
    0.13180820643901825,
    -0.0164793711155653,
    0.051322031766176224,
    0.01908719539642334,
    -0.20434321463108063,
    -0.06793110817670822,
    0.03829165920615196,
    -0.1009734570980072,
    0.0024543553590774536,
    0.031507764011621475
  ]
}