{
  "descriptor": [
    -0.05940432846546173,
    0.09444936364889145,
    0.0925687626004219,
    -0.07975117862224579,
    -0.15143659710884094,
    0.07128072530031204,
    -0.08215924352407455,
    -0.03649700805544853,
    0.2016468346118927,
    -0.1868123859167099,
    0.1733534336090088,
    -0.018617907539010048,
    -0.2380903661251068,
    0.09423299878835678,
    -0.05413226783275604,
    0.16379715502262115,
    -0.1897362321615219,
    -0.16702410578727722,
    -0.035155560821294785,
    -0.031722620129585266,
    0.012490186840295792,
    0.09793113172054291,
    0.01648108847439289,
    0.07249709963798523,
    -0.148923859000206,
    -0.3983106017112732,
    -0.05396635830402374,
    -0.06610860675573349,
    0.0475020557641983,
    -0.09875115007162094,
    -0.11971734464168549,
    0.061172664165496826,
    -0.1395055204629898,
    0.03432655707001686,
    0.0690312534570694,
    0.09920362383127213,
    -0.0730193704366684,
    -0.14668244123458862,
    0.2237340658903122,
    0.11064057797193527,
    -0.2552419602870941,
    -0.010607277043163776,
    0.06660373508930206,
    0.24099373817443848,
    0.2225683480501175,
    0.04015627130866051,
    0.023917559534311295,
    -0.10643709450960159,
    0.15878303349018097,
    -0.2935222089290619,
    0.04729494825005531,
    0.22267627716064453,
    0.016669252887368202,
    0.07048185169696808,
    0.08344230055809021,
    -0.16743279993534088,
    -0.015940578654408455,
    0.11049448698759079,
    -0.11848907917737961,
    0.011878645978868008,
    0.08665496855974197,
    -0.036893244832754135,
    -0.021814029663801193,
    -0.0831221267580986,
    0.2089729607105255,
    0.12109038233757019,
    -0.11800301820039749,
    -0.12227625399827957,
    0.23663188517093658,
    -0.15797004103660583,
    -0.0979636013507843,
    0.030597081407904625,
    -0.13176469504833221,
    -0.18071195483207703,
    -0.15206755697727203,
    0.03177076578140259,
    0.36034291982650757,
    0.1879928708076477,
    -0.08557923138141632,
    0.07651230692863464,
    0.016660425812005997,
    -0.02214363031089306,
    0.030846338719129562,
    0.1894988715648651,
    -0.09380494058132172,
    0.0044470843859016895,
    0.0014858898939564824,
    0.051580868661403656,
    0.21290794014930725,
    0.0342184379696846,
    0.04557469114661217,
    0.2328004240989685,
    -0.012079615145921707,
    0.034048788249492645,
    0.08397161215543747,
    0.06143629923462868,
    -0.15113888680934906,
    -0.019993027672171593,
    -0.19492171704769135,
    -0.036261461675167084,
    0.01995128020644188,
    -0.03760832920670509,
    0.0026898705400526524,
    0.18481579422950745,
    -0.2124684751033783,
    0.13390770554542542,
    -0.09814213216304779,
    -0.07977139204740524,
    0.04575033858418465,
    -0.001453730626963079,
    -0.041752833873033524,
    -0.029217014089226723,
    0.11749163269996643,
    -0.2118750661611557,
    0.11890004575252533,
    0.14890006184577942,
    0.05253588408231735,
    0.144287571310997,
    0.11302199959754944,
    0.07057665288448334,
    0.058971233665943146,
    -0.04492751881480217,
    -0.23700381815433502,
    -0.10401766747236252,
    0.05812403932213783,
    -0.05287041887640953,
    -0.02056114189326763,
    -0.021783875301480293
  ]
}