{
  "descriptor": [
    -0.11713646352291107,
    0.13784335553646088,
    -0.009751650504767895,
    -0.08471382409334183,
    -0.1020987406373024,
    0.026784570887684822,
    -0.07028438150882721,
    -0.08055992424488068,
    0.0840461403131485,
    0.030911963433027267,
    0.20142126083374023,
    -0.04143156856298447,
    -0.33956581354141235,
    -0.059386346489191055,
    -0.03264164552092552,
    0.0972781777381897,
    -0.19196394085884094,
    -0.14260852336883545,
    -0.15809662640094757,
    -0.07408012449741364,
    0.0578930489718914,
    0.06841029971837997,
    0.055752258747816086,
    -0.0018119075102731586,
    -0.21925123035907745,
    -0.2681214213371277,
    -0.08274628967046738,
    -0.11433370411396027,
    0.16353097558021545,
    -0.1225186139345169,
    0.0015523693291470408,
    0.03048006445169449,
    -0.15216201543807983,
    -0.01357321161776781,
    0.037359267473220825,
    0.07525958120822906,
    -0.07131428271532059,
    -0.10577812045812607,
    0.28913459181785583,
    -0.009718043729662895,
    -0.15525487065315247,
    0.041402366012334824,
    0.08181868493556976,
    0.25641223788261414,
    0.24746227264404297,
    -0.0127046974375844,
    0.07345971465110779,
    0.020012663677334785,
    0.0711866244673729,
    -0.27205565571784973,
    0.10539820045232773,
    0.18851061165332794,
    0.18936020135879517,
    0.11625407636165619,
    0.0988890528678894,
    -0.21823722124099731,
    -0.020055901259183884,
    0.2276824414730072,
    -0.17513133585453033,
    0.10631082952022552,
    0.05337364599108696,
    -0.10706774890422821,
    -0.07472135871648788,
    -0.0745348334312439,
    0.14546549320220947,
    0.08213851600885391,
    -0.12847626209259033,
    -0.19630038738250732,
    0.22436876595020294,
    -0.15233482420444489,
    -0.06886214762926102,
    0.12986904382705688,
    -0.10693742334842682,
    -0.0855366662144661,
    -0.265031099319458,
    0.004227239638566971,
    0.31593552231788635,
    0.10368464142084122,
    -0.2048974335193634,
    0.04422273486852646,
    -0.021882791072130203,
    -0.04387695714831352,
    -0.0557461678981781,
    -0.020014433190226555,
    -0.13573779165744781,
    -0.0647367462515831,
    -0.13132457435131073,
    -0.03219398856163025,
    0.2151164710521698,
    -0.002711799694225192,
    0.011359783820807934,
    0.22026373445987701,
    0.07963033765554428,
    -0.014550935477018356,
    0.0897703766822815,
    0.0438777394592762,
    -0.0901743471622467,
    -0.118292897939682,
    -0.026446998119354248,
    0.02974109910428524,
    0.005164814181625843,
    -0.23422567546367645,
    -0.04775344580411911,
    0.10011935979127884,
    -0.14584793150424957,
    0.21646328270435333,
    -0.0034091707784682512,
    0.019298801198601723,
    -0.05976556986570358,
    -0.0139376912266016,
    -0.048343852162361145,
    0.035256192088127136,
    0.23798072338104248,
    -0.31798526644706726,
    0.19939716160297394,
    0.20084744691848755,
    0.014840004034340382,
    0.0947372317314148,
    0.07516565173864365,
    0.0919111892580986,
    -0.02027222514152527,
    0.0682959109544754,
    -0.19614095985889435,
    -0.1762527972459793,
    -0.012616315856575966,
    -0.10541921854019165,
    -0.007143981289118528,
    0.11767304688692093
  ]
}