{
  "descriptor": [
    -0.1068342849612236,
    0.025102799758315086,
    0.08447563648223877,
    -0.0959090143442154,
    -0.16539554297924042,
    0.02822192758321762,
    -0.0539487786591053,
    -0.015232753939926624,
    0.21926212310791016,
    -0.1535528600215912,
    0.1875992864370346,
    -0.024647299200296402,
    -0.23302844166755676,
    0.1075453981757164,
    -0.03707175329327583,
    0.1638621836900711,
    -0.1341320127248764,
    -0.14076636731624603,
    -0.04500597342848778,
    -0.008201763033866882,
    -0.004784098360687494,
    0.08946825563907623,
    0.03177043795585632,
    0.0871690884232521,
    -0.08913089334964752,
    -0.3974238336086273,
    -0.0719321072101593,
    -0.045111801475286484,
    0.07221759855747223,
    -0.09628117084503174,
    -0.06852894276380539,
    0.041173674166202545,
    -0.16031676530838013,
    -0.006585900671780109,
    0.07698732614517212,
    0.11134979873895645,
    -0.12993879616260529,
    -0.14458930492401123,
    0.273701012134552,
    0.07080207765102386,
    -0.2710057199001312,
    -0.012602351605892181,
    0.06850556284189224,
    0.24342581629753113,
    0.15386313199996948,
    0.03166644647717476,
    0.046086106449365616,
    -0.11972425878047943,
    0.16914618015289307,
    -0.2922796905040741,
    0.057848818600177765,
    0.1818934679031372,
    0.05851593241095543,
    0.054394930601119995,
    0.10557933896780014,
    -0.12500891089439392,
    0.002436130540445447,
    0.12549634277820587,
    -0.15157780051231384,
    0.03502330183982849,
    0.07799584418535233,
    -0.01494499109685421,
    0.00866677239537239,
    -0.10751225054264069,
    0.21225731074810028,
    0.07162821292877197,
    -0.11715739965438843,
    -0.10650467872619629,
    0.21727225184440613,
    -0.14651398360729218,
    -0.07617349922657013,
    0.08170736581087112,
    -0.10659916698932648,
    -0.20735782384872437,
    -0.21810124814510345,
    0.03703201562166214,
    0.4065408408641815,
    0.16383834183216095,
    -0.049397774040699005,
    0.09683166444301605,
    0.013129989616572857,
    -0.06646484136581421,
    -0.023937972262501717,
    0.16905005276203156,
    -0.11218594014644623,
    0.049962133169174194,
    0.0023369051050394773,
    0.07037265598773956,
    0.225014790892601,
    0.00995646882802248,
    0.03952212259173393,
    0.20861788094043732,
    0.03342093899846077,
    0.06376909464597702,
    0.05891936644911766,
    0.0788617730140686,
    -0.11946648359298706,
    -0.0623922273516655,
    -0.19372691214084625,
    -0.016253506764769554,
    0.0003509202797431499,
    -0.02559565007686615,
    0.04332450404763222,
    0.14418160915374756,
    -0.22698263823986053,
    0.15698350965976715,
    -0.06555376201868057,
    -0.11084549129009247,
    0.0038470912259072065,
    0.05270248278975487,
    -0.06395091861486435,
    -0.03952943533658981,
    0.08866574615240097,
    -0.2474174201488495,
    0.11340592801570892,
    0.13596610724925995,
    0.0805959478020668,
    0.14659497141838074,
    0.08782762289047241,
    0.03451533243060112,
    0.04467647150158882,
    -0.026605382561683655,
    -0.17391559481620789,
    -0.10195107012987137,
    0.06139875203371048,
    -0.0022210474126040936,
    0.030010677874088287,
    0.028309291228652
  ]
}