-0.0271048 -0.0156073 -0.114686 0.037838 0.0926011 0.0727586 0.0285749 -0.120212 -0.0497364 0.0157063 -0.00316452 0.0332386 0.0804198 0.0265489 0.0181022 -0.0490501 -0.0483814 0.00809358 0.0909602 0.171622 0.0576474 -0.165495 0.110788 0.0968625 0.0433065 0.0382624 -0.130282 -0.239999 0.0767615 0.062698 0.0943433 0.0249348 -0.0319955 -0.0823456 0.059618 0.112829 -0.0727491 0.170043 -0.0379514 -0.106027 0.0178605 0.02723 -0.109191 0.0800785 -0.179969 0.0251439 0.147292 0.052158 0.00265092 -0.0565542 -0.130482 -0.0365291 0.0767775 -0.0621221 0.12242 0.0221628 0.00938971 0.190875 0.0162276 -0.112753 -0.0820086 0.0290947 0.218053 -0.108189 0.132604 0.0296915 0.0463629 0.00775227 -0.015911 0.0036578 0.0136644 0.166287 -0.0485593 0.0240189 0.0257815 -0.0132159 -0.0918564 0.0608502 0.0831907 0.0623219 -0.0912464 0.0586662 -0.0809153 -0.0586277 0.0119189 -0.0727026 0.0226228 0.0871138 0.0386308 -0.11651 0.105095 0.0456172 0.0838012 -0.0893649 -0.00640677 -0.190177 0.0373405 0.142952 0.0670451 -0.0678017 0.00142306 -0.0157524 0.0310689 -0.0517695 -0.161623 0.121723 0.00886187 0.0172771 0.151966 0.063125 0.0177099 0.102061 -0.0521704 -0.0927745 0.0358484 0.0982973 -0.0873094 -0.134671 -0.0398164 0.102637 -0.0362907 -0.0211762 -0.0656843 0.0521336 -0.203381 0.133257 -0.0585118 0.0724003 
0.0358456 -0.0657394 -0.083547 0.0375697 0.130585 0.117755 0.109913 -0.056484 -0.00610192 -0.0224919 -0.0170515 0.0472702 0.0627049 -0.0215152 0.0071884 -0.127113 -0.0868283 0.0303765 -0.000639134 0.157032 0.0647887 -0.155535 0.100269 0.0960011 0.0341844 -0.0382367 -0.150875 -0.195272 0.0396976 0.00814098 0.0929088 0.00555959 -0.0867408 -0.0203751 0.0609903 0.0526017 -0.0785195 0.147467 -0.0553019 -0.159909 0.0863575 0.0195413 -0.135464 0.0755649 -0.228293 -0.0721968 0.0444117 0.0894589 0.0571791 0.0178468 -0.15911 -0.0271484 0.063127 -0.0328237 0.120823 -0.0232812 -0.0153194 0.185488 -0.0427013 -0.141128 -0.0856106 0.0480577 0.226868 -0.0893141 0.0776204 0.0573694 0.0486029 0.0108175 -0.0416205 0.0200579 0.0111962 0.165827 -0.0116783 0.0741179 -0.0308692 -0.0367335 -0.0538097 -0.016582 0.109244 0.0610808 -0.0973345 0.0422669 -0.0370868 -0.0739795 0.0540149 -0.103827 0.0549446 0.149686 0.073069 -0.0752328 0.194726 0.00637608 0.0760983 -0.0868275 -0.0315165 -0.21769 0.0165232 0.0903479 0.0451461 -0.0479905 0.0424909 -0.00960219 0.0307709 -0.0415622 -0.115294 0.111831 0.0159049 0.0214053 0.151355 0.0787184 0.0599159 0.144925 -0.0577615 -0.0322304 0.0645101 0.081656 -0.038353 -0.0808185 0.0105975 0.107858 -0.032306 -0.0277976 -0.0579187 0.0552884 -0.169025 0.0866096 -0.0227757 0.049979 
-0.0067629 0.0173118 0.0371775 0.0810946 0.0514673 0.180152 0.0811684 -0.0743326 0.0244981 -0.0263356 0.0166815 0.0316139 0.00854816 -0.166015 0.00799865 -0.122511 -0.173142 0.0742125 -0.0564403 0.10592 0.086414 -0.138976 0.0318986 0.119134 0.051567 -0.0407509 -0.185977 -0.192478 0.0419245 -0.0319668 0.126144 0.0530717 -0.119802 0.0493861 0.107544 0.0324891 -0.0447327 0.0744091 0.00641675 -0.145968 0.175455 -0.119029 -0.101657 0.0356941 -0.179276 -0.140196 0.0542781 0.082152 -0.0243469 0.01098 -0.106648 -0.00475395 0.0518203 -0.0166529 0.100172 0.00547162 -0.0243702 0.0819598 -0.0853318 -0.151261 -0.0878135 0.0464182 0.189733 -0.103004 0.0848334 0.0975769 0.0802701 -0.096272 -0.0991005 0.0780128 -0.0612022 0.111458 -0.0257394 0.128656 0.0174724 -0.111968 -0.068841 -0.0045121 0.100688 0.102624 -0.0971385 0.0589408 0.0121754 -0.0621072 0.034736 -0.0534979 0.0703785 0.128178 0.0315453 0.00139864 0.211467 -0.0294421 0.0759851 -0.062727 -0.102699 -0.185867 -0.0136643 0.0692122 0.0342187 -0.0386828 0.0677478 -0.00953327 -0.0231099 0.00242889 0.0487519 0.112798 0.092139 0.0824083 0.106012 0.0820834 -0.0158363 0.133083 -0.070329 -0.0519107 0.0945988 0.00757661 -0.050487 -0.0683923 0.07925 0.107388 0.0611212 -0.0496365 -0.0501515 0.0413993 -0.0893445 0.081428 0.0482463 0.0493949 
-0.0025266 0.00380474 0.00290282 -0.00565944 0.0660599 0.165681 0.071085 -0.0573236 0.0119911 -0.108665 -0.0237253 0.0556401 0.0488328 -0.157475 -0.00182304 -0.130121 -0.20272 -0.0069445 -0.114816 0.169705 0.0633473 -0.0785993 0.0463238 0.0877965 -0.0468135 0.00057279 -0.147237 -0.223566 -0.0029268 -0.0286134 0.0707942 0.0046287 -0.0752253 0.0681716 0.102537 0.0483406 0.017924 0.142863 -0.0606558 -0.103845 0.178124 -0.0971867 -0.0750885 0.0826241 -0.199001 -0.0245733 0.118816 0.0704334 -0.0793994 0.0792814 -0.165726 -0.103695 0.022838 0.0460484 0.141663 -0.0191028 -0.0650501 0.0985029 -0.093442 -0.171972 -0.0740678 0.0610902 0.1986 -0.0770028 0.0912114 0.010568 0.078259 -0.041973 -0.0528529 0.00698878 -0.0279076 0.0389783 0.00165976 0.0956249 0.0665427 -0.0401952 -0.130952 0.0137595 0.123385 0.0972972 -0.0546863 0.0799066 -0.0315317 -0.0430752 -0.00859331 -0.0113777 0.0901207 0.117115 0.00475387 0.0390612 0.22258 -0.110777 0.057524 -0.0899018 -0.142678 -0.151645 -0.000900212 0.073147 0.0429249 -0.058472 0.0233317 -0.0148149 -0.015887 0.0227079 -0.0425624 0.0815235 -0.0156485 0.152711 0.00594365 0.0625294 0.0453218 0.120081 -0.104044 -0.0374744 0.0101985 0.0478697 -0.109541 -0.117855 0.014562 0.0984627 0.0576256 0.00433135 -0.013612 0.0901266 -0.0809159 0.0299518 -0.00544857 0.00307866 
