-0.00798239 0.124067 -0.0428508 0.0028592 0.00342903 0.190834 -0.0444925 -0.0920365 -0.0477467 0.0228341 0.0355688 0.0180137 0.046451 -0.214738 -0.0226634 0.0514578 -0.208005 0.0707891 -0.0184486 0.0744916 0.140993 -0.0673993 0.0657478 0.0271869 0.00262889 0.0160555 -0.0540349 -0.259425 0.00997801 0.116455 -0.00302201 0.0405666 0.0264778 0.0676149 0.138485 0.0186825 0.0496089 0.0154452 0.0571726 -0.117264 0.0117423 -0.23229 0.077082 0.0748302 -0.0931796 0.00833788 0.219615 0.0319265 -0.229214 0.0493752 0.0150427 -0.0630579 0.0350663 0.0474659 0.113197 0.0519837 0.0502945 -0.0555752 -0.0495185 -0.14035 -0.0413542 -0.0252984 0.17727 -0.108083 0.137783 -0.0253187 -0.0614978 -0.0437352 -0.0710649 0.0675014 -0.107233 -0.00269154 -0.146414 -0.0691511 0.0564816 -0.0248187 -0.0538832 0.0662175 0.0405856 0.11509 -0.0174058 0.0210949 -0.0394206 0.0463446 -0.0841709 0.0854346 -0.0197058 0.00540139 0.0413964 0.147098 0.0778311 -0.10407 -0.0824056 0.0100917 -0.155857 -0.0284031 -0.0627164 0.182751 0.0724273 -0.0657054 0.120274 0.00204632 -0.0531309 -0.0106202 0.0658282 0.0425287 0.0110584 0.141312 -0.0482655 0.0209283 -0.0731624 0.0415521 -0.0421849 -0.115612 0.0658257 0.0544556 -0.0759437 -0.0635595 0.0328892 0.1219 0.134403 -0.0651023 0.0789723 0.0196595 -0.00917535 0.0817031 0.124646 0.032677 
-0.00586844 0.102373 -0.0632271 -0.0167329 -0.00282602 0.174362 -0.044617 -0.0715986 -0.048945 0.0299817 0.0447793 0.0217312 0.0605567 -0.209816 -0.0402775 0.0514966 -0.221726 0.0542935 -0.015244 0.0938067 0.146823 -0.0767216 0.0554681 0.0237325 -0.0119494 0.0414707 -0.0351317 -0.264074 0.0114542 0.113423 -0.025851 0.0195317 0.026771 0.0630226 0.124727 0.0185036 0.0433584 0.0288867 0.0525751 -0.116783 0.00782305 -0.233767 0.0660764 0.0978613 -0.091708 0.00753123 0.220082 0.0353703 -0.227848 0.0464068 -0.00906735 -0.0696461 0.0202422 0.060099 0.12474 0.046647 0.0369659 -0.0528349 -0.0564706 -0.14706 -0.0270522 -0.0438321 0.197404 -0.0767273 0.124525 -0.0355268 -0.0616934 -0.0288029 -0.0334135 0.0390556 -0.108863 -0.00827112 -0.14267 -0.0761104 0.060969 -0.0259823 -0.055038 0.0823637 0.047565 0.118678 -0.0170078 0.0163609 -0.0438251 0.0440003 -0.0941951 0.0922777 -0.00472989 0.0186069 0.0651372 0.131848 0.0822033 -0.104348 -0.0870189 0.0127659 -0.16593 -0.0387286 -0.0649339 0.16997 0.08373 -0.0794124 0.117376 -0.00443251 -0.0481955 -0.0227643 0.054248 0.0471528 -0.000665166 0.153478 -0.0578306 0.0145048 -0.0618376 0.0436838 -0.0503406 -0.116716 0.0645828 0.0636854 -0.0768889 -0.0768651 0.0248804 0.106363 0.118553 -0.060066 0.0836052 0.0287264 -0.0279207 0.0807696 0.112485 0.0396898 
-0.00450898 0.109479 -0.0494639 -0.00583216 -0.00415587 0.180619 -0.04734 -0.0729112 -0.0513531 0.0234225 0.0430155 0.0203106 0.047924 -0.21605 -0.0318582 0.046444 -0.212123 0.0603971 -0.00915742 0.08143 0.145779 -0.0732961 0.066651 0.0225396 -0.00379696 0.0364132 -0.0329636 -0.265976 0.0152116 0.107376 -0.013537 0.02333 0.0322755 0.0634913 0.132729 0.0113584 0.0461558 0.0369108 0.0527032 -0.120361 0.0081032 -0.230669 0.0611211 0.0919996 -0.0993537 0.00518408 0.218832 0.0238007 -0.231018 0.0453872 0.00334662 -0.0577849 0.0286468 0.0543694 0.11817 0.0478755 0.0517792 -0.0539795 -0.055542 -0.149126 -0.0341302 -0.0450439 0.191598 -0.0903806 0.139117 -0.0341214 -0.0591365 -0.0406008 -0.0494004 0.0616299 -0.112619 -0.0103483 -0.145864 -0.0713966 0.0583709 -0.0344455 -0.0568788 0.077002 0.0447848 0.120578 -0.0304913 0.0165389 -0.0385792 0.038864 -0.0791577 0.0744136 -0.0102375 0.0188984 0.0574759 0.135073 0.0810997 -0.101521 -0.0880268 0.010476 -0.153593 -0.0407609 -0.0546844 0.180493 0.0775415 -0.0733369 0.113181 0.0036741 -0.0505161 -0.0148359 0.0627695 0.0412629 0.0144218 0.144469 -0.0421778 0.00614495 -0.0675313 0.0471366 -0.0472522 -0.116772 0.0762299 0.0569947 -0.0758297 -0.0818748 0.0374537 0.114736 0.123549 -0.0608452 0.0788158 0.0201607 -0.00591971 0.0789626 0.13141 0.0399699 
-0.0109426 0.123538 -0.0462721 0.0177538 -0.00189547 0.182136 -0.040013 -0.0781109 -0.0443076 0.0386021 0.0506543 0.0279821 0.0412828 -0.227011 -0.0442398 0.0542988 -0.199402 0.0840635 -0.0150537 0.0833247 0.147253 -0.0964978 0.071531 0.0318003 0.00551744 0.0189425 -0.0435189 -0.252515 0.0245605 0.10972 -0.00857309 0.0329873 0.0353745 0.065197 0.124891 0.00202395 0.0416882 0.0324072 0.052584 -0.127844 0.00380618 -0.230443 0.0747543 0.0768679 -0.0987279 -0.0353171 0.218979 0.0187801 -0.218303 0.0568123 0.0248671 -0.0565174 0.0144834 0.0485493 0.112745 0.0532932 0.0546556 -0.0621889 -0.0539219 -0.145849 -0.0426231 -0.0485209 0.191254 -0.112278 0.144942 -0.0222489 -0.069151 -0.0651494 -0.0840755 0.0729873 -0.117212 0.00224362 -0.144628 -0.0472917 0.0487448 -0.0430069 -0.0316924 0.0828508 0.0378286 0.0979236 -0.0431031 0.015517 -0.0318311 0.0420356 -0.0674561 0.0732628 -0.0240283 0.0257009 0.0744935 0.131812 0.0696839 -0.1032 -0.0871464 0.0109557 -0.127148 -0.0429622 -0.0607607 0.189746 0.0608092 -0.0600168 0.110592 -0.00234254 -0.0526909 -0.00418449 0.0840032 0.0526111 0.0326092 0.131467 -0.0253392 0.00445066 -0.0956896 0.0539299 -0.0258174 -0.101335 0.0835389 0.0408462 -0.0511137 -0.0606774 0.047828 0.124449 0.116654 -0.0614127 0.0770285 0.0114309 -0.00516497 0.0859801 0.138219 0.0396782 
-0.0196892 0.127186 -0.0503621 0.0141988 -0.00408887 0.184691 -0.0439528 -0.071133 -0.0416302 0.0469137 0.054396 0.023002 0.0408191 -0.230381 -0.0539646 0.0612921 -0.201832 0.0880297 -0.0156786 0.0822381 0.151755 -0.105205 0.0720035 0.031717 0.00428123 0.0144267 -0.0413691 -0.246419 0.0332774 0.101779 -0.00734385 0.0187855 0.0340106 0.0581506 0.122124 0.00425578 0.0340877 0.0276924 0.051393 -0.12432 -0.00243252 -0.227339 0.0737184 0.0775264 -0.0923065 -0.0506281 0.218592 0.0224895 -0.218575 0.0590716 0.0190697 -0.0594011 0.00542383 0.0467223 0.104366 0.0550079 0.0542053 -0.0622869 -0.0571699 -0.147687 -0.0436297 -0.0440986 0.200697 -0.111333 0.144679 -0.0189776 -0.0739952 -0.0677985 -0.0854392 0.0703851 -0.11686 0.00702651 -0.141198 -0.0448812 0.0483604 -0.0461389 -0.0269316 0.0901166 0.0377916 0.0863824 -0.0439301 0.0124548 -0.0318484 0.0456986 -0.0735582 0.0823968 -0.0288669 0.0318841 0.0851095 0.126514 0.0692535 -0.102011 -0.0881628 0.0149115 -0.114042 -0.0447249 -0.0675385 0.193546 0.0493686 -0.0525083 0.111458 -0.00972755 -0.0574055 -0.0130174 0.0913479 0.0640988 0.0389501 0.123134 -0.023553 0.00337631 -0.102266 0.0548524 -0.011896 -0.0949538 0.0854244 0.0415568 -0.0469982 -0.0469292 0.049593 0.121234 0.107298 -0.0700159 0.0782969 0.00671236 -0.0146382 0.0936654 0.130871 0.0416333 
-0.0102425 0.126641 -0.0654571 0.00376111 -0.00938257 0.171004 -0.0555217 -0.0676169 -0.0593494 0.0609052 0.050455 0.0188719 0.0436963 -0.218899 -0.0532926 0.0644294 -0.182317 0.0837814 0.00181476 0.0918013 0.137482 -0.10398 0.0914572 0.0270079 -0.00766364 0.0314846 -0.0169922 -0.249228 0.0325945 0.0981655 -0.0256045 0.0189033 0.0467436 0.0552151 0.115977 0.000700279 0.0434633 0.0538012 0.0504733 -0.124522 -0.0270042 -0.227454 0.0628204 0.0771768 -0.0999242 -0.0209482 0.2234 0.0259581 -0.228991 0.0672417 0.0278744 -0.0404998 0.0066941 0.0529954 0.106387 0.0433441 0.0807327 -0.0709897 -0.0462027 -0.149842 -0.0354133 -0.050441 0.198156 -0.108513 0.144878 -0.0342035 -0.0822108 -0.0498797 -0.0741068 0.075833 -0.123798 -0.00423416 -0.150238 -0.0451453 0.0487605 -0.0494445 -0.0240306 0.102465 0.0441118 0.0824621 -0.0517493 0.00874181 -0.0425491 0.037288 -0.0662388 0.0687882 -0.0403096 0.0320875 0.0970051 0.126731 0.0620278 -0.0920231 -0.0854404 0.0180008 -0.102876 -0.0446609 -0.0529355 0.20447 0.0563175 -0.0681957 0.113563 0.00141009 -0.0574502 -0.00332899 0.0870098 0.0500106 0.0308755 0.117409 -0.0111482 -0.00481868 -0.0951332 0.0693077 -0.00151739 -0.0938325 0.0831605 0.0399665 -0.046543 -0.0724285 0.0498249 0.12008 0.102499 -0.0656627 0.0854562 0.00711285 -0.0112702 0.0845913 0.137363 0.0358174 
-0.0102425 0.126641 -0.0654571 0.00376111 -0.00938257 0.171004 -0.0555217 -0.0676169 -0.0593494 0.0609052 0.050455 0.0188719 0.0436963 -0.218899 -0.0532926 0.0644294 -0.182317 0.0837814 0.00181476 0.0918013 0.137482 -0.10398 0.0914572 0.0270079 -0.00766364 0.0314846 -0.0169922 -0.249228 0.0325945 0.0981655 -0.0256045 0.0189033 0.0467436 0.0552151 0.115977 0.000700279 0.0434633 0.0538012 0.0504733 -0.124522 -0.0270042 -0.227454 0.0628204 0.0771768 -0.0999242 -0.0209482 0.2234 0.0259581 -0.228991 0.0672417 0.0278744 -0.0404998 0.0066941 0.0529954 0.106387 0.0433441 0.0807327 -0.0709897 -0.0462027 -0.149842 -0.0354133 -0.050441 0.198156 -0.108513 0.144878 -0.0342035 -0.0822108 -0.0498797 -0.0741068 0.075833 -0.123798 -0.00423416 -0.150238 -0.0451453 0.0487605 -0.0494445 -0.0240306 0.102465 0.0441118 0.0824621 -0.0517493 0.00874181 -0.0425491 0.037288 -0.0662388 0.0687882 -0.0403096 0.0320875 0.0970051 0.126731 0.0620278 -0.0920231 -0.0854404 0.0180008 -0.102876 -0.0446609 -0.0529355 0.20447 0.0563175 -0.0681957 0.113563 0.00141009 -0.0574502 -0.00332899 0.0870098 0.0500106 0.0308755 0.117409 -0.0111482 -0.00481868 -0.0951332 0.0693077 -0.00151739 -0.0938325 0.0831605 0.0399665 -0.046543 -0.0724285 0.0498249 0.12008 0.102499 -0.0656627 0.0854562 0.00711285 -0.0112702 0.0845913 0.137363 0.0358174 
-0.0322669 0.148004 -0.045039 0.0095148 -0.00655972 0.18597 -0.0579442 -0.0775088 -0.0360468 0.0722946 0.0541782 0.0118897 0.0424436 -0.22621 -0.0456363 0.0679774 -0.1915 0.0955114 -0.0175343 0.0778125 0.137282 -0.10954 0.0772613 0.0342356 0.00587535 0.00989624 -0.0392889 -0.229906 0.0379849 0.092705 0.00265613 0.0155218 0.0389653 0.0530983 0.125281 0.0125013 0.0411718 0.02788 0.0546069 -0.125415 -0.016788 -0.230587 0.0745177 0.0638262 -0.0852764 -0.0509397 0.214491 0.0390782 -0.218251 0.0634989 0.027044 -0.0510467 0.00242667 0.0385516 0.0974592 0.0562608 0.0570826 -0.0737114 -0.052303 -0.153098 -0.0519249 -0.0383983 0.191947 -0.11997 0.143029 -0.00731392 -0.0795283 -0.0583795 -0.0991195 0.0759739 -0.114523 0.0103318 -0.143802 -0.0459022 0.0529651 -0.0469326 -0.022882 0.0992383 0.0475767 0.073212 -0.0418154 0.0126153 -0.034159 0.0527594 -0.070659 0.0783581 -0.0441531 0.0383245 0.101637 0.134543 0.0563426 -0.0955318 -0.0728792 0.0244311 -0.105518 -0.0438128 -0.0732006 0.199085 0.0380344 -0.056292 0.12069 -0.0125413 -0.0668434 -0.02045 0.102974 0.0706853 0.0408962 0.100585 -0.00805007 0.0106242 -0.110159 0.0659843 0.00540092 -0.0806386 0.0828158 0.0323247 -0.0497674 -0.0348543 0.0457652 0.12118 0.108762 -0.076871 0.0809199 0.00428682 -0.0158678 0.0983689 0.128899 0.0378709 
-0.028131 0.138455 -0.0486096 0.00490304 -0.0160613 0.176813 -0.0567852 -0.0735688 -0.0372685 0.078632 0.0471704 0.0160753 0.0334551 -0.239666 -0.0562189 0.0668684 -0.203342 0.0874811 -0.00515178 0.0794297 0.132208 -0.0990531 0.0812493 0.0231952 -0.0119574 0.0366657 -0.0311316 -0.246428 0.0357622 0.0880873 -0.0117915 0.00797012 0.0361414 0.0439179 0.136393 0.00276149 0.0452959 0.0508258 0.0577077 -0.123516 -0.0289615 -0.225696 0.0525614 0.0708913 -0.0911038 -0.0425252 0.213035 0.0356686 -0.2101 0.0684725 0.0308856 -0.0357229 0.000747831 0.049249 0.108268 0.0420933 0.0811528 -0.0822642 -0.0554753 -0.155914 -0.0368068 -0.0539282 0.199194 -0.10449 0.148666 -0.0377844 -0.0752905 -0.0539433 -0.0741327 0.0777769 -0.117869 0.00959291 -0.13711 -0.0355472 0.0404809 -0.0566544 -0.0359146 0.109024 0.0528857 0.0786925 -0.0384772 0.016927 -0.0344792 0.0524338 -0.0612735 0.0531681 -0.0388504 0.0513816 0.113151 0.125065 0.0527204 -0.0812515 -0.0700593 0.022665 -0.108637 -0.0541046 -0.0541462 0.196302 0.046982 -0.0597374 0.124736 -0.000869289 -0.068834 -0.0267435 0.105583 0.0500242 0.0473512 0.0940063 -0.00128198 0.0239536 -0.0998902 0.0733851 0.00676108 -0.0875475 0.085162 0.0386708 -0.0451531 -0.0522106 0.0354669 0.10345 0.104083 -0.0663077 0.0951816 -0.00434284 -0.0107363 0.0943238 0.137172 0.0413539 
-0.0414781 0.136201 -0.0526393 0.00540004 -0.0101034 0.173148 -0.0512445 -0.0728431 -0.0351237 0.0901377 0.0424115 0.0147412 0.0276823 -0.241741 -0.059308 0.0623563 -0.208914 0.0986326 0.000552663 0.072841 0.127741 -0.116031 0.0812192 0.00823689 -0.00659745 0.0358057 -0.0394632 -0.248273 0.0345867 0.077557 -0.00474951 0.0134218 0.032041 0.0348944 0.142997 0.00124411 0.0377767 0.0463967 0.0609586 -0.131416 -0.0181579 -0.226297 0.0498814 0.0722582 -0.0954888 -0.0450128 0.206312 0.0382531 -0.206605 0.0539927 0.0183548 -0.0378494 -0.000553138 0.0398327 0.0984512 0.0454581 0.083504 -0.0846306 -0.0613254 -0.149856 -0.0324501 -0.0523672 0.200137 -0.100411 0.159778 -0.0310165 -0.0826623 -0.053144 -0.0692528 0.0801419 -0.115134 0.0185227 -0.132693 -0.0342903 0.0319055 -0.0586069 -0.0392405 0.109706 0.0495849 0.0638741 -0.0567072 0.018113 -0.03718 0.057674 -0.0706426 0.0521702 -0.0340124 0.060865 0.118725 0.111857 0.0544462 -0.0701085 -0.0633127 0.0113245 -0.101535 -0.0600825 -0.0543172 0.197416 0.0394095 -0.056571 0.123175 -0.00881081 -0.0687599 -0.0352814 0.121363 0.0530276 0.057378 0.0966954 0.00357173 0.0317582 -0.109362 0.0680245 0.00977052 -0.0892658 0.0895936 0.0318814 -0.0417925 -0.0503357 0.0466245 0.100631 0.102251 -0.0684405 0.0885982 -0.00414835 -0.0148166 0.0918564 0.128113 0.0452105 
-0.0376918 0.127329 -0.0673415 -0.00256269 -0.0128024 0.162084 -0.0514625 -0.0725033 -0.038344 0.0978945 0.0372573 0.0124273 0.026845 -0.236442 -0.0672161 0.0580279 -0.203116 0.100945 0.0163549 0.0766988 0.118859 -0.115454 0.0854082 0.00241155 -0.0173596 0.0545884 -0.0283064 -0.254465 0.036083 0.0749952 -0.0157742 0.0124216 0.0340515 0.0251582 0.149941 -0.00676746 0.0422041 0.0659798 0.0638753 -0.139324 -0.0301521 -0.218411 0.0385309 0.0813109 -0.102537 -0.0363584 0.204942 0.0428076 -0.200495 0.0552479 0.0120015 -0.0287712 0.00591258 0.0437386 0.101692 0.037863 0.102074 -0.085071 -0.0592527 -0.157373 -0.0232943 -0.0590832 0.211304 -0.0904742 0.156946 -0.0388022 -0.0836735 -0.0472615 -0.0524341 0.0770546 -0.118324 0.0115589 -0.131574 -0.0288234 0.0219774 -0.0682373 -0.0446692 0.111872 0.0549759 0.0558916 -0.060311 0.0262143 -0.0450035 0.0499041 -0.0604691 0.0350091 -0.0370428 0.0688412 0.135361 0.102442 0.0582806 -0.0562504 -0.0574563 0.00324641 -0.0885552 -0.0682417 -0.0423024 0.204697 0.0433632 -0.065291 0.126398 -0.0022025 -0.0634963 -0.0388982 0.116332 0.0433102 0.0611242 0.0865152 0.0126366 0.0386498 -0.0977447 0.0745518 0.0140989 -0.0918159 0.0887883 0.0323955 -0.0358834 -0.0692123 0.0467359 0.0861709 0.097629 -0.0665179 0.096511 -0.00866087 -0.0239081 0.0845322 0.127978 0.0467869 
-0.0150972 0.0962 -0.0525081 -0.0229259 -0.028045 0.128839 -0.0411647 -0.0472591 -0.0446576 0.0325291 0.0266363 -0.00404603 0.0454785 -0.218856 -0.0377961 0.0240385 -0.225918 0.019148 0.0143091 0.102225 0.13245 -0.100543 0.0610699 -0.0140376 -0.0195966 0.0743769 -0.0322708 -0.274146 0.0198772 0.080642 -0.0230118 -0.00966463 0.041053 0.0390295 0.145838 -0.0107872 0.0548238 0.101989 0.0537935 -0.145324 -0.00643372 -0.229017 0.0344395 0.10562 -0.0933254 0.0284717 0.203121 0.0269706 -0.210028 0.0423891 -0.0448395 -0.0382259 0.039294 0.0669036 0.134522 0.0192445 0.0644687 -0.0802271 -0.0574359 -0.180808 -0.00642785 -0.0722519 0.187884 -0.0440296 0.126528 -0.0397556 -0.0460037 -0.0360407 0.00308815 0.00929463 -0.117935 -0.0301213 -0.135606 -0.0602448 0.0593189 -0.0553754 -0.0710465 0.0855826 0.0823573 0.148525 -0.0498129 0.00168397 -0.0481802 0.0385134 -0.0427159 0.0332337 -0.0104555 0.059323 0.112982 0.0993417 0.0823369 -0.0681347 -0.0580112 -0.00772391 -0.165606 -0.0800537 -0.0195439 0.181252 0.0815909 -0.101973 0.109178 0.0144108 -0.0398773 -0.0378607 0.0530807 0.0288139 0.0378176 0.154199 -0.00410772 0.0182762 -0.0487482 0.0524023 -0.0734277 -0.118793 0.0748739 0.0641121 -0.0745904 -0.110839 0.024997 0.0773698 0.0892675 -0.0352825 0.0815924 0.0279204 -0.0117747 0.056941 0.140559 0.0496026 
-0.014265 0.0963176 -0.0495595 -0.00762205 -0.0237176 0.141717 -0.0412639 -0.050035 -0.0382051 0.0299689 0.027539 0.00567732 0.0405058 -0.230272 -0.0428369 0.026441 -0.224832 0.0319895 0.00587543 0.100424 0.137786 -0.107306 0.0640323 -0.010011 -0.0144584 0.059694 -0.0435012 -0.275656 0.011957 0.0817036 -0.0119375 0.00340712 0.0386326 0.0448076 0.145332 -0.00759556 0.0525442 0.0873449 0.0536517 -0.148532 -0.00129005 -0.231036 0.0372832 0.0952943 -0.0937219 0.00677385 0.202382 0.0255589 -0.203938 0.0501257 -0.0327453 -0.039447 0.0360969 0.064568 0.132694 0.0208906 0.0673987 -0.0867836 -0.0609549 -0.176646 -0.0120349 -0.066645 0.185322 -0.0616949 0.133227 -0.039747 -0.0477051 -0.042414 -0.0157107 0.0240793 -0.11804 -0.0217354 -0.136769 -0.0531698 0.050835 -0.0543078 -0.062388 0.0836653 0.0743556 0.144364 -0.0557629 0.00222603 -0.0428421 0.0417271 -0.045251 0.0406339 -0.0122138 0.0598667 0.11008 0.101915 0.0794104 -0.0737365 -0.0606661 -0.00506784 -0.160943 -0.0762975 -0.0250706 0.181096 0.068753 -0.0905806 0.114478 0.0102897 -0.0469869 -0.0334617 0.0712136 0.0327535 0.0424974 0.148187 -0.00746033 0.0247078 -0.0675011 0.0513665 -0.0657903 -0.116154 0.0786926 0.0593403 -0.0655344 -0.0994978 0.0342372 0.0880916 0.0934457 -0.0366201 0.0843981 0.0226714 -0.00354822 0.0591236 0.146895 0.0512038 
-0.00917726 0.0971034 -0.0650612 -0.0145938 -0.0350624 0.129623 -0.036873 -0.0432058 -0.0489793 0.0471091 0.0336072 -0.000406845 0.0463794 -0.225008 -0.0505489 0.0248336 -0.213432 0.028549 0.0209934 0.103243 0.126394 -0.110712 0.0622688 -0.0196445 -0.0276356 0.0777083 -0.0312315 -0.272791 0.0243344 0.0779711 -0.0298003 0.00385205 0.0420256 0.0356139 0.139349 -0.0197324 0.0571433 0.107117 0.0603411 -0.148549 -0.0124303 -0.231829 0.0252513 0.096561 -0.0979727 0.014179 0.198348 0.0261041 -0.206216 0.0437348 -0.0361027 -0.0220688 0.0339645 0.0707817 0.126124 0.0144192 0.0820593 -0.0930825 -0.0593972 -0.176671 -0.00606625 -0.0758409 0.192279 -0.0534094 0.126098 -0.0377524 -0.0449236 -0.0399621 -0.000719749 0.010017 -0.125444 -0.0327944 -0.137978 -0.0440737 0.0538551 -0.0617521 -0.0605445 0.0893715 0.0779227 0.13844 -0.0611397 -0.00144613 -0.0458555 0.035893 -0.03338 0.0347313 -0.0158251 0.0600306 0.124481 0.0914782 0.0784079 -0.0641025 -0.0571661 -0.00357908 -0.153729 -0.089165 -0.0125759 0.183571 0.0748517 -0.0981665 0.115507 0.0170353 -0.0405771 -0.0275623 0.0687192 0.0294276 0.0515158 0.152029 0.0022112 0.0204328 -0.0615044 0.0557781 -0.0598539 -0.117513 0.0782857 0.0549345 -0.0646989 -0.111506 0.0369917 0.0742628 0.0819348 -0.0431537 0.0891732 0.0219622 -0.00546113 0.0560165 0.143241 0.0533971 
-0.0162511 0.0908007 -0.0607946 0.00362285 -0.0350709 0.135355 -0.0375885 -0.0507632 -0.0425294 0.0506349 0.0380272 -0.00311974 0.0477244 -0.210873 -0.0418168 0.0160646 -0.206534 0.0401312 0.0259401 0.098688 0.122615 -0.134579 0.0704348 2.45595e-05 -0.0105786 0.0645901 -0.0362263 -0.271473 0.0235536 0.0701253 -0.0100422 0.0166904 0.0432403 0.0345634 0.132542 -0.00856055 0.0494829 0.0995163 0.0497389 -0.163139 0.0013086 -0.238397 0.0220848 0.0902883 -0.10552 -0.00373029 0.193661 0.0330294 -0.198219 0.0321597 -0.0392197 -0.0271257 0.0524239 0.0563495 0.125864 0.0280236 0.0776378 -0.0849539 -0.04888 -0.184553 -0.0191212 -0.0623976 0.188716 -0.0654094 0.127426 0.000476173 -0.0407523 -0.0484147 -0.0166528 0.0242133 -0.136474 -0.025135 -0.143113 -0.0408672 0.0603812 -0.0691129 -0.0521972 0.0854467 0.0779263 0.1317 -0.0745629 -0.00384534 -0.0509063 0.0174806 -0.0301962 0.0351428 -0.0184926 0.0624058 0.119106 0.0901219 0.0882154 -0.0575214 -0.0424099 -0.0145882 -0.148136 -0.0907827 -0.0230049 0.190875 0.0802192 -0.0986331 0.12208 0.00767036 -0.0329951 -0.0342055 0.0783502 0.0416519 0.0564258 0.13941 0.0123513 0.0168413 -0.0740961 0.0683356 -0.0492585 -0.127655 0.0861002 0.047933 -0.0602769 -0.108098 0.053634 0.0869102 0.0876597 -0.0566557 0.0729547 0.0226622 -0.0179755 0.0679381 0.139316 0.06201 
-0.0330974 0.0833804 -0.0538745 0.00571923 -0.0142909 0.14404 -0.0606281 -0.0637547 -0.0400474 0.0437678 0.0311151 -0.00190469 0.0414478 -0.190711 -0.0227384 0.0338839 -0.196341 0.0507785 0.0337308 0.0765583 0.136491 -0.131383 0.0891807 0.0131928 0.0150944 0.0576462 -0.0309089 -0.284516 0.0150005 0.0698975 0.0204071 0.0239668 0.0523731 0.0327458 0.135495 0.0181906 0.0393616 0.0764804 0.049341 -0.158604 0.00547937 -0.22707 0.0287611 0.0895578 -0.097449 0.0124052 0.202076 0.0284361 -0.20773 0.00539302 -0.0349659 -0.0481791 0.0706078 0.0326669 0.118964 0.0494469 0.0825651 -0.0629842 -0.043384 -0.175802 -0.0266618 -0.0461017 0.178816 -0.075037 0.149411 0.00537968 -0.0571072 -0.0257563 -0.0187998 0.056039 -0.130125 -0.0106915 -0.15943 -0.0813562 0.0612104 -0.0537958 -0.062917 0.092402 0.0617913 0.121805 -0.0840955 0.0119086 -0.0546605 0.0180565 -0.059403 0.043465 -0.0129958 0.0546491 0.080897 0.089828 0.0860306 -0.0527468 -0.049564 -0.0124063 -0.135046 -0.0595873 -0.0387218 0.201449 0.07383 -0.0892633 0.119362 -0.0126988 -0.0445336 -0.0413309 0.0833708 0.0420643 0.037841 0.117029 0.00428512 0.00574003 -0.0910739 0.0628393 -0.0441588 -0.139268 0.101093 0.055864 -0.0798459 -0.113526 0.0553873 0.108782 0.107923 -0.0563158 0.058421 0.0178129 -0.0256225 0.0829521 0.126965 0.0633971 
-0.0330974 0.0833804 -0.0538745 0.00571923 -0.0142909 0.14404 -0.0606281 -0.0637547 -0.0400474 0.0437678 0.0311151 -0.00190469 0.0414478 -0.190711 -0.0227384 0.0338839 -0.196341 0.0507785 0.0337308 0.0765583 0.136491 -0.131383 0.0891807 0.0131928 0.0150944 0.0576462 -0.0309089 -0.284516 0.0150005 0.0698975 0.0204071 0.0239668 0.0523731 0.0327458 0.135495 0.0181906 0.0393616 0.0764804 0.049341 -0.158604 0.00547937 -0.22707 0.0287611 0.0895578 -0.097449 0.0124052 0.202076 0.0284361 -0.20773 0.00539302 -0.0349659 -0.0481791 0.0706078 0.0326669 0.118964 0.0494469 0.0825651 -0.0629842 -0.043384 -0.175802 -0.0266618 -0.0461017 0.178816 -0.075037 0.149411 0.00537968 -0.0571072 -0.0257563 -0.0187998 0.056039 -0.130125 -0.0106915 -0.15943 -0.0813562 0.0612104 -0.0537958 -0.062917 0.092402 0.0617913 0.121805 -0.0840955 0.0119086 -0.0546605 0.0180565 -0.059403 0.043465 -0.0129958 0.0546491 0.080897 0.089828 0.0860306 -0.0527468 -0.049564 -0.0124063 -0.135046 -0.0595873 -0.0387218 0.201449 0.07383 -0.0892633 0.119362 -0.0126988 -0.0445336 -0.0413309 0.0833708 0.0420643 0.037841 0.117029 0.00428512 0.00574003 -0.0910739 0.0628393 -0.0441588 -0.139268 0.101093 0.055864 -0.0798459 -0.113526 0.0553873 0.108782 0.107923 -0.0563158 0.058421 0.0178129 -0.0256225 0.0829521 0.126965 0.0633971 
-0.0200643 0.0708345 -0.0519104 0.0113763 -0.00498183 0.157707 -0.0553712 -0.0667768 -0.0342406 0.0277714 0.0329187 0.0130562 0.0326436 -0.193779 -0.0171335 0.023737 -0.196892 0.0603317 0.0302498 0.0714137 0.132485 -0.10824 0.0984241 0.0220275 0.014292 0.0530568 -0.0196281 -0.29274 0.00215834 0.0703382 0.0245863 0.0260914 0.0523362 0.0446021 0.139029 0.018165 0.0424346 0.0704327 0.0426658 -0.152595 0.0186753 -0.219849 0.0226165 0.0980443 -0.120946 0.002163 0.197624 0.0232744 -0.198424 0.020257 -0.0239729 -0.0510699 0.0707262 0.0358658 0.121807 0.0509218 0.0855694 -0.0509501 -0.0489716 -0.16563 -0.0390619 -0.0512375 0.186086 -0.0863818 0.156398 -0.00969014 -0.0542451 -0.0315915 -0.0259095 0.0829142 -0.128286 -0.00730295 -0.157918 -0.074538 0.0519708 -0.0573969 -0.067938 0.0840321 0.050282 0.118618 -0.0828755 0.019842 -0.0478402 0.0120521 -0.0573989 0.0351701 -0.0042111 0.0490736 0.0635648 0.0967744 0.0953228 -0.0618984 -0.0585183 -0.0197372 -0.129067 -0.0584762 -0.0422744 0.196257 0.0775597 -0.0836315 0.11456 -0.00933479 -0.0409629 -0.0382106 0.085444 0.0311952 0.0336789 0.107854 -0.00293646 0.00771157 -0.084811 0.0671798 -0.0389266 -0.138196 0.103993 0.0528093 -0.067001 -0.123048 0.0645273 0.119125 0.127507 -0.0550576 0.057367 0.018596 -0.0170611 0.0746775 0.138258 0.0687385 
-0.0210133 0.0694514 -0.0434546 0.0131027 -0.00719628 0.157652 -0.0561278 -0.0629814 -0.0236639 0.0214365 0.0336052 0.00864536 0.0370145 -0.192216 -0.00691779 0.0162333 -0.200604 0.0493438 0.0202242 0.0706425 0.134574 -0.1112 0.0997199 0.0275555 0.0214058 0.0447755 -0.0239235 -0.29532 -0.00291698 0.0655042 0.0410682 0.0223056 0.0526776 0.0491928 0.135633 0.023876 0.0377572 0.0753534 0.032859 -0.152683 0.0239352 -0.223072 0.0130614 0.103092 -0.118821 0.00254201 0.188782 0.0261125 -0.192468 0.0185237 -0.0277641 -0.0511655 0.0737982 0.0289132 0.123147 0.0517041 0.0709817 -0.0463065 -0.0445516 -0.170656 -0.046416 -0.0540689 0.178269 -0.0847894 0.153957 -0.00901542 -0.0467034 -0.0258883 -0.0269778 0.0842608 -0.125509 -0.00538585 -0.157989 -0.0824418 0.0538207 -0.0576598 -0.071922 0.0817694 0.0514313 0.137028 -0.0867143 0.00997101 -0.0480283 0.00811252 -0.0582974 0.0295752 0.00367776 0.0481495 0.0592702 0.0955195 0.094624 -0.0673811 -0.0536273 -0.023402 -0.139288 -0.0609707 -0.0448171 0.185885 0.0795415 -0.0860496 0.114289 -0.00806614 -0.042042 -0.0402684 0.0810145 0.0294073 0.0277349 0.109674 0.00391533 0.00408102 -0.0832288 0.0717281 -0.0522249 -0.137634 0.107069 0.0572239 -0.0733056 -0.123488 0.0652382 0.127418 0.128162 -0.049449 0.0463193 0.0305209 -0.0102814 0.0708127 0.140672 0.0710647 
-0.0243528 0.0709684 -0.0337276 0.0142153 0.00479816 0.162116 -0.058279 -0.0611489 -0.013696 0.0162663 0.0311424 0.011434 0.0322086 -0.197923 -0.000692766 0.0196514 -0.196025 0.0626098 0.00442588 0.0597389 0.143676 -0.102922 0.0982124 0.0256241 0.0275763 0.0394629 -0.0320511 -0.298103 -0.00505719 0.0619708 0.0565635 0.0390117 0.0516 0.0577348 0.139095 0.0249227 0.0372212 0.0694302 0.0354318 -0.148686 0.0390218 -0.216702 0.0112754 0.101119 -0.116623 0.00274315 0.184436 0.0196477 -0.193828 0.0055989 -0.0241462 -0.0522186 0.0706316 0.0215997 0.112162 0.0576565 0.0710559 -0.0488996 -0.0459824 -0.168501 -0.0491692 -0.0558866 0.165379 -0.0857709 0.156864 -0.0182087 -0.0454534 -0.0181844 -0.0245988 0.100302 -0.117542 -0.00493072 -0.1578 -0.0937427 0.0469349 -0.05503 -0.0838405 0.0844847 0.0382675 0.130578 -0.0946128 0.0298476 -0.0424072 0.0127887 -0.0611198 0.032618 0.0156209 0.0474547 0.0427103 0.0942001 0.0931655 -0.0707333 -0.0623554 -0.0264592 -0.137103 -0.0527466 -0.0494711 0.181182 0.0679029 -0.0805571 0.110587 -0.015078 -0.0452311 -0.0278561 0.0885489 0.020995 0.0210737 0.107892 0.00183922 0.000451495 -0.0921864 0.0668927 -0.0649867 -0.136398 0.114302 0.0507507 -0.0862168 -0.137514 0.0698709 0.129008 0.14177 -0.0342694 0.0407438 0.0347927 -0.000575028 0.0626282 0.138618 0.0679712 
-0.0207752 0.062834 -0.0276393 0.00744124 -0.00155535 0.172624 -0.0669162 -0.053762 -0.0119839 0.00508111 0.0308436 0.0139868 0.0319196 -0.195047 0.00345234 0.0113021 -0.195807 0.0552942 0.00563929 0.0518015 0.147037 -0.095213 0.104648 0.0353299 0.0293519 0.0394601 -0.0195237 -0.304415 -0.0166465 0.0556338 0.0696928 0.021998 0.0509415 0.0642162 0.133852 0.0283781 0.0300071 0.0726675 0.0343354 -0.133209 0.0331082 -0.211399 -0.00478153 0.104536 -0.115503 -0.00464549 0.177798 0.0126019 -0.192574 0.0147589 -0.0194246 -0.0518905 0.073192 0.0223044 0.105151 0.0595385 0.0732507 -0.0349836 -0.0464676 -0.168537 -0.0522636 -0.055624 0.167297 -0.0921942 0.157625 -0.0332629 -0.0376247 -0.0107767 -0.024938 0.114642 -0.114672 -0.00494291 -0.164251 -0.098997 0.0439638 -0.0581012 -0.0879894 0.0792341 0.0361708 0.145212 -0.105338 0.0234456 -0.0343089 0.00869841 -0.0678703 0.0243995 0.0259475 0.0406864 0.0364981 0.0876585 0.0887475 -0.0794856 -0.0555352 -0.021383 -0.132344 -0.0509914 -0.0508068 0.17505 0.0634545 -0.0755936 0.104445 -0.0111604 -0.0576835 -0.0216152 0.0907639 0.0155132 0.0123934 0.0955872 -0.0064369 -0.00941342 -0.0903137 0.070127 -0.0649093 -0.132362 0.117032 0.0598774 -0.0873097 -0.140895 0.0733572 0.137108 0.145633 -0.0351025 0.0336352 0.0325489 0.00601151 0.0594686 0.141742 0.0726074 
-0.0189545 0.0671965 -0.0268922 0.0105964 0.00792777 0.179323 -0.0656659 -0.0604702 -0.00817697 0.0037203 0.0246321 0.0151091 0.0286783 -0.202009 0.00575645 0.0150421 -0.196931 0.0591308 -0.00121032 0.0531567 0.149126 -0.0900871 0.101866 0.0363371 0.0319424 0.0291546 -0.0303492 -0.303206 -0.0194505 0.0610997 0.0730338 0.0263248 0.044907 0.0656126 0.142071 0.031209 0.0336773 0.0594944 0.0342698 -0.138945 0.0355683 -0.209862 0.00545065 0.10133 -0.112747 -0.00262306 0.180066 0.0202995 -0.188771 0.0217287 -0.013978 -0.0571478 0.0724175 0.0186829 0.109737 0.0569977 0.0674958 -0.0387964 -0.0462501 -0.168815 -0.0517347 -0.0491849 0.162517 -0.0976235 0.157455 -0.0370072 -0.0411598 -0.0123608 -0.0320647 0.115933 -0.110374 0.000873247 -0.161946 -0.101074 0.0373849 -0.0535146 -0.0866011 0.079289 0.0381446 0.144632 -0.0935434 0.0289137 -0.0357511 0.0149262 -0.0650647 0.0264104 0.0206225 0.0419692 0.0348193 0.0977603 0.0891425 -0.0797883 -0.060309 -0.0206412 -0.135851 -0.0470329 -0.0527487 0.174609 0.0573408 -0.0741715 0.110755 -0.0119767 -0.0588301 -0.0269138 0.0884997 0.0159468 0.0108252 0.0937319 -0.00964397 0.00548353 -0.0892362 0.0665632 -0.0643544 -0.129454 0.112991 0.0588676 -0.0871087 -0.132737 0.0652281 0.138278 0.148338 -0.0312953 0.0398077 0.0330565 0.00524896 0.0577734 0.142884 0.0665878 
-0.0318885 0.0613978 -0.0200573 0.00250044 0.00830994 0.181141 -0.0827578 -0.0556415 -0.0040187 -0.00752219 0.0140327 0.0235974 0.0247261 -0.199592 -0.00331285 0.0216261 -0.191995 0.0540222 -0.000238524 0.0477461 0.161699 -0.0877868 0.107621 0.0524495 0.034134 0.0357808 -0.0186719 -0.310028 -0.0254271 0.057852 0.0869693 0.0093417 0.0485092 0.0694021 0.134208 0.0363497 0.0275887 0.0642378 0.0323859 -0.120711 0.0272776 -0.19481 0.00724019 0.101064 -0.0955511 -0.0106808 0.188913 0.00703423 -0.186411 0.0235508 -0.00602251 -0.0717423 0.0727404 0.0166036 0.110096 0.0658752 0.0738858 -0.0221247 -0.0408854 -0.175144 -0.0469582 -0.0471189 0.160843 -0.100813 0.162944 -0.0602018 -0.0429619 -0.00532298 -0.0292901 0.128159 -0.107899 0.00455216 -0.170141 -0.106985 0.0359704 -0.0495531 -0.0887857 0.0924331 0.0340012 0.143136 -0.107276 0.0376245 -0.0255804 0.0211203 -0.077839 0.019327 0.0306694 0.0468437 0.0305668 0.0829012 0.0739908 -0.0852137 -0.0523188 -0.0154065 -0.118182 -0.0298032 -0.0553492 0.178714 0.0453795 -0.064525 0.0969215 -0.018013 -0.0763106 -0.0116398 0.0884795 0.00745748 -0.00606507 0.0745975 -0.0232959 -0.00773641 -0.096865 0.0689405 -0.0643786 -0.121315 0.113111 0.0702439 -0.0906241 -0.139221 0.0566148 0.145424 0.14755 -0.0161717 0.0335122 0.0205441 -0.00567022 0.0613757 0.129323 0.0652839 
-0.0353969 0.0624672 -0.0112366 0.00128969 0.0039521 0.184676 -0.0909889 -0.046528 -0.00382528 -0.0102232 0.0109653 0.0236599 0.0237847 -0.203504 7.31665e-05 0.0242743 -0.190012 0.0477905 -0.00605506 0.0470756 0.163097 -0.087294 0.114136 0.0607776 0.0340475 0.0320235 -0.0176833 -0.312329 -0.0290478 0.0467046 0.0974287 0.00496511 0.0479312 0.0766168 0.122125 0.0402553 0.0227636 0.0663733 0.0271067 -0.104238 0.026136 -0.193007 0.000752397 0.0964573 -0.0880929 -0.0144768 0.189879 0.00173958 -0.18722 0.0309999 0.00139961 -0.0730072 0.0660045 0.0152793 0.104073 0.0664959 0.0785327 -0.020419 -0.0327873 -0.175722 -0.0485583 -0.0428658 0.151065 -0.104207 0.161152 -0.0721902 -0.0375652 -0.00173723 -0.0299666 0.137315 -0.106675 0.00968264 -0.172156 -0.100793 0.0397542 -0.0522645 -0.0900573 0.0993223 0.0312361 0.147383 -0.113802 0.035801 -0.0206217 0.0216802 -0.082486 0.02235 0.0359701 0.0451231 0.0251985 0.0758537 0.0658989 -0.0874187 -0.0493541 -0.0129749 -0.114224 -0.0219957 -0.05643 0.17637 0.0366056 -0.0597367 0.0876692 -0.0220753 -0.0852288 0.000463222 0.0915466 0.00403691 -0.0158522 0.0702938 -0.0250382 -0.015616 -0.103638 0.0776378 -0.063734 -0.118069 0.113035 0.0717252 -0.0908031 -0.143208 0.0560746 0.152723 0.147713 -0.00688325 0.0301065 0.0217971 -0.00579939 0.0573422 0.125547 0.0655951 
-0.024903 0.0626563 -0.00870733 0.00419719 0.00101667 0.194202 -0.0873882 -0.0419524 -0.0014794 -0.0192735 0.0141895 0.0282739 0.0242411 -0.206117 0.00902439 0.0140812 -0.192585 0.0378044 -0.0181599 0.045829 0.151761 -0.0781808 0.111241 0.06577 0.0342458 0.0209977 -0.00908518 -0.305929 -0.0473048 0.0417319 0.0973573 0.00511442 0.0449556 0.0913428 0.112792 0.0410821 0.0291073 0.055862 0.0145861 -0.0977379 0.0388016 -0.202355 0.00330703 0.0992282 -0.0953645 -0.0122737 0.18668 0.00182504 -0.18996 0.0458854 0.0126555 -0.079563 0.0587966 0.0190472 0.108461 0.0661404 0.0582962 -0.0182628 -0.0276274 -0.171722 -0.055988 -0.0431541 0.142716 -0.111702 0.15898 -0.0715441 -0.0322836 -0.00205622 -0.0390837 0.145392 -0.106225 0.00818827 -0.166701 -0.09974 0.0453281 -0.048515 -0.0856969 0.0931862 0.0274671 0.153553 -0.108789 0.0251189 -0.0185989 0.0163283 -0.0869393 0.0270916 0.0418449 0.0333361 0.0146526 0.089982 0.0663637 -0.10521 -0.054072 -0.0168255 -0.126129 -0.0152221 -0.0563404 0.159815 0.0435611 -0.0606328 0.081074 -0.0178152 -0.0822365 0.0043287 0.0870057 0.000580366 -0.0305798 0.0786419 -0.0454538 -0.0200288 -0.095991 0.0827299 -0.0629939 -0.116451 0.107259 0.0624801 -0.0885036 -0.140011 0.06181 0.159169 0.15733 -0.0067736 0.0304459 0.0341748 0.0140213 0.0467534 0.132349 0.0612554 
-0.0337891 0.0615557 -0.0217596 -0.00809793 -0.000730415 0.184395 -0.0894445 -0.0454824 -0.00647616 -5.11102e-05 0.0154428 0.0202958 0.0321315 -0.20511 -0.00792462 0.0228627 -0.199619 0.0502654 -0.00437512 0.0521949 0.164257 -0.0921133 0.110405 0.054923 0.0250913 0.0396098 -0.0178781 -0.311224 -0.0245493 0.0499031 0.086195 -0.00200014 0.0438519 0.0707041 0.126507 0.0359186 0.0217334 0.0694426 0.0337074 -0.110939 0.0170352 -0.198618 -0.00136458 0.101404 -0.0899017 -0.0246454 0.186667 0.0143887 -0.185403 0.0365075 -0.00538483 -0.0728486 0.0634262 0.0214214 0.104533 0.0601944 0.079678 -0.0244489 -0.0380414 -0.184391 -0.0435114 -0.043274 0.164564 -0.0941131 0.151546 -0.0665242 -0.0389363 0.000844311 -0.0234496 0.121233 -0.110224 0.00674613 -0.169216 -0.0990256 0.0366994 -0.0567424 -0.0913747 0.0933731 0.0416554 0.150374 -0.104451 0.0310278 -0.0225009 0.021571 -0.0814656 0.0219437 0.0324313 0.0517665 0.0466167 0.0767714 0.070289 -0.085103 -0.0454953 -0.00959411 -0.121405 -0.0332039 -0.0595544 0.180689 0.0367799 -0.0650047 0.101339 -0.0193118 -0.0830437 -0.00926985 0.0939129 0.00807226 -0.0104763 0.0728686 -0.0226213 -0.00658867 -0.0970415 0.0781781 -0.0606429 -0.115279 0.109073 0.0764068 -0.0880899 -0.133723 0.0520811 0.142801 0.141338 -0.0183926 0.0374814 0.0190083 -0.0157272 0.0577566 0.122568 0.0696429 
-0.0286671 0.0554371 -0.0211658 -0.0133541 -0.00440699 0.183962 -0.0920191 -0.0372458 -0.00696148 -0.00869171 0.0143368 0.0241667 0.0272868 -0.200889 0.00281317 0.00130135 -0.195787 0.0408696 -0.000424579 0.0499749 0.144411 -0.0785908 0.116565 0.0631438 0.0214555 0.0425014 0.00720367 -0.31028 -0.0374124 0.0358479 0.089774 -0.0120636 0.0501816 0.0775148 0.118248 0.0364028 0.0277524 0.0724577 0.0147213 -0.100538 0.0293419 -0.199832 -0.0145436 0.119075 -0.10908 -0.0112603 0.183578 0.0141414 -0.184198 0.0455356 -0.00188067 -0.0681116 0.0630661 0.0200239 0.106884 0.060753 0.072647 -0.0151165 -0.0295984 -0.183062 -0.050925 -0.0485241 0.161636 -0.0901451 0.149824 -0.0797889 -0.0295466 -7.67481e-05 -0.0191337 0.139564 -0.112981 -0.00235823 -0.16573 -0.0969865 0.043248 -0.0613395 -0.098868 0.0973992 0.0401395 0.152266 -0.112664 0.0298228 -0.0220544 0.0128887 -0.0752413 0.00967507 0.0422497 0.0458243 0.0353578 0.080216 0.0734285 -0.0897179 -0.0433705 -0.0238991 -0.119878 -0.0360841 -0.0525252 0.171984 0.0463891 -0.0746433 0.0883344 -0.00850811 -0.0750714 -0.0069585 0.0848953 -0.00338728 -0.0241669 0.0714403 -0.0309258 -0.0144486 -0.0797035 0.0872231 -0.0609703 -0.116786 0.101689 0.0684141 -0.0822994 -0.158308 0.0638614 0.148085 0.153054 -0.0156832 0.0262125 0.0278398 -0.00560514 0.0435566 0.127864 0.0731721 
-0.0126383 0.0513373 -0.0298935 -0.0113003 -0.00213201 0.186712 -0.0784142 -0.0298233 -0.0132565 -0.00516481 0.0196521 0.0326403 0.0339868 -0.206295 0.00064226 -0.00350582 -0.193603 0.0414485 -0.0141697 0.0592106 0.139139 -0.0783755 0.115983 0.0684449 0.0160019 0.039134 0.0126682 -0.309186 -0.0422053 0.0379511 0.0758354 -0.00353506 0.043228 0.0874581 0.104942 0.0259746 0.0220431 0.0775721 0.00333962 -0.0997435 0.0332971 -0.207276 -0.0188484 0.127616 -0.120236 -0.013654 0.179426 0.0159053 -0.187386 0.0559534 0.012661 -0.0674342 0.0505248 0.020164 0.110413 0.0562274 0.0608298 -0.00807402 -0.0238561 -0.180401 -0.0532159 -0.0576801 0.166313 -0.08955 0.146164 -0.0850161 -0.032658 0.00174375 -0.0270041 0.139412 -0.114225 -0.00207024 -0.15956 -0.0899621 0.0377989 -0.0615604 -0.0920964 0.0930663 0.0377594 0.156143 -0.110159 0.0186674 -0.0230021 0.00205356 -0.076249 0.00664146 0.0489252 0.0402179 0.0389648 0.0861189 0.0713548 -0.100718 -0.0548899 -0.0260029 -0.12475 -0.0341058 -0.0469639 0.157832 0.054369 -0.0791407 0.087893 -0.000947074 -0.070097 0.00483551 0.0756709 -0.0103354 -0.0359182 0.0834054 -0.034017 -0.0228129 -0.0699027 0.100815 -0.0625998 -0.113127 0.102259 0.0634092 -0.0816647 -0.158475 0.0694102 0.152816 0.15103 -0.0158502 0.0274875 0.0372178 0.00557597 0.0364915 0.129041 0.0642878 
-0.0108553 0.0574064 -0.0291798 -0.0124625 -0.00359135 0.196388 -0.0835532 -0.0252451 -0.0125705 -0.0127038 0.0184943 0.0252164 0.0284611 -0.208197 0.00281976 0.000597211 -0.184961 0.0393949 -0.0146649 0.0546235 0.141408 -0.0706912 0.116077 0.077132 0.0163173 0.0317765 0.0172577 -0.307348 -0.036284 0.0315647 0.0859105 -0.00955374 0.0388055 0.0889263 0.104613 0.03438 0.0239189 0.0718417 -0.00281379 -0.0942342 0.0295711 -0.200163 -0.0178902 0.13095 -0.111012 -0.0120841 0.184476 0.0178339 -0.194687 0.0587759 0.0126053 -0.0695784 0.0476897 0.0155183 0.106149 0.0583188 0.0557915 -0.00190387 -0.0165578 -0.184834 -0.0572451 -0.0492512 0.167641 -0.0990998 0.146657 -0.0902065 -0.0275955 -0.00390401 -0.0310805 0.150535 -0.116137 -0.00228486 -0.159093 -0.0889748 0.0365499 -0.0699269 -0.0895432 0.104903 0.0347986 0.149788 -0.106954 0.0241017 -0.0294986 -0.00589058 -0.0746189 0.00787819 0.0424286 0.0344741 0.0323808 0.0921491 0.0785312 -0.102285 -0.0631717 -0.0274333 -0.108466 -0.023836 -0.044214 0.159724 0.0448784 -0.0717691 0.0798296 -0.00176191 -0.0741411 0.00461559 0.0680907 -0.00702534 -0.0379785 0.0720046 -0.0355022 -0.0255793 -0.068214 0.104896 -0.0573365 -0.111521 0.1042 0.0599675 -0.0789055 -0.164608 0.0727306 0.152343 0.15109 -0.0146172 0.0332955 0.0401437 0.00521665 0.0322915 0.129502 0.0560792 
-0.00484838 0.0551329 -0.0356951 -0.0135283 -0.00901886 0.197132 -0.0733066 -0.0220938 -0.0197674 -0.00892735 0.0274996 0.0274125 0.0285012 -0.206546 0.00162267 -0.00525266 -0.191166 0.0397888 -0.0123062 0.0499655 0.131492 -0.06926 0.114827 0.069427 0.0114804 0.0374548 0.0273809 -0.30204 -0.0368386 0.028212 0.0703097 -0.00641224 0.0375049 0.0916776 0.0991198 0.0270122 0.0247983 0.0711272 -0.00366729 -0.0912455 0.0367106 -0.209609 -0.0190357 0.134314 -0.123147 -0.0141419 0.182382 0.0156244 -0.20132 0.0581342 0.01239 -0.0673916 0.0421107 0.0235651 0.1052 0.0596178 0.0533864 0.00059527 -0.02154 -0.177091 -0.0591296 -0.0539359 0.176654 -0.0970642 0.147963 -0.0783384 -0.0286027 -0.00849346 -0.029808 0.152358 -0.122639 -0.00551974 -0.153324 -0.0790184 0.0422419 -0.0732941 -0.0865401 0.0963246 0.0300475 0.140723 -0.105314 0.0178974 -0.0295284 -0.0137347 -0.0794718 0.0103138 0.0452054 0.0288829 0.0329064 0.0963482 0.0870326 -0.106336 -0.0677874 -0.0333545 -0.109924 -0.0260208 -0.0408363 0.155874 0.0581575 -0.0712432 0.0761455 0.000904687 -0.0649685 0.00445767 0.0701745 -0.00578022 -0.0373713 0.0827544 -0.0444559 -0.0342734 -0.0614102 0.108112 -0.0498555 -0.116744 0.106432 0.0525544 -0.0711241 -0.163319 0.0860624 0.148584 0.155279 -0.0264613 0.0369874 0.0414965 0.0119516 0.0321576 0.131886 0.0578221 
0.00234346 0.0476805 -0.0238419 -0.010691 -0.0114021 0.195855 -0.0580925 -0.0161372 -0.0213673 -0.0248324 0.0283123 0.03191 0.0304936 -0.212879 0.00191131 -0.0151976 -0.205342 0.0266415 -0.0228216 0.0574185 0.132578 -0.0693841 0.113535 0.06977 0.0075384 0.0319689 0.0191788 -0.301218 -0.0408855 0.0255045 0.062081 -0.0141406 0.0329507 0.100773 0.0948097 0.0166968 0.0267109 0.0787274 -0.00855174 -0.0901709 0.0480515 -0.213959 -0.0193854 0.128099 -0.130446 -0.0216608 0.177671 0.0100814 -0.195753 0.0693144 0.00536655 -0.071886 0.041753 0.0351884 0.112845 0.0518335 0.0497798 0.00190984 -0.0298055 -0.174341 -0.0586392 -0.0521213 0.17383 -0.093791 0.144343 -0.0702496 -0.0222736 -0.0170461 -0.0327242 0.138849 -0.124694 -0.00626383 -0.146514 -0.064228 0.0521376 -0.0701321 -0.0852113 0.0799981 0.0371378 0.156323 -0.101427 0.00500769 -0.020776 -0.0137019 -0.0765678 0.0118788 0.0510087 0.0324937 0.0289201 0.0971457 0.0968696 -0.112749 -0.0628322 -0.0335765 -0.129333 -0.0353562 -0.0411662 0.148226 0.0664184 -0.0714151 0.0742893 0.00161237 -0.0609569 0.00863975 0.0691985 -0.00522354 -0.0328106 0.100691 -0.0468389 -0.0378845 -0.0543009 0.110177 -0.0548918 -0.115474 0.102897 0.0591866 -0.0703007 -0.148569 0.0820802 0.153051 0.14952 -0.0244337 0.0323552 0.0433002 0.0162314 0.0336665 0.134931 0.0573724 
-0.00171205 0.0515703 -0.0317313 -0.00308208 -0.00403674 0.198079 -0.053583 -0.0264677 -0.0160828 -0.019655 0.0311853 0.0331668 0.0244544 -0.206036 0.00221258 -0.0125572 -0.199103 0.0377986 -0.0170173 0.045605 0.130974 -0.0718415 0.11176 0.0632418 0.0148121 0.0301405 0.017503 -0.298978 -0.0371779 0.029277 0.0638322 0.000963489 0.0351933 0.0956737 0.10079 0.0196669 0.0308874 0.0706368 -0.00600647 -0.0976194 0.0576434 -0.210171 -0.0113832 0.126184 -0.136219 -0.019267 0.179258 0.00773697 -0.196586 0.052479 0.00438665 -0.0718837 0.0440636 0.0309143 0.112459 0.0619987 0.0497502 0.00367478 -0.0333746 -0.169063 -0.0626432 -0.0529888 0.177867 -0.102962 0.155743 -0.0569969 -0.0274805 -0.0178026 -0.0347216 0.151276 -0.124948 -0.00202793 -0.146534 -0.0676366 0.0499847 -0.0676899 -0.0842989 0.082348 0.0252907 0.133683 -0.106519 0.0178797 -0.0245003 -0.0155009 -0.0791293 0.0148723 0.0494469 0.0305371 0.0210352 0.0986215 0.100946 -0.112984 -0.0683536 -0.0430638 -0.117724 -0.0339787 -0.0412854 0.151762 0.0696652 -0.0644399 0.0729444 -0.00336172 -0.0528821 0.00406231 0.070809 -0.00215659 -0.0284642 0.0979837 -0.0500592 -0.0368502 -0.0609073 0.103626 -0.0498067 -0.12153 0.111298 0.0493184 -0.0687369 -0.152784 0.0919214 0.15112 0.158007 -0.0278675 0.0341867 0.0443101 0.0186401 0.0374438 0.133845 0.0592731 
-0.000696543 0.0582879 -0.0338384 0.00414482 -0.000541262 0.192685 -0.0427949 -0.0365154 -0.0152216 -0.00899923 0.0257412 0.0383127 0.0226459 -0.213505 0.00850857 -0.0274767 -0.197674 0.0446286 -0.0105387 0.0564911 0.117493 -0.0733584 0.108157 0.0562898 0.0144137 0.0256679 0.0040309 -0.298703 -0.0423118 0.0405809 0.0610364 0.0066002 0.0373933 0.0903036 0.118032 0.0139289 0.0407364 0.0702024 -0.00530308 -0.115038 0.0581381 -0.214113 -0.00605641 0.12908 -0.152217 -0.0156705 0.177185 0.0156168 -0.185096 0.0619142 0.00964678 -0.0649309 0.0461793 0.0285223 0.121427 0.0549814 0.0411027 -0.00763909 -0.037262 -0.166817 -0.0647104 -0.0616351 0.174641 -0.107387 0.160045 -0.06437 -0.028663 -0.0299368 -0.0476991 0.143821 -0.119467 -0.00141341 -0.142533 -0.0634502 0.0372174 -0.0658197 -0.0836605 0.0759665 0.0365529 0.138777 -0.106046 0.0142685 -0.0275407 -0.00563086 -0.0603719 -0.00188094 0.041201 0.0336965 0.0361417 0.105788 0.0934592 -0.108415 -0.0605668 -0.0476309 -0.127079 -0.0503751 -0.0341863 0.149405 0.0684904 -0.0732071 0.0792514 0.0124934 -0.0466862 -0.00573817 0.0684967 -0.00346137 -0.0151706 0.0995018 -0.0377037 -0.0117688 -0.0570131 0.0963293 -0.0540431 -0.118945 0.100538 0.0417578 -0.0573906 -0.152275 0.0885882 0.150774 0.157947 -0.028825 0.0337766 0.0467387 0.0271854 0.0306415 0.147483 0.0578667 
-0.0121231 0.032193 -0.0381037 -0.00239311 -0.00450806 0.132158 -0.0232881 -0.0468721 -0.0449862 -0.0059425 0.011427 0.0237189 0.023734 -0.179291 -0.00191302 -0.0045815 -0.199494 -0.0018992 0.0624775 0.0626882 0.124378 -0.0814812 0.0732132 0.033922 0.0127318 0.101866 0.00234875 -0.302838 0.0169455 0.0604099 0.0172391 0.0055006 0.0335608 0.0457468 0.14168 0.00775996 0.0525921 0.102097 0.0315048 -0.151958 0.046421 -0.198996 0.0142188 0.129106 -0.12532 0.0432001 0.194132 0.00944213 -0.186137 -0.0121945 -0.0493481 -0.0526492 0.0859123 0.0336831 0.167143 0.045669 0.0587573 0.0059849 -0.0576085 -0.164876 -0.0217058 -0.0747978 0.194977 -0.0546795 0.167744 -0.0236304 -0.0333802 -0.0365337 0.0159687 0.0689453 -0.142361 -0.00365532 -0.152148 -0.0610587 0.0600146 -0.0657298 -0.0768028 0.101173 0.0682973 0.141246 -0.0798197 0.0199654 -0.038694 -0.0137404 -0.0385832 -0.0399156 0.0356143 0.0674737 0.0442219 0.0806691 0.122766 -0.0461208 -0.0568722 -0.0362568 -0.140605 -0.0613507 0.00722806 0.165696 0.119046 -0.0927937 0.0790588 0.00945659 -0.0294862 -0.0382014 0.0254575 0.00556713 0.0196336 0.118324 -0.0026612 -0.00793931 -0.0312711 0.0770299 -0.0844602 -0.157368 0.120148 0.0658151 -0.0668366 -0.167436 0.0452782 0.109678 0.12122 -0.0232033 0.0481619 0.0246876 -0.0268736 0.0675849 0.129309 0.0562263 
-0.0168282 0.0448443 -0.0494283 -0.00907802 -0.0135809 0.137026 -0.0188204 -0.0385537 -0.0541309 0.0164473 0.0204602 0.0294905 0.0354081 -0.194556 -0.0281734 0.0138831 -0.219942 -0.00263333 0.0460924 0.0729763 0.13654 -0.0955603 0.0607111 0.0198665 -0.00133217 0.116653 -0.0102278 -0.297708 0.0295535 0.0632595 -0.0111911 0.00779107 0.0178281 0.0427041 0.126374 0.00117277 0.0383084 0.108779 0.0404178 -0.137259 0.038324 -0.204141 0.0192853 0.122474 -0.113899 0.0177735 0.205668 0.00405934 -0.194196 -0.00941448 -0.042233 -0.0528442 0.0520999 0.0522531 0.166622 0.0412726 0.0598361 -0.00566293 -0.0609894 -0.170969 -0.0142221 -0.0793602 0.210743 -0.0469048 0.165336 -0.0221948 -0.0352231 -0.0344441 0.0231047 0.0509266 -0.139029 0.0107625 -0.135726 -0.0408222 0.0672236 -0.062216 -0.075886 0.102478 0.0645761 0.130316 -0.0668478 0.0147901 -0.02775 -0.00164209 -0.0568944 -0.0170709 0.0424107 0.0785611 0.0711902 0.0703836 0.109507 -0.0551365 -0.0628503 -0.0247053 -0.147902 -0.0657386 0.00615832 0.165288 0.114196 -0.0810206 0.0805696 0.00553426 -0.0324268 -0.0267408 0.0267881 0.0170093 0.0150613 0.137655 -0.0129696 -0.015056 -0.0399893 0.0844308 -0.0793963 -0.150365 0.120161 0.0665101 -0.0699262 -0.143805 0.0386698 0.0940236 0.105656 -0.0300857 0.0726063 0.0140954 -0.0332635 0.0801615 0.116755 0.057507 
-0.026992 0.0599972 -0.0651084 -0.000757155 -0.0109154 0.141922 -0.00519875 -0.0699819 -0.0633074 0.0326238 -0.00210285 0.0354939 0.0244172 -0.188687 -0.0527316 0.00774814 -0.229288 0.0159225 0.0655459 0.055521 0.131574 -0.108545 0.0792259 0.00572226 0.00155845 0.117248 -0.0337508 -0.29881 0.0451396 0.0775178 -0.0132523 0.024448 -0.00173396 0.00877758 0.134611 -0.0171488 0.00793107 0.121858 0.0588425 -0.127428 0.0159528 -0.184718 0.001102 0.110548 -0.126064 0.00412366 0.198871 0.00246638 -0.16658 -0.00901886 -0.023864 -0.00826648 0.0642656 0.0438933 0.15391 0.0321682 0.116664 0.0118263 -0.0581372 -0.163872 -0.0115928 -0.0621768 0.234212 -0.0501132 0.172931 -0.0258056 -0.0390438 -0.04299 0.00791332 0.0731239 -0.13147 0.0402251 -0.12763 0.000158818 0.0436754 -0.0678772 -0.0820455 0.0680451 0.0600241 0.122688 -0.0734369 0.0168414 -0.0126687 0.0103449 -0.0501315 -0.0497811 0.033122 0.0840997 0.0830896 0.0360384 0.0906186 -0.0287432 -0.0354898 -0.0331102 -0.119855 -0.0956413 0.0242916 0.196166 0.112109 -0.0647266 0.0938713 0.0247505 -0.0313499 -0.0119661 0.0310543 0.0111128 0.0356531 0.129742 0.0219615 0.00361729 -0.0382419 0.0895136 -0.0652856 -0.145767 0.119803 0.0823507 -0.0490081 -0.116104 0.0529491 0.0981418 0.0966904 -0.0491477 0.0676512 -0.0350548 -0.0600581 0.0989925 0.109093 0.0763213 
-0.0428434 0.0601913 -0.0779118 -0.0112809 -0.00745739 0.134171 -0.0144497 -0.0568488 -0.0769046 0.0593716 -0.0032904 0.0359388 0.0286542 -0.176057 -0.0181698 -0.00223282 -0.234227 -0.00200564 0.0867475 0.0638417 0.102606 -0.120257 0.0789085 0.00583849 0.0168091 0.1186 -0.0173595 -0.298005 0.0288048 0.0634657 -0.0115752 0.00410086 0.00849046 0.00673269 0.113274 0.00682827 0.00790508 0.0952816 0.037787 -0.114399 0.0374846 -0.199804 0.0114623 0.131542 -0.145943 0.0339971 0.212361 0.00419352 -0.171052 -0.0142739 -0.0246281 -0.0311679 0.0478765 0.0352437 0.165047 0.0475916 0.0855326 0.0142073 -0.0362361 -0.151379 -0.0184196 -0.0669948 0.215999 -0.0451002 0.176938 -0.0276028 -0.04324 -0.0307086 0.0257389 0.0703335 -0.122558 0.0611457 -0.125817 -0.0187575 0.0722958 -0.0452507 -0.0924721 0.0961111 0.0605999 0.114179 -0.0864519 0.00823405 -0.0149544 0.0256132 -0.0680441 -0.0250356 0.045034 0.079375 0.0820034 0.0300749 0.0747807 -0.026581 -0.03393 -0.053746 -0.135777 -0.095216 0.0187945 0.184558 0.120453 -0.083796 0.0692021 0.0174742 -0.0100458 -0.0333782 0.00745274 0.0187733 0.00266943 0.143121 -0.00149643 0.00486602 -0.0319197 0.0843904 -0.0614291 -0.159924 0.103629 0.0698703 -0.0471965 -0.13722 0.0488472 0.106201 0.112679 -0.0525024 0.0558862 -0.00786126 -0.0699937 0.0941369 0.0940791 0.0922088 
-0.0381295 0.0823686 -0.0814159 0.0072037 0.00250558 0.165686 0.00246555 -0.0824056 -0.0742618 0.0612103 -0.0122345 0.0449722 0.015736 -0.19156 -0.0190008 -0.013839 -0.233336 0.0145362 0.0832227 0.0495935 0.0969805 -0.11834 0.0677623 0.0240084 0.031818 0.0865925 -0.0457442 -0.295316 0.0264106 0.0909238 0.00119977 0.0258766 -0.0134294 0.00620545 0.11955 0.0045326 -0.00340195 0.0587352 0.0503786 -0.111849 0.0433848 -0.207028 0.0190399 0.115223 -0.146528 0.0248526 0.210482 0.010182 -0.167308 -0.00699713 0.00164418 -0.0091597 0.0630323 0.0198672 0.161365 0.0528398 0.0839038 0.0259419 -0.0403904 -0.137708 -0.0297859 -0.0420629 0.219168 -0.0802277 0.17443 -0.0259724 -0.0407709 -0.0493701 -0.0177287 0.0888895 -0.11744 0.0764577 -0.137486 -0.00290646 0.0604761 -0.0345659 -0.0810505 0.072318 0.0566506 0.120092 -0.0842085 0.0150464 -0.00402558 0.034382 -0.060457 -0.0252629 0.0331758 0.0590305 0.0710501 0.0430981 0.0678142 -0.0339931 -0.0287733 -0.0435022 -0.13076 -0.0960763 0.0211095 0.176624 0.116751 -0.0734439 0.0843147 0.0283121 -0.0184976 -0.0202615 0.00504677 0.0263851 0.00942256 0.139545 -0.0083469 0.0298959 -0.0256209 0.0769452 -0.0547173 -0.160157 0.0965225 0.0708469 -0.0412757 -0.11201 0.0652975 0.126102 0.127155 -0.0721529 0.0534468 -0.0249142 -0.0702815 0.107403 0.0949312 0.0831252 
-0.0173407 0.0640616 -0.089887 0.000692779 -0.0195133 0.173227 0.0143409 -0.0701684 -0.0764195 0.039908 -0.020881 0.04503 0.0332106 -0.193508 -0.0335325 -0.021844 -0.245169 -0.00474611 0.0588531 0.0613394 0.0970172 -0.120358 0.0580102 0.0313115 0.00222721 0.0824669 -0.0536381 -0.303889 -0.00556046 0.0953235 -0.0236171 0.035185 -0.0253711 0.022514 0.106684 -0.00209723 0.00302843 0.0706907 0.0335794 -0.111597 0.0370306 -0.22044 0.0200972 0.104721 -0.130888 0.0238101 0.209544 0.0124714 -0.179106 0.019202 0.003406 -0.0377208 0.0745195 0.044421 0.175109 0.0437985 0.0759976 0.0257586 -0.0309217 -0.152777 -0.0159764 -0.0196779 0.211165 -0.0845845 0.156074 -0.0189715 -0.0315861 -0.0433911 -0.0204084 0.0549189 -0.127977 0.0508547 -0.130854 0.00366773 0.0639663 -0.0238012 -0.0702467 0.0431277 0.0707823 0.136668 -0.0614441 -0.00916663 -0.0227953 0.0115915 -0.0713096 -0.00371978 0.0334734 0.0416511 0.0740589 0.0595871 0.0724256 -0.0585961 -0.0224165 -0.0433017 -0.156998 -0.0676944 0.0245522 0.160543 0.129883 -0.0621422 0.0991088 0.033022 -0.0225878 -0.00484133 -0.00232049 0.0176913 -0.0165303 0.153943 -0.0556688 0.0261859 -0.0125888 0.0859594 -0.0529393 -0.173978 0.0777342 0.0858947 -0.0465788 -0.0969359 0.0568999 0.115715 0.115714 -0.0806842 0.0744826 -0.0205736 -0.0589405 0.0983692 0.0807635 0.0599975 
-0.00648299 0.0347469 -0.079455 -0.00567208 -0.0147731 0.183439 0.0192546 -0.0538266 -0.0826251 0.0121674 -0.027396 0.0471661 0.0373249 -0.188633 -0.0227132 -0.0355397 -0.255058 -0.0271604 0.0485929 0.067792 0.101351 -0.118215 0.0453864 0.0472411 0.00645523 0.0788352 -0.0526258 -0.304595 -0.0286272 0.079154 -0.0151992 0.00885638 -0.0476549 0.0347571 0.0956737 0.0107687 -0.0113676 0.0505274 0.0130258 -0.109482 0.0546926 -0.216343 0.0235028 0.125447 -0.123471 0.0184123 0.207483 0.0133012 -0.174984 0.0304131 -0.0048745 -0.0819119 0.0693221 0.0433349 0.189725 0.0446073 0.0317986 0.0587275 -0.0215691 -0.159284 -0.00991971 -0.00648826 0.209963 -0.0768956 0.151447 -0.0168655 -0.0242314 -0.0427257 -0.0140308 0.0452349 -0.1236 0.0629003 -0.115383 -0.00549258 0.0618617 -0.0202419 -0.0699633 0.0397797 0.0780563 0.151972 -0.0487499 -0.0223791 -0.0249733 -0.00445483 -0.0895336 -0.0047366 0.0548629 0.040744 0.0640516 0.059879 0.0878802 -0.0688571 -0.0249822 -0.051985 -0.170634 -0.0489692 0.0255121 0.139559 0.128888 -0.0553006 0.081321 0.0313209 -0.0222597 -0.017947 -0.0224206 0.0236862 -0.0424341 0.158374 -0.0852925 0.0192284 0.00701924 0.0895866 -0.0615802 -0.17423 0.0762456 0.094261 -0.0476418 -0.0894914 0.0412387 0.114932 0.107988 -0.0777754 0.0722734 -0.00730428 -0.0631965 0.0917622 0.0679889 0.0519823 
0.00310786 0.0193207 -0.0840562 -0.00659655 -0.0216348 0.187621 0.0339877 -0.0569607 -0.0940324 0.0159158 -0.028071 0.0602729 0.0508526 -0.175729 -0.0380596 -0.0372902 -0.25878 -0.0207141 0.0414046 0.069823 0.0999244 -0.121048 0.0434662 0.0594239 -0.013838 0.0780424 -0.059468 -0.306277 -0.0411383 0.0939693 -0.0420101 0.0166552 -0.060576 0.0347956 0.0781319 0.00781607 -0.0271636 0.0510714 0.00779497 -0.096234 0.03935 -0.212451 0.0113198 0.106688 -0.121882 0.0130473 0.198874 0.0110924 -0.175009 0.0403852 0.00803734 -0.0885935 0.0696828 0.0517025 0.190815 0.0409964 0.0409105 0.0728075 -0.0207999 -0.142764 0.00262101 0.0135521 0.212922 -0.0786056 0.143881 -0.0163555 -0.0256525 -0.0326875 -0.0230781 0.0339089 -0.121334 0.0654342 -0.11113 0.00459372 0.0569264 -0.00419965 -0.0598637 0.0193059 0.0825536 0.144397 -0.0369161 -0.0339186 -0.0318857 -0.0140157 -0.103604 0.00443157 0.0573409 0.0287633 0.060998 0.0595724 0.0803408 -0.0745201 -0.0134409 -0.0376883 -0.179507 -0.0360296 0.0216863 0.127239 0.144058 -0.0390078 0.0976325 0.0326196 -0.0311303 -0.00946166 -0.0217879 0.0215398 -0.0568097 0.152932 -0.107729 0.0212166 0.0116482 0.0959186 -0.0420821 -0.181856 0.0648705 0.114411 -0.046953 -0.0654094 0.0293892 0.113032 0.0929841 -0.0968562 0.0764867 -0.0199145 -0.0701084 0.110193 0.0440587 0.0423298 
-0.0149849 -0.00180902 -0.0724609 -0.0168545 -0.0170022 0.187213 0.0376187 -0.0550675 -0.0918029 0.00792578 -0.0260636 0.0592174 0.061032 -0.154233 -0.0392614 -0.0563016 -0.274293 -0.0170492 0.0410928 0.0644965 0.108834 -0.132282 0.0295167 0.0606788 -0.00890966 0.0828239 -0.0737906 -0.29883 -0.0326026 0.0804155 -0.023523 -0.00376813 -0.0793708 0.0174821 0.0792768 0.0210749 -0.0581943 0.0388414 0.00653468 -0.093923 0.0572681 -0.194618 -0.00402482 0.122996 -0.12557 -0.0119557 0.182179 0.0168096 -0.157914 0.0172152 -0.0272417 -0.106032 0.0718332 0.0393496 0.177308 0.0478845 0.0204873 0.105535 -0.0263999 -0.149341 0.00177458 0.0319995 0.226615 -0.0515334 0.134863 0.00679747 -0.00926989 -0.0313842 -0.00833302 0.0180283 -0.106262 0.0800701 -0.0897176 -0.00441639 0.0550902 -0.00473467 -0.0813044 0.00414415 0.0883805 0.145907 -0.0402509 -0.0285428 -0.0246487 -0.0139975 -0.115512 0.00212248 0.0806203 0.0437231 0.0599516 0.0343141 0.0956534 -0.0627467 0.00661223 -0.0433278 -0.186542 -0.056074 0.00806643 0.125115 0.13334 -0.0342998 0.0916963 0.0243069 -0.0245874 -0.0306732 -0.028489 0.0425114 -0.0517337 0.151057 -0.103611 0.0240009 0.0216196 0.0876698 -0.0546915 -0.180766 0.063592 0.126979 -0.0587035 -0.0522627 0.0244066 0.100378 0.0802681 -0.113281 0.0516949 -0.0258535 -0.10206 0.123802 0.0151869 0.0585151 
-0.0349508 0.0170616 -0.0730328 -0.0242513 -0.0415819 0.177425 0.0163045 -0.0294722 -0.110466 0.0547289 -0.00460643 0.0331219 0.0740796 -0.147502 -0.0323788 -0.0317513 -0.253773 -0.0076136 0.0658281 0.0527982 0.116525 -0.160323 0.0456299 0.0599785 0.00131821 0.104104 -0.0600511 -0.2991 0.0171727 0.0596949 -0.0118071 0.000430291 -0.0631851 0.00276465 0.0553219 0.0163913 -0.0766146 0.0687185 0.0282797 -0.0816439 0.0344013 -0.203879 -0.0303947 0.114537 -0.109177 -0.0323943 0.182362 0.00774403 -0.179573 -0.0199138 -0.0323418 -0.074471 0.070185 0.0262281 0.133381 0.0594823 0.0562032 0.0969899 -0.0164494 -0.164851 -0.0069757 0.0203365 0.233948 -0.0474743 0.128478 0.0405558 -0.00775622 -0.0267815 0.00191257 0.0145292 -0.124611 0.0805441 -0.111959 0.000233879 0.0734025 -0.0339342 -0.0783313 0.0245658 0.0849937 0.141177 -0.0751788 -0.0317175 -0.0201794 -0.0224548 -0.1072 0.00502229 0.0738416 0.047458 0.0838923 0.000312767 0.0834001 -0.0355028 0.00828603 -0.0261964 -0.1553 -0.0657406 0.00902436 0.154673 0.118925 -0.039005 0.0855478 0.00504316 -0.0320428 -0.0144761 -0.0161439 0.0586855 -0.0323123 0.137148 -0.054813 -0.0161044 -0.00507949 0.107995 -0.0453777 -0.188074 0.0921402 0.116245 -0.0695586 -0.0700287 0.0488834 0.0982949 0.0694993 -0.127464 0.0426876 -0.032956 -0.118232 0.137388 0.0130324 0.0754535 
-0.0349508 0.0170616 -0.0730328 -0.0242513 -0.0415819 0.177425 0.0163045 -0.0294722 -0.110466 0.0547289 -0.00460643 0.0331219 0.0740796 -0.147502 -0.0323788 -0.0317513 -0.253773 -0.0076136 0.0658281 0.0527982 0.116525 -0.160323 0.0456299 0.0599785 0.00131821 0.104104 -0.0600511 -0.2991 0.0171727 0.0596949 -0.0118071 0.000430291 -0.0631851 0.00276465 0.0553219 0.0163913 -0.0766146 0.0687185 0.0282797 -0.0816439 0.0344013 -0.203879 -0.0303947 0.114537 -0.109177 -0.0323943 0.182362 0.00774403 -0.179573 -0.0199138 -0.0323418 -0.074471 0.070185 0.0262281 0.133381 0.0594823 0.0562032 0.0969899 -0.0164494 -0.164851 -0.0069757 0.0203365 0.233948 -0.0474743 0.128478 0.0405558 -0.00775622 -0.0267815 0.00191257 0.0145292 -0.124611 0.0805441 -0.111959 0.000233879 0.0734025 -0.0339342 -0.0783313 0.0245658 0.0849937 0.141177 -0.0751788 -0.0317175 -0.0201794 -0.0224548 -0.1072 0.00502229 0.0738416 0.047458 0.0838923 0.000312767 0.0834001 -0.0355028 0.00828603 -0.0261964 -0.1553 -0.0657406 0.00902436 0.154673 0.118925 -0.039005 0.0855478 0.00504316 -0.0320428 -0.0144761 -0.0161439 0.0586855 -0.0323123 0.137148 -0.054813 -0.0161044 -0.00507949 0.107995 -0.0453777 -0.188074 0.0921402 0.116245 -0.0695586 -0.0700287 0.0488834 0.0982949 0.0694993 -0.127464 0.0426876 -0.032956 -0.118232 0.137388 0.0130324 0.0754535 
-0.0230064 0.0341125 -0.0984572 -0.0359735 -0.0296042 0.175367 0.00273984 -0.0246764 -0.122433 0.0801716 0.0113451 0.020115 0.0722354 -0.148441 -0.00322638 -0.0199185 -0.242612 -0.002047 0.0847273 0.0584427 0.0893791 -0.135473 0.0511071 0.0292685 0.0019599 0.109853 -0.0278918 -0.285571 0.0227824 0.0549045 -0.0334986 0.000722849 -0.034734 0.00631343 0.0683473 0.0216855 -0.036693 0.0477673 0.0265835 -0.0989011 0.042728 -0.22031 -0.00202752 0.138874 -0.139611 0.0098551 0.19611 0.0266183 -0.202423 -0.0131479 -0.0371682 -0.068882 0.0485787 0.0318994 0.134593 0.0581341 0.0429847 0.0560261 -0.0147476 -0.154508 -0.0180628 -0.00569657 0.231424 -0.0437043 0.132492 0.040033 -0.0252404 -0.0184669 0.0212223 0.0170122 -0.127723 0.0662621 -0.114882 -0.02052 0.0884507 -0.0358941 -0.0827468 0.0530762 0.080935 0.118479 -0.0547497 -0.0259742 -0.032705 -0.0134712 -0.099099 0.0282586 0.0569975 0.0426924 0.0887355 0.0386227 0.0972447 -0.0339423 -0.0331782 -0.0343622 -0.157843 -0.0702981 0.00340464 0.164367 0.121138 -0.0728257 0.0820839 0.00897589 -0.000707738 -0.0465436 -0.0253387 0.0609238 -0.032507 0.155012 -0.055046 -0.00566063 0.00511529 0.0985145 -0.0342536 -0.188577 0.0875067 0.0777792 -0.0581753 -0.0991722 0.0574577 0.0891167 0.0979115 -0.130273 0.063763 -0.00259818 -0.0998186 0.106998 0.043811 0.082448 
-0.00627415 0.048278 -0.0806573 -0.0309603 -0.0368339 0.178917 -0.00166274 -0.017884 -0.109397 0.0673461 0.0145819 0.0225852 0.0777274 -0.197124 -0.037625 -0.0138903 -0.246673 0.0160312 0.0320235 0.0899008 0.110394 -0.130836 0.0743374 0.0655753 -0.0249749 0.0720947 -0.0272245 -0.291829 0.022198 0.0664674 -0.0379272 -0.0145027 -0.032172 0.032806 0.066266 -0.00549131 -0.0407672 0.0704608 0.00146762 -0.0929141 0.00925404 -0.234041 -0.0201738 0.140997 -0.131163 -0.0152067 0.196177 0.0432083 -0.201665 0.0490541 -0.00302627 -0.0614875 0.0351258 0.0343388 0.127474 0.0372185 0.0565169 0.030583 -0.00331526 -0.17089 -0.0137139 -0.0056588 0.22635 -0.041206 0.112948 -0.0211376 -0.0279045 -0.04118 -0.0181287 0.0253987 -0.140113 0.0400789 -0.113142 -0.00248061 0.0616564 -0.0524534 -0.0663733 0.0597248 0.0912705 0.147534 -0.0460878 -0.0454444 -0.040812 -0.0115991 -0.0804749 0.021919 0.0362728 0.0382892 0.104101 0.0603854 0.0882349 -0.0535354 -0.0379417 -0.0216781 -0.158767 -0.0675222 -0.0114454 0.165636 0.111706 -0.0766738 0.113462 0.0261087 -0.0267854 -0.0156323 0.00261456 0.034562 -0.0258293 0.151251 -0.0327434 -0.00276794 0.00130602 0.125768 -0.0278253 -0.157764 0.0648167 0.0972856 -0.0521065 -0.0793763 0.0464721 0.111188 0.0742103 -0.108449 0.0545987 -0.000325032 -0.0914319 0.0994565 0.0516964 0.054673 
-0.00167955 0.0322364 -0.0895994 -0.0340284 -0.021819 0.149783 -0.0145875 -0.00939737 -0.110745 0.0823449 0.0236051 0.0251133 0.0863832 -0.192815 -0.0432625 0.00291655 -0.224728 0.0244319 0.0349554 0.116543 0.116725 -0.133544 0.0876816 0.0854397 -0.0226415 0.0834932 -0.00188103 -0.29222 0.044407 0.0658357 -0.0435682 -0.0152295 -0.0177975 0.0318468 0.0511223 -0.00885143 -0.0422609 0.085259 -0.00281891 -0.100423 -0.00207405 -0.224023 -0.0308202 0.155916 -0.1343 -0.0140507 0.197588 0.0533503 -0.188811 0.0450143 -0.00581355 -0.0579679 0.0240565 0.0252259 0.124875 0.0294099 0.0654984 0.0266495 0.00517171 -0.172409 -0.00729278 -0.0270227 0.224515 -0.0144882 0.0975448 -0.0402844 -0.0363949 -0.0319109 0.00457301 0.0159396 -0.149033 0.0380043 -0.118605 -0.0112961 0.0574207 -0.0658556 -0.0603299 0.0977749 0.0900436 0.145679 -0.0455828 -0.0342846 -0.0501071 -0.017886 -0.0630815 0.0189222 0.032358 0.0553186 0.111217 0.0462889 0.090247 -0.0316049 -0.0525509 -0.0137229 -0.147775 -0.0729655 -0.0228625 0.171417 0.112513 -0.101408 0.113436 0.00791136 -0.0198698 -0.0104946 0.000916944 0.028438 -0.0291256 0.146843 0.000332941 -0.0109452 -0.00256357 0.145231 -0.028583 -0.14563 0.0639516 0.0945895 -0.0554022 -0.105255 0.0329093 0.108865 0.0599876 -0.0824682 0.0444056 0.00934963 -0.117603 0.094638 0.0388146 0.0530742 
0.0180421 0.0171816 -0.109746 -0.0296913 -0.0262281 0.16503 -0.0158701 -0.00944494 -0.09872 0.082773 0.0259383 0.017002 0.0771373 -0.189271 -0.041419 -0.000923483 -0.196552 0.0260868 0.0547136 0.111068 0.105125 -0.13565 0.102492 0.0775367 -0.0348921 0.0910299 0.00353239 -0.308825 0.0309238 0.0420227 -0.0185377 -0.0120414 -0.0215952 0.0214217 0.0691401 0.00388902 -0.0300071 0.106279 0.00639776 -0.114266 -0.0211686 -0.20739 -0.0671137 0.147942 -0.137227 -0.0201385 0.178639 0.0657137 -0.175914 0.0524283 -0.0168671 -0.0419511 0.0369626 0.0208505 0.116463 0.0180072 0.0865295 0.0298263 0.000314647 -0.176924 -0.0146273 -0.0262901 0.241292 -0.0489358 0.109484 -0.0429975 -0.0258753 -0.0181927 0.00692294 0.036029 -0.149194 0.0370946 -0.12879 -0.00676284 0.0311784 -0.0903789 -0.0555399 0.102594 0.0955858 0.142393 -0.0633939 -0.0352199 -0.0653647 -0.0441979 -0.0494125 -0.00849535 0.0211923 0.0600511 0.123658 0.037563 0.104243 -0.0181585 -0.0394789 -0.016892 -0.113503 -0.0817227 0.000518977 0.171905 0.092107 -0.0933383 0.121902 0.0114686 -0.0388344 -0.0274486 0.0172064 0.0287988 -0.00861492 0.101957 0.0156519 0.00555423 -0.0104999 0.153068 -0.00235695 -0.144548 0.0849162 0.0889375 -0.050182 -0.121507 0.0436114 0.102382 0.0547474 -0.092942 0.0612775 0.0133878 -0.101192 0.0810658 0.0542032 0.055514 
0.0303322 0.0275815 -0.101192 -0.0221887 -0.0298175 0.183732 -0.0240614 -0.00458787 -0.0796044 0.0718178 0.0271577 -0.00344665 0.0730178 -0.18943 -0.008077 -0.0161874 -0.166598 0.030981 0.0560302 0.0946574 0.0960153 -0.122088 0.111291 0.082498 -0.0241448 0.0653243 0.00548198 -0.311465 0.0184239 0.0289344 0.0238724 -0.00629322 -0.00707394 0.0342467 0.088539 0.010401 0.00224327 0.10158 0.00375524 -0.129624 -0.0147079 -0.212528 -0.0674747 0.147028 -0.143872 -0.0241856 0.166898 0.078287 -0.170045 0.0574679 -0.0120209 -0.0359403 0.0591822 0.0131783 0.105548 0.0220401 0.0845829 0.0139625 0.0102838 -0.19575 -0.0391499 -0.0280208 0.218373 -0.0840613 0.106037 -0.0351982 -0.00990959 -0.0250855 -0.0109493 0.0529663 -0.156281 0.0174547 -0.145916 -0.0242407 0.0265307 -0.105165 -0.0575171 0.100563 0.0992773 0.158744 -0.0762165 -0.035803 -0.0672233 -0.0526118 -0.0194406 -0.0172927 0.00926497 0.0465695 0.115098 0.0554865 0.110845 -0.0241463 -0.0353879 -0.0286251 -0.107414 -0.0836501 0.0014934 0.178811 0.069559 -0.0970542 0.127068 0.0237593 -0.0357606 -0.0285815 0.0271156 0.0202747 0.00151012 0.0775566 0.0282039 0.0123684 -0.018313 0.147647 -0.00759895 -0.143222 0.0883279 0.0728171 -0.0455677 -0.14352 0.0586324 0.112254 0.0801337 -0.0958544 0.0562798 0.0300467 -0.0712382 0.0515163 0.0838048 0.0600961 
0.0387851 0.0154203 -0.125111 -0.0117552 0.00932408 0.156203 -0.0171048 -0.0348835 -0.0582315 0.0364409 0.00908864 0.0401862 0.0612178 -0.200483 -0.0584084 0.0190696 -0.159509 0.0448782 0.0370909 0.106356 0.140577 -0.102348 0.102134 0.0674059 -0.0254524 0.0851655 0.00263368 -0.335905 0.0142937 0.0868244 -0.00224599 0.03811 0.00660436 0.033724 0.106075 -0.0177269 0.0125799 0.119194 0.0243485 -0.146398 -0.017312 -0.180044 -0.0344657 0.151781 -0.130935 -0.00487276 0.183823 0.0430745 -0.161111 0.0377752 0.00293244 -0.0428273 0.0633753 0.0215947 0.130804 0.0161021 0.107382 0.0109871 -0.0121374 -0.184233 -0.0124905 -0.0645324 0.22528 -0.0693105 0.122538 -0.0938226 -0.0387474 -0.0126041 0.00877194 0.0450002 -0.141217 0.00869958 -0.153963 -0.0505681 -0.00585206 -0.0736088 -0.0606219 0.105497 0.0650023 0.151128 -0.0686411 0.0118236 -0.0617999 -0.0282098 -0.0211783 -0.0245349 0.0187841 0.0551295 0.0942589 0.0447871 0.0884165 -0.0385857 -0.0775311 -0.0206286 -0.100016 -0.0633964 0.0030198 0.179174 0.0774366 -0.0911604 0.129618 0.0121933 -0.036821 0.011586 0.0148458 -0.0171366 -0.00857252 0.0986454 0.0133255 0.0153648 -0.0295784 0.118558 -0.0462868 -0.132272 0.0928235 0.0863207 -0.0689512 -0.161078 0.0354946 0.106077 0.0803479 -0.0322809 0.0687879 0.0123896 -0.062543 0.0478239 0.0778239 0.0403683 
0.0227017 0.0385201 -0.122864 -0.0197989 0.00509158 0.15958 -0.0346019 -0.0271913 -0.0495036 0.0512381 0.0325806 0.0500587 0.0534375 -0.209192 -0.0701312 0.0229754 -0.160796 0.0600757 0.0328935 0.0994591 0.138286 -0.093074 0.106771 0.0740643 -0.0258172 0.0827681 0.0419957 -0.316565 0.0282708 0.0839546 -0.00729752 0.00509024 0.0297498 0.0342098 0.0935913 -0.0220036 0.00894079 0.112978 0.0139566 -0.119447 -0.0178725 -0.184643 -0.0357189 0.167091 -0.142993 -0.0229761 0.189174 0.0313721 -0.172308 0.0425579 0.0199498 -0.0276022 0.0329736 0.0213234 0.116222 0.0312059 0.101348 0.00578578 -0.0203465 -0.176211 -0.0293491 -0.0902113 0.240356 -0.0658106 0.130928 -0.115788 -0.0498232 -0.0207286 -0.00121585 0.0734744 -0.134072 0.00351444 -0.153349 -0.0574839 0.00790232 -0.0707376 -0.0634664 0.131286 0.0471189 0.129654 -0.0855637 0.0169992 -0.041304 -0.00695067 -0.0305834 -0.0148182 0.02332 0.0560041 0.0995071 0.0498976 0.0643815 -0.058838 -0.0904057 -0.0117557 -0.0802479 -0.0753519 -0.0115985 0.176765 0.0713957 -0.0925241 0.11758 0.0152164 -0.0399391 0.0142223 0.0282294 -0.0122065 -0.00570283 0.090568 0.00970582 -0.00856004 -0.0372637 0.116502 -0.0292429 -0.112196 0.0923426 0.0749085 -0.0662546 -0.159554 0.0505677 0.114493 0.0872963 -0.0397915 0.0532632 0.00532103 -0.0491795 0.0590799 0.0874091 0.05256 
0.0227017 0.0385201 -0.122864 -0.0197989 0.00509158 0.15958 -0.0346019 -0.0271913 -0.0495036 0.0512381 0.0325806 0.0500587 0.0534375 -0.209192 -0.0701312 0.0229754 -0.160796 0.0600757 0.0328935 0.0994591 0.138286 -0.093074 0.106771 0.0740643 -0.0258172 0.0827681 0.0419957 -0.316565 0.0282708 0.0839546 -0.00729752 0.00509024 0.0297498 0.0342098 0.0935913 -0.0220036 0.00894079 0.112978 0.0139566 -0.119447 -0.0178725 -0.184643 -0.0357189 0.167091 -0.142993 -0.0229761 0.189174 0.0313721 -0.172308 0.0425579 0.0199498 -0.0276022 0.0329736 0.0213234 0.116222 0.0312059 0.101348 0.00578578 -0.0203465 -0.176211 -0.0293491 -0.0902113 0.240356 -0.0658106 0.130928 -0.115788 -0.0498232 -0.0207286 -0.00121585 0.0734744 -0.134072 0.00351444 -0.153349 -0.0574839 0.00790232 -0.0707376 -0.0634664 0.131286 0.0471189 0.129654 -0.0855637 0.0169992 -0.041304 -0.00695067 -0.0305834 -0.0148182 0.02332 0.0560041 0.0995071 0.0498976 0.0643815 -0.058838 -0.0904057 -0.0117557 -0.0802479 -0.0753519 -0.0115985 0.176765 0.0713957 -0.0925241 0.11758 0.0152164 -0.0399391 0.0142223 0.0282294 -0.0122065 -0.00570283 0.090568 0.00970582 -0.00856004 -0.0372637 0.116502 -0.0292429 -0.112196 0.0923426 0.0749085 -0.0662546 -0.159554 0.0505677 0.114493 0.0872963 -0.0397915 0.0532632 0.00532103 -0.0491795 0.0590799 0.0874091 0.05256 
0.0194369 0.0632254 -0.139506 -0.0398844 -0.00715923 0.137016 -0.0276753 -0.0279079 -0.0741172 0.0889912 0.0383099 0.0428531 0.0634698 -0.209096 -0.058721 0.0170862 -0.16688 0.0404715 0.0517661 0.112119 0.095494 -0.0737995 0.0806359 0.059429 -0.0416617 0.0956113 0.0659574 -0.291096 0.030392 0.103665 -0.0550878 -0.0207544 0.0347886 0.0285495 0.0957581 -0.0249121 0.0281171 0.0900415 0.00715747 -0.106945 -0.0287803 -0.210324 -0.010025 0.189608 -0.148711 0.0265409 0.204229 0.0521441 -0.185804 0.0531911 0.0362418 -0.0234571 0.00776439 0.0250911 0.131797 0.0267209 0.0644626 -0.0108752 -0.00789942 -0.153021 -0.0186199 -0.110697 0.233866 -0.0404835 0.121669 -0.138799 -0.0565452 -0.0228724 0.0105918 0.0411013 -0.130156 -0.00500779 -0.14014 -0.0666069 0.0217983 -0.0531914 -0.0607807 0.155494 0.0607745 0.12849 -0.0493114 -0.00162328 -0.0509239 0.0140981 -0.034583 -0.0127779 0.0122722 0.0378277 0.118897 0.0779662 0.0420056 -0.058938 -0.096028 -0.0112024 -0.110885 -0.0775578 0.00120892 0.152709 0.0984496 -0.124486 0.112365 0.0425142 -0.0219887 -0.00932082 0.000162804 -0.0171094 -0.0187574 0.117068 -0.0126912 0.0157102 -0.00235002 0.10284 -0.0267666 -0.110048 0.0500181 0.0649356 -0.0563918 -0.15604 0.0247151 0.0955237 0.0827535 -0.0496887 0.0653803 0.0223364 -0.0451258 0.0528494 0.0830886 0.0392776 
0.0271893 0.0779988 -0.142036 -0.0402047 -0.0195394 0.152611 -0.0341337 -0.0254172 -0.0822372 0.0915944 0.0463961 0.0338749 0.0553466 -0.204607 -0.0505231 0.00783064 -0.146281 0.0508211 0.077384 0.0875945 0.090272 -0.0602352 0.0835118 0.0582075 -0.035806 0.0883571 0.0829605 -0.283569 0.0354845 0.10568 -0.0502985 -0.033884 0.0431243 0.0227949 0.10079 -0.032173 0.0321605 0.0773696 0.0157152 -0.0980762 -0.0409649 -0.208905 -0.0158405 0.189961 -0.15287 0.0260898 0.200323 0.0403369 -0.197589 0.052801 0.0514618 -0.00115519 0.0147344 0.0234134 0.108796 0.0357526 0.0803864 -0.011869 -0.00681388 -0.147763 -0.0248601 -0.111043 0.237827 -0.060149 0.123498 -0.140888 -0.0510012 -0.0324315 -0.00191265 0.0635728 -0.131895 -0.0146134 -0.153766 -0.0706069 0.0167235 -0.0592513 -0.0590221 0.150721 0.0520237 0.124158 -0.0677036 -0.0039936 -0.0439925 0.0126886 -0.026032 -0.0165498 0.00196639 0.0143003 0.113231 0.0801721 0.0360354 -0.0609289 -0.0983187 -0.00869389 -0.0874134 -0.0829891 0.00865 0.1617 0.0892882 -0.11778 0.109803 0.0608189 -0.0206692 -0.00611812 0.00273857 -0.0190869 -0.00303309 0.101507 -0.0146376 0.00732071 -0.00031127 0.0868405 -0.0137085 -0.114705 0.0564828 0.0597376 -0.0458896 -0.162656 0.0456276 0.0997119 0.0894945 -0.070949 0.0595638 0.0131485 -0.026161 0.0500965 0.102149 0.0484453 
