-0.0596116 0.0550814 -0.106501 0.00929765 0.0202312 0.187849 0.00240569 -0.129635 -0.0313944 0.0247027 0.0222565 -0.000645822 0.0898851 0.0158609 -0.0183956 -0.0304494 -0.15134 0.0381073 0.0360017 0.0352615 0.119637 -0.17448 0.0511757 0.137528 0.0669415 -0.0130089 -0.111512 -0.207158 0.0671331 0.108024 0.103279 0.014999 -0.067603 -0.0608986 0.0335589 0.130537 -0.145793 0.00918791 -0.0388306 -0.0641469 0.00868513 -0.0800167 -0.0694395 0.117963 -0.0920409 -0.0239606 0.141852 0.0720809 -0.0857625 -0.0779323 -0.08323 -0.0333596 0.0938832 -0.0879871 0.0858293 0.109898 -0.0125869 0.214809 0.0362715 -0.147271 -0.0837046 0.106313 0.245529 -0.0792426 0.0778897 0.099934 0.0238375 0.000424451 -0.0609122 0.0772192 -0.0198179 0.13453 -0.0734799 -0.0455704 0.0582015 0.000528404 -0.0881349 0.000821364 0.0406901 0.0693718 -0.0394003 0.0304518 -0.059972 -0.0510303 -0.107702 0.0257813 0.0277606 -0.00201198 0.0179049 -0.0228975 0.0927034 -0.0273673 0.0538472 -0.0576228 -0.0504473 -0.0869183 -0.0513145 0.141673 0.0901806 -0.0196513 0.092524 -0.00382994 0.000819615 -0.0600196 -0.125177 0.150098 -0.059499 0.0264573 0.0218073 0.0133178 0.0331513 0.0933982 -0.0384713 -0.141572 0.0464574 0.14381 -0.0871603 -0.0270044 0.0449596 0.132266 0.0405046 -0.154191 -0.0502615 -0.00345553 -0.218024 0.198173 -0.0608661 0.088344 
-0.0710078 0.0764309 -0.089904 0.0145497 0.0128388 0.2014 0.00583633 -0.145536 -0.0132256 0.0142676 0.00870366 -0.0162542 0.0762314 0.0306509 -0.0168821 -0.0364691 -0.148859 0.0422362 0.024543 0.00924527 0.108868 -0.176246 0.0501542 0.122981 0.0695893 -0.0336646 -0.14187 -0.180174 0.0605214 0.094885 0.126607 0.0311817 -0.0761874 -0.0545169 0.0461345 0.141583 -0.132701 0.0160488 -0.0295508 -0.0645966 0.0104686 -0.0702565 -0.0586328 0.0794132 -0.0744043 -0.0319327 0.127377 0.0748893 -0.0831693 -0.0707344 -0.0990983 -0.0202447 0.104441 -0.0821376 0.0781439 0.112631 -0.00585412 0.213781 0.0231351 -0.153696 -0.0928198 0.138764 0.235049 -0.112019 0.0791412 0.132613 0.0344634 -0.00103247 -0.0892548 0.101375 -0.00944544 0.133555 -0.0734836 -0.0160069 0.058382 -0.000588858 -0.0816514 -0.0313626 0.042652 0.0413941 -0.043065 0.040526 -0.0571021 -0.0513811 -0.112014 0.0241375 0.0120562 -0.00780596 0.0179197 -0.014574 0.103264 -0.0406149 0.0895787 -0.0653825 -0.0232207 -0.0793338 -0.0510273 0.149734 0.0749313 0.0027014 0.0882217 -0.00514655 -0.0159118 -0.048817 -0.109128 0.161786 -0.0484806 0.00679487 0.0197168 0.0229975 0.0190178 0.0877106 -0.0307911 -0.125763 0.0517498 0.133693 -0.0728493 -0.0114932 0.0637452 0.134269 0.0531815 -0.159549 -0.0424371 -0.00831067 -0.215317 0.193661 -0.0513208 0.0834343 
-0.0585044 0.0890655 -0.107808 0.0073187 0.0118459 0.201919 0.0231315 -0.133703 -0.0440221 0.0442699 0.00622118 -0.0198542 0.0927776 0.0255887 -0.0143269 -0.0364433 -0.136031 0.0517742 0.0256474 0.00797979 0.101881 -0.184778 0.0574795 0.117169 0.0615905 -0.0291644 -0.14395 -0.188244 0.0735397 0.0999181 0.105528 0.0572223 -0.0910178 -0.051293 0.0362809 0.120005 -0.134851 0.0295532 -0.0217014 -0.0624251 0.00571521 -0.0824971 -0.0598154 0.0892297 -0.0898091 -0.0239751 0.130359 0.0809296 -0.101667 -0.0726075 -0.0742853 -0.00704992 0.0867817 -0.0842027 0.0697974 0.105041 0.0102411 0.217988 0.0409524 -0.153769 -0.0871157 0.131835 0.23686 -0.114663 0.0797367 0.12372 0.0283496 0.00330975 -0.0884824 0.100618 -0.0223846 0.139366 -0.0761428 -0.0014299 0.0480124 -0.0104791 -0.0772522 -0.0221707 0.0455045 0.0382228 -0.0495236 0.0279392 -0.0611342 -0.0594419 -0.110652 0.0156201 0.0150717 -0.0184166 0.0322162 -0.0202111 0.0955104 -0.0387214 0.0789874 -0.0774315 -0.0224751 -0.0839349 -0.0315674 0.159604 0.0763855 -0.00318852 0.0897233 0.0103022 -0.00717599 -0.0175832 -0.114814 0.145054 -0.0615231 0.0328836 0.0324144 0.0130854 0.0224475 0.104049 -0.0348409 -0.126886 0.0533469 0.124865 -0.0686679 -0.0267557 0.0745481 0.135613 0.0513008 -0.165002 -0.0368165 -0.00331826 -0.213733 0.175463 -0.0638368 0.074967 
-0.0567138 0.0841179 -0.121532 -0.00755623 0.0315435 0.178929 0.0110733 -0.146944 -0.0296728 0.0202868 0.0182365 -0.00539452 0.0946615 0.0567108 -0.0265382 -0.0273649 -0.125884 0.0421032 0.0222483 0.0243717 0.110762 -0.158546 0.0577731 0.118295 0.0572522 -0.0158838 -0.121539 -0.176159 0.0957903 0.117346 0.10509 0.0361375 -0.0759753 -0.0748274 0.0286132 0.130553 -0.140985 0.0462968 -0.0266533 -0.0391391 -0.0111998 -0.0337235 -0.0783739 0.105981 -0.0943955 -0.010529 0.137003 0.070849 -0.0786117 -0.0845665 -0.0972564 -0.000846757 0.0759976 -0.0880287 0.0650599 0.105567 -0.000510057 0.248141 0.0300675 -0.14095 -0.095864 0.114287 0.260908 -0.0950238 0.0718567 0.0979098 0.0359614 0.0167957 -0.0676892 0.093256 0.00918398 0.141637 -0.0609185 -0.0178609 0.0501228 6.20732e-05 -0.0946551 -0.0180908 0.0288633 0.0307619 -0.0305056 0.055202 -0.0679574 -0.0529997 -0.102 0.0111076 0.015998 -0.0122037 0.0177828 -0.0418562 0.0928859 -0.0378036 0.0663329 -0.0713984 0.00242347 -0.101666 -0.0408717 0.15379 0.0810004 -0.00285148 0.0629777 -0.000716564 0.000882072 -0.0240975 -0.15719 0.158186 -0.0654847 0.0179726 0.0472289 0.00516672 0.044626 0.0942801 -0.0452573 -0.103921 0.0379791 0.141873 -0.083185 -0.0326436 0.050261 0.124971 0.030458 -0.140476 -0.0522108 0.000159349 -0.228111 0.184955 -0.0805388 0.0788509 
-0.0660748 0.0544012 -0.105612 0.026828 0.0439635 0.174128 0.00287157 -0.151677 -0.0351023 0.0230776 0.0210111 0.0163611 0.0723181 0.044214 -0.0285339 -0.0238095 -0.108852 0.0687497 0.0487972 0.0362757 0.114322 -0.171477 0.0420989 0.1475 0.0749192 -0.0181147 -0.121319 -0.187621 0.0802075 0.115291 0.115314 0.031676 -0.069573 -0.0817755 0.0300386 0.1474 -0.163011 -0.00854735 -0.0403751 -0.0534909 0.00422855 -0.0342552 -0.0674036 0.105776 -0.0869717 -0.0199289 0.146327 0.0565096 -0.0744464 -0.101224 -0.0809381 -0.0259069 0.0856423 -0.112318 0.072762 0.122003 -0.0142322 0.236667 0.0421609 -0.113189 -0.0858667 0.120536 0.240113 -0.097833 0.091523 0.086262 0.0240526 -0.0162529 -0.0786343 0.0978558 0.00752617 0.147187 -0.0613731 -0.0400319 0.0350677 0.00948912 -0.0792181 0.0125227 0.0174661 0.0213863 -0.0518712 0.0635273 -0.0719769 -0.0471855 -0.10267 0.0179401 0.0172635 -0.0142866 -0.00264302 -0.0395221 0.0790079 -0.00779307 0.0554354 -0.0645251 0.00375346 -0.079441 -0.0470415 0.140604 0.0746925 -0.00093065 0.063761 -0.00781596 0.00118917 -0.0561254 -0.137651 0.165564 -0.0439077 -0.00396517 0.032565 0.0203713 0.0208638 0.0736679 -0.0247151 -0.131066 0.03914 0.129227 -0.0765337 -0.0403698 0.0429108 0.12733 0.0248192 -0.145084 -0.0649028 -0.0136472 -0.227236 0.211222 -0.0727836 0.0766037 
-0.0703958 0.0631111 -0.106066 0.0250735 0.0385625 0.175829 0.00293244 -0.152034 -0.0278407 0.0288111 0.0266786 0.00978878 0.0715386 0.0316272 -0.0320493 -0.0212264 -0.120919 0.0689611 0.0432495 0.0321929 0.115761 -0.173169 0.0434579 0.136173 0.0726723 -0.0162908 -0.126842 -0.190282 0.0898483 0.110381 0.121023 0.0308335 -0.0736406 -0.0841151 0.0375082 0.144398 -0.161904 0.00048396 -0.0292096 -0.0523817 0.00286167 -0.0400812 -0.0771008 0.108116 -0.086049 -0.0281296 0.141087 0.0615128 -0.0721854 -0.10282 -0.0893694 -0.0125855 0.0800863 -0.111896 0.062564 0.117574 -0.0101915 0.231205 0.0309522 -0.114897 -0.0906233 0.113907 0.250786 -0.0940736 0.0926311 0.0844355 0.0274781 -0.0177295 -0.0754592 0.099909 0.00560822 0.148344 -0.0600459 -0.0315043 0.0344761 -0.00368755 -0.0838711 0.0125967 0.0171029 0.0270176 -0.0508127 0.0590986 -0.069653 -0.042791 -0.103856 0.0163104 0.016837 -0.00914175 0.00323943 -0.0444882 0.0842892 -0.00869684 0.0568732 -0.0620664 0.00443817 -0.090455 -0.0491986 0.141391 0.0700165 0.00138424 0.0652574 -0.00943252 -0.00620764 -0.0547017 -0.122783 0.167067 -0.0312928 0.00137763 0.0474589 0.023174 0.0148464 0.0760613 -0.0278651 -0.12342 0.0448884 0.130086 -0.0752167 -0.0337157 0.0500811 0.124554 0.0248557 -0.14661 -0.064242 -0.0126764 -0.226166 0.207865 -0.0704411 0.082548 
-0.0645289 0.0703599 -0.108611 0.0126902 0.0290376 0.184465 0.00494339 -0.145169 -0.0355925 0.0223536 0.0182441 -0.00299655 0.0833912 0.0351169 -0.0204143 -0.0277489 -0.134655 0.0509183 0.0368139 0.027779 0.111438 -0.171362 0.0550851 0.120424 0.0695782 -0.0206271 -0.131797 -0.190336 0.0801318 0.10769 0.11536 0.0329636 -0.0755509 -0.0757769 0.0356166 0.136069 -0.151484 0.0158195 -0.0272913 -0.0513555 0.0031311 -0.051614 -0.0736568 0.102816 -0.0940001 -0.0200965 0.140791 0.0659763 -0.0806785 -0.0873304 -0.0931188 -0.0130237 0.0890034 -0.0947793 0.062777 0.107014 -0.000715741 0.22765 0.0331107 -0.134024 -0.0918392 0.123258 0.246839 -0.0940637 0.0798841 0.104914 0.032999 -0.00162454 -0.0732813 0.0888229 0.000565824 0.145497 -0.0633292 -0.0245257 0.0500234 -0.000777265 -0.0934192 -0.016017 0.0296205 0.0461286 -0.0422074 0.0460547 -0.0659339 -0.047613 -0.104291 0.0227236 0.0153193 -0.0109793 0.00977829 -0.0399159 0.0917265 -0.020225 0.0640996 -0.0651623 -0.0159802 -0.0954282 -0.0448561 0.153048 0.0741566 -0.00547714 0.0700516 -0.00535117 0.000519617 -0.0446137 -0.133899 0.163178 -0.0474501 0.0216583 0.0417304 0.0170829 0.0284276 0.0836574 -0.036879 -0.126593 0.0406651 0.136179 -0.0815075 -0.0252751 0.0551802 0.128695 0.0334138 -0.15219 -0.0562507 -0.00806062 -0.221383 0.19449 -0.0682272 0.0870601 
-0.0599992 0.0736338 -0.123568 0.00455361 0.0275999 0.171347 0.00529124 -0.143364 -0.035609 0.0240109 0.0303929 0.00269819 0.087395 0.042205 -0.0352604 -0.0161674 -0.134531 0.0381188 0.030221 0.0377947 0.10816 -0.172304 0.0586508 0.117403 0.0592589 -0.00506861 -0.112473 -0.18415 0.0972397 0.106466 0.101625 0.0303526 -0.0779869 -0.0840147 0.0170363 0.133629 -0.155739 0.040836 -0.0250325 -0.0331232 -0.00836773 -0.0403272 -0.0888201 0.106786 -0.0922338 -0.0156301 0.142023 0.0594066 -0.0794311 -0.0892502 -0.100292 -0.000542291 0.0673481 -0.0915648 0.059365 0.103161 -0.001807 0.245286 0.0279361 -0.125098 -0.0938154 0.107553 0.269647 -0.0884008 0.0776251 0.0974553 0.0333542 0.00746918 -0.0597745 0.0882559 0.00371473 0.150931 -0.0565084 -0.00882181 0.0569927 -0.00748946 -0.0887533 -0.00307612 0.0194637 0.035788 -0.0377772 0.0444561 -0.0715887 -0.0560048 -0.108987 0.0222102 0.0165934 -0.00689439 0.0136353 -0.0566419 0.0908555 -0.0272988 0.0586139 -0.0625389 0.00416579 -0.102954 -0.040251 0.144919 0.0858141 -0.00291889 0.0511221 -0.0149984 -0.00469055 -0.0305185 -0.142488 0.168674 -0.0505108 0.0276358 0.04983 -0.00152962 0.0305748 0.0985387 -0.0313287 -0.108585 0.0427919 0.138143 -0.0852337 -0.024334 0.0559335 0.122593 0.0175917 -0.141335 -0.0543839 -0.00175568 -0.226803 0.195804 -0.0838118 0.0832937 
-0.0630292 0.0766302 -0.129486 0.00548231 0.0360074 0.181878 -0.0012878 -0.147844 -0.0270933 0.0323274 0.0345628 0.012909 0.077073 0.0400197 -0.0366665 -0.0135401 -0.11877 0.0600834 0.0467037 0.0237832 0.115787 -0.155681 0.0389081 0.137161 0.0678113 -0.00968319 -0.0996872 -0.180283 0.10098 0.126907 0.107309 0.0261874 -0.0687661 -0.0853021 0.0233917 0.13997 -0.156544 -0.00362836 -0.0216017 -0.0303722 -0.00961873 -0.038083 -0.0738734 0.115106 -0.0824841 -0.0263212 0.147392 0.0558767 -0.0773212 -0.101593 -0.0794454 -0.00229693 0.0720939 -0.103911 0.0580632 0.126572 -0.0103215 0.244778 0.0262845 -0.112252 -0.0954138 0.102349 0.269708 -0.0986899 0.080819 0.08076 0.0268645 -0.0102748 -0.0713104 0.100213 0.00578706 0.146498 -0.0695971 -0.0327996 0.0435224 0.00281224 -0.0798587 0.0105743 0.00612051 0.0193749 -0.0396522 0.0646482 -0.0646883 -0.0387555 -0.105296 0.0246424 0.0150192 -0.0216783 0.00819445 -0.0434494 0.0754902 -0.0246939 0.0420132 -0.0527546 0.0190989 -0.0873655 -0.0506175 0.138726 0.0782326 0.00336551 0.0592728 -0.0118492 -0.00504523 -0.0425364 -0.144856 0.17034 -0.0481572 -0.00171542 0.0292642 0.00871445 0.0280471 0.0753962 -0.0243464 -0.116849 0.039203 0.134054 -0.0730456 -0.0328931 0.0551084 0.124629 0.0327306 -0.151889 -0.0525028 -0.0156178 -0.227862 0.207723 -0.0779854 0.0822785 
-0.0571084 0.0781147 -0.118854 0.00114097 0.0198867 0.176911 0.0118778 -0.142672 -0.04122 0.0237119 0.0170483 -0.00355148 0.0868677 0.0524782 -0.0318004 -0.0249546 -0.129318 0.0384992 0.036391 0.0236305 0.105261 -0.166903 0.0546547 0.119056 0.0578998 -0.00687354 -0.119099 -0.180135 0.0946455 0.111388 0.0969577 0.035834 -0.08396 -0.0829999 0.0212302 0.128406 -0.156942 0.0413275 -0.0290643 -0.0356214 -0.0162154 -0.0372983 -0.0844845 0.10478 -0.0867994 -0.00841707 0.138967 0.0582401 -0.085495 -0.0876457 -0.0890498 0.00395402 0.0784109 -0.0908115 0.0655172 0.103638 0.00437758 0.250005 0.0373627 -0.134055 -0.0865204 0.117955 0.261761 -0.0917442 0.0747803 0.099235 0.0376851 0.0077971 -0.0663667 0.0950137 0.00383495 0.148787 -0.0584332 -0.00598213 0.0496557 -0.00436564 -0.0886516 -0.0164727 0.0265493 0.034239 -0.0344464 0.0458647 -0.071761 -0.0616102 -0.10399 0.00699805 0.0152962 -0.0157451 0.0171287 -0.0493046 0.0868472 -0.0258581 0.0650396 -0.0688457 0.00635037 -0.0934943 -0.0282365 0.14949 0.0867537 -8.62881e-05 0.0586227 0.00068756 -0.00306817 -0.0273403 -0.155865 0.160206 -0.05852 0.0193777 0.04464 -0.000123139 0.0435338 0.0994748 -0.0351216 -0.118006 0.0443434 0.140791 -0.0781089 -0.0304681 0.0566215 0.121287 0.0216741 -0.147071 -0.0480404 -0.0103525 -0.224474 0.193489 -0.0778056 0.0783863 
-0.0597319 0.0942224 -0.132083 0.00243942 0.0236319 0.175459 0.00937593 -0.148297 -0.0432733 0.0401922 0.0185678 -0.0166452 0.0954178 0.0630549 -0.0174796 -0.0153082 -0.111501 0.0394737 0.0412631 0.0216561 0.0985464 -0.171757 0.0629179 0.101279 0.06167 -0.0131388 -0.129942 -0.176383 0.100746 0.117288 0.100768 0.0554149 -0.0714622 -0.0833832 0.0259274 0.134704 -0.139438 0.0499843 -0.0214915 -0.0455099 -0.0214602 -0.0384322 -0.0738701 0.0934701 -0.0893894 0.0019768 0.13991 0.0665565 -0.0876772 -0.0963351 -0.091018 0.0119479 0.0808075 -0.0936933 0.0592141 0.103674 0.00865687 0.234206 0.0398077 -0.134281 -0.0978584 0.115762 0.252747 -0.107291 0.0826423 0.115485 0.0314653 0.0179545 -0.0716523 0.0878447 0.0044417 0.14552 -0.0651971 -0.0140668 0.0532661 -2.06621e-05 -0.0858104 -0.0192071 0.0264144 0.0251658 -0.0349043 0.0422149 -0.0768062 -0.0575405 -0.100639 0.0149843 0.00196479 -0.0211503 0.021928 -0.0442671 0.0828592 -0.0265899 0.0640928 -0.0669417 0.0109733 -0.0957314 -0.0283119 0.160274 0.0797867 -0.00205839 0.0639176 9.68707e-05 0.00220731 -0.0257078 -0.158738 0.164661 -0.0556882 0.0194163 0.0589197 0.00461202 0.0317523 0.0933785 -0.0347258 -0.115623 0.046303 0.131472 -0.0813467 -0.0306079 0.0594309 0.12342 0.0265023 -0.150541 -0.0405852 -0.00230212 -0.21802 0.187347 -0.0736872 0.0781372 
-0.0605793 0.0649344 -0.117843 0.0190405 0.0338184 0.168939 0.0084174 -0.145421 -0.0335131 0.0302873 0.0277297 0.00342406 0.0812624 0.0544714 -0.0229333 -0.0168373 -0.101632 0.0573237 0.0466127 0.0348598 0.105139 -0.16866 0.0584583 0.134703 0.0632173 -0.0145288 -0.117876 -0.186348 0.0971909 0.109482 0.115191 0.0365682 -0.0687484 -0.0868909 0.0270257 0.144358 -0.15483 0.0336589 -0.038216 -0.0415463 -0.0169097 -0.0226701 -0.0908034 0.102391 -0.0911443 -0.0158321 0.139173 0.0582225 -0.0709921 -0.0992357 -0.0905103 -0.00653676 0.0782143 -0.109416 0.0592164 0.113922 -0.00274729 0.245159 0.0393556 -0.115143 -0.0980524 0.109801 0.253989 -0.1083 0.0924926 0.0896514 0.0338668 -0.00487012 -0.0770378 0.0985293 0.00899107 0.150796 -0.0611902 -0.0198529 0.0369688 -0.00589918 -0.079623 0.00700241 0.0180221 0.0183231 -0.0479861 0.0531031 -0.0835091 -0.0612991 -0.0956957 0.0064624 0.00783145 -0.0170725 0.00618696 -0.053343 0.0827917 -0.010427 0.0601538 -0.0680238 0.0269508 -0.0897072 -0.036271 0.144197 0.0758672 0.00506478 0.0520556 -0.00961981 -0.00410675 -0.0427562 -0.147399 0.165945 -0.0396794 -0.00914431 0.0599018 0.00918296 0.0197135 0.091936 -0.0199714 -0.120585 0.0462587 0.132601 -0.072871 -0.0400145 0.048912 0.125918 0.0147501 -0.14332 -0.0595567 -0.00105778 -0.223764 0.201128 -0.0768327 0.0755392 
-0.0601152 0.0894753 -0.113476 0.00455636 0.0185703 0.199272 0.0122545 -0.150921 -0.0328675 0.0264665 0.0109964 -0.00812423 0.0784955 0.050774 -0.00978169 -0.0326992 -0.114559 0.0469593 0.0443348 3.5209e-05 0.0941141 -0.151687 0.0523595 0.124615 0.0618824 -0.0202146 -0.120346 -0.17624 0.083581 0.112805 0.116495 0.0481362 -0.0741168 -0.0668505 0.0412963 0.138397 -0.13307 0.0246431 -0.0278972 -0.0448983 -0.00701377 -0.0485823 -0.0687937 0.0917379 -0.0874112 -0.00642889 0.134712 0.0687916 -0.091933 -0.085265 -0.079347 0.00260001 0.0970867 -0.0950921 0.0671927 0.120409 -0.000612853 0.241904 0.0304457 -0.131292 -0.101626 0.125755 0.251132 -0.128458 0.0920424 0.1083 0.0349117 -0.00313426 -0.0971708 0.116309 -0.00517002 0.133682 -0.0787534 -0.0120998 0.0453606 -0.000522864 -0.0797117 -0.0235935 0.028214 0.0197304 -0.0425 0.0489873 -0.0703798 -0.0594495 -0.102978 -0.000210795 0.00578506 -0.0328198 0.00960053 -0.019557 0.0907487 -0.0333346 0.0717759 -0.0695486 0.0170243 -0.0744964 -0.0278072 0.151122 0.0818565 0.00588374 0.0684 0.00932431 -0.0120958 -0.0323561 -0.14562 0.154396 -0.055244 -0.00601605 0.0307365 0.0133237 0.0349441 0.0900374 -0.0258653 -0.125538 0.049379 0.128007 -0.0650195 -0.0375764 0.070779 0.137074 0.052803 -0.163026 -0.0397573 -0.00807751 -0.210036 0.189148 -0.0585061 0.0714588 
-0.0583469 0.0936135 -0.099767 0.00175038 0.0237941 0.198813 0.0281705 -0.149483 -0.0317463 0.0273101 0.0148698 -0.00928075 0.0782767 0.0466334 -0.00452678 -0.0450235 -0.131599 0.0395111 0.0267182 -0.00199439 0.0929969 -0.157919 0.0331654 0.118086 0.0694682 -0.0270246 -0.135015 -0.162345 0.086908 0.108964 0.114727 0.0410198 -0.0943965 -0.0653937 0.0369695 0.134333 -0.147294 0.0114448 -0.0226073 -0.0456756 0.00925953 -0.0569321 -0.0700362 0.0933261 -0.0831814 -0.00702287 0.120722 0.0740565 -0.0927942 -0.0932607 -0.0880152 0.00658678 0.0835781 -0.101654 0.0623317 0.117049 -0.0277037 0.253075 0.0203982 -0.121919 -0.0977467 0.131274 0.250265 -0.109557 0.0828328 0.12227 0.0365493 -0.000420927 -0.0978319 0.107366 0.00377822 0.142467 -0.0648827 -0.00917034 0.0480959 0.00190957 -0.079916 -0.0352744 0.0334897 0.0299408 -0.0362572 0.0386368 -0.0618035 -0.0554601 -0.107835 -0.000509631 0.0179042 -0.0284399 0.0111294 -0.0164471 0.0979411 -0.0405603 0.0754163 -0.0639529 -0.00445407 -0.0847374 -0.0316805 0.127797 0.0839913 0.00749922 0.0664925 0.0119512 -0.0115092 -0.0361707 -0.147433 0.16571 -0.0543047 0.0160854 0.0325524 0.00985843 0.0496524 0.0877249 -0.0414256 -0.114966 0.050487 0.126742 -0.0750575 -0.0146772 0.0725355 0.134326 0.0471503 -0.166835 -0.0526265 -0.00159649 -0.202039 0.190372 -0.0634625 0.0663576 
-0.0609647 0.0852144 -0.0898754 0.00715407 -0.00333162 0.204585 0.0225876 -0.129415 -0.0165177 0.0120772 0.020014 -0.0113229 0.0715717 0.0526322 -0.00649946 -0.0617182 -0.132939 0.0237108 0.0321916 -0.00792983 0.0865836 -0.154904 0.0267956 0.13418 0.0634757 -0.0281127 -0.117079 -0.15365 0.0812069 0.0909228 0.124402 0.0274321 -0.0888551 -0.0656336 0.0225316 0.14147 -0.146866 0.0145825 -0.0449374 -0.0304352 0.0150209 -0.05577 -0.0878421 0.0936393 -0.080151 -0.027403 0.113844 0.0613388 -0.0850472 -0.0860533 -0.0893918 0.0139708 0.0898084 -0.0933607 0.0678957 0.125722 -0.032842 0.255166 0.0287311 -0.133848 -0.108292 0.129918 0.250413 -0.114883 0.0716221 0.127948 0.0610263 -0.0191432 -0.099665 0.119378 -0.00287582 0.129365 -0.0609884 0.00553899 0.0623587 -0.00767936 -0.0783963 -0.0349337 0.0303621 0.0335914 -0.0456374 0.033599 -0.0562262 -0.0708776 -0.0959779 -0.000709835 0.0218914 -0.0335306 0.010054 -0.0186573 0.0979659 -0.0473701 0.0832689 -0.0709628 0.0055022 -0.0843716 -0.0257898 0.117375 0.0873849 0.0124216 0.0577414 0.0175417 -0.0112121 -0.0405559 -0.151717 0.170013 -0.0527582 -0.00275532 0.0196472 -0.00383893 0.0490616 0.0940017 -0.0354256 -0.125699 0.051516 0.122796 -0.0572103 -0.0275067 0.0891162 0.133208 0.051705 -0.176327 -0.0536319 -0.00677925 -0.193483 0.192039 -0.0494984 0.0803633 
-0.0466233 0.0946752 -0.115505 0.00529019 0.0158825 0.206298 0.0362851 -0.151194 -0.0488979 0.0257403 -0.00982366 -0.0138387 0.0752028 0.0543735 -0.0310041 -0.0256431 -0.124609 0.0485649 0.0360613 -0.00981087 0.0963664 -0.156194 0.0369116 0.112802 0.0531249 -0.0196965 -0.145479 -0.158799 0.0798296 0.116976 0.0816274 0.0741867 -0.113814 -0.0620883 0.0328075 0.120489 -0.13799 0.0215346 -0.0148145 -0.0499124 -0.00664983 -0.0467593 -0.0430313 0.0687925 -0.0694202 -0.00919773 0.129876 0.0664738 -0.105699 -0.0721288 -0.0662099 0.00378737 0.0897537 -0.0748033 0.0829586 0.104247 0.0137037 0.246735 0.0350301 -0.140569 -0.0777447 0.151628 0.25176 -0.130783 0.0735719 0.129875 0.0295228 1.02193e-05 -0.0940095 0.114284 -0.00673156 0.148166 -0.0667315 0.0267941 0.0352013 0.00425864 -0.0619253 -0.0437694 0.0352696 -0.00222679 -0.0198704 0.0532767 -0.0657374 -0.0718607 -0.109703 0.00593308 0.00111364 -0.0321696 0.0236708 -0.0149965 0.0990345 -0.0377838 0.0733284 -0.0756373 0.0164958 -0.0568727 -0.00876049 0.153892 0.0880823 0.0162758 0.0821519 0.0130864 -0.0113583 -0.010408 -0.150304 0.149628 -0.0685548 0.011477 0.00923049 0.0167212 0.0477202 0.0973858 -0.0227451 -0.124781 0.0540884 0.126629 -0.0520951 -0.0183866 0.0717019 0.117284 0.046613 -0.163616 -0.00643926 -0.0231489 -0.222745 0.187035 -0.0691506 0.0547235 
-0.059039 0.0847044 -0.0943547 0.00563164 0.0230179 0.209995 0.0422247 -0.149288 -0.046931 0.0288702 -0.0124586 -0.0092841 0.0690529 0.0440359 -0.000795016 -0.0555919 -0.139254 0.0455861 0.0369751 -0.0151459 0.073223 -0.149625 0.0272225 0.114422 0.0563949 -0.023801 -0.156707 -0.159801 0.0666233 0.0970022 0.10144 0.0540314 -0.119878 -0.065157 0.0439769 0.13093 -0.13776 -0.00553584 -0.0237225 -0.0426153 0.0285117 -0.0487721 -0.0540806 0.0803406 -0.0931191 -0.00754515 0.119681 0.0748775 -0.0867775 -0.077055 -0.0787089 -0.00939126 0.0878254 -0.0859975 0.0780366 0.107089 -0.0108785 0.251557 0.034614 -0.125498 -0.0882162 0.160286 0.235885 -0.116836 0.0772096 0.127963 0.0462778 -0.0100033 -0.0911685 0.107767 0.0039059 0.15691 -0.0465373 0.0227564 0.0423727 0.00839853 -0.0890527 -0.0447248 0.0438468 0.00911961 -0.0198578 0.0512495 -0.0564634 -0.0573024 -0.108905 0.00327147 0.0223194 -0.0279277 0.00907839 -0.0166253 0.105124 -0.0296627 0.0901866 -0.0886322 -0.0103055 -0.0771052 -0.0173883 0.133634 0.0836881 0.0134551 0.0703461 0.0188338 0.00140332 -0.0353639 -0.146535 0.152033 -0.062788 0.0145906 0.00566902 0.0404914 0.0634207 0.0866913 -0.0269422 -0.129845 0.0359764 0.120485 -0.0545925 -0.0173615 0.0653919 0.113349 0.0595927 -0.173706 -0.0330052 -0.0145538 -0.218865 0.183823 -0.0769803 0.0659451 
-0.0484472 0.0816918 -0.109619 -0.00108004 0.0291932 0.196481 0.0422027 -0.143998 -0.0635844 0.0351117 -0.00710131 -0.00327115 0.088375 0.0414599 -0.0300342 -0.0450483 -0.127641 0.0628693 0.0331626 0.0143194 0.0981265 -0.163292 0.0416759 0.120037 0.0433269 -0.0159823 -0.151907 -0.173629 0.0806328 0.111876 0.0763439 0.0544103 -0.11428 -0.0637805 0.0433815 0.11456 -0.139308 0.0270082 -0.022312 -0.0589486 0.00530767 -0.0477856 -0.0542686 0.0908945 -0.101696 -0.00728094 0.133461 0.0767342 -0.0991805 -0.0679907 -0.0734158 -0.00594565 0.0737642 -0.0762692 0.0843836 0.0959895 0.01067 0.244915 0.0343421 -0.138074 -0.0715897 0.145797 0.252046 -0.109831 0.0803812 0.0994124 0.0289966 -0.00309123 -0.0837327 0.102862 -0.00222335 0.150314 -0.0556287 0.0193599 0.0281777 0.00366527 -0.0795901 -0.0222175 0.0529096 0.00621969 -0.0343133 0.0491874 -0.0637247 -0.0572303 -0.106757 -0.000258136 0.018669 -0.0146464 0.0307053 -0.0245582 0.10303 -0.0304715 0.081206 -0.0866165 -0.0069577 -0.0902127 -0.0135116 0.157556 0.0815362 0.00238689 0.0815248 0.0270502 -0.00041472 -0.0152343 -0.140707 0.144101 -0.0649991 0.0291495 0.0247 0.0269197 0.0511789 0.0947443 -0.0326753 -0.118811 0.0384639 0.131566 -0.0567366 -0.0331745 0.0544243 0.118227 0.0347522 -0.160445 -0.0328553 -0.0155841 -0.232389 0.18253 -0.0810033 0.0597645 
-0.045126 0.0899431 -0.109249 0.00412439 0.0244098 0.206731 0.0496941 -0.145544 -0.0563001 0.0396356 -0.00635235 -0.00736991 0.0813011 0.0397719 -0.022645 -0.0456615 -0.125966 0.0597948 0.0362593 -0.0074073 0.0965286 -0.158523 0.0244981 0.119844 0.0545029 -0.0203003 -0.157471 -0.169243 0.0798399 0.118865 0.0817865 0.0642941 -0.123832 -0.0628734 0.0432629 0.1134 -0.144047 0.00951406 -0.0137891 -0.0559769 0.00772901 -0.0513515 -0.0523276 0.0863541 -0.0851447 -0.00912797 0.124373 0.0727578 -0.101698 -0.0819026 -0.0622306 0.00161577 0.0810306 -0.0854343 0.0798358 0.104054 0.000331969 0.249238 0.0333222 -0.132468 -0.0721731 0.146714 0.246986 -0.118111 0.078186 0.110977 0.0340454 -0.00524034 -0.0916025 0.104076 -0.00141151 0.154332 -0.0594244 0.0165016 0.0233621 0.00565855 -0.0743766 -0.0340154 0.0461992 0.0106966 -0.0297691 0.0492148 -0.0598933 -0.0603467 -0.106007 -0.00436413 0.0196772 -0.0302094 0.0269569 -0.0192405 0.0960043 -0.0334883 0.0775323 -0.0785923 -0.00670553 -0.0775508 -0.00817262 0.140573 0.0828872 0.0110735 0.0860416 0.0292311 -0.00409859 -0.0162467 -0.148265 0.144496 -0.0641144 0.0220867 0.0145585 0.0288118 0.0577921 0.0893391 -0.0358335 -0.126885 0.0468237 0.127305 -0.0601413 -0.0254035 0.0617246 0.115159 0.043764 -0.167603 -0.0265544 -0.0189833 -0.219322 0.185227 -0.076494 0.0540962 
-0.0372515 0.0860287 -0.12135 0.0065388 0.0197438 0.195848 0.0497605 -0.146504 -0.0641668 0.037867 -0.0137287 -0.0128659 0.0864465 0.0618755 -0.0290078 -0.0286975 -0.11201 0.0448812 0.044368 -0.00119185 0.0936136 -0.161928 0.0256287 0.115149 0.0515328 -0.00903693 -0.157723 -0.159761 0.0860685 0.124835 0.066236 0.0840646 -0.127766 -0.0654678 0.0250457 0.112928 -0.136354 0.0266575 -0.00784356 -0.0539975 -0.00565193 -0.0399142 -0.0409868 0.0669314 -0.0687933 -0.00695146 0.130513 0.0686212 -0.0945446 -0.0828378 -0.0607048 0.00353681 0.0856074 -0.0707222 0.0922052 0.0948261 0.0149001 0.249601 0.0467675 -0.144043 -0.0658253 0.15108 0.243315 -0.121961 0.0611353 0.135219 0.038394 0.00320292 -0.07824 0.0885916 -0.00724654 0.159808 -0.0582411 0.0352575 0.033488 0.00635879 -0.0606816 -0.0382258 0.0468188 0.00173 -0.0110675 0.0565481 -0.0622858 -0.0746988 -0.0960655 0.00120691 0.0090474 -0.0257537 0.0347558 -0.0298174 0.0957252 -0.0275276 0.080665 -0.077707 0.00254362 -0.0683235 0.00332757 0.149127 0.0930248 0.00965847 0.0835395 0.0193641 0.00231075 -0.00104796 -0.167577 0.146408 -0.0743133 0.0196777 0.0132522 0.0225464 0.0590279 0.0982435 -0.0329276 -0.12723 0.0476999 0.127352 -0.0542208 -0.0241645 0.0515628 0.101652 0.0340465 -0.157941 -0.00262664 -0.0228784 -0.236052 0.186838 -0.08536 0.0514393 
-0.0590499 0.0889774 -0.117598 -0.00178346 0.0221365 0.187888 0.0369369 -0.140611 -0.0625368 0.0542522 0.00222834 -0.00959488 0.0848606 0.0613607 -0.0077671 -0.026087 -0.12611 0.0372398 0.0452257 0.00246679 0.0804537 -0.173119 0.0461814 0.0901587 0.0564069 -0.00362835 -0.142105 -0.16221 0.0914665 0.102741 0.0846253 0.0609937 -0.102374 -0.0803539 0.0237298 0.130932 -0.150775 0.0347454 -0.0183303 -0.0443659 -0.00509649 -0.0459548 -0.0649598 0.0828913 -0.0907182 0.00530096 0.127457 0.0632621 -0.0968944 -0.0929391 -0.0793746 0.0108631 0.0639403 -0.08866 0.0718161 0.101844 -0.00161406 0.25418 0.0317351 -0.115671 -0.0867028 0.129495 0.254016 -0.107816 0.0922444 0.131221 0.0221807 0.0164134 -0.0815239 0.10355 0.00819161 0.16657 -0.0560741 0.0160838 0.0467122 0.00592349 -0.0748731 -0.0329365 0.0368947 0.00144061 -0.0339933 0.0324207 -0.0656696 -0.0614101 -0.117044 -0.00371191 0.0153694 -0.0173444 0.0298313 -0.0353592 0.0864946 -0.0264067 0.0739525 -0.0741795 0.00845946 -0.0833616 -0.00844489 0.143811 0.0882247 0.012798 0.0580079 0.0105636 -0.00348856 -0.0302321 -0.154568 0.164351 -0.0638531 0.0240991 0.0436587 0.0031607 0.0415992 0.0986246 -0.0277023 -0.119947 0.0609365 0.122085 -0.0599515 -0.0172335 0.0704107 0.122658 0.0373198 -0.169763 -0.0271662 -0.0105424 -0.2114 0.190542 -0.0704669 0.0687501 
-0.0522851 0.0820169 -0.115838 0.00937042 0.0234968 0.190289 0.0343385 -0.149073 -0.0532089 0.0342117 0.00354409 -0.00982887 0.0869501 0.0754261 -0.00814867 -0.0217519 -0.118392 0.0382511 0.0360265 0.00146129 0.0899078 -0.170151 0.0548138 0.0913937 0.0573901 -0.0133056 -0.150163 -0.166669 0.0787666 0.106774 0.0939217 0.0762026 -0.0969319 -0.0743306 0.0220266 0.139849 -0.147071 0.0414776 -0.0235125 -0.0431565 -0.00577599 -0.0339243 -0.064359 0.0752328 -0.0901371 0.00447181 0.125969 0.0554986 -0.0916595 -0.0901603 -0.0791126 0.00483039 0.0710986 -0.0811766 0.0755825 0.10078 0.00624275 0.252448 0.0384809 -0.116853 -0.0921637 0.135315 0.244111 -0.118343 0.091676 0.130461 0.0284553 0.0228729 -0.0814138 0.112648 0.0156426 0.162127 -0.0556204 0.0104623 0.0452425 0.00931459 -0.0770473 -0.0431653 0.0246594 0.00221578 -0.0316553 0.038544 -0.068572 -0.0695202 -0.121591 0.00805902 0.0153869 -0.0279111 0.0112356 -0.0356981 0.0891952 -0.0352472 0.0738011 -0.0805935 0.0090025 -0.0752163 -0.0156516 0.149297 0.0867334 0.0199092 0.0585831 0.00753856 -0.000711947 -0.0214098 -0.153266 0.160874 -0.0703229 0.0211596 0.0391245 0.00054894 0.0299844 0.0964045 -0.0320668 -0.12194 0.062039 0.12602 -0.0601964 -0.0223221 0.0701666 0.127015 0.0411569 -0.160831 -0.0252424 -0.00580658 -0.205801 0.186296 -0.0651341 0.0746801 
-0.0611149 0.0919878 -0.111885 0.00570897 0.0223785 0.194326 0.0386822 -0.148879 -0.0514336 0.0499069 -0.00294142 -0.014683 0.0774943 0.0606217 -0.00288202 -0.0303637 -0.132271 0.0434484 0.0368169 -0.010762 0.0762022 -0.169645 0.0489216 0.0997059 0.0607438 -0.0211739 -0.147111 -0.158911 0.0783554 0.103282 0.0914297 0.0632586 -0.106308 -0.0745084 0.02541 0.132161 -0.149516 0.01893 -0.024175 -0.0389316 0.00114003 -0.0478804 -0.0595335 0.0809063 -0.090538 0.00281212 0.120884 0.0692367 -0.0889078 -0.0847507 -0.0700055 0.00599729 0.0698518 -0.0895369 0.073896 0.104172 0.00128792 0.250763 0.0429809 -0.115968 -0.0902183 0.140821 0.241469 -0.11153 0.0847931 0.13082 0.0238179 0.0133194 -0.0864495 0.11494 0.0094224 0.169128 -0.0518424 0.01682 0.045735 0.00843998 -0.0782248 -0.0383507 0.0306369 -5.16708e-05 -0.0258791 0.0367121 -0.0632309 -0.060457 -0.122054 0.0066167 0.014116 -0.0272757 0.0193105 -0.0285062 0.0858677 -0.0305364 0.0788101 -0.0865213 0.00400519 -0.074896 -0.0194886 0.141779 0.0906715 0.0151534 0.0669452 0.010169 0.00244955 -0.029744 -0.146852 0.154842 -0.0717892 0.0205905 0.0324692 0.0145473 0.0459847 0.100135 -0.0210493 -0.122573 0.0528092 0.123934 -0.0525859 -0.0100176 0.0718608 0.123378 0.0495115 -0.170418 -0.0287705 -0.0102582 -0.216184 0.187977 -0.0745958 0.0718136 
-0.0520526 0.0860193 -0.110777 0.000535569 0.0275968 0.194876 0.042802 -0.139404 -0.0620561 0.0446792 0.00102276 -0.00576133 0.0873459 0.0620365 -0.00978493 -0.0325406 -0.127226 0.051636 0.030502 -0.00662416 0.0922469 -0.168961 0.0453913 0.113913 0.0622413 -0.0258593 -0.139579 -0.159019 0.0815785 0.113979 0.0786404 0.0574665 -0.107659 -0.0663876 0.017268 0.121729 -0.157138 0.0112215 -0.0259339 -0.0403045 0.00182452 -0.0497725 -0.0520828 0.0886704 -0.0932034 -0.0030889 0.124107 0.0656164 -0.0966109 -0.0833829 -0.0596705 -0.00133852 0.0639432 -0.0865784 0.0749661 0.106961 0.00080262 0.258724 0.0451437 -0.116799 -0.0820073 0.1397 0.241184 -0.103716 0.0777594 0.122749 0.0162315 0.0127369 -0.0887767 0.111712 0.00554716 0.16417 -0.0561856 0.00390481 0.0434588 0.0153313 -0.0723099 -0.0355488 0.0322388 0.00469255 -0.0299226 0.0325297 -0.0559586 -0.0586698 -0.125446 0.0115565 0.0216216 -0.0303262 0.0173918 -0.0253409 0.0826347 -0.0382657 0.068631 -0.0821399 -0.0051378 -0.0732174 -0.0249608 0.143425 0.0912049 0.012475 0.0708854 0.0166481 0.00550532 -0.0171992 -0.148307 0.151005 -0.0815096 0.0320948 0.0230717 -0.00218028 0.0476908 0.097481 -0.0287327 -0.119361 0.0509072 0.132175 -0.0557713 -0.00974945 0.0677536 0.13196 0.0442859 -0.1732 -0.0381474 -0.0140415 -0.219136 0.189879 -0.080274 0.0679117 
-0.0520024 0.0946471 -0.111937 0.00261198 0.0270416 0.187828 0.0525117 -0.141166 -0.0395716 0.0409797 0.000303711 -0.0126411 0.0845602 0.0581448 -0.0200691 -0.0376655 -0.126997 0.0541032 0.0131725 -0.00282922 0.0919019 -0.166865 0.0406946 0.126087 0.0555237 -0.0370538 -0.146346 -0.152798 0.0899622 0.115522 0.0828733 0.0585394 -0.113231 -0.0634028 0.0211099 0.119051 -0.150555 0.0248409 -0.0380486 -0.0419048 0.00220773 -0.0416385 -0.0566892 0.0937274 -0.0893898 -0.00898094 0.116893 0.0784294 -0.0850039 -0.0758838 -0.0661564 0.00653074 0.0606976 -0.0903561 0.0826681 0.104758 -0.00356219 0.257963 0.0491639 -0.129048 -0.0856054 0.136673 0.244134 -0.103336 0.0657176 0.113593 0.0251735 0.00532016 -0.0886445 0.114581 0.00781028 0.161848 -0.0476956 0.0189171 0.0371635 0.00484752 -0.0732339 -0.0242611 0.0343765 -0.00427273 -0.0236654 0.0468184 -0.0627541 -0.064806 -0.112734 0.0082401 0.0163997 -0.0254412 0.0260814 -0.0236978 0.0917476 -0.0413953 0.0715142 -0.0988265 0.00408016 -0.0791172 -0.0250722 0.137888 0.0921453 0.00913376 0.076392 0.0178166 0.0101526 -0.0144711 -0.156431 0.144793 -0.0829443 0.0239793 0.035357 0.0102231 0.0577504 0.109303 -0.0334633 -0.110817 0.0449402 0.13097 -0.0485091 -0.0184699 0.0660818 0.124194 0.0415587 -0.156607 -0.0373498 -0.00352594 -0.232809 0.182179 -0.0849277 0.0617056 
-0.0513553 0.0843877 -0.111814 0.00471444 0.0456638 0.182422 0.0377106 -0.163216 -0.0691024 0.041527 -0.00491109 -0.000524988 0.0786606 0.0663441 -0.0115506 -0.0153393 -0.108607 0.0708833 0.0419384 0.0164433 0.0851632 -0.150182 0.0663806 0.110986 0.0459595 -0.0140593 -0.145787 -0.162827 0.0892452 0.115379 0.0741396 0.0651345 -0.0972279 -0.0702067 0.0458754 0.130457 -0.130907 0.0400819 -0.020894 -0.0523868 -0.0148658 -0.0203351 -0.0442169 0.0790105 -0.108831 0.0110105 0.1417 0.0722153 -0.0923164 -0.0647896 -0.0703992 -0.00663451 0.0577903 -0.0779327 0.0892109 0.0951298 0.0186407 0.254174 0.0316331 -0.10945 -0.0858561 0.138894 0.253696 -0.123849 0.102876 0.104744 0.00621907 0.00633005 -0.0952652 0.121934 0.0147939 0.165644 -0.051721 0.0267479 0.0277807 0.00537279 -0.070723 -0.0206986 0.0402361 -0.0313098 -0.020408 0.059622 -0.0762171 -0.0613531 -0.115613 -0.00615377 -0.00121333 -0.015817 0.0167726 -0.0197283 0.101301 -0.0228778 0.0717498 -0.0878613 0.0274323 -0.0761058 -0.018251 0.168938 0.0843138 0.0115896 0.0615559 0.0128383 -0.00100292 -0.0230466 -0.145163 0.151979 -0.0627235 0.00608341 0.0523507 0.0212826 0.0383871 0.10031 -0.00791783 -0.103934 0.0490103 0.122854 -0.0387366 -0.0296433 0.0478843 0.125694 0.0400536 -0.151993 -0.0228821 -0.0106875 -0.235762 0.188137 -0.0718589 0.0553681 
-0.0487919 0.07778 -0.103537 0.00185913 0.0387641 0.182771 0.0489968 -0.150478 -0.0692961 0.0461301 -0.00745843 0.0029165 0.0912032 0.0417797 -0.0240921 -0.0194826 -0.130536 0.0631556 0.0296448 0.0191567 0.106671 -0.165927 0.0444827 0.119932 0.0476804 -0.00373042 -0.157339 -0.17772 0.089469 0.125569 0.0599843 0.0699981 -0.111235 -0.0587421 0.0417066 0.109255 -0.136669 0.0365761 -0.00840187 -0.0662617 -0.000230016 -0.0497692 -0.0381277 0.0802845 -0.0939909 -0.000431827 0.139174 0.0730823 -0.100023 -0.0758929 -0.0643779 -0.0125364 0.0660256 -0.0727082 0.103044 0.0913786 0.0180371 0.242237 0.0258307 -0.128821 -0.0644407 0.132665 0.247625 -0.0994941 0.0859421 0.112899 0.0065293 0.011137 -0.0797967 0.0937539 -0.00456199 0.163669 -0.0626498 0.0187779 0.0342974 0.0099178 -0.0721361 -0.0179905 0.056167 0.00254175 -0.0196035 0.0530738 -0.0584625 -0.0555576 -0.114646 -0.00120227 0.0211244 -0.00220058 0.0310696 -0.0211846 0.0990106 -0.0260328 0.0709684 -0.0743577 -0.0195382 -0.0787094 -0.0184663 0.158079 0.095015 9.21145e-05 0.0882083 0.0124007 -0.00262349 -0.012717 -0.13604 0.140393 -0.0708971 0.0356927 0.0399164 0.0171505 0.0418496 0.102883 -0.0361206 -0.117713 0.0555977 0.1372 -0.0618238 -0.022333 0.0374037 0.12225 0.0385131 -0.148706 -0.0216667 -0.0171124 -0.24181 0.195892 -0.0811572 0.0551206 
-0.0492046 0.0735879 -0.0975318 0.0068368 0.0398769 0.18028 0.0489153 -0.154946 -0.0735841 0.044663 -0.00848188 0.00069338 0.0892416 0.0527407 -0.0127208 -0.0237351 -0.129028 0.0647727 0.0366781 0.0246266 0.0987011 -0.166485 0.0582932 0.112347 0.0470655 -0.00908598 -0.163071 -0.175754 0.0827562 0.119777 0.0607987 0.0668494 -0.104322 -0.0609672 0.0456953 0.114284 -0.134512 0.0473421 -0.0129492 -0.0677181 -0.00433253 -0.0425766 -0.0423211 0.0706936 -0.106695 0.00217591 0.136318 0.0701484 -0.0943728 -0.0678923 -0.0696202 -0.0133096 0.0670301 -0.0663041 0.102478 0.0866466 0.0226128 0.239672 0.0235815 -0.122784 -0.0686857 0.137603 0.243355 -0.106241 0.0950225 0.119151 0.00847291 0.0113217 -0.0864918 0.096753 0.00419592 0.166924 -0.0573799 0.024787 0.0357964 0.0103938 -0.0720136 -0.0309407 0.0595586 -0.00163965 -0.0222469 0.0478347 -0.0622148 -0.0573777 -0.11333 -0.00470482 0.0154618 -0.00135204 0.0297024 -0.021017 0.10193 -0.024347 0.0820242 -0.0773393 -0.0178675 -0.0868867 -0.0189331 0.164215 0.094956 0.00321805 0.0837472 0.0137653 -0.0010664 -0.0205831 -0.133599 0.145694 -0.0627953 0.0290871 0.0482899 0.0203473 0.0382033 0.102986 -0.0271735 -0.115745 0.0531102 0.136018 -0.0548819 -0.0179648 0.0354387 0.124469 0.0353007 -0.153074 -0.0249188 -0.0156077 -0.235777 0.197565 -0.0728133 0.0589213 
-0.0504646 0.0880728 -0.122347 -0.00839368 0.0323315 0.16925 0.0476144 -0.14404 -0.0690088 0.0561211 0.00252645 -0.00742845 0.102349 0.0790563 -0.0181878 -0.0145862 -0.119099 0.0426329 0.0311139 0.0189495 0.0955591 -0.178569 0.0468639 0.0968491 0.0489138 -0.00376633 -0.14516 -0.154908 0.100054 0.125431 0.0549266 0.0724646 -0.0987223 -0.071423 0.0163866 0.120331 -0.144215 0.0533134 -0.0177191 -0.0562362 -0.0181451 -0.0427009 -0.0448469 0.0787675 -0.0878026 0.0133436 0.131988 0.0679301 -0.100407 -0.0877491 -0.0754779 0.00477554 0.0530189 -0.0766863 0.091475 0.0961083 0.00264154 0.254726 0.0328809 -0.121093 -0.0731899 0.122973 0.25229 -0.0955974 0.0806164 0.134669 0.00495663 0.0304568 -0.0762635 0.0889963 0.00834257 0.16042 -0.0581222 0.0120369 0.0462677 0.0164922 -0.0613815 -0.0293444 0.044788 -0.010178 -0.020765 0.0362392 -0.0696608 -0.0633508 -0.118626 0.00290555 0.013027 -0.0117098 0.0415643 -0.0257568 0.0876877 -0.0371813 0.0683851 -0.0740574 -0.00142772 -0.0807047 -0.0164559 0.151338 0.102665 0.00459011 0.0709726 0.0097639 0.00394584 -0.0157498 -0.161793 0.159039 -0.0816246 0.0379331 0.0485726 -0.0084638 0.0415754 0.103765 -0.0386419 -0.108095 0.0589461 0.132424 -0.0592266 -0.0150513 0.0523837 0.122893 0.0272063 -0.155778 -0.0219492 -0.00444966 -0.228919 0.191692 -0.0796402 0.0570519 
-0.0499334 0.0827472 -0.0919745 -0.00500843 0.0411191 0.181248 0.0450417 -0.144318 -0.0544213 0.0287562 -0.00615791 -0.0150811 0.0875631 0.0583433 -0.0148418 -0.0276345 -0.125786 0.0635239 0.0144968 0.0175195 0.106517 -0.157156 0.0555874 0.124129 0.0477719 -0.0279657 -0.156617 -0.159231 0.095284 0.108765 0.0798736 0.0475682 -0.108171 -0.0589309 0.0457847 0.121037 -0.136788 0.0454433 -0.0288333 -0.0614123 -0.00702203 -0.0291433 -0.0473776 0.0856961 -0.0944079 -0.002594 0.129565 0.0833026 -0.0908167 -0.0603598 -0.0856562 -0.0101732 0.0604116 -0.0767677 0.0908506 0.0901816 0.008704 0.251232 0.030546 -0.136946 -0.0773964 0.143391 0.246588 -0.100316 0.0759251 0.113017 0.0152683 0.00989331 -0.0870879 0.108126 0.0100669 0.158587 -0.0504054 0.0210916 0.0320569 -0.00129318 -0.0769795 -0.0235545 0.0574395 -0.00657859 -0.0148398 0.0554995 -0.0679625 -0.0643914 -0.108136 -0.00176373 0.00880894 -0.00277485 0.0280329 -0.0160167 0.115732 -0.0300818 0.07563 -0.0915248 0.00282727 -0.0831515 -0.028883 0.164834 0.0812752 0.00414269 0.0768965 0.0122882 0.000498319 -0.0228153 -0.145517 0.14955 -0.070838 0.0199201 0.057716 0.0147928 0.0489536 0.107835 -0.0348426 -0.101705 0.0516512 0.137975 -0.0500387 -0.0228591 0.0433684 0.125186 0.03446 -0.143975 -0.0327234 -0.00295096 -0.247275 0.182716 -0.0748618 0.0557078 
-0.0522396 0.0888637 -0.114028 0.00304202 0.0296048 0.177595 0.040516 -0.147281 -0.0604801 0.0505051 0.00310618 -0.0113417 0.0984007 0.0562555 -0.0214847 -0.0162641 -0.126049 0.0507203 0.029342 0.0168746 0.110537 -0.180223 0.0472233 0.105325 0.056974 -0.0139765 -0.157747 -0.173322 0.0941867 0.127564 0.0690611 0.0684009 -0.0985015 -0.0682392 0.0310558 0.118012 -0.145431 0.0409376 -0.0131745 -0.063247 -0.0129656 -0.052472 -0.0468566 0.0811098 -0.0841277 0.00522509 0.13486 0.0702216 -0.0993891 -0.0879748 -0.0708249 0.00417251 0.0670013 -0.079671 0.0885598 0.0946862 0.0133956 0.235785 0.0341084 -0.130426 -0.0713135 0.126779 0.242484 -0.0948487 0.0810525 0.122817 0.00918309 0.0208806 -0.076477 0.0893879 0.00305102 0.158551 -0.0644289 0.000282773 0.0430362 0.0116634 -0.0715617 -0.0251828 0.045699 0.0143744 -0.0261255 0.0388599 -0.0633501 -0.0546892 -0.116131 0.010133 0.0140548 -0.0120097 0.0337735 -0.0270768 0.0865855 -0.0309522 0.0674703 -0.0718098 -0.0192084 -0.0850397 -0.0227468 0.157588 0.0914846 0.00146949 0.0873941 0.0130857 0.0022095 -0.0187811 -0.144275 0.152263 -0.0695354 0.0413997 0.0502259 0.00575236 0.0349544 0.0955995 -0.0447856 -0.119052 0.0576478 0.139133 -0.0689262 -0.0156471 0.0478815 0.126594 0.0302192 -0.154416 -0.027909 -0.0112041 -0.228142 0.194556 -0.0721032 0.0658138 
-0.0498351 0.0795648 -0.118988 -0.0020774 0.0207252 0.179349 0.0446985 -0.123313 -0.0630656 0.0537823 0.0102186 -0.00631132 0.104243 0.0732248 -0.0124905 -0.0295485 -0.123912 0.0364245 0.0271478 0.0128205 0.0946997 -0.179795 0.0385532 0.110036 0.0542943 -0.00933909 -0.137725 -0.159167 0.0928204 0.11268 0.0667349 0.0713455 -0.102706 -0.0673697 -0.00382243 0.12581 -0.154309 0.0361415 -0.0330887 -0.0392525 0.00489231 -0.0511602 -0.0591827 0.0878492 -0.0932562 -0.00617731 0.128897 0.0612367 -0.0938481 -0.0944222 -0.0668638 0.00434832 0.0506088 -0.0781452 0.0868514 0.105029 -0.0034518 0.252933 0.0517108 -0.126385 -0.0829815 0.121729 0.241989 -0.0914196 0.0656297 0.133522 0.0257594 0.0226366 -0.066652 0.0947836 0.00386672 0.162819 -0.0524074 0.0100465 0.0585432 0.0122654 -0.0721458 -0.0210707 0.0322759 0.0027514 -0.0297511 0.0356568 -0.0578721 -0.0673732 -0.117394 0.0211788 0.0320816 -0.0181122 0.0323022 -0.0361707 0.0832456 -0.0405372 0.0639303 -0.0843965 -0.0149607 -0.0839012 -0.0197699 0.138123 0.101961 0.00325598 0.0648527 0.0103418 0.0169353 -0.0124986 -0.165163 0.158196 -0.092697 0.0415439 0.0321159 -0.0166169 0.0425766 0.107526 -0.0444352 -0.123664 0.0543381 0.127926 -0.0576177 -0.0292593 0.064426 0.122728 0.0380616 -0.162787 -0.0295432 -0.00154224 -0.223414 0.188193 -0.0824874 0.0751617 
-0.0429552 0.07995 -0.109039 0.00124644 0.0196755 0.192269 0.039579 -0.129784 -0.0569362 0.0297953 0.0109126 -0.00483885 0.0964946 0.0492976 -0.0235812 -0.0367626 -0.139881 0.0417781 0.0189955 0.0124376 0.111534 -0.172024 0.0360297 0.121799 0.0592667 -0.0237676 -0.137178 -0.168612 0.0825608 0.119121 0.0713005 0.0534699 -0.107119 -0.0571501 0.0131359 0.117884 -0.159334 0.0157499 -0.0290789 -0.0483112 0.00558256 -0.0648601 -0.0544654 0.0966201 -0.0877496 -0.0116692 0.130907 0.0655913 -0.104239 -0.0777192 -0.0666379 -0.00211267 0.0656522 -0.0775258 0.0842123 0.104171 -0.00637128 0.248109 0.0405517 -0.132576 -0.0756828 0.131773 0.248462 -0.0888424 0.0632948 0.120806 0.0232178 0.00800149 -0.0778841 0.0975959 -0.00453473 0.149569 -0.0596449 -0.0013658 0.0503438 0.00888815 -0.071649 -0.0320356 0.0363207 0.028798 -0.0286316 0.0316776 -0.0567862 -0.0642453 -0.120124 0.0240127 0.0264506 -0.0246224 0.0232408 -0.0191539 0.0949369 -0.0464199 0.0571194 -0.0744659 -0.0294996 -0.0792298 -0.0285326 0.139212 0.0980797 0.000429364 0.080906 0.0161019 0.00692724 -0.0177913 -0.150801 0.154511 -0.0826373 0.0494696 0.0182033 -0.00904258 0.0495017 0.0994308 -0.0488729 -0.125398 0.0507341 0.137763 -0.0633158 -0.0168415 0.0671763 0.131771 0.039371 -0.165795 -0.0347034 -0.00785052 -0.217451 0.188263 -0.0687671 0.0701575 
-0.0409005 0.0629798 -0.114485 0.000806939 0.030141 0.191589 0.0377897 -0.130206 -0.0584001 0.0253543 0.00649542 0.00346798 0.0986717 0.0508653 -0.0236746 -0.031724 -0.136881 0.0374577 0.0245449 0.0218376 0.116068 -0.173046 0.0386722 0.111575 0.0603001 -0.0114788 -0.141521 -0.179667 0.0756988 0.117292 0.0760541 0.0555924 -0.108186 -0.0604086 0.0158582 0.123636 -0.159321 0.022757 -0.0219161 -0.0540475 0.00603157 -0.0534681 -0.0574572 0.0917102 -0.0877196 -0.0141502 0.132374 0.0599431 -0.0967312 -0.0823902 -0.0764156 -0.0160548 0.0683879 -0.0763627 0.0856309 0.100033 -0.00727877 0.253722 0.0320302 -0.131334 -0.0719323 0.12844 0.2535 -0.0941143 0.073261 0.11925 0.0229501 0.0207166 -0.0689415 0.0873448 0.000612843 0.158993 -0.060697 -0.00708193 0.0410523 0.0149144 -0.0730256 -0.0338982 0.0369212 0.0300839 -0.0332164 0.0359314 -0.0583784 -0.0625401 -0.121757 0.0164037 0.0325206 -0.0131877 0.0244848 -0.031803 0.0964401 -0.040697 0.0590849 -0.0665072 -0.0276775 -0.0803125 -0.0231289 0.137494 0.0923075 0.00491986 0.0723212 0.0062843 0.000453669 -0.0222759 -0.153624 0.156464 -0.0815656 0.0430307 0.0165411 -0.00346353 0.0435114 0.0943749 -0.0515869 -0.123873 0.0553587 0.140645 -0.0735886 -0.0182859 0.0541139 0.128064 0.0328503 -0.156226 -0.029648 -0.00647776 -0.216664 0.189106 -0.0734824 0.0681879 
-0.0527793 0.0682574 -0.118185 0.00337253 0.0206381 0.194378 0.0286809 -0.130552 -0.0595248 0.0350725 0.0059923 -0.000584655 0.0902617 0.0403156 -0.0325051 -0.0271942 -0.141816 0.0419574 0.0373586 0.0147073 0.110293 -0.181132 0.0298874 0.105109 0.0625237 -0.00470417 -0.140108 -0.179569 0.075413 0.111283 0.0783596 0.0551173 -0.107466 -0.069499 0.0176568 0.123474 -0.162964 0.00550766 -0.0146386 -0.0560076 0.0067841 -0.0636441 -0.0516439 0.091527 -0.0778367 -0.0195543 0.136108 0.0586873 -0.102889 -0.0907801 -0.0779778 -0.0168061 0.0743998 -0.0797797 0.0776284 0.105601 -0.00498413 0.24257 0.0340051 -0.133994 -0.0681684 0.133857 0.254931 -0.0920646 0.0727152 0.128304 0.0205987 0.00958935 -0.0665868 0.0822513 -0.00693281 0.155294 -0.0609997 -0.0065636 0.0440258 0.0104744 -0.0714106 -0.0295987 0.034466 0.0243908 -0.036616 0.0372103 -0.0578334 -0.057408 -0.123569 0.0248812 0.0277448 -0.0137844 0.0308251 -0.0331727 0.0914855 -0.0313401 0.059424 -0.0623963 -0.0231999 -0.0736762 -0.0234645 0.140659 0.0856608 0.00620041 0.0758437 0.000652952 -0.00226469 -0.03161 -0.142848 0.162128 -0.0705236 0.0392331 0.00678392 0.00311696 0.0391405 0.0873842 -0.040176 -0.133718 0.0544713 0.131305 -0.072907 -0.0137617 0.0634235 0.116697 0.0353605 -0.167432 -0.0239369 -0.0183693 -0.219651 0.195007 -0.0746587 0.0705258 
-0.0640114 0.0750505 -0.116555 0.0129253 0.0198748 0.180685 0.0216523 -0.129279 -0.0380051 0.0454947 0.0240938 0.00821742 0.0823035 0.046948 -0.0288249 -0.015327 -0.12812 0.0363935 0.0347934 0.0195813 0.101579 -0.184874 0.0274925 0.124779 0.0692499 -0.000166743 -0.117988 -0.168394 0.0950771 0.106169 0.0938821 0.0542783 -0.0877178 -0.0757492 -0.00467454 0.138026 -0.164385 0.0149049 -0.0308172 -0.039306 0.00672967 -0.0545841 -0.0660501 0.0934954 -0.0709729 -0.0252953 0.138124 0.0474225 -0.0916534 -0.10818 -0.0767633 -0.00388188 0.059538 -0.0970605 0.0781887 0.123148 -0.023184 0.252169 0.0380748 -0.120445 -0.0907545 0.109392 0.258141 -0.0953283 0.077552 0.130298 0.0235292 0.00279224 -0.0722283 0.0965333 -0.00286929 0.158516 -0.0597394 -0.00345791 0.0610293 0.00509875 -0.0633808 5.33433e-06 0.0162792 0.00735324 -0.045572 0.0466273 -0.059559 -0.0616466 -0.116604 0.022677 0.0282691 -0.0101813 0.0245044 -0.039433 0.0780578 -0.0328454 0.051732 -0.0576779 0.00470699 -0.0715645 -0.0301559 0.123308 0.0941067 0.00819978 0.0531984 -0.0163272 -0.0045555 -0.0320705 -0.152667 0.176375 -0.0679829 0.0169003 0.0267742 -0.0170529 0.0264817 0.102886 -0.0313318 -0.124687 0.0633614 0.11821 -0.0726352 -0.0250707 0.0712039 0.121979 0.0354948 -0.154819 -0.0353291 -0.0100637 -0.216795 0.209077 -0.0738486 0.0724568 
-0.0474969 0.0755689 -0.131521 -0.000337829 0.024934 0.182784 0.035035 -0.131152 -0.057692 0.0412909 0.0135495 0.00586265 0.101405 0.0565996 -0.042006 -0.0207516 -0.126558 0.0450147 0.0252039 0.0245209 0.113018 -0.184361 0.0378827 0.107914 0.0545174 -0.00340123 -0.132425 -0.172599 0.0899501 0.121399 0.0671246 0.066866 -0.100722 -0.0691091 0.00561281 0.120235 -0.159867 0.0347771 -0.0209044 -0.0508575 -0.00542293 -0.0510279 -0.0550105 0.0966429 -0.0832845 -0.0161374 0.13845 0.0561535 -0.101234 -0.089785 -0.0729173 -0.00410409 0.0540219 -0.0770854 0.0829622 0.105283 -0.00422686 0.253907 0.0369932 -0.132074 -0.0721937 0.11784 0.263666 -0.0945017 0.0736606 0.115185 0.0170262 0.0176655 -0.0668126 0.0918308 -0.000537628 0.154543 -0.0592227 0.000352696 0.0420638 0.00845368 -0.0641238 -0.0175096 0.028683 0.00759523 -0.0402669 0.0403902 -0.0630162 -0.0633575 -0.123223 0.0180496 0.0261973 -0.0144468 0.0374527 -0.0393055 0.0840305 -0.0450102 0.0558103 -0.0693775 -0.00465696 -0.0803055 -0.0208304 0.144691 0.0923586 0.00575576 0.066561 0.00494122 0.000671678 -0.00856329 -0.152774 0.160047 -0.080935 0.0429819 0.0238424 -0.0142232 0.0324535 0.0994276 -0.0453592 -0.114744 0.05645 0.128999 -0.0674509 -0.0272946 0.0660041 0.121916 0.0277397 -0.153865 -0.0263932 -0.0094488 -0.222013 0.189024 -0.0803354 0.0669017 
-0.0436983 0.0734 -0.132049 0.0141578 0.0286379 0.17336 0.036409 -0.142338 -0.0585019 0.0452789 0.0132429 0.00309684 0.103054 0.0632282 -0.0425186 -0.00859847 -0.110569 0.0498735 0.0313514 0.0330803 0.116785 -0.192427 0.0405558 0.116855 0.0578485 -0.00532128 -0.142236 -0.175729 0.0923682 0.131519 0.0633439 0.080617 -0.0972146 -0.068865 0.00774227 0.121335 -0.153322 0.0412929 -0.0189697 -0.063829 -0.0152059 -0.0469903 -0.0497747 0.0821643 -0.0744053 -0.0109997 0.13925 0.0590518 -0.0956046 -0.0952298 -0.0671012 -0.00444371 0.0648904 -0.0807329 0.0912607 0.10146 0.00491698 0.243378 0.0446684 -0.131955 -0.0674289 0.119324 0.251855 -0.0996202 0.0749883 0.122273 0.0132824 0.0169655 -0.0688461 0.0835379 -0.0043263 0.154872 -0.0631159 -0.00201169 0.0387487 0.0100554 -0.0534445 -0.0126811 0.031958 0.00788649 -0.0350489 0.0428161 -0.069533 -0.0689843 -0.11429 0.0178224 0.0158176 -0.0130013 0.035601 -0.0391072 0.0824689 -0.0339117 0.0593495 -0.063657 -0.00614142 -0.0762792 -0.0202219 0.148639 0.0970202 0.00157416 0.0792916 0.00275315 0.00181877 -0.0076341 -0.151137 0.157525 -0.0732965 0.0355418 0.0353486 -0.00692462 0.0237892 0.101667 -0.0407869 -0.118901 0.0579767 0.130768 -0.072275 -0.0245169 0.0509322 0.119443 0.0167842 -0.146226 -0.0238889 -0.0106058 -0.228769 0.198602 -0.0811145 0.0604211 
