{
  "descriptor": [
    -0.04823356121778488,
    0.07959412038326263,
    0.10129587352275848,
    -0.06197994574904442,
    -0.18772216141223907,
    0.03907856345176697,
    -0.07948701083660126,
    0.012703589163720608,
    0.1349162608385086,
    -0.11790889501571655,
    0.16526971757411957,
    -0.004089816473424435,
    -0.2099381685256958,
    0.09789055585861206,
    0.0001638738758629188,
    0.15447008609771729,
    -0.16503416001796722,
    -0.16380192339420319,
    -0.054410602897405624,
    -0.07705521583557129,
    -0.026035750284790993,
    0.0962512269616127,
    -0.02102937363088131,
    0.05476241186261177,
    -0.14497248828411102,
    -0.3890901207923889,
    -0.10183350741863251,
    -0.058915067464113235,
    0.12427408993244171,
    -0.11604589968919754,
    -0.06929924339056015,
    0.06300514191389084,
    -0.1235525831580162,
    0.016268430277705193,
    0.09647558629512787,
    0.013155958615243435,
    -0.10604317486286163,
    -0.15678049623966217,
    0.2599898874759674,
    0.10665879398584366,
    -0.24573516845703125,
    0.005181073676794767,
    0.08257758617401123,
    0.2585941255092621,
    0.20721551775932312,
    0.0041809650138020515,
    0.09024103730916977,
    -0.04844458028674126,
    0.15167376399040222,
    -0.28177985548973083,
    0.05220571532845497,
    0.20640692114830017,
    0.0305070411413908,
    0.0699845477938652,
    0.08059856295585632,
    -0.12565089762210846,
    -0.05746426805853844,
    0.13484697043895721,
    -0.15304486453533173,
    0.07940813153982162,
    0.06141594052314758,
    -0.06358115375041962,
    -0.05569301173090935,
    -0.07884886115789413,
    0.16247132420539856,
    0.10161729902029037,
    -0.11850934475660324,
    -0.17779326438903809,
    0.2246846705675125,
    -0.17558032274246216,
    -0.09675461053848267,
    0.07865694165229797,
    -0.10781347006559372,
    -0.1566118746995926,
    -0.21346454322338104,
    0.048835389316082,
    0.40120378136634827,
    0.13579168915748596,
    -0.0846061110496521,
    0.07962098717689514,
    0.03392261639237404,
    -0.07660377025604248,
    0.009373966604471207,
    0.16360369324684143,
    -0.12220936268568039,
    -0.002611745847389102,
    0.000683725462295115,
    0.07031039893627167,
    0.2644716203212738,
    0.02848181314766407,
    0.00927018839865923,
    0.18945805728435516,
    0.014454317279160023,
    0.05454232916235924,
    0.08418814092874527,
    0.11852633208036423,
    -0.12116661667823792,
    -0.11232739686965942,
    -0.1709790974855423,
    -0.03389376029372215,
    0.008687781170010567,
    -0.05190465599298477,
    -0.02822238579392433,
    0.1682070642709732,
    -0.17291012406349182,
    0.18494801223278046,
    -0.05931660905480385,
    -0.08829683065414429,
    -0.055287379771471024,
    0.015611479058861732,
    -0.07960320264101028,
    -0.0010994855547323823,
    0.12971904873847961,
    -0.210316464304924,
    0.10595844686031342,
    0.15971584618091583,
    0.0513257272541523,
    0.10330114513635635,
    0.11423000693321228,
    -0.01371812354773283,
    0.04012316092848778,
    -0.07301735132932663,
    -0.17837995290756226,
    -0.1315855085849762,
    0.04685955122113228,
    -0.04267457127571106,
    -0.013938563875854015,
    -0.0177127867937088
  ]
}