0.120518 0.0527862 -0.106918 -0.0576626 0.102002 0.173086 0.0695485 0.016158 0.0112036 -0.0946022 0.00369589 0.0309467 0.103963 -0.148778 -0.046163 0.0486391 -0.0757827 -0.0157169 -0.273706 0.154291 0.137807 -0.0155065 0.0897447 -0.000321301 -0.108739 -0.0498528 -0.117435 -0.206392 -0.0244641 0.0270639 -0.000477303 0.111493 -0.074107 0.118711 -0.00492291 0.00791956 0.0156659 0.198432 -0.0775265 -0.0223822 0.0357665 -0.0387191 -0.0469414 0.066963 -0.107021 0.0212115 0.0919573 0.0511687 -0.146465 0.132814 0.000883164 -0.0971781 -0.103635 0.0511677 0.0844194 -0.0633248 -0.0264417 0.0798805 -0.0227425 -0.133143 -0.0702802 -0.00800275 0.159207 -0.137151 0.0774751 -0.14264 -0.0114362 0.121978 -0.0496657 0.0337759 0.03466 0.0404462 0.00449766 -0.00842077 -0.0267966 0.0125137 -0.0556713 0.0371142 -0.00771389 0.0626679 0.0264149 0.0290561 -0.069896 -0.0408976 -0.0929921 0.0652942 0.0673175 0.0244117 0.00188132 0.0754126 0.0860146 -0.223829 -0.126745 -0.0381046 -0.0692974 0.00744645 0.0161785 0.012436 -0.0376385 0.0119818 0.0314309 -0.0157046 -0.0835292 0.152447 -0.0953171 -0.0161118 -0.161438 0.150931 -0.0205854 -0.0376007 0.0202886 0.153336 -0.100745 0.0524233 0.0491426 0.0611405 -0.171111 -0.0642944 -0.0306705 0.103505 0.00393333 0.0969287 0.101104 0.153229 0.0651006 -0.0637326 -0.0291821 -0.100375 
0.132549 0.0636102 -0.101239 -0.0619426 0.108019 0.193072 0.0735225 -0.00594643 0.00658129 -0.093023 0.00588863 0.00568275 0.119353 -0.118902 -0.0130825 0.0266123 -0.0745783 -0.00178509 -0.264215 0.135147 0.139882 0.0064464 0.0860429 0.0227549 -0.0960112 -0.0684177 -0.132284 -0.207085 -0.0259252 0.0493895 0.0133212 0.103473 -0.0894409 0.120614 0.0275616 0.0257223 0.0298275 0.178654 -0.0677888 -0.0299264 0.0414866 -0.0332576 -0.0457999 0.073222 -0.124679 0.033277 0.0905813 0.0796549 -0.137065 0.119655 0.00171667 -0.0915884 -0.081465 0.052109 0.0893128 -0.0593327 -0.0232995 0.0929051 -0.00420267 -0.151928 -0.0761765 0.0098994 0.152412 -0.143709 0.0615438 -0.124403 0.00960128 0.129357 -0.0422425 0.0345203 0.0415268 0.0491819 0.00126204 -0.0310389 -0.0221631 0.0105721 -0.0797489 0.0253822 0.0118466 0.0768005 0.052214 0.0429394 -0.0672522 -0.0490345 -0.0842551 0.0663621 0.066787 0.00847004 -0.0112483 0.0874925 0.106382 -0.220868 -0.107467 -0.0570821 -0.101013 -0.0136433 0.00293587 0.0288748 -0.023194 -0.00158862 0.0556195 0.0102205 -0.056732 0.14102 -0.112609 -0.0177891 -0.170922 0.142706 -0.016721 -0.0106175 0.0443896 0.14016 -0.114173 0.042414 0.03605 0.0782262 -0.175481 -0.0706722 -0.0491378 0.0962668 0.0271574 0.0739644 0.0950652 0.157176 0.04139 -0.0610492 -0.0328914 -0.0859543 
0.138353 0.0705028 -0.134104 -0.0577294 0.110093 0.185115 0.0703649 -0.0239499 -0.00702901 -0.0858769 0.0233175 0.0205657 0.11276 -0.111218 -0.0426787 0.0355144 -0.071477 0.00503346 -0.245822 0.134341 0.147305 -0.000168739 0.0842171 0.0163629 -0.0799118 -0.0464762 -0.10553 -0.203391 -0.0036016 0.0723755 -0.0131542 0.113811 -0.0901136 0.105887 0.0188524 0.0123103 0.00359534 0.181385 -0.0497974 -0.0344823 0.0200476 -0.0340388 -0.0503593 0.0901943 -0.125093 0.0454148 0.104334 0.0722594 -0.151406 0.107655 0.0105229 -0.0447297 -0.0868484 0.0416864 0.0893962 -0.0607615 -0.0204888 0.108466 -0.0135917 -0.14533 -0.0706559 -0.00938911 0.194921 -0.127778 0.0545703 -0.131008 -0.00698787 0.139929 -0.0367946 0.0566505 0.0398784 0.0538098 -0.00947251 -0.0250984 -0.0311152 0.00244594 -0.0740017 0.0238709 -0.00663565 0.0790614 0.0458613 0.0508317 -0.067842 -0.0626695 -0.0908564 0.0525032 0.0575248 0.00133075 -0.000839182 0.0783807 0.0997183 -0.212053 -0.126562 -0.0506012 -0.0789271 -0.0283343 0.0138607 0.0343649 -0.00291819 -0.0218437 0.0532176 0.01838 -0.0494695 0.148123 -0.126935 -0.00963401 -0.167198 0.16139 -0.00150765 -0.0281358 0.0597196 0.145098 -0.119211 0.0442022 0.0533565 0.0751844 -0.172977 -0.0798647 -0.0195919 0.103748 0.0196233 0.0692982 0.0974505 0.145295 0.0364327 -0.0512885 -0.0176248 -0.082351 
0.150841 0.07454 -0.0831829 -0.0368254 0.118979 0.231176 0.139769 -0.0144851 0.0505308 -0.0990546 0.0112543 0.014358 0.112277 -0.121448 0.00724792 -0.00558845 -0.0633766 -0.0148235 -0.274662 0.0980926 0.116979 0.034321 0.0354736 0.0391303 -0.0900227 -0.112687 -0.157389 -0.187606 -0.0219508 0.0747214 0.0310465 0.117575 -0.113371 0.121928 0.0350453 0.0146154 0.060734 0.138671 -0.0603398 -0.0241785 0.0889273 -0.037972 -0.0394275 0.0287036 -0.132876 0.00839907 0.0465827 0.0760818 -0.0946638 0.0925868 0.0163729 -0.0760646 -0.0561426 0.048893 0.0921078 -0.0372333 -0.0565038 0.110925 -0.0252617 -0.117258 -0.105114 0.010998 0.139249 -0.207606 0.0651683 -0.0888771 0.0360984 0.0932776 -0.0862483 0.0225613 0.0491015 0.059704 -0.00433519 -0.0216529 -0.0175319 0.0444275 -0.0519423 0.00390185 0.0073745 0.0735151 0.0639358 0.0358437 -0.0302809 -0.0262605 -0.0411589 0.0632539 0.0810676 -0.00832827 -0.0488647 0.10493 0.105899 -0.250873 -0.0907775 -0.0414256 -0.118876 -0.0264118 0.0119365 -0.0274608 0.000758457 0.035576 0.0752183 0.0257967 -0.0599543 0.143461 -0.123096 -0.0155857 -0.13934 0.115147 -0.0465833 0.0206528 0.0531206 0.101448 -0.100954 0.0356235 0.0336514 0.0781062 -0.17811 -0.0135845 -0.070728 0.100333 0.0419583 0.0460286 0.0829296 0.152618 0.0712846 -0.032355 -0.0443268 -0.0904353 
0.140258 0.0804856 -0.0769932 -0.0645253 0.11441 0.226696 0.104751 -0.0161567 0.0208878 -0.0847135 0.00734488 0.0223327 0.122152 -0.107537 -0.00947908 0.00141926 -0.0787026 -0.0178455 -0.268667 0.122749 0.12657 0.0305262 0.0436392 0.0399934 -0.0968968 -0.074076 -0.138577 -0.17631 -0.0115063 0.0729568 0.0123414 0.0907508 -0.110549 0.112883 0.0317088 0.0249907 0.0367095 0.161026 -0.0558956 -0.0255516 0.0580355 -0.0389392 -0.0453877 0.0447046 -0.125149 0.0186591 0.0668293 0.0797903 -0.118938 0.105995 0.0208585 -0.0629597 -0.0747259 0.0573244 0.109108 -0.0449627 -0.058743 0.126183 -0.0294525 -0.138729 -0.0935894 0.00935953 0.167535 -0.175976 0.0724213 -0.101695 0.0253209 0.114343 -0.0830556 0.0315152 0.0592845 0.0648195 -0.00167035 -0.028287 -0.0102505 0.0451496 -0.0570523 0.0110309 0.0300594 0.0785386 0.0699146 0.035466 -0.0244215 -0.0206566 -0.0580724 0.0375617 0.0827725 0.018439 -0.00995691 0.110198 0.0924255 -0.247445 -0.0835858 -0.0157537 -0.120781 -0.0348527 0.0152494 -0.00749178 -0.0023725 0.0172858 0.0756523 0.0413663 -0.0800469 0.140269 -0.132913 0.0064962 -0.157986 0.110944 -0.0333646 -0.00199009 0.0625854 0.122539 -0.109629 0.062219 0.0377232 0.0871369 -0.184853 -0.0189938 -0.0726429 0.100626 0.0302851 0.0384494 0.0945522 0.126591 0.0603117 -0.0121292 -0.0316745 -0.0898446 
0.138311 0.0958324 -0.0780731 -0.0625148 0.103776 0.221211 0.113681 -0.00855117 0.0212864 -0.0716082 0.0256401 0.0185017 0.120271 -0.135047 -0.01927 0.0196993 -0.0858929 -0.0111955 -0.27359 0.11396 0.139295 0.0209488 0.0250331 0.0215341 -0.0949601 -0.0689785 -0.138377 -0.180025 0.0122082 0.0797279 0.00278944 0.108392 -0.109958 0.113162 0.0333099 0.00296182 0.0375809 0.156299 -0.0341648 -0.0319518 0.0558172 -0.0617955 -0.0365511 0.0502582 -0.109917 0.0172082 0.0713361 0.0721802 -0.150797 0.0881864 0.0172676 -0.0527488 -0.0858942 0.0523571 0.0896808 -0.044129 -0.0671721 0.102664 -0.0507503 -0.13147 -0.0856356 -0.0130021 0.176119 -0.168091 0.0700736 -0.0939174 0.0127292 0.103332 -0.082006 0.0252833 0.0467979 0.0521634 -0.0139423 -0.0271222 -0.0159399 0.0285462 -0.0480808 0.0195054 0.0177893 0.0802755 0.0660013 0.0321759 -0.0327997 -0.0247375 -0.0584372 0.0540274 0.0771336 0.00641679 -0.00300335 0.114221 0.0972305 -0.247491 -0.11404 -0.00504994 -0.115161 -0.0289118 0.0138076 -0.0123637 -0.00367736 0.0182008 0.0757093 0.0247941 -0.0840665 0.14426 -0.117004 0.00902765 -0.135797 0.140538 -0.0238082 -0.0165326 0.0469563 0.116183 -0.119846 0.05107 0.0608171 0.0697864 -0.191116 -0.0165555 -0.0503994 0.0996253 0.0296348 0.0453033 0.100483 0.142856 0.0749181 -0.0225386 -0.0152491 -0.0977582 
0.143058 0.0869612 -0.071167 -0.0541213 0.111334 0.224513 0.123421 -0.011673 0.0327136 -0.0792476 0.0235136 0.0261331 0.115992 -0.132458 -0.0181706 0.0192128 -0.0792042 -0.00392515 -0.279187 0.102465 0.140622 0.0337421 0.0112294 0.0328679 -0.0944571 -0.0799665 -0.143648 -0.177709 -0.00177492 0.0911855 0.0016476 0.10875 -0.115193 0.116271 0.0406321 0.0044213 0.0409976 0.132473 -0.0369777 -0.0324484 0.0613941 -0.0514688 -0.0261474 0.0440316 -0.100852 0.0146759 0.0637608 0.0679237 -0.141363 0.0846504 0.0273498 -0.0697313 -0.0787274 0.0492009 0.0943536 -0.0379411 -0.0801316 0.107625 -0.0494649 -0.119265 -0.0802154 -0.00900838 0.163255 -0.175644 0.0696277 -0.0976267 0.0114928 0.100382 -0.0883808 0.0213358 0.052101 0.0524283 -0.0109632 -0.0437012 -0.0279061 0.0444649 -0.042998 0.0151846 0.01359 0.0750272 0.0756247 0.0387337 -0.0319185 -0.0215915 -0.0604741 0.0559004 0.0801689 -0.00455415 -0.0193401 0.122847 0.0906296 -0.25155 -0.116953 -0.00250901 -0.120425 -0.0113114 0.0089285 -0.0309047 -0.0015674 0.0281574 0.0817732 0.0254523 -0.085249 0.13558 -0.119179 0.00303762 -0.139311 0.125162 -0.047724 -0.00385109 0.0509478 0.10028 -0.112884 0.0442932 0.0552057 0.074907 -0.193397 -0.0052481 -0.0671343 0.0939943 0.0316969 0.0459004 0.098776 0.139295 0.0812707 -0.016441 -0.0216576 -0.106611 
0.128192 0.0941696 -0.0727115 -0.0898533 0.105075 0.205386 0.0917466 -0.0133484 0.0279778 -0.0692325 0.0144435 0.00910855 0.126972 -0.113597 -0.014461 0.0242013 -0.100273 -0.0261135 -0.283332 0.117065 0.135861 0.0324843 0.0266141 -4.14026e-05 -0.101876 -0.0510262 -0.135503 -0.160569 0.0023051 0.0763322 0.00724438 0.0965947 -0.111089 0.101983 0.0426924 0.0195757 0.0311302 0.165609 -0.0268644 -0.0295466 0.0385272 -0.0494532 -0.0384218 0.0582597 -0.0936273 0.0348636 0.0613239 0.0908751 -0.139078 0.0923698 0.0079871 -0.0441875 -0.0931675 0.0548479 0.0949801 -0.0565493 -0.0768132 0.10137 -0.0555708 -0.140253 -0.0793827 -0.0157403 0.171665 -0.134719 0.0600471 -0.102773 0.0103658 0.137118 -0.0626129 0.0222754 0.0698657 0.054503 -0.00326972 -0.0475141 -0.0186602 0.0347341 -0.0639959 0.00964676 0.0283759 0.0922388 0.0907723 0.0333005 -0.0317539 -0.0084528 -0.0675986 0.0354754 0.0791917 0.0236839 0.0192604 0.116307 0.0860646 -0.240568 -0.105707 0.0032583 -0.127196 -0.0317431 0.011984 -0.0133931 -0.011438 0.0064539 0.0801806 0.0291368 -0.0926456 0.125367 -0.123064 0.0118046 -0.154642 0.132945 -0.0108779 -0.00976135 0.0561928 0.116059 -0.140158 0.0731241 0.0564486 0.080034 -0.195839 -0.00980553 -0.0652025 0.0896596 0.031895 0.0504087 0.113668 0.136995 0.0714389 -0.0289239 -0.0107016 -0.0905099 
0.128544 0.103525 -0.0986318 -0.0650519 0.114617 0.218529 0.0991411 -0.0283342 0.0173898 -0.0378673 0.0358563 0.0342321 0.120987 -0.132443 -0.0200585 0.0205742 -0.0827011 0.0198476 -0.264214 0.117348 0.129935 0.0251155 0.0252256 0.0302554 -0.0863582 -0.0542299 -0.116313 -0.178501 0.00239643 0.0947007 -0.0104618 0.107971 -0.106992 0.107085 0.0404896 0.0146984 0.029973 0.134555 -0.0335379 -0.0312198 0.0501999 -0.0644162 -0.0327694 0.0743891 -0.123502 0.0178351 0.0880258 0.0830874 -0.147653 0.083964 0.0476839 -0.0504935 -0.108107 0.0413598 0.0987714 -0.0343311 -0.0785534 0.108661 -0.0395943 -0.127257 -0.0804111 -0.0325726 0.188601 -0.157093 0.0790837 -0.117131 0.000902608 0.118835 -0.0777184 0.0478464 0.0541056 0.0685688 -0.00868836 -0.0453367 -0.0269713 0.0337637 -0.0586557 0.0441674 0.00953089 0.06157 0.0653252 0.054574 -0.0296623 -0.0144615 -0.0773303 0.0421682 0.0816765 0.00564977 0.0113772 0.11857 0.068883 -0.241418 -0.118742 -0.0127082 -0.116706 -0.0362238 0.00569387 -0.0146039 0.00171028 -0.00513085 0.0753662 0.0336684 -0.0744624 0.133873 -0.114276 0.00811425 -0.151457 0.132551 -0.0370373 -0.00275156 0.0544232 0.114481 -0.109795 0.0583185 0.0515398 0.0573168 -0.190061 -0.0337284 -0.0556552 0.0961667 0.0438933 0.0405532 0.104115 0.13807 0.0697718 -0.0165496 -0.0212473 -0.0923683 
0.0932428 0.116754 -0.0826462 -0.0725211 0.125419 0.187256 0.0989521 -0.051663 0.0353182 -0.0312168 0.0452012 0.0103079 0.113437 -0.102629 -0.0272813 0.0272305 -0.114186 0.00650212 -0.251171 0.0968384 0.159912 -0.0234524 0.00281526 -0.0285662 -0.0292253 -0.026235 -0.148202 -0.159823 0.0680921 0.0914622 0.0362387 0.128013 -0.117769 0.0628147 0.0543837 0.0138808 -0.00623701 0.167484 0.0408676 -0.0601474 0.0645099 -0.0595889 -0.0467755 0.0714847 -0.0969434 0.0332045 0.0630006 0.0810436 -0.146779 -0.0124654 -0.0331856 0.0340523 -0.0976598 0.01366 0.0730614 -0.0378538 -0.0855208 0.111599 -0.100387 -0.136667 -0.0756729 -0.0582269 0.212048 -0.0993185 0.0676154 -0.0552364 -0.00226137 0.153947 -0.03246 0.0536807 0.0795838 0.0888814 -0.0279001 -0.0510804 -0.0128786 0.0137246 -0.0863094 0.0309911 0.00830313 0.0886115 0.0305466 0.0734068 -0.0108739 -0.00133746 -0.0702763 0.024501 0.0947435 0.0561308 0.0299799 0.0639176 0.0916706 -0.207755 -0.0985369 0.00589614 -0.11477 -0.105153 0.00532898 -0.000885102 0.0113367 -0.0218893 0.0651819 0.0106061 -0.0752029 0.129055 -0.105499 0.0452796 -0.108167 0.18133 0.0630574 -0.027481 0.030504 0.0985454 -0.188569 0.0766824 0.110095 0.0552749 -0.225919 -0.0339325 -0.0160223 0.102359 0.040677 0.0583254 0.06667 0.138238 0.0422034 -0.00440652 -0.00131731 -0.0540165 
0.0954338 0.117683 -0.0776012 -0.0612652 0.138489 0.194402 0.106095 -0.0651318 0.0477144 -0.0431657 0.0405063 0.0168935 0.108173 -0.0964518 -0.0175139 0.0184192 -0.107124 0.012357 -0.258904 0.0916373 0.153932 -0.014336 -0.00389864 -0.0250453 -0.0188859 -0.04607 -0.158413 -0.152401 0.051525 0.103687 0.0460224 0.134301 -0.116077 0.0705469 0.0644346 0.0197021 0.00432822 0.14847 0.0373887 -0.0686121 0.0766571 -0.0580939 -0.0300213 0.0594316 -0.100076 0.0348768 0.0573465 0.0831146 -0.135898 -0.0113499 -0.0279918 0.0222675 -0.0849771 0.00958401 0.0798739 -0.0314951 -0.10373 0.115065 -0.104007 -0.127272 -0.0851883 -0.0492676 0.196653 -0.11737 0.0722312 -0.0457982 -0.00206642 0.149353 -0.053222 0.0568176 0.0866326 0.0889927 -0.0261967 -0.0642341 -0.0149237 0.0293737 -0.0804311 0.0153476 0.00533817 0.0869882 0.0350868 0.0779921 -0.00775867 0.00587967 -0.069616 0.0258231 0.0917129 0.0489301 0.0153766 0.0804494 0.0919806 -0.218646 -0.0947911 0.00642746 -0.12289 -0.0970639 -0.00215239 -0.011024 0.0104721 -0.0170733 0.0687446 0.0141107 -0.073182 0.122167 -0.106832 0.046619 -0.108689 0.172112 0.0473138 -0.0136958 0.0318534 0.0843222 -0.188271 0.0774322 0.101273 0.053373 -0.226777 -0.0197661 -0.0226397 0.108958 0.051914 0.0566778 0.0609029 0.138081 0.0553543 -0.00107739 0.00284 -0.0613816 
0.0869082 0.108209 -0.0445433 -0.0504679 0.140711 0.206147 0.11245 -0.0920581 0.0554462 -0.0504639 0.024561 0.0217701 0.0955996 -0.0843679 -0.000321108 0.0169644 -0.128791 0.0207084 -0.24928 0.0662955 0.160007 0.00157281 -0.0237273 -0.019419 -0.00640102 -0.0396469 -0.182694 -0.157277 0.038312 0.121883 0.0508174 0.150799 -0.12822 0.0666487 0.0915219 0.0320071 0.00454323 0.118785 0.0532089 -0.0778421 0.0867111 -0.0622253 -0.0176858 0.032785 -0.0822888 0.0455185 0.0530944 0.0742631 -0.13046 -0.0364569 -0.0216175 0.0115981 -0.0512868 0.0086521 0.0955612 -0.0142335 -0.101321 0.119268 -0.119357 -0.112469 -0.0715824 -0.032609 0.177778 -0.118082 0.0894343 -0.0226565 -0.00207258 0.145865 -0.0604412 0.0704673 0.0895919 0.0958106 -0.0356106 -0.0832656 -0.0135294 0.0476653 -0.0840213 -0.00879029 0.00905042 0.0861417 0.0505061 0.0931743 -0.00393874 0.0133921 -0.0741484 0.0150323 0.099947 0.0497128 -0.0124888 0.0983886 0.0941689 -0.20612 -0.0798353 0.0204193 -0.152532 -0.0751557 -0.00500906 -0.015193 0.0368398 0.00143269 0.0929586 0.0138491 -0.0845464 0.0985095 -0.0962111 0.0479768 -0.102541 0.149518 0.0243957 0.0026543 0.0262631 0.0605648 -0.192512 0.043291 0.112557 0.0702348 -0.233401 -0.00110743 -0.0432728 0.107779 0.0726199 0.0450087 0.0628206 0.113583 0.0593108 0.0336148 0.012611 -0.0560479 
0.0820522 0.112583 -0.0307654 -0.0523395 0.146099 0.214779 0.0909159 -0.101815 0.0472066 -0.0487692 0.027761 0.0228255 0.0868459 -0.107095 -0.00309649 0.0303291 -0.121128 0.0328699 -0.247955 0.0711536 0.155344 0.0208513 -0.0333567 0.00379497 -0.0127966 -0.0285388 -0.174008 -0.160624 0.0415407 0.109564 0.054253 0.125044 -0.134774 0.0595501 0.107251 0.0425414 0.0110943 0.0901916 0.0550392 -0.0768792 0.0909759 -0.0605323 -0.0123699 0.0409835 -0.0741935 0.0563664 0.0669667 0.0806578 -0.151776 -0.0379506 -0.0172448 -0.011907 -0.054501 0.00210592 0.0911886 -0.0137309 -0.110389 0.113546 -0.109235 -0.108406 -0.0647528 -0.0176684 0.17614 -0.114872 0.0937832 -0.0412943 -0.0053409 0.139178 -0.0545366 0.0706368 0.0921044 0.0904116 -0.0273919 -0.101839 -0.0151132 0.053865 -0.0969315 0.0303113 0.0132822 0.0738465 0.0678938 0.114695 -0.006244 0.017247 -0.079753 0.0280391 0.0986885 0.0515692 -0.0316073 0.111282 0.0949859 -0.196317 -0.0885078 0.0331413 -0.155518 -0.0623521 -0.0101007 -0.0177978 0.0226212 -0.00711477 0.0950249 0.00905808 -0.0961859 0.0820737 -0.0891157 0.0507192 -0.0931994 0.136939 0.00954228 0.0182534 0.030344 0.0551512 -0.166307 0.0477212 0.100476 0.0614619 -0.262953 -0.00326065 -0.073002 0.0880565 0.0676237 0.044749 0.0647576 0.110189 0.0556125 0.0456484 0.000730723 -0.0720253 
0.0701678 0.100102 -0.00145978 -0.0536981 0.137968 0.189155 0.0627393 -0.0699145 0.071359 -0.0781576 0.00447674 -0.0126184 0.048043 -0.102145 0.0437124 0.0512744 -0.146288 0.00561401 -0.227058 0.0554242 0.184693 0.0190467 0.0235544 0.00363775 0.0195975 -0.0412406 -0.153884 -0.187221 0.0454205 0.0696775 0.0879704 0.10452 -0.0874194 0.0781143 0.110553 0.0567797 0.0233427 0.137144 0.0214336 -0.0796457 0.0831723 -0.0427198 -0.012011 0.0521542 -0.0652729 0.08189 0.0883786 0.059537 -0.15687 -0.00860596 -0.0585117 -0.0085726 -0.0390758 0.00317504 0.115641 -0.00339651 -0.0573902 0.103571 -0.0974804 -0.146301 -0.0754666 -0.0280995 0.164415 -0.0996715 0.100241 -0.0322062 -0.0136524 0.139998 -0.0242366 0.13217 0.0735457 0.094733 -0.0571919 -0.0789475 0.0119121 0.0129236 -0.115046 0.042248 0.00735368 0.0681701 0.044277 0.132581 -0.0333527 -0.0137841 -0.0617649 0.020369 0.0727663 0.0691774 -0.0302702 0.116585 0.141752 -0.172379 -0.116942 -0.0193974 -0.109166 -0.038834 -0.0178009 0.0398117 0.0335632 -0.0131086 0.0644554 -0.0370204 -0.0733594 0.0534007 -0.105446 0.0399319 -0.11109 0.108673 0.0622124 -0.0298779 0.019294 0.0934651 -0.180474 0.0103274 0.161069 0.0698567 -0.212654 -0.0758382 -0.029404 0.116702 0.11307 0.0991926 0.0783474 0.13827 0.0274954 0.0117908 0.0704204 -0.0379502 
0.0958103 0.0818907 0.00934384 -0.0448558 0.135328 0.226966 0.0771293 -0.0666436 0.0793885 -0.0811232 -0.00443529 0.0204438 0.0554411 -0.114617 0.0358196 0.0268875 -0.13286 0.00472575 -0.246279 0.0518646 0.165446 0.0646983 0.00381049 0.0605591 -0.0135874 -0.053629 -0.149558 -0.195347 0.0082998 0.0850221 0.0731253 0.100167 -0.12323 0.0875289 0.0928352 0.0512123 0.0263505 0.104686 0.00499393 -0.0375738 0.0897574 -0.0410779 -0.045124 0.0308396 -0.0734061 0.0545039 0.0635315 0.056473 -0.118306 0.0117452 0.0180559 -0.0211243 -0.0345525 0.0163425 0.126169 -0.0119803 -0.0538999 0.115112 -0.0699599 -0.129785 -0.065036 -0.0192635 0.137294 -0.128443 0.0897161 -0.0918007 0.0242729 0.133856 -0.0300697 0.12845 0.081342 0.106945 -0.0393837 -0.0844651 -0.00186766 0.0421204 -0.114305 0.0480042 0.00665879 0.0884435 0.0808288 0.134682 -0.000278717 -0.00531375 -0.041899 0.0108433 0.104571 0.0535454 -0.0641471 0.119508 0.0972696 -0.194263 -0.100664 0.00719411 -0.151742 -0.0267208 -0.00373908 -0.0197628 0.0466117 0.00912406 0.0983232 -0.00349066 -0.0928699 0.0804795 -0.103004 0.00307486 -0.133919 0.0714656 -0.00648439 0.00575533 0.0366142 0.0944521 -0.153667 0.011127 0.113908 0.0919254 -0.23732 -0.0471595 -0.0909655 0.103466 0.104453 0.0836772 0.0839966 0.107027 0.0547561 0.0324792 0.0259839 -0.0515179 
0.0979732 0.0878749 -0.00606132 -0.0595384 0.150504 0.203748 0.0350313 -0.0933376 0.0632679 -0.0920841 0.00215845 0.00403383 0.0361434 -0.0746087 0.0449342 0.0271086 -0.111067 -0.0062992 -0.202251 0.0675748 0.162291 0.0624328 0.0207468 0.0353055 0.0214881 -0.0253202 -0.130062 -0.181214 0.0240398 0.072628 0.0794257 0.0738926 -0.111196 0.0621352 0.107356 0.0809976 0.0204224 0.12221 0.0376283 -0.0529278 0.0674957 -0.0126774 -0.0524264 0.0410391 -0.0754519 0.110654 0.0762533 0.0600142 -0.129222 0.00513333 -0.0209823 0.024125 -0.0380076 0.0105089 0.125408 -0.0278365 -0.0477457 0.127541 -0.0883186 -0.12995 -0.0558725 -0.021667 0.16457 -0.111168 0.0862001 -0.0992231 0.0175264 0.169072 0.00509867 0.157975 0.105341 0.117521 -0.0468804 -0.09763 0.0020452 0.0287568 -0.128527 0.0630867 0.00818592 0.0892712 0.0628749 0.164485 -0.00596311 -0.00540789 -0.0386388 -0.00845723 0.0862564 0.0697117 -0.0502177 0.102597 0.112616 -0.170614 -0.0904948 0.00892788 -0.117969 -0.0664531 0.00633516 0.00375716 0.039132 -0.0293867 0.0664567 0.00176365 -0.0897935 0.0614162 -0.124929 0.0314733 -0.122111 0.0724233 0.0373599 -0.00272455 0.055455 0.0887288 -0.165994 0.0389738 0.124019 0.0834452 -0.241901 -0.0878936 -0.0800412 0.09989 0.0949304 0.102012 0.0822344 0.116983 0.0414977 0.0221634 0.0556254 -0.040168 
0.0843481 0.0935334 0.0348993 -0.0588662 0.152295 0.169914 0.0427637 -0.0843619 0.063897 -0.0707928 0.0181981 0.00271619 0.0375277 -0.0667495 0.0513929 0.0174493 -0.0989175 -0.00559122 -0.199969 0.0765949 0.169566 0.0485534 -0.0101382 0.00806621 0.0286825 -0.0134193 -0.159186 -0.151278 0.0478652 0.062424 0.0804473 0.0626559 -0.110562 0.0450366 0.109592 0.0822562 0.0157664 0.131681 0.0710744 -0.0576005 0.0710543 -0.00356743 -0.0663931 0.0123945 -0.0594119 0.12082 0.0466474 0.0431885 -0.118941 -0.0317052 -0.0454292 0.0745057 -0.0626443 0.0123801 0.108852 -0.0417926 -0.0529985 0.0894269 -0.129454 -0.101675 -0.0355279 -0.0429355 0.138826 -0.0798279 0.0800764 -0.10485 0.0255594 0.186163 0.0252242 0.143908 0.137615 0.117249 -0.0467914 -0.105686 0.00784473 0.0422846 -0.133962 0.0840341 0.0192981 0.0945495 0.0279232 0.168898 0.0215172 0.0376757 -0.0234832 -0.00924608 0.103634 0.0961751 -0.0384007 0.0796619 0.094826 -0.155456 -0.0644239 0.0410295 -0.142301 -0.114011 0.00819517 -0.022759 0.0234236 -0.0368974 0.0617236 0.0120309 -0.106057 0.0574263 -0.0934147 0.0483956 -0.0810186 0.0876521 0.0796501 -0.00644994 0.0283515 0.0539983 -0.197616 0.0587587 0.135546 0.0817758 -0.256715 -0.0863859 -0.0953311 0.0935788 0.0679664 0.11767 0.05142 0.123376 0.0602015 0.0310942 0.0688401 -0.0237662 
