0.0966182 0.067257 -0.108732 -0.0782321 0.13015 0.115297 0.0577923 -0.0596546 -0.178943 0.0564671 0.0448954 0.085829 0.142217 -0.0304223 -0.039288 -0.0127239 0.0399972 0.0529226 -0.066199 0.194465 0.0834382 -0.00840415 0.0131813 0.0397908 -0.0658442 0.125518 -0.0637821 -0.139464 0.11646 0.0895883 -0.0796726 0.121216 -0.104883 0.0555925 -0.0135785 0.00324468 -0.0252751 0.201064 0.0534732 -0.0228108 0.0258707 -0.0112363 -0.0531306 0.0834803 -0.166183 0.0612086 0.160557 0.0470138 -0.1542 -0.0119566 0.0411365 0.0486353 -0.150961 0.0316437 0.0945372 -0.0524405 -0.0236275 0.168572 -0.0407246 -0.0816523 -0.0311682 -0.0406746 0.224216 -0.0796819 0.0992926 -0.115496 0.0210325 0.0875296 -0.0173263 0.0129218 0.0391724 0.0941808 0.00548585 0.0623123 -0.0146078 -0.0233686 -0.055665 0.11811 0.0573766 0.00549621 -0.0233806 0.106794 0.00862314 -0.0320796 -0.0450057 -0.0796467 0.114726 0.072011 0.0664417 -0.0122027 0.05546 -0.103248 -0.0245286 0.0241785 -0.061186 -0.158642 0.0903298 0.0527506 0.022633 -0.081039 -0.0208041 0.0945102 -0.0406546 0.207235 -0.143858 0.0558008 -0.0954644 0.150296 0.0800891 -0.0453931 0.0608938 0.136242 -0.14302 0.102985 0.0208447 -0.00331441 -0.161195 -0.179864 -0.0557494 0.060193 -0.0303988 0.0356358 0.0458841 0.0559505 -0.0384784 0.0365181 -0.0745221 -0.0855508 
0.0640879 0.0865319 -0.0867588 -0.0801456 0.112345 0.114556 0.0555224 -0.0633094 -0.201102 0.0867144 0.0360855 0.078282 0.138406 -0.0340674 -0.0204361 -0.0280895 0.0206776 0.0765612 -0.0295319 0.181319 0.0684804 -0.0126907 0.0385231 0.035157 -0.0739601 0.124642 -0.0675604 -0.152945 0.145658 0.0876989 -0.0939698 0.127537 -0.076643 0.0458272 0.00181888 -0.00525562 -0.00411561 0.204096 0.0486984 -0.0119905 0.0302114 -0.0364135 -0.0567284 0.0696414 -0.205259 0.073846 0.183527 0.0345252 -0.169731 -0.0195347 0.0425441 0.0622561 -0.141192 0.042978 0.0868754 -0.033286 0.0352711 0.13526 -0.0424088 -0.0749595 -0.0354459 -0.0351948 0.211343 -0.0789189 0.122163 -0.11105 0.0250939 0.0494799 -0.0228409 0.0459843 0.0170518 0.0837875 -0.0111338 0.082814 0.0183895 -0.0261925 -0.0762171 0.132106 0.0662158 -0.0221308 -0.0488959 0.115527 0.0131443 -0.00396478 -0.0272364 -0.0686451 0.104283 0.0738561 0.0545202 -0.00409883 0.0621104 -0.085363 -0.0076622 0.0013961 -0.0703672 -0.186714 0.085216 0.103802 0.0407045 -0.078069 -0.0109179 0.102637 -0.0238151 0.208549 -0.112871 0.0513592 -0.0712304 0.157326 0.0897652 -0.0464712 0.0326596 0.126924 -0.12694 0.0637821 0.0130862 0.00117797 -0.129195 -0.208376 -0.0396164 0.0737645 -0.00468149 0.00516072 0.0253291 0.0364323 -0.0537936 0.0514135 -0.0678037 -0.0514274 
0.082381 0.0822017 -0.0946422 -0.0827073 0.140779 0.126616 0.0867797 -0.0672198 -0.169093 0.075564 0.0493973 0.0841812 0.144067 -0.0207728 0.00323809 -0.0488787 0.035731 0.0718072 -0.0416675 0.164656 0.0779289 0.000318213 0.00386939 0.0236011 -0.0588614 0.0993354 -0.0921206 -0.146612 0.142622 0.111562 -0.0667782 0.117122 -0.0825322 0.0403416 0.0324714 0.0112115 -0.00803938 0.18915 0.0598257 -0.0370734 0.0393898 -0.0159959 -0.0696469 0.0742728 -0.203528 0.0872501 0.148746 0.0466164 -0.165552 -0.0541411 0.0093566 0.0746024 -0.129046 0.0153545 0.0765643 -0.0220139 -0.0346294 0.170815 -0.0943056 -0.0444179 -0.0542481 -0.0483488 0.229113 -0.100449 0.138537 -0.0980415 0.0230767 0.0740012 -0.0489214 0.0252968 0.0573811 0.0860542 -0.022081 0.0360803 -0.0106971 0.00447855 -0.0720526 0.0961866 0.0706929 -0.00683496 -0.0600599 0.100977 0.00905439 0.00198102 -0.032892 -0.0893372 0.116115 0.0535323 0.0503538 0.00902405 0.0723867 -0.103452 -0.0111958 0.0271127 -0.0659807 -0.197364 0.0820311 0.0549004 0.0303907 -0.0686686 -0.0069516 0.107133 -0.0385236 0.165458 -0.141418 0.0785214 -0.0532208 0.142069 0.105273 -0.0325423 0.056623 0.0904654 -0.153545 0.0765315 0.0370051 0.00908833 -0.155882 -0.185292 -0.034973 0.0888423 -0.00802305 -0.00732485 0.00836161 0.070052 -0.0123546 0.0594931 -0.046457 -0.0695736 
0.111603 0.0549097 -0.111487 -0.0525678 0.129923 0.114632 0.0837855 -0.0526296 -0.192217 0.075216 0.0381513 0.107385 0.131609 -0.0547474 -0.0386081 0.00950936 0.0626459 0.0688517 -0.0489331 0.171296 0.0952825 -0.00241234 -0.0164206 0.0425623 -0.0502609 0.131232 -0.0648837 -0.162605 0.105164 0.126452 -0.106376 0.151426 -0.0992311 0.0645108 0.00345524 -0.0268371 -0.0197738 0.180367 0.0733775 -0.0495874 0.0110262 -0.0285389 -0.0224481 0.0738448 -0.140791 0.0731751 0.165998 0.0136425 -0.180933 -0.032819 0.0902629 0.0401049 -0.126045 0.0234987 0.108496 -0.0430027 -0.0239654 0.151742 -0.0504177 -0.0653217 -0.00747832 -0.07192 0.20416 -0.0974129 0.12319 -0.119292 -0.00714592 0.0831767 -0.0410348 0.00294575 0.0262292 0.0836567 -0.0247144 0.0221311 -0.036849 0.00100254 -0.0298285 0.110159 0.0512924 0.018033 -0.0315321 0.100602 0.0108656 -0.0345862 -0.0493428 -0.0992513 0.114942 0.0487348 0.0623671 0.00864361 0.020134 -0.0968584 -0.057555 0.0540345 -0.0720412 -0.10782 0.112661 0.0320812 0.0289577 -0.072541 0.0014225 0.0986049 -0.0513177 0.207032 -0.144013 0.0293284 -0.0873818 0.143274 0.0596697 -0.0536225 0.056796 0.119823 -0.140655 0.061406 0.0556079 -0.00188547 -0.175936 -0.176239 -0.0608937 0.0691266 -0.0255685 0.0294019 0.0636412 0.0411868 0.00748102 0.0518425 -0.0440637 -0.117461 
0.0883699 0.0135794 -0.0864282 -0.0815299 0.132614 0.0879829 0.0420785 -0.0587703 -0.196813 0.0424204 0.00727835 0.094376 0.10954 -0.0246685 -0.0303465 -0.0342117 0.0546077 0.0620699 -0.00482843 0.190252 0.0661841 0.0235644 0.0145805 0.0313045 -0.0725738 0.17404 -0.0411712 -0.168716 0.0942916 0.0630182 -0.0921621 0.0972432 -0.0960391 0.0423874 0.0244 -0.00232259 -0.00482872 0.202163 0.0547147 -0.041974 0.0286983 0.0151889 -0.0704744 0.0999102 -0.174843 0.0969228 0.1616 0.0255056 -0.141223 -0.0294702 0.0308571 0.0149395 -0.111146 0.0354753 0.0981144 -0.0557354 0.014918 0.156878 -0.0344829 -0.0807513 0.0244937 -0.0436858 0.195452 -0.0476637 0.121344 -0.154611 0.0362447 0.0793714 0.0397913 0.0150364 0.0318968 0.0777106 0.0207606 0.0391643 -0.0405836 -0.0285891 -0.091093 0.13894 0.0775856 -0.0085215 -0.0369466 0.152433 0.00478901 -0.0364019 -0.0194842 -0.131796 0.127619 0.0940039 0.0466619 -0.0293599 0.0633404 -0.0471893 -0.00337565 0.0126238 -0.0675518 -0.155191 0.117769 0.052361 0.0235946 -0.0861279 -0.0251061 0.0995134 -0.0354732 0.175437 -0.131978 0.015264 -0.0732149 0.112045 0.0558391 -0.0163915 0.0856342 0.117091 -0.135183 0.075963 0.00588933 -0.00759009 -0.174493 -0.237415 -0.0997823 0.0112915 -0.0420607 0.0617937 0.0336734 0.0292942 -0.0302451 0.0262041 -0.089873 -0.0893247 
0.0357619 0.0775128 -0.0678719 -0.0898024 0.0829025 0.103347 0.0358656 -0.0579467 -0.166356 0.101721 0.0477383 0.0368396 0.0944978 -0.0466483 0.0192777 -0.0653709 0.03491 0.0590627 0.0668079 0.138975 0.0388748 0.00571728 -0.0034794 0.00624668 -0.0635056 0.165672 -0.0569726 -0.176895 0.190164 0.044155 -0.0336213 0.0910966 -0.0594145 -0.0160721 0.0641499 0.0200474 0.0268487 0.180825 0.0903548 -0.0247191 0.0499752 -0.0376411 -0.147982 0.0641768 -0.183602 0.128875 0.145231 0.0378372 -0.163791 -0.130016 -0.0570727 0.127504 -0.0549847 -0.00172193 0.0186712 -0.00302969 0.0550175 0.110786 -0.100678 -0.0390278 -0.018362 -0.031141 0.214118 -0.062645 0.134987 -0.0957087 0.0872873 0.0298208 0.0429214 0.0259311 0.00165421 0.0450869 -0.0427507 0.0487399 0.0283523 -0.0541127 -0.122381 0.165807 0.0808846 -0.00875228 -0.101611 0.142716 -0.00559768 -0.000554574 0.0385199 -0.0897634 0.101246 0.0706915 0.020309 -0.0431896 0.116043 -0.00138008 0.0350694 0.0369875 -0.0500984 -0.234696 0.110299 0.0697448 0.0467078 -0.0837813 -0.00973526 0.0863398 -0.0429375 0.117833 -0.0922467 0.0767117 0.0407154 0.0992543 0.119678 -0.00294918 0.0475282 0.0690873 -0.126866 0.00792699 0.028262 -0.006173 -0.180338 -0.257511 -0.0329191 0.026135 -0.0132097 -0.0235515 -0.0248807 0.0394536 -0.0437393 0.0699092 -0.069171 -0.0329064 
0.0505334 0.0513202 -0.0562558 -0.0751241 0.114068 0.129142 0.0315327 -0.0344537 -0.193114 0.0425226 0.0215416 0.0766613 0.0947416 -0.0840192 -0.0235832 -0.059051 0.0152599 0.0669046 0.0125545 0.183449 0.0789222 -0.0021511 0.025294 0.0570524 -0.064116 0.143999 -0.0486873 -0.178144 0.152755 0.0367099 -0.0480417 0.0641112 -0.0788954 0.0387277 0.0358639 -0.000215932 0.00971286 0.175523 0.041537 -0.0358015 0.0761067 -0.02719 -0.0783702 0.0991554 -0.210067 0.0577821 0.18971 0.0272832 -0.159267 -0.0340252 -0.0052308 0.0412627 -0.103221 0.0302215 0.0838759 -0.0223851 0.0406187 0.135208 -0.0591501 -0.097296 -0.01859 -0.0186637 0.219468 -0.0669849 0.133499 -0.124725 0.0520196 0.000130356 0.00875913 0.045354 -0.00938771 0.066654 -0.0111718 0.0812402 0.0169974 -0.0568493 -0.0999127 0.177555 0.0856238 -0.00697375 -0.0811797 0.145133 0.031388 -0.00539573 0.0173073 -0.0889705 0.120216 0.11318 0.0357304 -0.0238533 0.112669 -0.0492349 -0.000430839 -0.000770051 -0.05561 -0.206254 0.0981586 0.105248 0.00981102 -0.0809132 -0.0295004 0.0968486 -0.0326258 0.167276 -0.099011 0.0578669 -0.0209141 0.128965 0.0786656 -0.024778 0.0473762 0.11275 -0.12499 0.0493411 0.0169231 -0.00828086 -0.138831 -0.248706 -0.0500634 0.0546328 -0.012198 0.0134922 -0.0015067 0.0177599 -0.0669332 0.0550426 -0.0670424 -0.0417393 
0.0930534 0.0656539 -0.0748506 -0.0757275 0.143808 0.104598 0.0656927 -0.0454166 -0.176972 0.0399594 0.0374274 0.088488 0.117942 -0.0244827 -0.00376893 -0.0321336 0.0816995 0.0359557 -0.0234219 0.170741 0.0832333 0.0365335 -0.0229104 0.0475121 -0.0463916 0.12736 -0.0532874 -0.131487 0.128893 0.0947515 -0.0699943 0.0904086 -0.0826104 0.0581883 0.0168192 0.00532609 0.0188477 0.184258 0.0536766 -0.0268271 0.0515071 0.0159364 -0.0391684 0.0770517 -0.16702 0.103639 0.165582 0.0180603 -0.152152 -0.0582725 0.0389046 0.0519448 -0.130007 0.022755 0.109667 -0.0305759 -0.04164 0.163739 -0.0682145 -0.0589582 -0.0255494 -0.064233 0.186947 -0.0894004 0.12654 -0.125239 0.0389617 0.0719532 -0.00500928 0.00915141 0.0514533 0.0807631 -0.00902376 0.0236833 -0.000462918 0.00784551 -0.0676571 0.149404 0.0626654 0.00177594 -0.042633 0.137655 0.0367993 -0.00903859 -0.0153554 -0.107612 0.134088 0.073519 0.0295069 -0.00249107 0.051401 -0.0913108 -0.0315395 0.0358926 -0.0645708 -0.170635 0.11239 0.024167 0.0152298 -0.0825563 -0.0379758 0.109665 -0.0336499 0.186047 -0.174429 0.049784 -0.0733826 0.122968 0.0715029 -0.0450486 0.0825775 0.0915307 -0.168691 0.0891431 0.0287033 -0.00765339 -0.185028 -0.220989 -0.0888047 0.0549032 -0.0277781 0.0548904 0.0187159 0.0615871 -0.00106769 0.0473785 -0.0605551 -0.0950487 
0.0805921 0.0841875 -0.0447729 -0.0812335 0.143272 0.113446 0.0703808 -0.0389405 -0.192209 0.048413 0.0322449 0.0571338 0.117778 -0.00918009 0.0129493 -0.0179018 0.0690471 0.0521882 -0.0344439 0.16008 0.0938958 0.0316347 0.00117614 0.0542741 -0.0491517 0.111467 -0.0746871 -0.13015 0.172446 0.0846007 -0.0679088 0.108276 -0.0895833 0.0610892 0.0186898 0.0136329 0.0174351 0.196682 0.0450578 -0.0264992 0.048013 0.00870252 -0.044235 0.0525057 -0.16417 0.110056 0.170484 0.0288304 -0.173755 -0.0648096 0.0217379 0.0715227 -0.125894 0.0211063 0.0996519 -0.0219026 -0.00413448 0.165199 -0.0557808 -0.0613035 -0.0345299 -0.0338024 0.184002 -0.0932278 0.136269 -0.0939097 0.0326381 0.0593865 -0.0179097 0.0467829 0.0302618 0.0782998 -0.0184754 0.0460522 0.0177236 -0.00869664 -0.0606137 0.162395 0.0650396 -0.0319082 -0.038702 0.137464 0.02239 -0.0179432 -0.00847204 -0.0910133 0.115821 0.0774458 0.0124138 0.0144551 0.0913796 -0.0821139 -0.0293206 0.0229288 -0.0523942 -0.159936 0.101782 0.0679708 0.0351153 -0.0643124 -0.0290284 0.107265 -0.0381756 0.191913 -0.159991 0.061499 -0.06933 0.123465 0.107471 -0.0714923 0.0558781 0.112787 -0.159219 0.069668 0.0539187 0.0086667 -0.162564 -0.218732 -0.0733384 0.0720961 -0.0160705 0.0396945 0.0175445 0.0595062 -0.0321591 0.0641132 -0.0581085 -0.086331 
0.0782472 0.0410513 -0.0505219 -0.0743418 0.14204 0.126623 0.0622171 -0.0455204 -0.202358 0.0484761 0.0103268 0.0787788 0.122584 -0.0271755 -0.000184322 -0.0287289 0.0306048 0.0774314 -0.0212459 0.172012 0.0999875 0.00685852 0.0345578 0.0649665 -0.0555404 0.121979 -0.0826522 -0.175764 0.144859 0.0760446 -0.0712319 0.102564 -0.0992313 0.0469104 0.0286331 0.00461609 -0.0186768 0.200086 0.0439024 -0.0339799 0.0467561 0.00337928 -0.068622 0.0668586 -0.197166 0.0747956 0.170355 0.0264937 -0.159395 -0.0428553 0.0265636 0.0375701 -0.10223 0.0277945 0.100268 -0.0305751 0.0398098 0.168841 -0.0461178 -0.0812962 -0.0196569 -0.0186856 0.198887 -0.0793288 0.138874 -0.109473 0.0276895 0.0543579 -0.0120946 0.0468676 0.024269 0.0968492 -0.0137069 0.0525526 -0.00410242 -0.0152373 -0.0889448 0.13159 0.0821028 -0.00734646 -0.0466227 0.131442 0.0262745 -0.0173445 -0.0146329 -0.098851 0.127533 0.0945014 0.0213916 -0.0121236 0.085389 -0.0600486 -0.0077246 0.00701192 -0.07265 -0.174614 0.0941389 0.101198 0.0332976 -0.0646252 -0.00642333 0.100548 -0.0346397 0.181086 -0.131815 0.0442602 -0.0642125 0.121152 0.098729 -0.0472714 0.0518871 0.122759 -0.137338 0.0458003 0.0412102 0.030688 -0.158269 -0.212935 -0.080534 0.0730162 -0.0169437 0.0174245 0.00768569 0.0247454 -0.0579535 0.0739175 -0.0719213 -0.0580659 
0.13142 0.0220656 -0.101653 -0.0429737 0.165073 0.143694 0.0987161 -0.0449098 -0.15473 -0.0216055 0.00198296 0.100868 0.110601 -0.0586723 -0.0403572 -0.0322334 0.0300976 0.0446551 -0.0803229 0.203935 0.112412 -0.00277275 0.00875014 0.0831575 -0.046985 0.0658112 -0.102778 -0.161968 0.0939967 0.092758 -0.0672777 0.109358 -0.131219 0.078109 0.0121312 0.00228286 -0.0294618 0.156971 0.00381905 -0.085799 0.055897 0.013213 -0.0331568 0.080538 -0.16752 0.0601163 0.154669 0.051753 -0.142544 0.0248004 0.0148746 0.00283917 -0.0888965 0.0143422 0.143475 -0.0506728 -0.0439039 0.193204 -0.0367194 -0.108658 -0.0221773 0.00782408 0.220537 -0.0975223 0.0883955 -0.0883357 0.0122437 0.0598155 -0.0467235 0.0151002 0.0322253 0.095776 0.00165661 0.0544257 -0.040319 0.00804946 -0.0372487 0.0813907 0.0796522 0.0171405 -0.00426236 0.120852 -0.00418785 -0.061139 -0.0110511 -0.0884314 0.103007 0.0853198 0.0380533 0.0320923 0.121282 -0.103089 -0.0557937 0.0131499 -0.0639328 -0.120909 0.0912598 0.045029 0.0209286 -0.0708881 0.0140137 0.0840034 -0.0332345 0.167629 -0.195889 0.0607327 -0.100572 0.125438 0.0518293 -0.013433 0.113336 0.141943 -0.138181 0.0622294 0.0352372 0.0246081 -0.157885 -0.16573 -0.0684192 0.0806377 -0.0342367 0.0477425 0.0539786 0.0583449 -0.04726 0.0499396 -0.0478967 -0.118589 
0.128936 0.0129927 -0.11608 -0.0373343 0.150503 0.145317 0.12042 -0.0419155 -0.144927 0.0150331 0.0162317 0.108 0.132281 -0.0692981 -0.0297078 -0.0378657 0.00288009 0.0603002 -0.0789022 0.200489 0.116045 -0.038749 0.0214338 0.0821231 -0.0496418 0.0545418 -0.123158 -0.195309 0.0940595 0.110656 -0.065908 0.129528 -0.125524 0.066895 0.0138284 -0.00682917 -0.0484553 0.171045 0.0171731 -0.0875964 0.0398707 -0.0155249 -0.0691143 0.0776134 -0.182869 0.0311608 0.138627 0.0540673 -0.143575 0.0197241 0.00618804 0.00749949 -0.0826025 0.00646256 0.121868 -0.0433991 -0.0392301 0.193036 -0.0625228 -0.0926699 -0.0362957 -0.00872434 0.239785 -0.106608 0.091697 -0.0742041 0.00661006 0.0618523 -0.0680117 0.000419547 0.0248189 0.105027 -0.0220748 0.0603962 -0.0480468 -0.00147908 -0.0362796 0.0463766 0.0874894 0.0432577 -0.0314201 0.0849173 -0.0219634 -0.0637561 -0.021272 -0.0813618 0.102834 0.0678898 0.0570331 0.0150682 0.114822 -0.0999711 -0.0458015 0.0186278 -0.0722699 -0.136608 0.0756066 0.0447223 0.0266102 -0.0643796 0.033465 0.0628828 -0.0376167 0.154747 -0.171306 0.0690598 -0.0847616 0.130831 0.077011 -0.0121825 0.0884214 0.145657 -0.132585 0.0329764 0.0516223 0.0423345 -0.144519 -0.148367 -0.0362474 0.106986 -0.0294162 0.0103891 0.0391919 0.0698665 -0.0495849 0.0584081 -0.0388818 -0.101415 
0.119715 0.0224729 -0.0805286 -0.0640433 0.130563 0.117069 0.0723125 -0.0310082 -0.179992 0.0340512 0.0285502 0.102448 0.13184 -0.0407553 -0.0187071 -0.0253457 0.0418134 0.0498911 -0.0373905 0.197946 0.116218 0.00894021 -0.00572248 0.0944419 -0.0486941 0.11596 -0.0659374 -0.170706 0.108652 0.117289 -0.0956047 0.0862985 -0.10219 0.0650885 0.0161108 -0.00670688 -0.0319435 0.186517 0.0365361 -0.0592766 0.00938361 0.00365419 -0.0565748 0.0798016 -0.148185 0.0611382 0.163173 0.0275651 -0.161853 -0.00460363 0.0453474 0.0200759 -0.0926773 0.0222927 0.14035 -0.0386151 -0.0363493 0.185981 -0.0586889 -0.0994593 -0.0102674 -0.0449768 0.218867 -0.0839484 0.101753 -0.102877 0.0169803 0.0722802 -0.0373586 -0.00801128 0.0318634 0.0842353 -0.0241661 0.0211798 -0.0279732 0.00507101 -0.0459338 0.095086 0.0961626 0.0469087 -0.0200133 0.108267 0.00807888 -0.0515595 -0.0189759 -0.113738 0.116841 0.0730197 0.0676472 0.014876 0.0654494 -0.0868542 -0.0385495 0.0600732 -0.0784522 -0.133575 0.097826 0.0326167 0.0327628 -0.0845938 0.0153579 0.0947023 -0.0546447 0.158303 -0.184825 0.0596255 -0.0846924 0.0968025 0.0656887 -0.0462901 0.0985779 0.137076 -0.142629 0.0490319 0.0503673 0.042439 -0.174079 -0.185643 -0.0924059 0.0712708 -0.0405538 0.0231383 0.0443922 0.0430087 -0.0300829 0.081346 -0.0340122 -0.10704 
0.149779 0.00416195 -0.0832291 -0.0386169 0.149192 0.184785 0.1342 -0.018117 -0.129562 -0.041009 0.0129757 0.107517 0.129113 -0.0737771 -0.0227706 -0.0720215 0.00553932 0.0436267 -0.124154 0.190277 0.111638 -0.00597204 0.00835793 0.121363 -0.0619989 0.0117034 -0.125044 -0.167083 0.07486 0.0827814 -0.0539129 0.12288 -0.149419 0.107989 -0.00184897 -0.00467765 -0.0385513 0.139084 -0.0105081 -0.0758278 0.0838216 -0.0182577 -0.0758567 0.0536354 -0.183407 0.00829404 0.108246 0.0675468 -0.140938 0.0460445 0.00542977 -0.0114203 -0.0657777 0.0153294 0.113422 -0.0404129 -0.0590224 0.205076 -0.0565989 -0.0964706 -0.045743 0.0434906 0.21579 -0.128132 0.0640788 -0.0528195 0.0304079 0.046424 -0.0955055 0.00485236 0.013821 0.0779264 -0.0122621 0.0698605 -0.0348491 0.00563717 -0.0239048 0.0163517 0.0928392 0.0568804 -0.0149806 0.0730167 -0.00144074 -0.078358 -0.00400725 -0.0637377 0.119952 0.0548157 0.00996507 0.0460197 0.156055 -0.134413 -0.041237 0.0296876 -0.0875766 -0.114441 0.0603364 0.0159438 0.0187977 -0.0438828 0.0498767 0.0779299 -0.0540013 0.176927 -0.164936 0.0670572 -0.0978044 0.123789 0.0249142 -0.016189 0.107718 0.149185 -0.1247 0.0430259 0.0392538 0.0437813 -0.148756 -0.120968 -0.0343886 0.117463 -0.0243108 -0.00422881 0.0267832 0.0674691 -0.0332077 0.0539753 -0.0516829 -0.116895 
0.135042 -0.021188 -0.121918 -0.00699407 0.140564 0.140625 0.127368 -0.0146081 -0.0681977 -0.030664 0.0312826 0.144076 0.151334 -0.124463 -0.0838979 -0.0498531 -0.0178549 0.0576597 -0.176508 0.237321 0.124549 -0.0479646 0.0117852 0.145086 -0.0856729 -0.00776767 -0.118434 -0.189197 0.039538 0.11592 -0.0613131 0.123663 -0.115165 0.10197 -0.0408153 -0.0190855 -0.0748175 0.131035 -0.0667123 -0.0661055 0.0588554 -0.0371034 -0.0781695 0.100358 -0.170379 -0.0528488 0.0993588 0.0709929 -0.0829079 0.0806339 0.0432145 -0.0530383 -0.092049 -0.00377744 0.115666 -0.0453719 -0.0909625 0.160819 -0.0229683 -0.088542 -0.0506607 -0.00971693 0.200377 -0.0803181 0.0348073 -0.13897 0.0189089 0.0268608 -0.100396 -0.0413573 0.0111979 0.0633768 0.0044295 0.0465104 -0.0620195 0.0202816 -0.0178862 0.0333213 0.0541482 0.0968131 -0.00501816 0.0376198 -0.0197651 -0.0496033 -0.0192148 -0.0229974 0.122644 0.0445752 0.0299144 0.0196592 0.0766216 -0.142326 -0.0692779 0.0204534 -0.105771 -0.0953029 0.0199393 -0.0234431 0.00746321 -0.0510085 0.0622157 0.0545035 -0.0403499 0.174069 -0.145421 0.0318466 -0.117772 0.143766 0.024733 0.00400596 0.0724636 0.148975 -0.123635 0.0398178 -0.00566618 0.0648011 -0.129763 -0.0895366 -0.0479518 0.127302 -0.0538721 0.0233233 0.00467227 0.0775353 -0.0400342 0.0371449 -0.0820066 -0.1067 
0.154919 -0.0195002 -0.108078 -0.0348873 0.152798 0.176602 0.133788 -0.00518159 -0.111976 -0.0414355 0.00826601 0.0889947 0.152011 -0.0876338 -0.0311234 -0.0714079 -0.0311228 0.0303613 -0.159428 0.200198 0.108224 -0.044655 0.0211551 0.125043 -0.0474091 -0.0269413 -0.13384 -0.16824 0.0446454 0.0755797 -0.0293718 0.0934654 -0.181761 0.0890177 -0.0357034 0.00152704 -0.0945039 0.102067 -0.0374979 -0.0527727 0.0836279 -0.0262829 -0.0834076 0.101221 -0.173268 -0.0327195 0.0839743 0.100637 -0.0777136 0.0725171 0.0125488 -0.0520758 -0.0815193 -0.00862976 0.0866753 -0.0632918 -0.0797004 0.203711 0.00685495 -0.104037 -0.0468245 0.05052 0.191247 -0.0759887 0.00629465 -0.0897874 0.0405626 0.047395 -0.0705185 -0.0354916 0.0184253 0.113657 0.0230387 0.0607001 -0.0570939 0.00182846 -0.041751 0.00329966 0.0789869 0.116176 0.0215248 0.0231798 -0.00997031 -0.0648248 -0.0209136 -0.0275555 0.122557 0.0511664 0.015358 -0.00156737 0.131597 -0.112994 -0.0481014 -0.00708863 -0.114747 -0.110797 0.0353622 -0.000319146 0.00284256 -0.0492254 0.0452612 0.0670456 -0.0187299 0.165709 -0.171146 0.0454404 -0.134467 0.162328 0.0350226 0.0115971 0.110529 0.152484 -0.133268 0.0471757 -0.0101842 0.0736583 -0.129882 -0.0625866 -0.0547193 0.113898 -0.0516653 -0.0034412 0.00581998 0.0819169 -0.0807011 0.0117954 -0.108214 -0.0830918 
0.0783856 0.0197499 -0.0464994 -0.0504826 0.125788 0.180665 0.120756 -0.0159452 -0.0980834 0.00925649 0.0225913 0.0826212 0.168608 -0.120192 -0.0166074 -0.0814341 -0.0804753 0.0954337 -0.174986 0.185521 0.130633 -0.0543208 0.00927557 0.137347 -0.0678321 -0.0225605 -0.163546 -0.194096 0.0744768 0.081285 -0.00672349 0.0915034 -0.144852 0.0902915 0.0134148 0.00313624 -0.0682227 0.103057 -0.0335965 -0.0440985 0.109727 -0.0733573 -0.0698085 0.118081 -0.197525 -0.0622245 0.119484 0.0911343 -0.11721 0.0306352 0.00268901 -0.074022 -0.103167 0.00572256 0.079356 -0.019327 -0.0719955 0.163551 -0.0202377 -0.124042 -0.0472396 0.0344595 0.17885 -0.060885 0.0546727 -0.0855032 0.0449202 0.00294673 -0.0794835 -0.0158834 0.00804872 0.0933734 0.0149066 0.0499493 -0.0307111 -0.024682 -0.0912157 0.0549979 0.0931462 0.0731769 -0.0123764 0.0614747 -0.00825975 -0.0265556 -0.0391643 -0.00170278 0.141551 0.0568823 0.0214089 0.0208616 0.120099 -0.129195 -0.0234352 -0.0294532 -0.15102 -0.137843 -0.0152394 0.0490241 0.00230375 -0.0352675 0.0507581 0.0549749 -0.0212452 0.165087 -0.0964902 0.0556412 -0.101679 0.176856 0.038778 0.00968518 0.0410583 0.132136 -0.14796 0.0164888 -0.00961602 0.059745 -0.129658 -0.104882 -0.0411878 0.113973 -0.00184297 -0.0188648 -0.0309627 0.084565 -0.0943647 0.0272008 -0.109598 -0.0522578 
0.0731041 0.0209747 0.0349365 0.00972201 0.134999 0.211603 0.110521 -0.0918309 -0.0785169 0.00803856 0.00178123 0.082196 0.109632 -0.138081 0.0440244 -0.0833584 -0.102319 0.161391 -0.149406 0.132514 0.102415 0.00319048 0.0137059 0.221217 -0.0297293 -0.0547728 -0.177598 -0.215895 0.0463161 0.0965029 0.0195878 0.103875 -0.174571 0.0870768 0.0782556 0.0154802 -0.0432867 0.0213985 -0.0259318 -0.0425905 0.128007 -0.0811155 -0.0577923 0.077647 -0.19697 -0.0623817 0.12386 0.102654 -0.102854 0.0295467 0.0676656 -0.104699 -0.0330905 -0.0224009 0.0908614 0.0040108 -0.0457264 0.155544 0.0118983 -0.10144 -0.043863 0.0736945 0.120819 -0.0932241 0.0727427 -0.0719807 0.0657608 -0.0537919 -0.117746 0.0530923 -0.014581 0.120548 0.020272 0.0471036 -0.044719 -0.0342814 -0.113542 0.0505822 0.0960476 0.0646063 0.0506613 0.124181 -0.0195044 -0.0471517 -0.00412411 -0.021634 0.109608 0.034502 -0.0579692 0.0679323 0.13173 -0.0780383 0.00493009 -0.0357039 -0.177839 -0.0998513 -0.0358833 0.048249 0.0493716 -0.0284581 0.0922309 0.0426465 -0.0141414 0.112627 -0.0607972 0.0229515 -0.0670243 0.102091 0.0147148 0.0865218 0.0466357 0.13482 -0.0804272 -0.0425258 -0.0245238 0.0548458 -0.138818 -0.0845813 -0.091339 0.0904179 0.0525889 -0.0291637 -0.0442742 0.045807 -0.0963646 0.071619 -0.105406 -0.0598175 
0.0704291 0.0370785 -0.0154648 -0.0265708 0.14244 0.199142 0.105697 -0.0801682 -0.0693432 0.0113056 0.027737 0.0872307 0.138946 -0.127103 0.0109123 -0.0755094 -0.0967903 0.121636 -0.163883 0.14965 0.124016 -0.00634539 -0.0259921 0.170036 -0.0357878 -0.0187295 -0.172588 -0.200334 0.0753116 0.119395 0.0187827 0.102752 -0.165072 0.0717806 0.0649414 0.027986 -0.0553443 0.0314204 -0.00196545 -0.0456343 0.126584 -0.0752763 -0.0599907 0.111913 -0.174803 -0.0335869 0.130408 0.108675 -0.113991 -0.0134919 0.0298057 -0.0615856 -0.0667873 -0.0247043 0.0920121 -0.00465857 -0.0946441 0.160096 -0.021725 -0.106324 -0.0478022 0.0370328 0.159701 -0.0549832 0.0563813 -0.0880383 0.0631949 -0.00367224 -0.0771302 0.0107715 0.0236556 0.106218 0.0105705 0.00524578 -0.034306 -0.011317 -0.127172 0.0666998 0.0843834 0.0872104 0.044122 0.116806 -0.00470516 -0.0180657 -0.0248369 -0.00690272 0.134755 0.0429821 -0.0264268 0.0477963 0.115119 -0.103287 -0.0233776 -0.00863026 -0.189147 -0.129408 -0.0244026 0.0242286 0.0306039 -0.0505363 0.0769344 0.0545935 -0.0149139 0.116824 -0.10005 0.056104 -0.086159 0.147612 0.0279081 0.066085 0.0544883 0.100687 -0.153183 -0.0124828 -0.0153406 0.0608382 -0.174196 -0.0967418 -0.080603 0.0907918 0.0380602 -0.0203822 -0.031768 0.0644065 -0.0895499 0.0632713 -0.0996131 -0.0511888 
0.0605456 -0.000848413 0.169751 0.132793 0.110761 0.153676 0.104464 -0.162535 0.0326544 -0.0289509 -0.0454476 0.0679715 0.0114551 -0.0649105 0.054551 -0.0515747 0.013982 0.169498 -0.123817 0.000475126 0.0613186 0.0688362 -0.0117909 0.26682 0.0274657 -0.109338 -0.183734 -0.131943 -0.00332473 0.083891 0.0653388 0.154868 -0.155407 0.0735852 0.0838286 -0.0391806 0.0428986 -0.00659095 -0.00324843 -0.00966015 0.146029 0.00992565 -0.0193465 -0.133449 -0.0880764 -0.105138 0.0107432 0.0148766 0.0450696 -0.0493261 0.16323 -0.09183 0.103837 -0.0119835 0.0571965 0.031453 0.0553002 0.0772971 0.0742826 -0.0380989 -0.0220809 0.0990273 -0.0938872 -0.156206 0.0648724 -0.000179739 0.117179 -0.108103 -0.142521 0.0839434 -0.0226888 0.0975784 0.0283336 0.0438071 -0.0256304 0.0102748 -0.0553177 0.00786823 0.034601 0.00979671 0.0672234 0.177984 0.045443 -0.023435 0.110723 -0.0540743 0.0731417 0.0036724 -0.197766 0.0352218 0.0402428 -0.0200297 0.112674 -0.0237019 -0.150233 -0.026448 -0.0225563 0.00714971 0.0876518 0.0530312 0.130425 0.0144321 -0.00801986 0.148216 0.0306463 -0.0949596 0.017796 -0.0597313 -0.0348611 0.113521 -0.0301963 0.0577206 0.0174094 -0.0617654 -0.0370128 0.0265897 -0.162875 0.00546605 -0.192772 0.00737061 0.0528983 0.0414621 -0.100188 -0.0640662 -0.0311303 0.123437 -0.133954 -0.0572427 
0.0182033 0.0526865 0.0893008 -0.00529377 0.120828 0.226458 0.0345317 -0.0960044 -0.0563864 0.0160138 -3.64801e-05 0.068598 0.0804788 -0.180098 0.0259558 -0.0787159 -0.0956714 0.186565 -0.164557 0.0995335 0.0999947 0.0329634 -0.00514945 0.177727 -0.0427065 -0.00305521 -0.164732 -0.197843 0.0695436 0.0177849 0.0805446 0.10623 -0.164709 0.0825962 0.09703 0.0263997 -0.0151631 0.00198873 -0.00201316 -0.0186913 0.178072 -0.0877183 -0.0765419 0.0772697 -0.180809 -0.080944 0.125673 0.0910533 -0.104617 -0.0307279 0.0680843 -0.0777725 -0.0522366 -0.0169835 0.0278428 0.0148269 -0.00848511 0.0781886 0.0210664 -0.122723 -0.0398678 0.0651382 0.0783351 -0.0575401 0.0879173 -0.112286 0.11128 -0.0640362 -0.0634564 0.10531 -0.0164192 0.0803015 0.0406337 0.0246549 -0.0248912 -0.0671437 -0.176979 0.12821 0.0603067 0.027474 0.0183915 0.189387 0.0271134 0.00715454 0.0169485 -0.00957827 0.145744 0.0707711 -0.0842609 0.0450517 0.111089 -0.0521005 0.0167464 -0.0369306 -0.17929 -0.117383 -0.0350972 0.0667068 -0.0107776 -0.0238733 0.0724238 0.0414308 -0.0325194 0.131598 0.0246355 0.00458569 -0.0294394 0.091599 0.013141 0.086731 -0.00562403 0.102158 -0.0964504 -0.0138145 -0.0301653 -0.00736626 -0.192724 -0.143009 -0.0976234 0.0320673 0.0793369 0.000792852 -0.0542668 0.00953646 -0.0570206 0.0439568 -0.119096 -0.024435 
0.0113518 0.0793919 0.218258 0.073033 0.0709137 0.20662 0.0112709 -0.155653 -0.0185792 -0.0276094 -0.0618527 0.0396945 -0.0510561 -0.0968565 0.076693 -0.110564 0.00709038 0.161177 -0.104048 -0.0277335 -0.027676 0.108964 -0.0120204 0.186374 0.0246308 -0.0318351 -0.109172 -0.0352102 0.0351012 -0.0581336 0.113817 0.15409 -0.167042 0.0922304 0.0965818 -0.00941164 0.0332295 -0.0134163 -0.0037279 -0.0169512 0.19257 -0.0478728 -0.0680564 -0.104624 -0.104353 -0.0547385 0.0131389 0.0657192 -0.0598693 -0.038761 0.137108 0.0114823 0.086633 -0.0577293 -0.0144419 0.0216534 0.0286633 0.0601889 0.0501695 -0.0791982 -0.0403672 0.141525 -0.0445257 -0.121014 0.0832409 0.0378611 0.140768 -0.104784 -0.162881 0.224659 -0.0611856 0.0418651 0.049723 0.114251 -0.00651137 -0.0751036 -0.0870821 0.0158327 0.0429612 -0.0448227 0.0219982 0.205676 0.0575873 -0.0614023 0.120143 -0.150842 0.0611401 0.0391483 -0.172554 0.10038 0.103622 0.0143386 0.122722 0.000645085 -0.0895514 -0.0294185 0.0346165 0.0163525 0.0389055 -0.000827504 0.0740921 0.0540422 -0.0647398 0.138299 0.0566734 -0.0475259 0.0379875 -0.0618631 -0.000658804 0.0778878 0.0320156 0.130385 0.0169775 0.00489604 -0.00334149 -0.106488 -0.17508 -0.0675873 -0.0467603 -0.00791774 0.107864 0.0153084 -0.0656878 -0.0863621 0.0532877 0.0621799 -0.0652954 -0.0893518 
-0.0292002 0.0690611 0.123656 -0.00491804 0.0722532 0.215499 -0.0291396 -0.113111 -0.0851984 -0.00817444 -0.0162887 0.0553948 0.0222945 -0.163547 -0.016775 -0.124495 -0.0968462 0.15555 -0.083284 0.101654 0.0646426 0.00182333 0.0012515 0.115647 -0.045431 0.0768222 -0.137921 -0.144707 0.0924361 -0.05252 0.0804474 0.0799004 -0.138086 0.0501221 0.11851 0.0370384 -0.0172094 0.0490914 -0.000138583 -0.077859 0.177722 -0.0888954 -0.102003 0.04222 -0.174908 -0.04446 0.129828 0.0850346 -0.141634 -0.0416204 -0.00607163 0.0133394 0.00927197 -0.00951564 0.0429935 0.0157747 0.0193785 0.0604777 -0.0278309 -0.164122 -0.0331525 0.11772 0.138084 -0.0405292 0.116611 -0.0279473 0.120892 -0.0782079 -0.0709523 0.15949 -0.0435799 0.0231222 0.0401976 0.0851601 0.0124876 -0.0942124 -0.162043 0.101061 0.0933578 -0.0123406 -0.0528119 0.202893 0.0393047 -0.0177391 0.0510382 -0.0845681 0.119184 0.135237 -0.0422241 0.0700622 0.173301 -0.0159716 0.0899927 0.00175755 -0.127547 -0.151794 0.0250638 0.104202 -0.00441347 -0.0530921 0.068071 0.0828789 -0.0718524 0.0861864 0.0463942 0.061318 0.0522928 0.0545781 0.0490942 0.0613056 0.0306525 0.122237 -0.0772788 0.00565988 0.0133051 -0.053702 -0.185924 -0.176393 -0.0148172 0.0106389 0.0664748 -0.0303394 -0.0416485 -0.0635951 -0.0423882 0.0905211 -0.0351219 -0.023914 
0.0127838 0.0373531 -0.0190759 -0.0617475 0.00194778 0.120094 -0.0781521 0.0254104 -0.121502 0.0591436 0.0722017 0.00730946 0.0786952 -0.10123 -0.0452124 -0.0199098 -0.0306122 0.0615413 0.0566014 0.131141 0.122831 -0.0594767 0.0146008 0.126668 -0.0157732 0.185435 0.0392758 -0.177459 0.153788 -0.0401316 0.0321848 -0.026019 -0.0624577 0.0210577 0.00718689 0.0136522 -0.0228443 0.159097 0.0733463 -0.0333486 0.0228903 -0.0728626 -0.0893573 0.13833 -0.0994057 -0.115326 0.185339 0.0216953 -0.127198 -0.0403693 -0.00499254 0.0248225 -0.0679678 0.0327408 0.0746539 0.00853227 0.0549485 0.0943939 0.00896144 -0.219453 -0.00704733 -0.0690421 0.231134 -0.0107852 0.0303129 -0.0514565 0.0763297 -0.0251173 0.0894153 0.0615362 -0.0915355 0.0589276 -0.0480571 0.0740861 0.0436552 -0.19346 -0.0925428 0.217166 0.0819509 0.0547018 -0.0805861 0.141696 0.0509474 -0.0723451 0.029858 -0.0824798 0.110986 0.15001 0.137588 -0.072514 0.0974447 0.00094898 0.00111784 0.0160516 -0.0192198 -0.172921 0.0520171 0.136657 -0.0286382 -0.100496 -0.0394351 0.0348449 -0.039214 0.103692 -0.0323115 0.0828663 -1.7459e-05 0.0306098 0.104491 -0.0782952 0.0087465 0.154557 -0.101394 0.0137616 0.0832106 -0.0260469 -0.0895793 -0.255016 -0.014498 -0.0111772 0.00652927 0.0125919 0.0290348 -0.0234594 -0.132724 0.0455506 0.00423686 0.0500613 
-0.00377178 0.0561233 0.0606188 -0.0569708 -0.0425917 0.123978 -0.0906063 0.0635273 -0.125632 0.0426784 0.039863 -0.00150975 0.0199109 -0.131645 -0.00236842 -0.0446452 -0.0441328 0.0533819 0.0656097 0.109372 0.0636339 -0.00951041 0.0431654 0.126076 -0.0418562 0.166397 0.0718656 -0.145239 0.146101 -0.0998171 0.022203 -0.0501863 -0.0181687 0.0508543 0.0205037 0.001108 0.0288864 0.173434 0.0208359 -0.0160008 0.025491 -0.0872902 -0.084053 0.0906826 -0.115087 -0.0904677 0.182823 -0.0081106 -0.152646 0.0324851 0.0143833 0.0432095 -0.0532552 0.064387 0.0813273 0.00966227 0.100481 0.0435528 0.0056469 -0.220097 -0.0299339 -0.0495714 0.184201 -0.0358501 0.045825 -0.0447993 0.0854687 -0.0783558 0.0327246 0.133264 -0.116962 0.00888984 -0.056569 0.135834 0.0854697 -0.204884 -0.0813644 0.205241 0.0987864 0.0155822 -0.0950913 0.132615 0.059656 -0.0731338 0.0802489 -0.100624 0.0708065 0.146405 0.122203 0.000650124 0.117286 -0.00145726 0.0108699 0.00512502 0.0149362 -0.140602 0.0621333 0.163449 -0.021708 -0.0883674 -0.0553585 0.0542761 -0.05223 0.0948486 0.000524209 0.0620115 0.0244262 -0.0157605 0.0977237 -0.100774 -0.00137842 0.178612 -0.0480011 -0.00282841 0.0939808 -0.0459022 -0.019594 -0.276561 0.0261141 0.0090448 0.0545243 0.000207806 0.0522144 -0.0448423 -0.0770455 0.0328782 0.0890211 0.0488066 
0.0341807 0.0612136 -0.0523533 -0.0460372 0.0216564 0.12822 -0.0773747 -0.0147556 -0.0954067 -0.0093906 0.0494363 0.0238521 0.0268238 -0.107605 -0.0368728 -0.0674587 -0.039262 0.0304535 0.0811709 0.147376 0.077745 -0.00626781 0.052764 0.146984 -0.00996514 0.13093 0.0854553 -0.176107 0.126204 -0.0210717 0.0253659 -0.079534 -0.0307832 0.0146338 0.0324623 0.0214127 0.0180119 0.149414 0.0129336 -0.0253689 0.0302188 -0.0541784 -0.0962933 0.161031 -0.166975 -0.0255073 0.19837 0.0242509 -0.108179 0.0356462 -0.0110022 0.0596589 -0.0332183 0.033357 0.113171 -0.00580696 0.0641875 0.103861 0.000262193 -0.203313 -0.038398 -0.0545361 0.255673 -0.0439845 0.041681 -0.111013 0.0927007 -0.0545083 0.0587236 0.111909 -0.069354 0.0481812 -0.0510016 0.0882814 0.0696242 -0.155685 -0.10903 0.20951 0.0742747 0.0660506 -0.0741894 0.157261 0.0424755 -0.060454 0.0710838 -0.0881081 0.0654029 0.124265 0.0893539 -0.0274544 0.126162 -0.0216387 -0.0104837 -0.0279395 0.00893151 -0.205363 0.0623107 0.138019 0.0130576 -0.134026 -0.0442022 0.0696846 -0.0067293 0.0822367 -0.092281 0.0705813 0.00869701 0.0279219 0.0800773 -0.0358843 0.0760707 0.150384 -0.067071 0.0200999 0.0364096 -0.00358533 -0.0678018 -0.274061 -0.000490232 0.0272963 0.024411 0.0231259 0.0208273 -0.0094997 -0.114278 0.0404554 0.0428024 0.052982 
0.0571545 0.0160457 -0.077754 -0.0214814 0.0403702 0.118026 -0.0409014 -0.00580057 -0.0686407 -0.0450195 0.0491512 0.0999183 0.0298071 -0.152226 -0.11494 -0.0464994 -0.0495365 0.0280249 0.00666318 0.184179 0.122147 -0.0406344 0.0388983 0.170899 -0.0125631 0.120934 0.106035 -0.190696 0.0722141 0.0183313 -0.0198883 -0.0643051 -0.0305402 0.0602804 -0.00402785 -0.0241432 -0.0171468 0.154617 -0.0267776 -0.0587522 0.027483 -0.0750732 -0.0593346 0.191977 -0.141994 -0.0588091 0.195243 -0.000393152 -0.123005 0.074098 0.0291157 -0.000738586 -0.0538971 0.0265916 0.162539 -0.0151314 -1.83768e-06 0.119994 -0.0160257 -0.206611 -0.0158995 -0.0933495 0.271136 -0.0303841 0.0549694 -0.145119 0.031937 -0.0399871 0.0216373 0.094999 -0.0732729 0.0322598 -0.0530047 0.0538848 0.0267237 -0.114695 -0.0543499 0.193475 0.0560612 0.0867295 -0.0849575 0.12756 0.0417548 -0.0764269 0.0205427 -0.0986565 0.0892938 0.129444 0.102648 -0.00350335 0.0920525 -0.083038 -0.0621036 -0.000856286 -0.00540257 -0.142908 0.0545655 0.080985 0.023913 -0.134681 -0.0219874 0.0532867 -0.0359481 0.107149 -0.0908539 0.0372863 -0.0317129 0.0603177 0.0203179 -0.0745895 0.0724807 0.178954 -0.0758563 0.0392027 0.0573071 0.00374408 -0.0910715 -0.229747 0.00276859 0.0659689 -0.00121295 0.0634621 0.023463 -0.0045373 -0.0726284 0.0484444 0.0548487 -0.00871802 
0.0536687 0.026334 -0.103035 -0.0391402 0.0436164 0.101562 -0.0423062 0.000355028 -0.0808518 -0.012428 0.0556036 0.095389 0.0591843 -0.137477 -0.127543 -0.00695792 -0.0289937 0.0243644 0.0175324 0.146463 0.158528 -0.0505916 0.0219179 0.136428 0.00359443 0.153799 0.113665 -0.194527 0.0954765 0.0602838 -0.02729 -0.0210547 -0.0254312 0.0487012 -0.0170594 -0.0548926 -0.0204344 0.155215 0.0304418 -0.0549089 0.0121849 -0.0826588 -0.032091 0.197338 -0.107399 -0.0666494 0.197109 -0.0168583 -0.130507 0.00426107 0.0568616 0.00703241 -0.0525927 0.0188524 0.138163 -0.00595144 0.0130138 0.113011 -0.0143151 -0.206515 0.00464194 -0.134075 0.257705 -0.0116323 0.0518711 -0.143019 0.00906287 -0.0110054 0.0554287 0.0567625 -0.0837043 0.0324381 -0.0809401 0.00465907 0.0141064 -0.103077 -0.046936 0.192943 0.033355 0.107252 -0.0853361 0.116537 0.0630695 -0.0530829 0.00493169 -0.1022 0.110635 0.118389 0.112896 -0.039701 0.0436839 -0.0763226 -0.0901527 0.0265421 -0.0156705 -0.127127 0.0602317 0.0928717 0.0177879 -0.128983 -0.0175169 0.0417885 -0.0332912 0.149707 -0.0922552 0.013917 -0.0490195 0.0895458 0.0221979 -0.106079 0.0459543 0.152441 -0.121391 0.0364847 0.0777866 0.00764827 -0.120235 -0.225409 -0.000453206 0.0559478 -0.00440201 0.0751868 0.0255527 -0.0199556 -0.0696333 0.0410477 0.0301184 -0.00346664 
0.0930003 0.049697 -0.113394 -0.0467308 0.0677751 0.193487 0.0340472 0.0314163 -0.0444305 -0.0314867 0.0699956 0.0520849 0.0754751 -0.185408 -0.0996305 -0.0172527 -0.0850688 0.029576 -0.0730294 0.126858 0.1829 -0.0531144 -0.0137566 0.149326 -0.00232971 0.0398867 0.025819 -0.196581 0.129201 0.0593223 0.00533003 -0.0107331 -0.0951464 0.0803689 0.000848553 -0.0276362 -0.0421617 0.0640376 -0.00303597 -0.0844626 0.0595974 -0.122328 -0.0327086 0.203078 -0.0972282 -0.0848959 0.16622 0.0630598 -0.178152 0.0187115 -0.0144558 -0.0138602 -0.0608279 -0.0151291 0.104639 0.0165792 -0.0698425 0.147728 -0.0427492 -0.195063 -0.0382717 -0.0587544 0.302621 -0.0489266 0.022815 -0.073297 0.00757383 -0.0274966 -0.00840974 0.0458508 -0.0903797 0.0412922 -0.0849972 0.0082665 -0.000762518 -0.101319 -0.0256632 0.159378 0.0393039 0.098762 -0.0331391 0.0853774 0.0116609 -0.0823101 -0.00987403 -0.010666 0.0880039 0.0801531 0.0886503 0.0430037 0.159308 -0.123378 -0.146524 0.0135382 -0.0300501 -0.0884177 0.0185849 0.0568038 0.00998837 -0.0863576 0.0361657 0.0134089 -0.0398267 0.0920166 -0.12146 0.0719781 -0.0580074 0.121263 0.00820481 -0.0716912 0.0783183 0.15312 -0.116653 -0.000504002 0.105169 0.0297957 -0.116839 -0.150808 0.0442711 0.0895528 0.0155798 0.0069325 0.0455837 0.0589091 -0.0858221 0.0362367 0.0177297 -0.0383346 
0.0864128 0.0754315 -0.119525 -0.0561051 0.0742235 0.190992 0.0442598 0.0266551 -0.0256815 -0.0218804 0.0939107 0.0679916 0.0861979 -0.197855 -0.127399 -0.00250525 -0.103227 0.0342489 -0.138137 0.111968 0.18006 -0.0421359 -0.03511 0.138875 -0.00982572 0.0221793 0.022333 -0.161932 0.133192 0.0718856 -0.00149133 0.00557192 -0.109781 0.0869098 -0.0350148 -0.0372135 -0.069481 0.03241 -0.00110649 -0.0329655 0.0690031 -0.123096 -0.0271361 0.209332 -0.079257 -0.101775 0.146324 0.0673414 -0.168943 0.015218 0.00413976 0.000365117 -0.112998 -0.0214355 0.0716026 0.0162536 -0.0968721 0.15052 -0.0437858 -0.158935 -0.050774 -0.0613806 0.295561 -0.0213235 -0.0123848 -0.101306 0.00743953 -0.0149819 -0.0117803 0.0423803 -0.0680074 0.050371 -0.0593927 0.0127063 0.00340871 -0.0843726 -0.0326868 0.152313 0.000506149 0.0978407 -0.0059095 0.0797639 0.0296616 -0.0490042 -0.0472843 0.0338113 0.10519 0.0533439 0.0703956 0.0360946 0.125836 -0.150838 -0.162415 0.0221221 -0.0412759 -0.0834038 -0.00992358 0.0232635 0.00654204 -0.0780601 0.0282901 0.00482891 -0.037408 0.124371 -0.112666 0.0651349 -0.0860614 0.165675 -0.00381657 -0.0802717 0.0784277 0.146759 -0.128432 0.0303828 0.0809212 0.0285058 -0.126731 -0.106987 0.0515328 0.0943354 0.0202629 0.0111942 0.030398 0.0672286 -0.0855853 0.0271783 -0.0214437 -0.0371537 
0.066395 0.0608483 -0.106862 -0.0450686 0.076593 0.222676 0.0561759 -0.0142175 0.00284472 -0.0434891 0.0794731 0.0582316 0.0972502 -0.164402 -0.119847 -0.0468656 -0.140688 0.046536 -0.139356 0.113109 0.193466 -0.0659121 -0.0231323 0.131972 -0.0162299 -0.00728026 -0.0481913 -0.177558 0.121344 0.0817521 0.0395438 0.0167469 -0.11654 0.0737102 0.01048 0.00637123 -0.0754243 0.0424233 -0.0120497 -0.0699043 0.0847658 -0.115173 -0.0614666 0.179509 -0.10696 -0.107535 0.124372 0.0947452 -0.139797 0.010125 -0.0505549 0.0146918 -0.0663767 -0.0195632 0.0844201 0.0307203 -0.0804949 0.158034 -0.0690807 -0.176687 -0.0646579 -0.00616829 0.313392 -0.0412805 0.00490219 -0.060706 0.0272781 -0.0102293 -0.0359055 0.0713007 -0.0513674 0.053793 -0.0587281 0.0209526 -0.00151079 -0.0736876 -0.0522243 0.0963083 0.0280875 0.0969499 -0.0235406 0.0794935 0.0181276 -0.0439214 -0.0415378 0.0269197 0.101007 0.0681945 0.0615836 0.0482064 0.174345 -0.153448 -0.0966721 0.00365309 -0.0673611 -0.122912 -0.0294195 0.0505583 0.0202297 -0.0558176 0.0786518 0.0258204 -0.0391937 0.083194 -0.0954124 0.0930034 -0.0616342 0.144996 0.0157255 -0.0300287 0.0681802 0.12614 -0.140547 0.0131255 0.0761552 0.0634763 -0.110113 -0.0947441 0.0629844 0.119926 0.0343945 -0.0274824 0.0075736 0.0575415 -0.115455 0.0570264 -0.00875462 -0.00594187 
0.0794232 0.0390857 -0.114608 -0.0197894 0.074204 0.166387 0.0694033 -0.00535773 0.0039672 -0.0516496 0.100133 0.0911721 0.109351 -0.187863 -0.160154 -0.0162392 -0.129118 0.0859074 -0.206498 0.139767 0.197288 -0.0690393 -0.00882502 0.188111 -0.0533972 -0.0590105 -0.0402059 -0.189164 0.0848349 0.107455 -0.0295062 0.0243449 -0.107296 0.088204 -0.0469292 -0.0277788 -0.11014 0.012251 -0.0687572 -0.00869391 0.0594803 -0.109063 -0.0655328 0.177302 -0.089621 -0.102035 0.121569 0.0745356 -0.135425 0.0504992 0.00129741 -0.0363866 -0.0984268 -0.0240349 0.0469915 0.0273208 -0.063768 0.140106 -0.0273856 -0.105767 -0.0370886 0.0107661 0.258603 -0.00846174 -0.0335781 -0.140954 0.0102793 -0.0294511 -0.0430798 0.0354325 -0.0505791 0.0273401 -0.032424 0.00917668 -0.0184723 -0.034454 -0.0384899 0.103296 -0.0169644 0.0886905 -0.00255564 0.0557048 -0.0248113 -0.0396516 -0.0884091 0.124257 0.0938084 -0.00358817 -0.00609783 0.0342009 0.120915 -0.166086 -0.117484 -0.0128583 -0.0777198 -0.0698789 -0.0822835 0.0107 0.0413958 -0.0468234 0.0870414 -0.00488013 -0.0259442 0.128891 -0.0557031 0.0398402 -0.0921429 0.185635 -0.0408014 -0.0405218 0.0495098 0.126039 -0.0943971 -0.00273019 0.00346049 0.0950771 -0.115248 -0.0524186 0.0351061 0.122257 -0.0138818 -0.00328915 -0.0397543 0.079576 -0.121744 0.0597515 -0.0893238 -0.0405612 
0.0813787 0.0143836 -0.0945264 0.00581675 0.0921702 0.164124 0.100531 -0.0275157 0.0195649 -0.0811187 0.0812501 0.0866423 0.115669 -0.13067 -0.124988 -0.0398305 -0.122469 0.0875827 -0.213448 0.134039 0.204268 -0.0914131 0.0041673 0.207533 -0.0298662 -0.114093 -0.0905965 -0.188008 0.0557679 0.123299 -0.00626993 0.042358 -0.117378 0.0954337 -0.0387983 0.000994203 -0.10716 0.00831998 -0.0862666 -0.0223298 0.081048 -0.0799052 -0.0620642 0.136183 -0.105281 -0.0921294 0.101081 0.0773759 -0.10082 0.04626 -0.022122 -0.0592198 -0.0690934 -0.0258785 0.0682828 0.0377646 -0.0626374 0.167186 -0.0196821 -0.0958819 -0.0431802 0.05531 0.221037 -0.0386022 -0.0312805 -0.0926153 0.0201064 -0.018972 -0.06387 0.0464658 -0.0285003 0.0531023 -0.0286424 0.00329796 -0.0156476 -0.00629571 -0.0317902 0.0654557 -0.00578171 0.0811379 -0.0145108 0.0548044 -0.035186 -0.0536159 -0.0947795 0.136512 0.092449 -0.0118675 -0.0465975 0.0300654 0.146311 -0.174532 -0.0749228 -0.0414811 -0.0975954 -0.0748998 -0.104322 0.0133866 0.0577301 -0.0271499 0.0970431 -0.0110768 -0.00888261 0.124929 -0.063022 0.0497743 -0.10775 0.174374 -0.0397068 -0.0297297 0.0368214 0.111149 -0.102566 -0.0157587 -0.00199675 0.125038 -0.102044 -0.0356002 0.0219886 0.1495 -0.00998712 -0.0025552 -0.0750636 0.0976739 -0.141478 0.0718227 -0.104667 -0.0321803 
0.100897 0.0141739 -0.145145 0.0179073 0.117662 0.183365 0.0809442 -0.0735986 -0.0334458 -0.05702 0.0965754 0.124816 0.100119 -0.0977257 -0.137755 -0.032618 -0.0799593 0.120266 -0.124061 0.125298 0.202247 -0.0685223 0.00039946 0.223031 0.00885756 -0.078257 -0.0435412 -0.189291 0.0724439 0.183222 -0.0320527 0.0288833 -0.111563 0.0570895 -0.019695 0.00404566 -0.123834 -0.0401349 -0.0378745 -0.0339592 0.0389225 -0.0480458 -0.039048 0.161976 -0.130154 -0.0809488 0.141122 0.0599395 -0.100628 0.02704 0.0283737 -0.0198873 -0.0523286 -0.037825 0.0870907 0.0453962 -0.0533163 0.206246 -0.0216774 -0.0801515 -0.0455936 0.0335682 0.277684 -0.0592097 -0.0176833 -0.106364 0.00118593 -0.0233307 -0.0730685 0.069607 -0.0150492 0.0828245 -0.0470092 -0.0279026 -0.0355058 0.00299792 -0.0201034 0.0631448 -0.0160921 0.0791982 -0.00872805 0.0855788 -0.0151642 -0.049669 -0.0788547 0.0926148 0.0754635 -0.0232374 -0.0272013 0.0261758 0.113764 -0.146735 -0.100263 -0.00628534 -0.0615195 -0.0949166 -0.0843475 0.0376982 0.0635245 -0.0469394 0.0886728 0.02459 0.0083449 0.112102 -0.112838 0.0771211 -0.0917275 0.136674 -0.0428618 -0.0204116 0.06874 0.091318 -0.0766472 -0.0128548 0.00289437 0.120267 -0.0928079 -0.0471032 0.021344 0.144 -0.00822189 -0.0436477 -0.0552589 0.0383893 -0.14964 0.114754 -0.0721547 -0.0224182 
0.0851423 0.00874179 -0.108219 0.0229402 0.115203 0.174644 0.0818091 -0.0628695 0.00735601 -0.104556 0.0854779 0.11748 0.0919062 -0.0970519 -0.141348 -0.0394472 -0.0943114 0.11063 -0.173971 0.112351 0.217408 -0.0732485 0.0114327 0.228234 0.00738567 -0.116144 -0.0562138 -0.184495 0.0471038 0.156146 -0.00693324 0.0180199 -0.100902 0.0735762 -0.0258311 0.00572384 -0.11879 -0.0229384 -0.0742919 -0.0225793 0.0642544 -0.0357724 -0.0451222 0.138357 -0.115776 -0.0797103 0.12203 0.0445471 -0.0950633 0.028059 0.000397019 -0.0434149 -0.041815 -0.033971 0.0821244 0.0552029 -0.0500452 0.202406 -0.0258581 -0.0867132 -0.0461774 0.0557019 0.240723 -0.0570955 -0.0160048 -0.0979433 0.00753009 -0.0106599 -0.0732934 0.0820471 -0.00473409 0.0654544 -0.03892 -0.038365 -0.0187445 0.0247079 -0.0346966 0.053413 -0.0265077 0.0713955 -0.0294077 0.0882197 -0.0192243 -0.0505295 -0.098501 0.121677 0.0856793 -0.0189723 -0.0707355 0.0254147 0.125339 -0.170866 -0.0808768 -0.0266122 -0.0663203 -0.0768814 -0.106859 0.024039 0.0639428 -0.0278929 0.0837587 0.00114413 -0.000590555 0.120073 -0.0914969 0.0611946 -0.10448 0.140345 -0.061849 -0.0385623 0.0560271 0.0901012 -0.0819451 -0.0112714 0.000652915 0.134849 -0.117618 -0.0374005 0.0223464 0.155288 -0.00724291 -0.0121343 -0.0885913 0.0512605 -0.136958 0.110526 -0.0901006 -0.029691 
0.0706981 -0.000521618 -0.117639 0.0252674 0.100552 0.179172 0.0558472 -0.0842373 -0.00961171 -0.090152 0.0859618 0.124925 0.0964381 -0.0713995 -0.163069 -0.0351212 -0.094678 0.111101 -0.123881 0.106386 0.23027 -0.0874494 0.00807822 0.235801 0.020721 -0.0782525 -0.0411588 -0.189871 0.0628163 0.179286 -0.00509013 0.00587027 -0.100559 0.0381582 -0.0170624 0.0141492 -0.142253 -0.0243763 -0.0469797 -0.0330007 0.0322094 -0.0332532 -0.053611 0.147711 -0.102336 -0.0958244 0.13401 0.0379318 -0.0841949 0.000435018 0.0107029 -0.0185536 -0.0145071 -0.0379834 0.0949974 0.0615177 -0.0339978 0.214989 -0.021184 -0.104621 -0.0388805 0.0479202 0.266719 -0.0464193 -0.0110583 -0.0933426 0.00992468 -0.0152325 -0.065252 0.0811309 -0.00874664 0.0733337 -0.0534304 -0.055522 -0.0214273 0.020756 -0.0334693 0.0500479 -0.0163181 0.0973637 -0.0292801 0.0838246 -0.00128222 -0.0450778 -0.0913383 0.087923 0.0830477 -0.00667593 -0.0459435 0.000695563 0.0999114 -0.14539 -0.0650112 0.00167999 -0.0658227 -0.0930748 -0.0946739 0.0488892 0.0707 -0.0326459 0.0999324 0.0209904 -0.00892844 0.10767 -0.0954839 0.077181 -0.0886716 0.115714 -0.0504686 -0.0376095 0.0508485 0.0819274 -0.0845213 -0.0179448 0.00671692 0.152996 -0.116149 -0.03439 0.016343 0.147724 -0.020478 -0.0425131 -0.0843612 -0.000141751 -0.158271 0.151325 -0.0825508 -0.00192544 
0.0887135 -0.0194695 -0.111434 0.035157 0.137697 0.156871 0.0639637 -0.0610476 0.00129867 -0.0992554 0.0802115 0.136421 0.0894233 -0.0850466 -0.16446 -0.00179287 -0.0537545 0.123303 -0.168862 0.118791 0.241106 -0.0911892 0.0133879 0.236758 0.0276478 -0.0960831 -0.0429182 -0.18776 0.0490753 0.156584 -0.00100736 0.0339153 -0.0989825 0.058672 -0.0372607 -0.000200905 -0.14641 -0.0166218 -0.0580693 -0.0426815 0.046025 -0.00991069 -0.0424657 0.130441 -0.0839255 -0.0893326 0.115367 0.0290877 -0.0886654 -0.00489775 0.0179498 -0.0506355 -0.029112 -0.0576783 0.0795379 0.0496519 -0.0456945 0.212002 -0.0213447 -0.0886496 -0.030112 0.0408469 0.231438 -0.0487607 -0.00758453 -0.0989753 -0.0214363 0.0181843 -0.0692501 0.0705503 0.00201592 0.0760373 -0.0493148 -0.0789557 -0.0421625 0.0395432 -0.015686 0.067528 -0.0372107 0.0778608 -0.0422741 0.0913556 -0.0127068 -0.0543208 -0.102672 0.101104 0.0922972 0.00278323 -0.067636 -0.00360459 0.0917532 -0.147135 -0.095598 0.0104362 -0.0448917 -0.051803 -0.0982135 0.0184387 0.0437862 -0.0292135 0.0866081 -0.0183404 -0.0220124 0.129493 -0.0874356 0.0572296 -0.105745 0.116219 -0.0454917 -0.0637898 0.03292 0.0951406 -0.0791949 0.00235088 0.0285984 0.133841 -0.157323 -0.0272373 0.00686939 0.15163 -0.0364201 0.00827016 -0.0910422 0.0236336 -0.129447 0.131015 -0.101831 -0.0470128 
0.10373 -0.0315818 -0.117194 0.0374741 0.148188 0.160928 0.0704315 -0.0362556 0.0041547 -0.0916895 0.0831882 0.146594 0.0756868 -0.14786 -0.167681 0.0129316 -0.0585499 0.131211 -0.189272 0.135169 0.228788 -0.0727521 0.0188188 0.22436 0.00147548 -0.0969063 -0.0419077 -0.203991 0.0421689 0.126638 -0.0125796 0.0396315 -0.104775 0.0747424 -0.0394783 -0.0161704 -0.14131 -0.0286708 -0.0638662 -0.0365127 0.0583678 -0.0221702 -0.0565969 0.135009 -0.092236 -0.0936297 0.104991 0.0366489 -0.0924166 0.023582 0.026869 -0.0653853 -0.0581708 -0.0614701 0.0537005 0.0295321 -0.0439131 0.181867 -0.031941 -0.0576259 -0.0230285 0.0302774 0.228534 -0.045555 -0.00203249 -0.14607 -0.0303711 0.00836708 -0.0649541 0.0654971 -0.0093791 0.0744533 -0.0403454 -0.0587489 -0.0651379 0.0258407 -0.013518 0.0888429 -0.0476916 0.0773726 -0.0346451 0.0851598 -0.0212723 -0.0471305 -0.0985254 0.112496 0.0975914 0.00613581 -0.076755 0.00194537 0.100246 -0.138874 -0.127664 0.0147169 -0.0399754 -0.0410649 -0.0935239 -0.00713881 0.0212422 -0.0266897 0.0820657 -0.0331941 -0.0363929 0.126671 -0.0541123 0.0346986 -0.0894565 0.128406 -0.0494965 -0.0425739 0.0279168 0.100851 -0.0551127 0.0054127 0.0265982 0.11451 -0.155004 -0.0236493 0.00216528 0.146736 -0.0395117 0.0252327 -0.0793032 0.042123 -0.107295 0.10572 -0.10444 -0.0669088 
