0.0725301 0.0044988 -0.109341 -0.0157771 0.0830035 0.13855 0.0433752 0.034504 -0.0179204 -0.0551444 0.0694352 0.117373 0.0995914 -0.20218 -0.141625 0.00160672 -0.110804 0.0788848 -0.210392 0.17559 0.190272 -0.0845911 0.0414256 0.15216 -0.0587121 -0.0386393 -0.0223086 -0.225808 0.0185007 0.0719485 -0.042606 0.0351079 -0.049699 0.110823 -0.0631206 -0.028668 -0.0989738 0.0657274 -0.109068 -0.0234754 0.0563564 -0.103658 -0.0600688 0.17798 -0.11718 -0.0656474 0.143276 0.0227215 -0.164949 0.0792505 0.023087 -0.0921486 -0.112573 -0.0108363 0.0719046 0.0167639 -0.0547063 0.109471 -0.0103669 -0.117069 -0.0278465 -0.0266812 0.214308 -0.0105315 0.0287143 -0.171339 -0.0317926 0.0128681 -0.0402822 0.0448175 -0.0387875 0.0186722 -0.0290431 -0.0225563 -0.0209897 -0.00638981 -0.0471943 0.112352 -0.021491 0.0695766 -0.0642928 0.0397212 -0.0386694 -0.0456225 -0.115823 0.108677 0.109776 0.023451 0.00399807 0.0353436 0.0783825 -0.174884 -0.140204 -0.0183243 -0.0732995 -0.0244892 -0.0671948 0.0129192 0.0124669 -0.0476882 0.0469367 -0.0211061 -0.0356211 0.133346 -0.0502637 0.0100215 -0.127663 0.17988 -0.0519512 -0.0816721 0.0173832 0.145442 -0.0937639 -0.00944159 0.0259694 0.0655685 -0.132832 -0.0998815 0.0376256 0.135617 -0.00902471 0.0461622 -0.022566 0.0939248 -0.0406394 0.0287819 -0.0500857 -0.0600663 
0.0856659 0.0155621 -0.10368 -0.0170608 0.0988066 0.163411 0.0620317 0.0347921 -0.0176719 -0.057968 0.079899 0.120402 0.0989154 -0.194072 -0.132393 -0.00655244 -0.0970181 0.0838056 -0.208453 0.156449 0.202846 -0.0686021 0.0174665 0.162628 -0.0403005 -0.0557912 -0.0299592 -0.210836 0.0377964 0.0908789 -0.0307118 0.0295353 -0.0691022 0.109377 -0.0525103 -0.0306756 -0.103639 0.0404623 -0.0877936 -0.0232231 0.0633045 -0.0918266 -0.0561185 0.173847 -0.1141 -0.0756095 0.131644 0.0246136 -0.166244 0.0623907 0.0244502 -0.0702451 -0.113721 -0.0251479 0.0662716 0.0259173 -0.0766757 0.138696 -0.0299423 -0.109394 -0.0411457 -0.0250582 0.229915 -0.0324726 0.0233739 -0.157108 -0.0286158 0.0113804 -0.0605398 0.0482312 -0.022363 0.032829 -0.0377531 -0.0334449 -0.028851 0.00114202 -0.0409049 0.101735 -0.0181506 0.0783368 -0.0638337 0.0459596 -0.016928 -0.0397098 -0.107165 0.0987637 0.116731 0.0140642 0.000714537 0.0414899 0.0836386 -0.18509 -0.146178 0.000689834 -0.0659036 -0.0393686 -0.0646557 -0.00184815 0.00323933 -0.042652 0.0493899 -0.00859241 -0.0413676 0.134348 -0.0713476 0.0293125 -0.118779 0.169742 -0.0463094 -0.0822722 0.0331421 0.127263 -0.103873 0.00192742 0.0417622 0.0716356 -0.140706 -0.0826258 0.0388903 0.145279 -0.00436172 0.0277816 -0.0309381 0.0910488 -0.038181 0.0415022 -0.0422529 -0.06345 
0.0669284 0.0386717 -0.0877695 -0.0155861 0.0919712 0.158121 0.0642342 0.0179984 -0.0140675 -0.0345723 0.0913345 0.105293 0.107037 -0.191746 -0.116411 -0.0199833 -0.114461 0.0965687 -0.202344 0.151341 0.200059 -0.0758879 0.0124824 0.187286 -0.030994 -0.070973 -0.0391264 -0.20561 0.0579898 0.104777 -0.0271944 0.00659859 -0.06834 0.10459 -0.036573 -0.0236888 -0.100568 0.0245706 -0.0918246 -0.0239557 0.0670346 -0.109377 -0.0532178 0.179889 -0.121513 -0.0749585 0.136462 0.0472867 -0.162064 0.0509418 0.0216687 -0.0634161 -0.110804 -0.0338102 0.0674473 0.0383923 -0.0836712 0.133118 -0.024152 -0.110646 -0.0439001 -0.0222654 0.224943 -0.0187012 0.0188236 -0.14616 -0.0198892 -0.00602658 -0.0646591 0.0483021 -0.0292919 0.036894 -0.0403329 -0.0383303 -0.0119196 -0.00122903 -0.0525982 0.117911 -0.00148792 0.0803866 -0.054792 0.0458509 -0.0189187 -0.0285716 -0.102189 0.106254 0.109901 0.00957439 0.00122399 0.0524024 0.0869248 -0.178261 -0.125724 -0.0110209 -0.0941636 -0.0652718 -0.0865822 0.00537417 0.0232096 -0.056052 0.0675161 2.41978e-05 -0.0250897 0.116082 -0.0646983 0.0366158 -0.108085 0.176212 -0.0344967 -0.0660414 0.0350377 0.123786 -0.105456 -0.00663065 0.0242388 0.082818 -0.137011 -0.0742722 0.0273438 0.146352 0.000552843 0.0102655 -0.0549219 0.0957625 -0.0644342 0.0602564 -0.051367 -0.0503573 
0.0704544 0.0454693 -0.0871635 -0.00253971 0.0957228 0.166345 0.0714726 0.00954896 -0.0116246 -0.033546 0.0969352 0.105222 0.106546 -0.183285 -0.112255 -0.0319636 -0.100288 0.114743 -0.191717 0.14081 0.206947 -0.0765417 0.00372934 0.205019 -0.0156824 -0.0940598 -0.0460359 -0.204003 0.0540594 0.125911 -0.0242138 0.000494959 -0.0660178 0.107947 -0.0264196 -0.0261132 -0.0912342 0.00142506 -0.088542 -0.0323256 0.0678196 -0.106025 -0.0362494 0.175184 -0.125011 -0.0873246 0.139039 0.04402 -0.155586 0.045497 0.0330041 -0.0674807 -0.0997432 -0.0339383 0.0714786 0.0518946 -0.0861831 0.1335 -0.0230112 -0.110921 -0.0433791 -0.0170888 0.216563 -0.0389579 0.0176539 -0.138492 -0.0161112 -0.0211384 -0.0780071 0.0521355 -0.0272198 0.0381538 -0.0477988 -0.0517589 -0.0165447 0.00629929 -0.0439479 0.117015 -0.000527826 0.0747593 -0.062695 0.0542188 -0.0146462 -0.0258175 -0.09394 0.113212 0.103743 -0.00143326 -0.00121349 0.0592539 0.0847716 -0.186059 -0.120285 -0.0145267 -0.0970086 -0.0711169 -0.0963905 0.00832765 0.0226216 -0.0505985 0.0748442 0.00969417 -0.0136275 0.114194 -0.0648188 0.0406925 -0.101049 0.165693 -0.0478416 -0.0571027 0.0327863 0.106083 -0.102149 -0.0119364 0.0181118 0.0841758 -0.128126 -0.0717843 0.0238694 0.148798 0.00345996 0.00131379 -0.0657027 0.0923357 -0.0656326 0.0672292 -0.0486341 -0.0495371 
0.0737112 0.047068 -0.100817 0.0132664 0.0918861 0.166859 0.0608049 -0.000600976 -0.00277169 -0.0380368 0.108226 0.101336 0.104808 -0.164431 -0.122877 -0.0371572 -0.0847891 0.133423 -0.176617 0.145454 0.215539 -0.0887675 0.00477472 0.219244 -0.000769054 -0.112634 -0.0465122 -0.198859 0.0517932 0.142737 -0.0215914 -0.00477214 -0.0588708 0.101219 -0.024458 -0.0123706 -0.0918243 -0.0115809 -0.0890213 -0.045419 0.0527481 -0.0986297 -0.0318404 0.172538 -0.122952 -0.101866 0.142941 0.0430976 -0.146932 0.0505247 0.0290423 -0.0553371 -0.0910772 -0.0308563 0.0780583 0.0575105 -0.0830695 0.12795 -0.0192733 -0.117773 -0.0447046 -0.00992545 0.223905 -0.0552638 0.00482324 -0.130507 -0.012926 -0.0295917 -0.0852578 0.0636784 -0.0215359 0.0395838 -0.0546924 -0.0573277 -0.022595 0.000193479 -0.0299876 0.11807 -0.0059432 0.0669092 -0.074813 0.0646852 -0.0211876 -0.0347885 -0.086644 0.128209 0.0823149 -0.0080972 0.0101949 0.0578057 0.0883548 -0.18915 -0.115288 -0.0192894 -0.0801839 -0.0821717 -0.107573 0.0204689 0.0206184 -0.0524684 0.0799028 0.0140038 -0.0039696 0.104588 -0.0650794 0.0608852 -0.0895094 0.147995 -0.0477995 -0.0504489 0.0230554 0.094027 -0.0920447 -0.013877 0.0185236 0.0834725 -0.104687 -0.0791715 0.0363531 0.151615 -0.00215065 -0.00729471 -0.0677879 0.0894701 -0.0776594 0.074841 -0.0330376 -0.0380093 
0.0664391 0.0466467 -0.103777 0.0109405 0.076607 0.167668 0.0503999 -0.000962877 -0.0109716 -0.0398117 0.108035 0.0990518 0.10509 -0.16706 -0.132061 -0.0381983 -0.0947351 0.126574 -0.170214 0.150945 0.209184 -0.0954596 0.00969426 0.218485 -0.00649054 -0.100156 -0.0376701 -0.199975 0.0511145 0.13332 -0.023858 -0.00988481 -0.0564853 0.101409 -0.0327098 -0.00965294 -0.0946694 -0.00694276 -0.0921908 -0.0402989 0.0497336 -0.110932 -0.0335046 0.175684 -0.121371 -0.106936 0.150791 0.0428688 -0.152878 0.0583347 0.0263661 -0.0565145 -0.0884423 -0.0238439 0.0782743 0.0571883 -0.0755092 0.12465 -0.0113065 -0.125217 -0.0455988 -0.00295273 0.229995 -0.0498941 0.00195116 -0.127684 -0.0076638 -0.040171 -0.0825444 0.064068 -0.034907 0.0331058 -0.0538433 -0.0425299 -0.0110669 -0.0113102 -0.0282368 0.118553 -0.00605517 0.0713109 -0.0755667 0.0558605 -0.0215783 -0.039124 -0.0903916 0.131517 0.0795365 -0.00836581 0.0148737 0.0533759 0.0911144 -0.186523 -0.107829 -0.0218204 -0.0800256 -0.079282 -0.105283 0.032286 0.0234749 -0.0552435 0.0762649 0.0163388 -0.0059716 0.107288 -0.0574302 0.0635942 -0.0881311 0.154424 -0.0527734 -0.0554113 0.0192581 0.102785 -0.0867964 -0.0175129 0.0122873 0.0825772 -0.0958587 -0.081103 0.0457777 0.150208 -0.00291493 -0.0151599 -0.0643047 0.0814473 -0.0872615 0.0764643 -0.0343509 -0.0305769 
0.0738682 0.0442404 -0.122807 0.0187726 0.072777 0.152303 0.046345 -0.0106786 -0.0517879 -0.0318536 0.0962298 0.109492 0.11089 -0.15647 -0.161403 -0.00598193 -0.0727917 0.115828 -0.152681 0.169276 0.209894 -0.121533 0.0200388 0.207354 -0.0106453 -0.0687156 -0.0286413 -0.198952 0.0569032 0.140345 -0.0573237 0.0208713 -0.0551385 0.0957542 -0.0582592 -0.0257085 -0.104885 0.0190088 -0.078565 -0.0488754 0.0220993 -0.11433 -0.0122595 0.157379 -0.102859 -0.0866842 0.173832 0.0212663 -0.176486 0.0547996 0.0497259 -0.0526003 -0.0841134 -0.015578 0.0867644 0.0454612 -0.0505518 0.125538 0.0049551 -0.122398 -0.0282708 7.40142e-05 0.233863 -0.0530396 0.0144579 -0.118665 -0.0340217 -0.0345886 -0.0895899 0.0514128 -0.0518435 0.0289224 -0.065182 -0.0287025 -0.00508974 -0.00080689 0.00405129 0.119324 -0.00934342 0.0660371 -0.0798357 0.035892 -0.0260532 -0.0467059 -0.100933 0.122859 0.0686953 -0.00815747 0.0237828 0.0399197 0.0711105 -0.176569 -0.113465 -0.00156483 -0.0640545 -0.0540813 -0.0745632 0.0561997 0.0328125 -0.0544083 0.0702292 0.0189948 -0.0167192 0.142276 -0.0612391 0.0611234 -0.0955593 0.171849 -0.0516157 -0.0863384 0.00465318 0.116837 -0.076796 -0.0179425 0.0222808 0.0783031 -0.101902 -0.0744636 0.0496794 0.152177 -0.0267226 -0.0130223 -0.0440574 0.0543249 -0.0887074 0.0923636 -0.0385666 -0.0482556 
0.0808591 0.0567673 -0.112875 0.0410156 0.0757042 0.154653 0.0589488 -0.0187563 -0.0213353 -0.0579854 0.101137 0.110386 0.0988761 -0.175218 -0.156194 -0.0146887 -0.0772781 0.11828 -0.172982 0.1768 0.210356 -0.122381 0.0235139 0.184778 -0.00874983 -0.107395 -0.0521907 -0.19406 0.0326179 0.146961 -0.0493781 0.0284746 -0.0423483 0.117624 -0.0432964 -0.0294413 -0.0755359 0.0197284 -0.0830795 -0.0634065 0.0323433 -0.120291 0.00322921 0.133156 -0.110724 -0.0977321 0.159049 0.0130219 -0.166072 0.0851477 0.0413835 -0.060486 -0.0885547 -0.00111328 0.0884091 0.0403065 -0.0630044 0.0932147 -0.0207117 -0.108373 -0.0336301 -0.00668171 0.2213 -0.0848321 0.0272401 -0.11971 -0.0315121 -0.0486315 -0.114262 0.0589844 -0.0450054 0.0192179 -0.0663547 -0.0196902 -0.014316 0.00134297 0.0210425 0.101237 -0.0213186 0.0642802 -0.0895563 0.0284494 -0.0290157 -0.0369125 -0.0935864 0.139435 0.053257 -0.0154075 0.0185186 0.0633579 0.0837767 -0.2083 -0.114158 -0.00819769 -0.067546 -0.0598486 -0.0888346 0.0417891 0.0248626 -0.0390021 0.0681441 0.0163436 -0.024207 0.138305 -0.0338528 0.0613655 -0.069905 0.179586 -0.0590821 -0.0667816 -0.0181921 0.0949183 -0.0775494 -0.00469332 0.0207441 0.0656876 -0.0820588 -0.0585527 0.0589431 0.164908 -0.0201591 0.00703029 -0.0460488 0.0812433 -0.046519 0.0706983 -0.00710366 -0.0526009 
0.0688136 0.0582716 -0.10113 0.0384674 0.0701184 0.164137 0.0585843 -0.0311772 -0.0342282 -0.040707 0.0984691 0.110644 0.0976073 -0.16343 -0.141332 -0.0171335 -0.0988741 0.118747 -0.150721 0.166276 0.20792 -0.125285 0.0253924 0.196087 -0.00109267 -0.098463 -0.0529685 -0.197547 0.0367903 0.155708 -0.054778 0.0141566 -0.0442224 0.109131 -0.0313237 -0.0171215 -0.083445 0.0150796 -0.0790908 -0.0624582 0.0285811 -0.128221 0.00498191 0.127104 -0.115476 -0.0932827 0.169246 0.0147276 -0.171509 0.0787739 0.0453237 -0.0614324 -0.0801644 -0.00030552 0.107787 0.0531476 -0.0603454 0.108696 -0.024292 -0.107989 -0.0348947 -0.000636753 0.232171 -0.086597 0.0449355 -0.100722 -0.0380661 -0.0505094 -0.122932 0.0727893 -0.0460283 0.0344785 -0.0739629 -0.0193567 -0.000258238 0.00878157 0.0193658 0.0962744 -0.00529801 0.058637 -0.0847693 0.023339 -0.0240732 -0.0355185 -0.103914 0.127139 0.0536252 -0.0113585 0.0238713 0.0739742 0.0831291 -0.202383 -0.0986619 -0.00321945 -0.079823 -0.0627919 -0.0913255 0.0521518 0.0474146 -0.036922 0.0793642 0.0230305 -0.0264174 0.116751 -0.0358301 0.0744709 -0.070634 0.164913 -0.0608215 -0.0672179 -0.0145372 0.0983595 -0.0664622 -0.0204114 0.0284285 0.0814683 -0.0741001 -0.0476767 0.0534448 0.171916 -0.00866885 -0.0190422 -0.0451164 0.0656191 -0.0607412 0.102666 0.000497008 -0.0416548 
0.0668731 0.0614927 -0.101596 0.0296057 0.0755012 0.176153 0.0488507 -0.0430541 -0.0453068 -0.0491406 0.0874185 0.106073 0.0936611 -0.15368 -0.131575 -0.019998 -0.103286 0.120248 -0.131651 0.159838 0.211027 -0.108752 0.0341196 0.191854 0.00118638 -0.092962 -0.0483294 -0.20266 0.0386173 0.162518 -0.0538187 0.00127848 -0.0403261 0.104681 -0.00627984 -0.00912582 -0.0709673 0.0135874 -0.0737618 -0.0714731 0.0262642 -0.119688 0.0157797 0.133669 -0.128762 -0.0780361 0.184367 0.018184 -0.177631 0.080112 0.0404509 -0.0635662 -0.0663714 0.00726451 0.122554 0.0523748 -0.0479812 0.111915 -0.0266352 -0.123072 -0.0351775 0.00584242 0.241746 -0.0912291 0.0560609 -0.0988747 -0.0391082 -0.0477136 -0.11853 0.0841344 -0.0447792 0.0341567 -0.0790581 -0.0289568 0.00343983 0.0108775 0.00717596 0.0923718 0.00480395 0.0566781 -0.075297 0.0367828 -0.0229009 -0.033299 -0.0994559 0.114281 0.0471427 -0.00536054 0.021597 0.0875544 0.0940014 -0.198159 -0.0985317 -0.0100484 -0.082474 -0.0681031 -0.0880157 0.0772354 0.0487915 -0.04058 0.0842653 0.0331105 -0.0213665 0.102911 -0.0484124 0.0763609 -0.0720523 0.156217 -0.0623499 -0.0579706 -0.0030707 0.0912247 -0.0686496 -0.022827 0.0275091 0.0887806 -0.0732093 -0.0589683 0.045442 0.170684 0.00341079 -0.0268978 -0.0356703 0.0536545 -0.0678623 0.106168 0.0123068 -0.0342874 
0.0806221 0.0517279 -0.111987 0.0224914 0.0866371 0.174031 0.0549466 -0.0271793 -0.0358655 -0.0726415 0.0783986 0.117844 0.0934018 -0.173092 -0.128817 -0.0228085 -0.0928214 0.104999 -0.16212 0.173346 0.194921 -0.0898342 0.0481475 0.168614 -0.025331 -0.0947854 -0.0492482 -0.211065 0.0105999 0.138828 -0.0517992 0.016395 -0.0355333 0.121792 -0.0210834 -0.0170668 -0.0542842 0.0338462 -0.0919571 -0.0539833 0.0434673 -0.106967 0.00631992 0.134889 -0.14688 -0.0707291 0.17467 0.0110676 -0.169055 0.108305 0.042743 -0.0862086 -0.0855742 0.0170463 0.112972 0.0336949 -0.047353 0.104957 -0.0263764 -0.111455 -0.0409063 0.00113283 0.226916 -0.0984069 0.0600029 -0.134987 -0.0313449 -0.034031 -0.110948 0.077917 -0.0339657 0.0257703 -0.0600222 -0.0151251 -0.00549506 0.0150533 -0.00618036 0.0865962 -0.010488 0.0557779 -0.0767363 0.0387224 -0.0260977 -0.029912 -0.101081 0.120537 0.062444 -0.00768166 0.00283215 0.0812659 0.0909599 -0.215822 -0.110455 -0.0260277 -0.0771129 -0.0590377 -0.0796316 0.058102 0.0261938 -0.0335016 0.0596316 0.0261021 -0.0229829 0.125648 -0.0483977 0.0509421 -0.0896541 0.17164 -0.0761658 -0.0535722 0.00123656 0.0942265 -0.0714672 -0.00650561 0.0102974 0.0759202 -0.0810667 -0.0730767 0.0409771 0.170268 0.0042277 0.00812135 -0.0293575 0.0778983 -0.0370555 0.0638947 0.0005062 -0.0463382 
0.0854247 0.0542311 -0.121772 0.0204855 0.087021 0.167684 0.0591632 -0.0195587 -0.0269842 -0.0792608 0.078174 0.117064 0.0951324 -0.185168 -0.128912 -0.022274 -0.0825998 0.0892737 -0.17782 0.184266 0.181109 -0.0858975 0.0500243 0.153362 -0.0373931 -0.0896279 -0.0504921 -0.211312 0.00596122 0.121768 -0.0466206 0.0320248 -0.0341964 0.130008 -0.0325997 -0.0205253 -0.0403182 0.0526361 -0.0969175 -0.0483927 0.0564877 -0.106939 0.00035976 0.133893 -0.151344 -0.0659351 0.167128 0.0135593 -0.162782 0.113863 0.0374116 -0.0865355 -0.0964188 0.0200805 0.107078 0.0222503 -0.0505199 0.0941117 -0.0240765 -0.108944 -0.0488948 -0.00769016 0.219829 -0.102036 0.0564518 -0.14478 -0.0220599 -0.0277906 -0.102771 0.0667883 -0.0334405 0.019409 -0.0513784 -0.000574222 -0.00286461 0.0107645 -0.0116045 0.0925071 -0.0186514 0.0579341 -0.0789909 0.038505 -0.0266699 -0.0297821 -0.0950719 0.123485 0.0689063 -0.00625044 -0.00113756 0.0720423 0.0898276 -0.221565 -0.113031 -0.0345087 -0.0735069 -0.0613466 -0.0682174 0.0446847 0.0158202 -0.0372548 0.0449152 0.0216173 -0.022412 0.141671 -0.0504795 0.0394837 -0.0929157 0.186091 -0.074128 -0.0512285 0.000909115 0.100469 -0.0784763 0.00373976 0.00469881 0.0600323 -0.0905276 -0.0843175 0.0418663 0.165399 0.00330788 0.0286117 -0.0239743 0.0961246 -0.0245206 0.0397893 -0.00811184 -0.0522744 
0.0762859 0.0493568 -0.107229 0.0264275 0.0846276 0.165572 0.0573289 -0.0216047 -0.0296905 -0.0672458 0.0844476 0.117608 0.0936173 -0.179593 -0.136083 -0.0180905 -0.0956592 0.104638 -0.168987 0.178951 0.19851 -0.102525 0.0398973 0.174566 -0.0236065 -0.0931903 -0.0502908 -0.207933 0.0186489 0.13302 -0.0520873 0.0162657 -0.0388219 0.121571 -0.0285117 -0.0181389 -0.0613559 0.0333368 -0.0937419 -0.0568946 0.047311 -0.11265 0.00343855 0.133627 -0.134962 -0.0785627 0.169887 0.0127693 -0.167731 0.100113 0.0358766 -0.0859203 -0.0909424 0.0108624 0.110713 0.0358184 -0.0565433 0.102118 -0.0288396 -0.109397 -0.0373117 -0.00249972 0.226506 -0.0883525 0.0555774 -0.128815 -0.0335172 -0.0373923 -0.109157 0.0701909 -0.0394996 0.0261145 -0.0589464 -0.0131496 -0.00336873 0.0127233 0.000500598 0.0984267 -0.0103231 0.0541665 -0.0803213 0.0355241 -0.0273609 -0.0305966 -0.102246 0.12497 0.0646709 -0.000937619 0.0072338 0.0764128 0.0920535 -0.211967 -0.109771 -0.0196229 -0.0777009 -0.0577356 -0.0820919 0.047696 0.0288056 -0.035274 0.0609047 0.0164227 -0.0270926 0.123152 -0.0417277 0.0553697 -0.0840612 0.174752 -0.0714286 -0.058468 -0.00472407 0.098912 -0.0703707 -0.00746849 0.0155941 0.0730153 -0.0866044 -0.0663657 0.0409528 0.168018 -0.0047499 0.0115114 -0.0342675 0.0815938 -0.0420235 0.0709252 -0.00597199 -0.0506333 
0.0736585 0.0445595 -0.111835 0.022907 0.080402 0.162456 0.0541488 -0.0248268 -0.0304723 -0.0746533 0.0827004 0.119869 0.0950189 -0.172715 -0.143133 -0.0247302 -0.0997582 0.097576 -0.163167 0.182859 0.197409 -0.103313 0.0409004 0.169474 -0.0274206 -0.0826591 -0.0451025 -0.207327 0.0186107 0.13385 -0.0588165 0.0137959 -0.0356257 0.117924 -0.030837 -0.017677 -0.0616084 0.0439597 -0.0948889 -0.0589683 0.0486796 -0.111664 0.000649579 0.134281 -0.141166 -0.0752136 0.171683 0.00930678 -0.165751 0.0999004 0.0275936 -0.0798947 -0.0852173 0.018653 0.118387 0.0331091 -0.0512185 0.102199 -0.0318701 -0.11608 -0.0360893 -0.00269047 0.234864 -0.0814857 0.0527685 -0.125422 -0.0289456 -0.0346583 -0.100009 0.0679779 -0.0390067 0.0210226 -0.0581775 -0.0092753 0.00441602 0.0146931 -0.00490528 0.0916988 -0.00909895 0.0559059 -0.0822078 0.0391145 -0.0232868 -0.0320562 -0.100659 0.123588 0.0673903 0.0048921 0.0100082 0.0726971 0.0949429 -0.213703 -0.104153 -0.0215807 -0.0801124 -0.0673431 -0.0793397 0.0527381 0.0368952 -0.0413958 0.0609445 0.0198516 -0.0226573 0.124551 -0.0471732 0.0567106 -0.0847681 0.179032 -0.0746883 -0.0604774 0.000509564 0.0991696 -0.0753411 -0.00771968 0.0135066 0.0759048 -0.0876001 -0.0730926 0.0436072 0.164307 -0.00574172 0.0104703 -0.0323775 0.0750608 -0.0465458 0.074372 -0.00445918 -0.0438073 
0.0680451 0.048165 -0.103859 0.0284423 0.0768049 0.160239 0.0507435 -0.0282593 -0.0314942 -0.057766 0.0921815 0.122462 0.0942693 -0.167546 -0.147376 -0.014709 -0.104817 0.107123 -0.159373 0.173378 0.20553 -0.111316 0.0314719 0.187123 -0.0135842 -0.0837035 -0.0393465 -0.198446 0.0291632 0.14534 -0.0611902 0.00943225 -0.0394151 0.111226 -0.0355082 -0.0167624 -0.0791581 0.0244427 -0.0877471 -0.0539054 0.0380581 -0.116848 0.0048055 0.133692 -0.12363 -0.087157 0.174319 0.0100015 -0.167844 0.0878496 0.0406062 -0.0728597 -0.0869673 0.00791972 0.117102 0.0446708 -0.0594867 0.11148 -0.0300712 -0.110203 -0.034439 -0.00487552 0.236606 -0.072762 0.0469044 -0.114704 -0.0380148 -0.0391423 -0.108378 0.0732272 -0.0418889 0.0308834 -0.063112 -0.0175076 0.00567134 0.0148322 0.00591535 0.0969574 -0.0101502 0.056192 -0.0768655 0.0353552 -0.0195019 -0.0319837 -0.108726 0.124991 0.0642259 0.00117684 0.0153256 0.0731337 0.0838324 -0.20623 -0.106306 -0.00622649 -0.0805281 -0.0606002 -0.0888961 0.0495416 0.0449676 -0.0414504 0.0676884 0.0161878 -0.0255686 0.117702 -0.04305 0.0673496 -0.0829236 0.17003 -0.0703498 -0.0701078 -0.00420201 0.102511 -0.0686849 -0.0115425 0.0217757 0.0814006 -0.0846513 -0.0550582 0.0452341 0.167747 -0.0067262 -0.00315945 -0.038414 0.0632709 -0.057283 0.0961109 -0.00399408 -0.0416912 
0.0752057 0.043637 -0.114257 0.0260422 0.0865875 0.152436 0.0623153 -0.00410084 -0.0252428 -0.046563 0.0968253 0.120088 0.101561 -0.16682 -0.150297 -0.0158962 -0.0726721 0.122053 -0.174544 0.174293 0.204174 -0.11603 0.0202817 0.199047 -0.0174654 -0.0966286 -0.0445362 -0.193329 0.0367016 0.136184 -0.0544579 0.0282451 -0.0448273 0.113176 -0.0547 -0.0245397 -0.083309 0.016759 -0.0944868 -0.0506691 0.0454875 -0.106587 -0.00389172 0.137777 -0.117652 -0.0973838 0.16156 0.0153331 -0.165259 0.0751247 0.0400922 -0.0756391 -0.0962946 -0.00836021 0.0929995 0.0502883 -0.0675546 0.115909 -0.0180274 -0.106354 -0.0356997 -0.00127296 0.222539 -0.0756519 0.0264645 -0.11645 -0.0355289 -0.0374583 -0.106254 0.0576823 -0.0400472 0.0280558 -0.05785 -0.0206044 -0.00917804 0.0112675 0.0108498 0.111589 -0.0157448 0.0389948 -0.0906493 0.0450573 -0.0275763 -0.0385411 -0.100188 0.136733 0.0709871 -0.00479347 0.0169364 0.0574781 0.0820788 -0.202193 -0.114352 -0.0122186 -0.0600354 -0.0530178 -0.0886587 0.0356667 0.0245261 -0.0390257 0.0620275 0.00492626 -0.0194531 0.135914 -0.0503728 0.0632338 -0.0914953 0.164186 -0.068463 -0.0751637 -0.00302709 0.104399 -0.0694729 -0.0105189 0.0193264 0.0658091 -0.0915365 -0.0692999 0.0505474 0.161146 -0.0162471 0.00434867 -0.0489528 0.0794133 -0.0641207 0.0786896 -0.0326475 -0.0571001 
0.0785611 0.0407196 -0.11533 0.0267837 0.0825694 0.154419 0.0659114 -0.00695356 -0.00782766 -0.0592963 0.102432 0.111163 0.103165 -0.165212 -0.154154 -0.0256354 -0.0790081 0.113892 -0.18459 0.17171 0.207919 -0.116478 0.0152002 0.19893 -0.0165237 -0.103648 -0.0464496 -0.191963 0.038003 0.132256 -0.0425107 0.0255204 -0.0516411 0.113217 -0.0537257 -0.0208195 -0.0861524 0.0173373 -0.096203 -0.0521732 0.0506653 -0.108956 -0.0200632 0.142424 -0.11267 -0.100052 0.1456 0.0252851 -0.155064 0.068045 0.0226667 -0.0632924 -0.0900854 -0.0117314 0.0852515 0.0489445 -0.0725952 0.117885 -0.0226871 -0.108333 -0.0379324 0.0016083 0.227179 -0.0695474 0.0145046 -0.114005 -0.0215269 -0.0356858 -0.0961471 0.056269 -0.0418777 0.0230451 -0.0559283 -0.0209214 -0.0100283 0.00278542 0.00715679 0.107455 -0.0197571 0.0524876 -0.0880883 0.0428562 -0.0296171 -0.0443863 -0.0974381 0.140864 0.0733946 -0.00684351 0.00923166 0.0534153 0.0964686 -0.204467 -0.107778 -0.0153942 -0.0651704 -0.0622393 -0.0932224 0.0241218 0.0305221 -0.0404751 0.0695138 0.00458534 -0.019425 0.132478 -0.0473143 0.0622717 -0.086237 0.168559 -0.064499 -0.0694379 0.00147289 0.103779 -0.0797753 -0.00791827 0.019118 0.0714019 -0.0962011 -0.0675199 0.0552625 0.158366 -0.0185045 0.00523263 -0.0564958 0.0877536 -0.0669682 0.0746936 -0.0368234 -0.0526339 
0.0817945 0.0478398 -0.114625 0.025271 0.0818977 0.16043 0.0668753 -0.00775206 -0.00964264 -0.0587342 0.10059 0.10555 0.104458 -0.165165 -0.151926 -0.0185806 -0.0764647 0.113051 -0.184675 0.161494 0.212758 -0.112065 0.0121977 0.202479 -0.0133415 -0.109157 -0.0480408 -0.190984 0.0437871 0.140125 -0.0398234 0.0277961 -0.0560622 0.112819 -0.0509524 -0.0237451 -0.0858422 0.00944746 -0.0889077 -0.0482586 0.0448052 -0.109532 -0.0134199 0.139948 -0.102746 -0.0988016 0.146607 0.0263667 -0.159539 0.0640641 0.0297755 -0.0612049 -0.0845961 -0.0151523 0.0801194 0.0516083 -0.0694612 0.121366 -0.0195646 -0.109078 -0.0396981 0.0055261 0.224922 -0.0763238 0.0109439 -0.112115 -0.0229353 -0.0376468 -0.102177 0.0532947 -0.0443388 0.0232248 -0.0628048 -0.0267735 -0.0110193 0.00477465 0.0105968 0.104274 -0.0202917 0.0592316 -0.0792669 0.0397055 -0.0273946 -0.0427592 -0.0974421 0.143488 0.0684482 -0.0162006 0.00524027 0.0566608 0.0937393 -0.204395 -0.11287 -0.00988171 -0.0634268 -0.053636 -0.0936561 0.0286655 0.0288282 -0.0361014 0.0741797 0.00613029 -0.0227751 0.138647 -0.0514816 0.0607217 -0.0879531 0.167315 -0.0653725 -0.0701543 0.00176504 0.100682 -0.0812385 -0.00978158 0.0202247 0.0772848 -0.0992202 -0.0597581 0.052811 0.159794 -0.0163766 0.00037167 -0.0540265 0.0841222 -0.0688557 0.0759418 -0.0396698 -0.0552115 
0.0817235 0.043328 -0.113726 0.0212024 0.0798118 0.156925 0.0689123 -0.00226786 -0.0149841 -0.0538664 0.0986307 0.106038 0.107553 -0.165724 -0.147676 -0.0207035 -0.0803799 0.107926 -0.185138 0.165331 0.209862 -0.115767 0.0141229 0.197817 -0.0172408 -0.101891 -0.0475719 -0.19544 0.0405395 0.135272 -0.0453998 0.0274646 -0.0551151 0.113823 -0.0543672 -0.0256973 -0.0878879 0.0202757 -0.0924538 -0.0488622 0.0454077 -0.112763 -0.0173305 0.141256 -0.105995 -0.0937358 0.146369 0.0247048 -0.163241 0.0649409 0.0298162 -0.0637943 -0.087673 -0.0123183 0.0846033 0.047898 -0.0694271 0.120121 -0.0178839 -0.111147 -0.0362142 0.00125948 0.223574 -0.0698643 0.0144335 -0.112779 -0.024363 -0.0310484 -0.0970485 0.0506602 -0.0437277 0.0236101 -0.0613317 -0.0252701 -0.00836418 0.00614333 0.00616266 0.103918 -0.0156961 0.0608422 -0.0819982 0.0352079 -0.0287595 -0.0449159 -0.0994565 0.13915 0.0738184 -0.0122764 0.00989195 0.0555703 0.0908314 -0.203552 -0.111491 -0.0119362 -0.0698618 -0.0545153 -0.0887538 0.0266919 0.0325717 -0.0392919 0.0732058 0.00696802 -0.0209094 0.137923 -0.0532065 0.0567574 -0.0932589 0.172181 -0.0640637 -0.0749171 0.00282995 0.105971 -0.0839339 -0.0135843 0.0231326 0.0779076 -0.101841 -0.064182 0.0513509 0.159138 -0.016946 0.00187374 -0.0516874 0.0868769 -0.0653454 0.0736634 -0.0382509 -0.0548924 
0.0832644 0.0369477 -0.106517 0.0216942 0.0849278 0.157216 0.0766435 0.00905073 -0.0253122 -0.0454813 0.0903161 0.105321 0.108885 -0.180221 -0.134705 -0.0150104 -0.0788109 0.111054 -0.186031 0.16154 0.208261 -0.112542 0.0167488 0.202408 -0.0187413 -0.105553 -0.0555195 -0.207231 0.0379368 0.129198 -0.0422129 0.0319455 -0.061662 0.11726 -0.0544492 -0.0343228 -0.089944 0.0101812 -0.0929861 -0.0418841 0.0508784 -0.114666 -0.0142693 0.14411 -0.106117 -0.0951092 0.147128 0.0239086 -0.162172 0.0651553 0.0432664 -0.0833903 -0.0918666 -0.0188617 0.0742252 0.0472101 -0.0652954 0.12046 -0.00772135 -0.100504 -0.0307045 0.00338195 0.204611 -0.0699242 0.0203932 -0.12597 -0.0296329 -0.0400902 -0.099168 0.0409707 -0.0504215 0.0311163 -0.0606178 -0.0257117 -0.0174062 0.00530533 0.00544606 0.109673 -0.0123565 0.0647707 -0.0773452 0.0258622 -0.0308079 -0.0404919 -0.0999627 0.139681 0.0789548 -0.0182999 -0.00135984 0.0494878 0.0840211 -0.192657 -0.120356 -0.0158402 -0.0742237 -0.0404229 -0.0862175 0.0267148 0.0237923 -0.0300012 0.0674506 0.00204514 -0.0205649 0.144858 -0.0475997 0.0431211 -0.0977038 0.176631 -0.0645772 -0.0707348 -0.00322129 0.105595 -0.080818 -0.0229106 0.0188556 0.0780449 -0.0992874 -0.0606612 0.0401742 0.161016 -0.0168268 0.0048145 -0.0555084 0.0894554 -0.0664839 0.0641074 -0.0518754 -0.0601848 
0.079982 0.0334187 -0.107331 0.0233837 0.08259 0.147436 0.0711862 0.00138262 -0.023748 -0.0496618 0.0915715 0.110564 0.106091 -0.170822 -0.148224 -0.0090842 -0.0817792 0.108289 -0.185525 0.165501 0.212299 -0.118401 0.0160255 0.202415 -0.0178247 -0.0939362 -0.0479731 -0.203281 0.0411538 0.133239 -0.0481225 0.0353868 -0.0578652 0.111933 -0.0604126 -0.032957 -0.0978087 0.020427 -0.0918043 -0.0433905 0.0448626 -0.11205 -0.0144045 0.142677 -0.0989317 -0.0912015 0.15088 0.0181786 -0.162813 0.0589276 0.0390333 -0.0732833 -0.0873814 -0.0172136 0.0823696 0.0472906 -0.0625769 0.125147 -0.0113063 -0.102202 -0.0295538 0.00043911 0.212903 -0.060292 0.0184166 -0.11975 -0.0336633 -0.0352021 -0.0962673 0.0437488 -0.0496032 0.0280866 -0.0622862 -0.0246414 -0.011763 0.00785548 0.00762722 0.107285 -0.0168556 0.0635866 -0.0779263 0.0300975 -0.0310785 -0.0439181 -0.103987 0.137418 0.0773857 -0.0128848 0.000883758 0.0463517 0.0818577 -0.191182 -0.119008 -0.0106153 -0.0693294 -0.0390908 -0.085609 0.0291681 0.0350221 -0.0348471 0.0675791 -0.00045249 -0.022412 0.146775 -0.0498064 0.0476318 -0.0982734 0.17774 -0.0600073 -0.0821099 -0.00417077 0.11093 -0.0833674 -0.0211973 0.0252236 0.0819597 -0.101677 -0.0618316 0.0454663 0.161679 -0.0197158 0.00757281 -0.0543919 0.0805475 -0.071274 0.0759726 -0.0478115 -0.0586082 
0.0774049 0.0299423 -0.107151 0.019865 0.0820631 0.145066 0.0721698 0.00515763 -0.0188783 -0.0561435 0.088175 0.109429 0.106825 -0.173426 -0.150056 -0.0143793 -0.0846632 0.104398 -0.190032 0.167367 0.211037 -0.118056 0.0160932 0.202472 -0.0228508 -0.0962572 -0.0477731 -0.203785 0.0403958 0.12852 -0.0456227 0.0314371 -0.0576865 0.111113 -0.0609639 -0.0336146 -0.098256 0.0218825 -0.0988969 -0.0420214 0.0492676 -0.11174 -0.0193065 0.145499 -0.0994363 -0.0896199 0.146338 0.0201077 -0.159058 0.0598478 0.0310683 -0.0758098 -0.083491 -0.0188192 0.078843 0.0465634 -0.0633437 0.124545 -0.0110647 -0.103257 -0.0298815 0.00414408 0.211137 -0.0554416 0.0150661 -0.123075 -0.0294271 -0.0372848 -0.0929271 0.0377063 -0.0507809 0.0226936 -0.0592512 -0.0249194 -0.0105751 0.00953624 0.00363161 0.105955 -0.0157239 0.0663687 -0.0781175 0.0283923 -0.0327976 -0.0424616 -0.102031 0.139973 0.0789691 -0.011541 -0.00369022 0.0445817 0.0852347 -0.190607 -0.116395 -0.014222 -0.0704624 -0.0398073 -0.0871714 0.0265287 0.0348902 -0.0348576 0.0692423 -0.00231062 -0.0220392 0.145671 -0.050018 0.0438638 -0.0986555 0.179977 -0.0620438 -0.0789742 -0.000993327 0.109937 -0.0854194 -0.0217692 0.0182874 0.0852297 -0.104902 -0.061668 0.0445734 0.160575 -0.0229661 0.0090124 -0.0598229 0.0825491 -0.0739169 0.0729322 -0.0558526 -0.0597416 
0.0814092 0.0313244 -0.112488 0.0239937 0.0826543 0.150244 0.0772681 0.00717139 -0.0149473 -0.053192 0.0891159 0.104795 0.105492 -0.179565 -0.147166 -0.0169208 -0.079976 0.108934 -0.186077 0.163752 0.210234 -0.116876 0.0091325 0.205663 -0.020141 -0.103553 -0.0500752 -0.206921 0.0397054 0.132234 -0.0420523 0.0323694 -0.0598992 0.111911 -0.0552714 -0.0340873 -0.0922239 0.010148 -0.0975096 -0.0486692 0.0522553 -0.115514 -0.0167147 0.147785 -0.0974998 -0.0918325 0.144494 0.0255068 -0.158137 0.0568363 0.0313271 -0.077097 -0.0782658 -0.0225148 0.0762071 0.0502182 -0.067885 0.119718 -0.00946299 -0.104087 -0.0297414 0.00457821 0.209549 -0.0631123 0.0119891 -0.121738 -0.0270072 -0.0440474 -0.0944609 0.0322589 -0.0553676 0.0205423 -0.0620982 -0.0296133 -0.0168794 0.00777501 0.00782831 0.110656 -0.0154664 0.0666482 -0.0778825 0.0297743 -0.0364145 -0.0437504 -0.0958987 0.142729 0.0751927 -0.0172189 -0.00221439 0.048196 0.0888772 -0.189733 -0.119098 -0.0152942 -0.0708204 -0.0379451 -0.0861581 0.0212911 0.0324945 -0.0344257 0.0743711 -0.00155784 -0.0199796 0.140688 -0.051481 0.0431047 -0.0936592 0.175608 -0.0667859 -0.0688814 0.000865166 0.104497 -0.0835415 -0.0273434 0.0179002 0.0816483 -0.104143 -0.0629772 0.0443181 0.156773 -0.0209261 0.00563512 -0.0581401 0.0869471 -0.0729409 0.0697587 -0.0559243 -0.0637657 
0.0813875 0.0294539 -0.110251 0.0224859 0.0817549 0.146005 0.0753448 0.0104343 -0.0120871 -0.0581525 0.0882205 0.10599 0.105151 -0.182033 -0.150089 -0.017066 -0.0796275 0.107082 -0.191877 0.166252 0.20982 -0.113977 0.0107908 0.205489 -0.0246127 -0.104065 -0.0475427 -0.205677 0.0380329 0.128543 -0.0428171 0.0305852 -0.057514 0.113353 -0.0587641 -0.0370073 -0.091828 0.0137322 -0.102409 -0.0442298 0.0528259 -0.113041 -0.0187799 0.148725 -0.0974324 -0.0920188 0.14263 0.0235603 -0.156613 0.060606 0.0307046 -0.0788138 -0.0795255 -0.0210035 0.0739642 0.047765 -0.0660043 0.116878 -0.00841604 -0.104164 -0.0291742 0.00421886 0.205665 -0.0586117 0.00886219 -0.12816 -0.0248639 -0.0443317 -0.0919014 0.0303085 -0.0543226 0.0161806 -0.0588877 -0.0285557 -0.0162169 0.0084542 0.00529968 0.110953 -0.0173978 0.0679881 -0.0770551 0.0301093 -0.0364955 -0.0429685 -0.0943687 0.14509 0.0765097 -0.0166693 -0.00608803 0.0466155 0.0874205 -0.190591 -0.120141 -0.0166309 -0.0703659 -0.036736 -0.0871233 0.0196166 0.0308059 -0.0348261 0.0722319 -0.00314481 -0.0198166 0.144474 -0.0503685 0.0383598 -0.0947853 0.177805 -0.0672895 -0.070874 0.00113003 0.105345 -0.0843948 -0.0246992 0.0136493 0.0818271 -0.106464 -0.0637209 0.0423206 0.155487 -0.0235067 0.0113559 -0.0606816 0.0874741 -0.0708937 0.0657334 -0.0590981 -0.0650128 
0.0859307 0.0249656 -0.107961 0.025473 0.0826307 0.152183 0.0795076 0.0135386 -0.007457 -0.0667298 0.0871961 0.10227 0.108217 -0.182514 -0.141528 -0.0251972 -0.0749748 0.109974 -0.194473 0.163451 0.210684 -0.108041 0.0148794 0.210294 -0.025776 -0.118771 -0.0551018 -0.209148 0.0300383 0.128249 -0.0358855 0.028969 -0.0587476 0.120469 -0.0541174 -0.036376 -0.0832205 0.00800235 -0.105081 -0.0437413 0.0575802 -0.110098 -0.0211168 0.143848 -0.103332 -0.0997768 0.134577 0.0261585 -0.147112 0.0689088 0.0297104 -0.0880647 -0.0741484 -0.0185623 0.0686606 0.0490541 -0.0623785 0.113337 -0.00707259 -0.102791 -0.0311391 0.0117213 0.195794 -0.0701245 0.00605421 -0.130453 -0.0173547 -0.0499066 -0.0951956 0.027943 -0.0558964 0.0136425 -0.0580123 -0.0295757 -0.0213312 0.00824955 0.00600101 0.104193 -0.0154716 0.07145 -0.0777326 0.027586 -0.03627 -0.0427628 -0.0890514 0.150076 0.0761254 -0.0233143 -0.014631 0.0481495 0.0944797 -0.19567 -0.114464 -0.0223602 -0.0743021 -0.0371588 -0.0933536 0.0182555 0.0246778 -0.0281343 0.0765187 -0.00110282 -0.0187073 0.145621 -0.0443001 0.0328564 -0.092326 0.171766 -0.0737863 -0.0604637 -0.0009306 0.0986568 -0.0820828 -0.0247632 0.00519901 0.0845054 -0.100505 -0.0620222 0.0374211 0.156699 -0.0219886 0.0101708 -0.0666098 0.0927955 -0.0695292 0.0581475 -0.0636164 -0.0649203 
0.0840403 0.0349174 -0.106962 0.0218789 0.0791704 0.157639 0.0835823 0.00680918 -0.00894256 -0.0590759 0.0896816 0.100661 0.108004 -0.184923 -0.140872 -0.0235226 -0.0871643 0.10537 -0.193382 0.156978 0.208689 -0.106588 0.00762133 0.204015 -0.0257905 -0.111769 -0.0576423 -0.207653 0.0370946 0.132797 -0.0373618 0.030063 -0.0653988 0.118068 -0.0492868 -0.0367289 -0.0840348 0.00736382 -0.0944921 -0.0404188 0.0575884 -0.117255 -0.0191712 0.14541 -0.101287 -0.0975493 0.13674 0.0291253 -0.152848 0.0639492 0.0311358 -0.0799339 -0.0792567 -0.0174599 0.0709137 0.0495218 -0.0668865 0.117919 -0.0129532 -0.100976 -0.0329546 0.00769072 0.205256 -0.068425 0.00961739 -0.126589 -0.0171636 -0.0503183 -0.0958087 0.0303011 -0.0553669 0.0190195 -0.0589263 -0.0245434 -0.0175467 0.00526726 0.00396019 0.10235 -0.0141621 0.0742734 -0.0698857 0.0260159 -0.0322799 -0.0392451 -0.092846 0.145857 0.0775783 -0.0244944 -0.0103859 0.0517156 0.0940139 -0.19769 -0.114785 -0.018915 -0.0799976 -0.0417386 -0.0905666 0.0175911 0.0308974 -0.0270573 0.0775139 0.00281246 -0.0208963 0.144359 -0.0457236 0.0369883 -0.0907717 0.178714 -0.0716956 -0.0592593 0.00234643 0.0988591 -0.0867361 -0.0248285 0.00924502 0.0852104 -0.100843 -0.0558325 0.0391256 0.155154 -0.0158278 0.00381213 -0.0603682 0.0914346 -0.0686012 0.0621795 -0.0601706 -0.0611031 
0.076662 0.033083 -0.112622 0.0157496 0.083359 0.146304 0.0685983 0.000596607 -0.0219281 -0.0499165 0.0884405 0.10939 0.108928 -0.166555 -0.153169 -0.0081187 -0.0802324 0.107801 -0.183813 0.163392 0.215216 -0.113479 0.0127571 0.202879 -0.022224 -0.086671 -0.0434512 -0.205141 0.0471135 0.136305 -0.0485366 0.0338777 -0.0563323 0.105907 -0.0580617 -0.0326248 -0.0965884 0.0244644 -0.0925788 -0.0424009 0.0438291 -0.106912 -0.0151531 0.149234 -0.0971711 -0.0865787 0.154019 0.0192133 -0.162709 0.0490093 0.0354599 -0.0716549 -0.0814198 -0.017857 0.0839291 0.0497529 -0.0587879 0.128482 -0.0083504 -0.110429 -0.0292293 0.000116114 0.216969 -0.0550492 0.0167048 -0.122684 -0.0307299 -0.0319441 -0.0869804 0.038437 -0.048864 0.0237239 -0.0618698 -0.0322018 -0.0101194 0.0114313 0.000340918 0.111415 -0.0170758 0.0615906 -0.074061 0.0389376 -0.0310202 -0.0425008 -0.101312 0.135066 0.0800951 -0.00998696 -4.96623e-05 0.0439092 0.0803302 -0.189148 -0.119451 -0.0115947 -0.0682975 -0.0393903 -0.083667 0.0331251 0.0373687 -0.0372462 0.0714649 -0.000427695 -0.0201973 0.147814 -0.0595277 0.0444071 -0.10286 0.17486 -0.0618063 -0.0820898 0.00186503 0.110061 -0.0884473 -0.022653 0.0217608 0.0861209 -0.111168 -0.0692085 0.0395188 0.154432 -0.0203901 0.00833737 -0.0530847 0.0750791 -0.0788671 0.0787603 -0.0570475 -0.0585572 
0.0686607 0.0464106 -0.116151 0.00117417 0.0927294 0.154856 0.0578669 0.00913086 -0.0178232 -0.0420275 0.0932812 0.110027 0.103166 -0.185236 -0.138342 -0.00439661 -0.0824941 0.0994438 -0.18401 0.157308 0.20634 -0.0919675 0.00372996 0.18898 -0.0164121 -0.0682327 -0.0345098 -0.206274 0.0576688 0.121355 -0.0255869 0.0283529 -0.05905 0.10181 -0.0515631 -0.0242016 -0.0874744 0.0180867 -0.078305 -0.0283418 0.0657169 -0.102263 -0.0160466 0.173116 -0.104281 -0.0868921 0.163351 0.0232325 -0.162678 0.036733 0.0303024 -0.0683906 -0.103811 -0.0250555 0.0739716 0.0471435 -0.0794456 0.130704 -0.0132133 -0.115033 -0.0454118 -0.0223602 0.224511 -0.0487433 0.01821 -0.136211 -0.021707 -0.0242191 -0.0684146 0.0378075 -0.0370939 0.0365384 -0.0518563 -0.0344037 -0.0060385 -0.00106781 -0.0294586 0.132362 -0.0227459 0.06611 -0.0695299 0.0625751 -0.0179631 -0.0305409 -0.0990977 0.12717 0.0951442 0.00138177 0.00264017 0.0345874 0.0738487 -0.184018 -0.136097 -0.0131299 -0.0651136 -0.0518997 -0.0768559 0.0236581 0.0162559 -0.0480991 0.0423175 -0.00857588 -0.0151113 0.145042 -0.0761591 0.0487584 -0.107604 0.180359 -0.0528989 -0.0764062 0.0139573 0.109269 -0.103924 -0.00840557 0.0232744 0.0643245 -0.129251 -0.0909637 0.0374172 0.14278 -0.00288023 0.0201574 -0.04409 0.0847631 -0.0722197 0.0590677 -0.0576622 -0.0529238 
0.0628294 0.0386878 -0.109787 0.00697872 0.0905722 0.150978 0.0556936 -0.00152727 -0.0277078 -0.0401894 0.0893244 0.109351 0.106526 -0.170469 -0.140405 -0.00688052 -0.0901014 0.106281 -0.171597 0.15954 0.214547 -0.106592 0.0118113 0.199634 -0.00991256 -0.0685484 -0.0401059 -0.211639 0.061033 0.130021 -0.0293121 0.024545 -0.0588674 0.0933659 -0.0475802 -0.0207281 -0.100854 0.0186019 -0.0788806 -0.0371755 0.0563646 -0.105078 -0.0197817 0.169814 -0.106071 -0.0834361 0.166542 0.0225539 -0.162194 0.0308989 0.0285971 -0.0647328 -0.0889973 -0.0270362 0.0819475 0.0509987 -0.0659136 0.136594 -0.00874513 -0.117571 -0.0386013 -0.0115691 0.225779 -0.0422093 0.0220381 -0.126562 -0.0269522 -0.0282425 -0.0718547 0.0423759 -0.041309 0.039687 -0.0576969 -0.0386923 -0.00377103 0.00214634 -0.0263722 0.126542 -0.0139843 0.0704394 -0.0738664 0.0550929 -0.0209651 -0.0325746 -0.101514 0.123703 0.0909078 0.00368321 0.00283765 0.0320954 0.0761945 -0.174329 -0.1243 -0.0128418 -0.0727733 -0.0561436 -0.0820007 0.0397338 0.0290664 -0.0488475 0.0567718 -0.00377099 -0.0133907 0.138368 -0.0703044 0.0546165 -0.103251 0.177882 -0.044541 -0.0784546 0.0085156 0.110708 -0.102135 -0.0193267 0.0243211 0.0801862 -0.122423 -0.0860703 0.0376986 0.149712 -0.00901625 0.00715203 -0.0536906 0.0714364 -0.0889226 0.0796479 -0.0559087 -0.0442352 
0.0745042 0.0239197 -0.111155 0.012245 0.0909684 0.145681 0.0584288 -0.00298087 -0.0133721 -0.0666188 0.0849017 0.111799 0.104198 -0.15769 -0.159871 -0.00637795 -0.0818541 0.106029 -0.187496 0.1616 0.222589 -0.109336 0.0154159 0.208415 -0.0165638 -0.0849931 -0.0360868 -0.202304 0.0467569 0.133329 -0.0360693 0.0282011 -0.0581094 0.100505 -0.0589722 -0.0258014 -0.105366 0.0214444 -0.0911958 -0.0411881 0.044499 -0.0944803 -0.0202968 0.15345 -0.0905136 -0.0891023 0.151251 0.0194137 -0.155487 0.0445688 0.0233712 -0.0710106 -0.0717476 -0.0235261 0.0824497 0.0507389 -0.0601213 0.141871 -0.010252 -0.11715 -0.0315062 0.00584692 0.222367 -0.0476166 0.0080478 -0.119985 -0.0286866 -0.0238714 -0.0800166 0.0422467 -0.0439759 0.0242641 -0.0597491 -0.0407962 -0.0111378 0.0116119 -0.00595577 0.106312 -0.0209868 0.0660235 -0.0713019 0.0502887 -0.0296589 -0.0456909 -0.102834 0.133086 0.0816359 -0.00263634 -0.00652487 0.0381938 0.0866457 -0.185499 -0.119458 -0.008237 -0.0596906 -0.0368439 -0.0896358 0.0341751 0.0340977 -0.0389315 0.0694591 -0.00985735 -0.0235214 0.144255 -0.0654723 0.0483821 -0.10679 0.165928 -0.0591898 -0.085412 0.00826106 0.112437 -0.0920311 -0.0153057 0.0227658 0.0922284 -0.12051 -0.0694183 0.0405546 0.152957 -0.0211177 0.0139296 -0.0573023 0.0681525 -0.0883266 0.0818025 -0.0626861 -0.057415 
0.059759 0.0249807 -0.110166 0.0145115 0.0924149 0.140053 0.0360755 -0.0216001 -0.0229717 -0.0508375 0.0888375 0.113864 0.10382 -0.132691 -0.160103 0.0126402 -0.0865293 0.115453 -0.164938 0.151016 0.235282 -0.116675 0.0212068 0.217417 0.00537689 -0.0676742 -0.0263145 -0.204286 0.0538422 0.150547 -0.034253 0.0232433 -0.0540574 0.08121 -0.0544198 -0.0110999 -0.12205 0.0150107 -0.0749736 -0.0387557 0.0258245 -0.0862308 -0.0143418 0.158588 -0.0798758 -0.0836052 0.169508 0.0137371 -0.155425 0.0222276 0.0342483 -0.0634977 -0.0669389 -0.0297478 0.0922101 0.0602609 -0.0507188 0.151881 -0.000222188 -0.122926 -0.0266211 -0.00102581 0.227131 -0.0336431 0.0119679 -0.11414 -0.0394463 -0.00844259 -0.0689903 0.0571987 -0.0366886 0.0432125 -0.0659347 -0.064246 -0.00731923 0.0142603 -0.0152249 0.11451 -0.0244605 0.0673809 -0.0693295 0.062968 -0.028582 -0.0427595 -0.118177 0.124725 0.0784745 -0.000406077 -0.00172914 0.0266195 0.0653861 -0.168121 -0.118039 -0.00174598 -0.0606802 -0.0381827 -0.0967029 0.0524152 0.0451018 -0.0474216 0.0691938 -0.0128041 -0.0199103 0.133192 -0.0691608 0.0580214 -0.113646 0.15415 -0.0492123 -0.0952056 0.000377641 0.113194 -0.0918768 -0.0203739 0.0321376 0.103586 -0.125986 -0.0723114 0.034316 0.151552 -0.016783 0.00875129 -0.0583157 0.0480349 -0.108298 0.107129 -0.0584636 -0.0398643 
0.0575275 0.019779 -0.106456 0.0158614 0.0872107 0.139084 0.030453 -0.0183253 -0.0208124 -0.0523643 0.0939345 0.108388 0.108324 -0.119606 -0.162699 0.00782372 -0.0896562 0.127183 -0.162656 0.14981 0.244978 -0.123153 0.026121 0.22172 0.00799722 -0.0833057 -0.0274555 -0.198549 0.0510867 0.155242 -0.0404106 0.00745572 -0.0464625 0.0795767 -0.0528371 -0.00652603 -0.127247 0.0061731 -0.0827686 -0.0443974 0.015907 -0.0841448 -0.0154531 0.154826 -0.0823509 -0.0931027 0.164005 0.0148359 -0.150557 0.0287164 0.0293318 -0.0650116 -0.062554 -0.0246316 0.0916559 0.0640648 -0.042766 0.142389 0.000485457 -0.12631 -0.0221145 0.00693661 0.224183 -0.028893 0.00439795 -0.107632 -0.0406911 -0.00801768 -0.0684857 0.0614729 -0.0329912 0.0392742 -0.067086 -0.0764007 -0.00735952 0.0188243 -0.0111304 0.108167 -0.0218688 0.0635243 -0.0716306 0.0571519 -0.0295484 -0.0417768 -0.119174 0.139288 0.0722585 -0.0013306 0.00238078 0.0311024 0.0681867 -0.170174 -0.112261 -0.00174496 -0.0665376 -0.0443869 -0.112673 0.0602541 0.0459759 -0.046599 0.0839095 -0.010359 -0.015035 0.118425 -0.0583771 0.0646154 -0.10864 0.145643 -0.0525464 -0.0952998 -0.00589748 0.105064 -0.0840578 -0.0238678 0.0294491 0.113982 -0.115087 -0.062908 0.0339236 0.152949 -0.0234902 -0.002667 -0.0652972 0.0445827 -0.114414 0.116463 -0.0515547 -0.0294351 
0.0595121 0.0183901 -0.107544 0.018968 0.0842151 0.139591 0.0287494 -0.0173233 -0.0194144 -0.0481544 0.0978429 0.110179 0.110279 -0.11894 -0.164624 0.00384814 -0.0837909 0.130562 -0.159235 0.154266 0.244535 -0.124086 0.0249463 0.229233 0.0073382 -0.0850864 -0.0264487 -0.197034 0.051851 0.15809 -0.0419791 0.00272467 -0.0436609 0.0795043 -0.0527941 -0.00577531 -0.127119 0.0044026 -0.0844989 -0.048207 0.010551 -0.0847566 -0.0194578 0.154126 -0.0835888 -0.100964 0.16182 0.0171872 -0.146508 0.0331388 0.0320385 -0.0616655 -0.0609454 -0.0250489 0.0931885 0.0646375 -0.0449974 0.139623 -5.58276e-05 -0.128024 -0.0242442 0.00580386 0.226072 -0.0318755 0.00101228 -0.107973 -0.0385235 -0.0115832 -0.0734565 0.0592525 -0.0330459 0.0368823 -0.0687401 -0.076685 -0.00936235 0.0178912 -0.00607149 0.108423 -0.0179167 0.0657011 -0.0738765 0.05442 -0.0277498 -0.0425492 -0.113324 0.137303 0.0701407 -0.00063965 0.00966221 0.0320572 0.0665122 -0.170391 -0.109083 0.0044097 -0.0662482 -0.0484338 -0.114143 0.0582176 0.0428794 -0.0487161 0.0899899 -0.00546958 -0.0160924 0.11386 -0.0576054 0.0685671 -0.103325 0.136517 -0.050497 -0.0922529 -0.00589201 0.104977 -0.0794495 -0.0228523 0.0284012 0.114934 -0.110387 -0.0614115 0.0332092 0.153724 -0.0281153 -0.00906108 -0.0662262 0.0426898 -0.114471 0.121151 -0.0469495 -0.0284523 
0.0564526 0.0447897 -0.110868 0.0125803 0.0778114 0.169101 0.0307394 -0.0116605 -0.0267314 -0.0239612 0.103564 0.108807 0.106068 -0.147845 -0.131315 -0.0129722 -0.083986 0.134706 -0.136071 0.142732 0.221022 -0.0910399 0.0176866 0.224505 0.00575087 -0.0735906 -0.025061 -0.213597 0.0634901 0.157128 -0.0235926 0.00330318 -0.0388487 0.0819595 -0.0323472 -0.00327252 -0.096646 -0.00443399 -0.0724394 -0.0331207 0.0328756 -0.101542 -0.020785 0.177424 -0.119567 -0.105775 0.181272 0.0194064 -0.155466 0.0315359 0.0513632 -0.0486653 -0.0743432 -0.0201371 0.0924975 0.071101 -0.0479235 0.131075 -0.000995167 -0.13026 -0.0532522 -0.0188635 0.233359 -0.0583316 0.0156769 -0.128111 -0.016711 -0.0377692 -0.078174 0.0721947 -0.0338128 0.0440386 -0.0731893 -0.0608236 -0.00031788 -0.00190571 -0.0333994 0.128539 -0.0127293 0.0700294 -0.0763327 0.0729503 -0.00878324 -0.0288556 -0.0896035 0.123418 0.0786656 -0.00714919 0.0146842 0.0394104 0.0615936 -0.172041 -0.119793 -0.00902384 -0.0709199 -0.0723386 -0.0990933 0.0653223 0.0293843 -0.0541727 0.071792 0.0156938 -0.0025153 0.115185 -0.0699414 0.0686372 -0.0951441 0.135431 -0.0455979 -0.071735 0.00146514 0.0972907 -0.0888078 -0.0323945 0.0239368 0.0892176 -0.0954079 -0.101329 0.0395681 0.154041 0.0112743 -0.0256063 -0.0527956 0.0481648 -0.0984425 0.102486 -0.0248414 -0.00830991 
0.0580407 0.0413668 -0.108874 0.0141603 0.0718313 0.173125 0.0286624 -0.0112412 -0.0298173 -0.0288053 0.103256 0.103642 0.109071 -0.138744 -0.12881 -0.0112164 -0.0837354 0.132592 -0.133061 0.141235 0.224417 -0.0941242 0.0206985 0.226563 0.00764762 -0.0753319 -0.0287589 -0.213792 0.0615634 0.157384 -0.0213009 0.00557687 -0.0383033 0.0851364 -0.0342428 0.00152276 -0.0965637 -0.00233844 -0.0727045 -0.0351686 0.0283532 -0.101591 -0.0179065 0.172635 -0.116353 -0.110748 0.182597 0.0170566 -0.156527 0.0347648 0.0500167 -0.0530794 -0.0688663 -0.0143039 0.0956633 0.0734152 -0.0438589 0.132963 0.00431486 -0.135599 -0.054989 -0.0114735 0.232272 -0.0650495 0.0134283 -0.116152 -0.01498 -0.0402726 -0.0812604 0.0738725 -0.0376068 0.0429708 -0.076341 -0.0582571 0.00291643 -0.00552976 -0.0281211 0.120753 -0.011459 0.0719332 -0.0747005 0.0672456 -0.00992017 -0.0359616 -0.0904003 0.125911 0.0752188 -0.0115558 0.0145439 0.0410939 0.0673649 -0.174291 -0.11672 -0.0100558 -0.0701772 -0.0671672 -0.10058 0.0740358 0.0301536 -0.0496287 0.0725326 0.0166826 -0.00307574 0.115732 -0.0701454 0.0729965 -0.0965159 0.13215 -0.0469353 -0.0773044 -0.00373618 0.0991359 -0.0879368 -0.037178 0.0271906 0.0923164 -0.0858128 -0.100992 0.0428465 0.156983 0.012932 -0.0319004 -0.0494997 0.0471371 -0.102374 0.10393 -0.0194109 -0.00326888 
0.0668979 0.0254555 -0.0997296 0.029803 0.0695424 0.153077 0.0264946 -0.0242286 -0.0381253 -0.0532766 0.0982487 0.0975616 0.111799 -0.120304 -0.154189 0.00569244 -0.0847966 0.135778 -0.145151 0.153808 0.24395 -0.12151 0.0322442 0.232075 0.00757417 -0.0999469 -0.0391389 -0.202894 0.0446054 0.165667 -0.0468414 -0.00403963 -0.0436213 0.0882737 -0.0406848 -0.00213905 -0.116051 -0.00841574 -0.0817464 -0.0512284 -0.00263116 -0.0951909 -0.00386536 0.14387 -0.0847732 -0.101149 0.173277 0.0160968 -0.158447 0.0561775 0.0416438 -0.071119 -0.0536197 -0.00978172 0.0938764 0.0634125 -0.0309908 0.127058 0.00877711 -0.123818 -0.0247385 0.0243317 0.218736 -0.054992 0.00677849 -0.10361 -0.0363819 -0.0349472 -0.0920667 0.0602012 -0.042476 0.0329037 -0.0761975 -0.0682866 -0.00635151 0.0124681 0.00659672 0.0988941 -0.00989618 0.0735486 -0.0629987 0.0354008 -0.0334058 -0.0459704 -0.113817 0.15217 0.0495565 -0.0220752 0.00182494 0.0471701 0.0754365 -0.173182 -0.104742 0.00222236 -0.0747321 -0.040567 -0.116484 0.0778687 0.0419116 -0.0395941 0.0957403 0.00898528 -0.0163341 0.110056 -0.0455637 0.0725611 -0.0905756 0.13922 -0.0592432 -0.0826961 -0.017238 0.0940711 -0.0637456 -0.0345668 0.0200746 0.120067 -0.0849206 -0.0486926 0.0303319 0.160129 -0.0266234 -0.0300863 -0.0594183 0.0395645 -0.112692 0.122612 -0.0313059 -0.0248582 
0.0691447 0.017369 -0.103849 0.017107 0.0631133 0.142211 0.0290501 -0.000245922 -0.047514 -0.0545625 0.0866227 0.0947144 0.120601 -0.13991 -0.160391 0.0012724 -0.0815648 0.115078 -0.157309 0.173893 0.232521 -0.125762 0.0252173 0.225579 -0.0146628 -0.084074 -0.0324363 -0.202734 0.0419121 0.142676 -0.0580829 0.00153301 -0.0482647 0.0960082 -0.0574675 -0.0120259 -0.111828 0.00605945 -0.0972549 -0.0527923 0.00600426 -0.110663 -0.00840276 0.151205 -0.07829 -0.090533 0.173081 0.0230822 -0.170163 0.0633889 0.036788 -0.0853997 -0.05978 -0.00972724 0.0908499 0.0496722 -0.0446876 0.115603 0.0166791 -0.134661 -0.01126 0.0256826 0.208632 -0.0381162 0.000354005 -0.113425 -0.0332736 -0.0352265 -0.0816531 0.0300254 -0.0583198 0.0134121 -0.067124 -0.0575551 -0.00456637 0.0103936 0.00941093 0.111295 0.000850349 0.0801239 -0.0605655 0.0225382 -0.0436519 -0.0540613 -0.109639 0.149174 0.0573256 -0.0122487 0.0104779 0.0470999 0.0771016 -0.169421 -0.108872 0.00472637 -0.0820657 -0.0257633 -0.0981786 0.0650162 0.0355113 -0.0484635 0.0907751 0.00553732 -0.0224113 0.122169 -0.0516254 0.059638 -0.10291 0.157976 -0.0681924 -0.0848699 -0.00763839 0.109448 -0.0722017 -0.0346386 0.0085154 0.106554 -0.100075 -0.0591253 0.0257175 0.149053 -0.0425196 -0.0156657 -0.0506535 0.0492608 -0.10494 0.102532 -0.0494637 -0.0491101 
0.0682293 0.00236085 -0.0888517 0.0177843 0.0711425 0.147574 0.0393578 -0.00318267 -0.0447055 -0.0705923 0.0840777 0.106194 0.117001 -0.130277 -0.153673 -0.0130961 -0.0941608 0.108316 -0.160925 0.165946 0.238308 -0.126245 0.0232856 0.22305 -0.00603845 -0.0816701 -0.0403125 -0.2025 0.0328818 0.139437 -0.0482328 -0.00171063 -0.057061 0.0981047 -0.0562805 -0.0090823 -0.123386 0.00888417 -0.0941267 -0.0516378 0.0231264 -0.100969 -0.0156832 0.148699 -0.0857514 -0.097213 0.162359 0.0137935 -0.159638 0.0567382 0.0268128 -0.0878966 -0.0604145 -0.00922736 0.0988293 0.0512036 -0.0540071 0.138317 0.000361884 -0.129057 -0.0106035 0.0274276 0.212708 -0.0335477 0.0076566 -0.10437 -0.0296077 -0.0279204 -0.0810422 0.0418357 -0.0461754 0.0263752 -0.0607895 -0.054364 -0.00510117 0.01433 0.00119298 0.0920091 0.0031143 0.0840478 -0.0703474 0.0249483 -0.0298398 -0.0540446 -0.119214 0.134578 0.0771354 -0.00421983 0.00191842 0.0409718 0.0853846 -0.175171 -0.0985009 0.00290657 -0.0894854 -0.0361257 -0.0989342 0.0551557 0.040709 -0.0403107 0.0817543 0.00654639 -0.0227991 0.119568 -0.0521485 0.0640492 -0.105635 0.158529 -0.068305 -0.0913682 -0.0026648 0.107072 -0.0851554 -0.0310017 0.0204363 0.113882 -0.100179 -0.0557607 0.0294751 0.15645 -0.0361428 -0.0137211 -0.0621026 0.0459368 -0.101895 0.108174 -0.0447191 -0.0409324 
0.0542482 0.00797749 -0.0965596 0.0142227 0.0640749 0.125262 0.0201802 -0.0122853 -0.0585972 -0.0614882 0.0806119 0.111284 0.126944 -0.112124 -0.168967 0.00129973 -0.080414 0.0983295 -0.156849 0.179974 0.229479 -0.139572 0.0292031 0.217943 -0.0125294 -0.0540996 -0.0318301 -0.195691 0.0369696 0.137022 -0.057181 0.0110145 -0.0487754 0.0832077 -0.0787391 -0.00439649 -0.134703 0.0351458 -0.0985614 -0.0386871 0.00756045 -0.0941452 -0.0170885 0.14795 -0.076629 -0.0801707 0.178801 0.00475168 -0.165263 0.0453925 0.0355509 -0.0811676 -0.0654842 -0.011376 0.0999338 0.0475293 -0.0494175 0.142283 0.0211998 -0.134007 -0.00953947 0.0238891 0.209465 -0.0204862 0.00950749 -0.108255 -0.031238 -0.0143062 -0.0725776 0.0344023 -0.0411443 0.0252394 -0.0533392 -0.0519037 0.00625864 0.0222859 -0.00443303 0.0993681 -0.00311207 0.0810148 -0.0736777 0.0253083 -0.0341564 -0.0554569 -0.12821 0.128283 0.0782739 -0.00116317 0.00691708 0.0205976 0.0554526 -0.165503 -0.0890568 0.00641311 -0.0816515 -0.0321633 -0.0852397 0.0641454 0.0443834 -0.0518502 0.0663343 0.0056475 -0.0237043 0.137696 -0.0666316 0.0646723 -0.121714 0.167336 -0.0605447 -0.110224 -0.00729501 0.120114 -0.0886253 -0.0251216 0.0103986 0.109096 -0.11841 -0.0650329 0.0245577 0.150527 -0.0533648 -0.00442656 -0.0615934 0.0365399 -0.107864 0.115865 -0.0623881 -0.0429937 
0.0542174 0.00692828 -0.0899862 0.0165963 0.0676193 0.128385 0.0249385 -0.0167994 -0.0543108 -0.066177 0.0808517 0.112832 0.124889 -0.107353 -0.167484 -0.000396073 -0.0820355 0.0997331 -0.159458 0.174797 0.234639 -0.141107 0.0281882 0.219028 -0.00815718 -0.0581727 -0.0377219 -0.194802 0.0367079 0.139764 -0.0519307 0.0121299 -0.0520197 0.0841006 -0.0748622 -0.00286966 -0.135809 0.0359356 -0.0944857 -0.0403986 0.0104608 -0.0899288 -0.0180997 0.141002 -0.0749829 -0.0827 0.174119 0.0023471 -0.162978 0.0408537 0.0313739 -0.080119 -0.0629881 -0.0123167 0.101599 0.0507817 -0.0505635 0.149711 0.0133153 -0.131589 -0.00964558 0.0259408 0.210884 -0.0256985 0.0140746 -0.101203 -0.0314962 -0.0116363 -0.0770333 0.0408819 -0.0373148 0.0291907 -0.0550329 -0.0527929 0.00466401 0.025075 -0.00266668 0.0936016 -0.00286504 0.0784992 -0.0774777 0.0278429 -0.0312846 -0.0557728 -0.130869 0.124593 0.080711 0.000361956 0.00370844 0.0216418 0.0598625 -0.169295 -0.0839146 0.00822323 -0.0807142 -0.0337034 -0.0879097 0.0616168 0.0463379 -0.0457365 0.0676276 0.00440638 -0.0279842 0.137358 -0.0635735 0.067824 -0.119576 0.163038 -0.0593524 -0.111806 -0.00931151 0.117951 -0.0909731 -0.0228852 0.0171157 0.11305 -0.119823 -0.0605178 0.0251432 0.153929 -0.0516361 -0.00377881 -0.0657962 0.0360399 -0.106892 0.121004 -0.0608543 -0.043442 
0.0553611 0.00600314 -0.0877777 0.0184259 0.0648761 0.129942 0.023749 -0.0161311 -0.0530351 -0.0751188 0.0792455 0.114181 0.118235 -0.119055 -0.172423 0.000280858 -0.088793 0.101634 -0.161599 0.171929 0.234447 -0.134139 0.0284356 0.218234 -0.0119643 -0.0596346 -0.0335177 -0.198193 0.0322185 0.137173 -0.0547639 0.00962708 -0.0521823 0.0869132 -0.0725176 -0.00870036 -0.133044 0.0300194 -0.0956373 -0.035819 0.0132871 -0.0924988 -0.0153747 0.142968 -0.0738837 -0.0841102 0.176741 -0.0016562 -0.165212 0.0476815 0.0332943 -0.08436 -0.0612514 -0.00791596 0.0988047 0.0490313 -0.0439523 0.143899 0.0113218 -0.128316 -0.00670728 0.0285267 0.21011 -0.0235056 0.0136615 -0.10907 -0.0304325 -0.0200927 -0.0766594 0.0418358 -0.0423593 0.0236065 -0.0542329 -0.0484538 0.00444722 0.0225113 -0.00427544 0.0927106 -0.00736344 0.0801014 -0.0735719 0.0293806 -0.031874 -0.054345 -0.132162 0.131936 0.0784566 -0.00296711 -0.00568097 0.0237624 0.062701 -0.169764 -0.0893927 0.00571824 -0.0808368 -0.0275988 -0.089548 0.0622427 0.0465008 -0.0421784 0.0659782 0.00269213 -0.028764 0.13948 -0.0555067 0.0611726 -0.115979 0.167704 -0.0683909 -0.108758 -0.00898045 0.114949 -0.0866692 -0.0259217 0.0120821 0.113128 -0.11661 -0.0587994 0.0265081 0.152155 -0.0494674 -0.00149377 -0.0642292 0.0324456 -0.102913 0.117182 -0.0605284 -0.0446473 
0.0700367 0.000175081 -0.101584 0.0188746 0.0775701 0.130253 0.0194087 -0.00299167 -0.0502982 -0.0800527 0.0763845 0.119958 0.108534 -0.145941 -0.172583 0.00908164 -0.0745433 0.110557 -0.174756 0.186769 0.225419 -0.119344 0.0451586 0.197687 -0.0260529 -0.0576232 -0.0271644 -0.21134 0.0195758 0.115845 -0.0555132 0.024929 -0.0433547 0.0993566 -0.0734512 -0.0163313 -0.119271 0.0453353 -0.103419 -0.0400325 0.0176372 -0.0863996 -0.0213055 0.153229 -0.0910766 -0.0798087 0.177377 -0.00268017 -0.170084 0.070439 0.0376962 -0.0926833 -0.0785505 -0.00317499 0.088401 0.0303896 -0.0355717 0.123033 0.0123274 -0.126492 -0.00903849 0.014383 0.207704 -0.0298775 0.0194056 -0.139067 -0.034938 -0.0112964 -0.0678845 0.0502694 -0.0403469 0.017794 -0.046303 -0.0384764 -0.0137651 0.00745642 -0.0120625 0.104668 -0.0199996 0.0687984 -0.0787957 0.0424858 -0.0424337 -0.0620582 -0.125456 0.132148 0.077576 0.00315368 -0.00617724 0.0249874 0.0691508 -0.170024 -0.112954 -0.0057821 -0.0627143 -0.0215395 -0.0803105 0.0589362 0.0230077 -0.0472325 0.0511774 -0.00637349 -0.028665 0.145703 -0.0489307 0.042855 -0.116604 0.170096 -0.0614729 -0.103037 -0.0118152 0.124019 -0.0807764 -0.016004 0.0153696 0.0875513 -0.116693 -0.08606 0.0324323 0.148591 -0.0442781 0.0263596 -0.0476289 0.0513673 -0.0780432 0.0801005 -0.0490986 -0.0552361 
0.067165 0.0100054 -0.11343 0.00989022 0.0789489 0.130493 0.00497833 -0.00145916 -0.044656 -0.0812514 0.0768029 0.120411 0.108799 -0.149042 -0.174849 0.0143258 -0.0721876 0.108248 -0.177663 0.192772 0.21981 -0.110248 0.0646264 0.182559 -0.0326314 -0.0570446 -0.0166122 -0.210204 0.0195587 0.109565 -0.0542541 0.0194607 -0.027521 0.0983125 -0.0758989 -0.0156079 -0.109171 0.0586399 -0.107143 -0.0316114 0.0113438 -0.0807306 -0.0235062 0.156433 -0.104996 -0.0815669 0.180826 -0.00207469 -0.16503 0.0874865 0.0377629 -0.0890014 -0.0860593 0.00438255 0.0839163 0.0235163 -0.0216823 0.110648 0.0117334 -0.132272 -0.0215813 0.0062688 0.213 -0.0334826 0.0199229 -0.151829 -0.0349764 -0.00279152 -0.0621008 0.0562009 -0.0347206 0.014705 -0.0450955 -0.0355421 -0.00839417 0.00475952 -0.0216123 0.105064 -0.0277548 0.065801 -0.0783541 0.0472686 -0.0380473 -0.0526109 -0.121912 0.138225 0.0732055 0.00974581 -0.000798694 0.0225871 0.0634577 -0.175605 -0.118547 -0.00985604 -0.0529493 -0.0318289 -0.084176 0.0721013 0.0111846 -0.0519102 0.045391 -0.00957984 -0.0266366 0.148336 -0.048422 0.0414919 -0.11791 0.168331 -0.0551254 -0.102679 -0.0131863 0.126529 -0.0747231 -0.00214118 0.00780582 0.0826601 -0.11614 -0.0912384 0.0348847 0.151031 -0.041054 0.0328357 -0.0411739 0.0527503 -0.0739448 0.0694429 -0.0434137 -0.0451891 
0.0694987 0.00544778 -0.110997 0.0131442 0.0847595 0.128271 0.0229085 -0.000806696 -0.0366348 -0.0875491 0.0751665 0.120704 0.108059 -0.145898 -0.174036 0.00458927 -0.0710849 0.103704 -0.184315 0.190006 0.220664 -0.119264 0.0524473 0.186828 -0.0289107 -0.0674774 -0.026005 -0.205299 0.0203527 0.110873 -0.0491339 0.0246811 -0.0366618 0.100223 -0.077366 -0.017245 -0.112128 0.0541695 -0.109721 -0.0377883 0.0251191 -0.0808047 -0.0234065 0.150651 -0.100814 -0.0782769 0.168474 0.000299117 -0.160841 0.0767012 0.0254058 -0.0877725 -0.0821855 -0.00367214 0.0851941 0.0281253 -0.0361139 0.122507 0.00454662 -0.124529 -0.0195025 0.0123072 0.210748 -0.0354585 0.017863 -0.140734 -0.0338472 -0.00563678 -0.0674421 0.0509842 -0.0342952 0.0159879 -0.0454214 -0.0345015 -0.0103818 0.0121279 -0.0137597 0.102383 -0.0258863 0.0629256 -0.08557 0.0442949 -0.0401028 -0.0545385 -0.121286 0.137428 0.0778102 0.0085936 -0.00684913 0.0222909 0.0730768 -0.179403 -0.112757 -0.0138114 -0.0530798 -0.031897 -0.0837272 0.0566932 0.0184827 -0.0477287 0.0467195 -0.0120685 -0.026806 0.150295 -0.0525207 0.0436303 -0.117925 0.174255 -0.0578167 -0.102785 -0.00978199 0.122534 -0.0825688 -0.00427396 0.0120263 0.0849919 -0.118142 -0.0855534 0.0393815 0.155657 -0.0429662 0.0344782 -0.0523691 0.0611149 -0.0765206 0.0705988 -0.0534862 -0.0538938 
