0.00492486 0.107913 -0.0794399 -0.0508619 0.0203116 0.176801 0.0145179 -0.066431 -0.110949 0.0360961 0.0414754 0.0319969 0.0955901 -0.116141 -0.109501 0.0503331 -0.168081 0.0631925 -0.0101287 0.0240932 0.230076 -0.0850433 -0.0325239 0.0654518 0.02244 0.0604699 -0.057842 -0.195396 0.124138 0.186959 -0.0617161 0.0460399 -0.0596872 0.0199906 0.0553159 -0.022468 -0.0778619 -0.00325736 0.0838888 -0.0882414 -0.0114503 -0.166405 0.0661379 0.127645 -0.0214257 -0.00381251 0.208646 0.0112369 -0.255596 -0.0869694 0.0237386 0.00213181 0.0147243 0.00770156 0.104098 0.0751529 0.0278103 0.0965766 -0.049404 -0.159312 0.0206004 0.00929985 0.24363 -0.00720548 0.0701899 0.00633142 -0.0541127 -0.00814028 -0.0267226 0.0305669 -0.081009 0.028061 -0.131055 -0.0851495 0.0353509 0.0101488 -0.037335 0.0454902 0.033566 0.0889427 -0.00572143 0.0471518 0.0110114 0.0188538 -0.118073 0.0542209 0.0475776 -0.00025379 0.0527657 0.0809007 0.0694693 -0.0944829 -0.109942 0.0617369 -0.133575 -0.0271119 -0.027965 0.161714 0.0873948 -0.0354534 0.134625 0.0385477 -0.0310134 0.0639794 -0.0658937 0.0775478 -0.0559177 0.171435 -0.0379131 -0.0715816 0.0166797 0.0411655 -0.131308 -0.0996413 0.0947003 0.115423 -0.122374 -0.05308 0.0379302 0.0920178 0.05389 -0.100611 0.0445183 -0.0605334 -0.110164 0.158382 0.02088 0.00678899 
-0.0101177 0.101929 -0.0596098 -0.0409184 0.0303897 0.142063 0.0317618 -0.0591197 -0.089753 0.0501769 0.0426574 0.0437149 0.0860417 -0.118713 -0.091752 0.028415 -0.171905 0.0444758 -0.00268566 0.0467306 0.215453 -0.108695 -0.0435187 0.0777555 0.0343309 0.0669915 -0.0512769 -0.190584 0.139225 0.183855 -0.0564863 0.0355065 -0.038242 0.0155305 0.0534836 -0.0199718 -0.0714833 0.0195747 0.0571397 -0.115632 0.0122786 -0.180333 0.055018 0.138492 -0.03647 0.0152539 0.200749 0.0105266 -0.245432 -0.109986 -0.000719105 0.0088528 0.0143774 -0.0156174 0.135463 0.0858177 -0.0186371 0.0991929 -0.0671335 -0.150827 0.0135129 -0.0299701 0.240368 0.00879788 0.0903227 0.0182101 -0.0587875 -0.0216363 -0.0295421 0.018943 -0.0851381 0.0257627 -0.132057 -0.0927898 0.0500642 0.0173653 -0.0297373 0.0757012 0.0519903 0.0872478 -0.0314855 0.0418622 0.00227861 0.0216355 -0.0903657 0.0206989 0.0565995 0.0318047 0.0694087 0.0881559 0.0736735 -0.0879939 -0.103872 0.0615042 -0.14308 -0.0504868 -0.0251192 0.126471 0.117162 -0.0560251 0.12597 0.028846 -0.027359 0.0306899 -0.0834956 0.0892487 -0.0429372 0.168825 -0.00458874 -0.077989 0.0244214 0.052608 -0.149203 -0.103105 0.106535 0.104674 -0.129309 -0.0699781 0.0360912 0.102945 0.0487505 -0.0805968 0.012082 -0.0338585 -0.0980638 0.171584 0.0360569 -0.000273447 
0.000107321 0.12665 -0.088378 -0.0420221 -0.00433786 0.140057 0.0641501 -0.0502027 -0.0639744 0.114836 0.0619492 0.0152669 0.0883113 -0.139031 -0.0955212 0.00986697 -0.163726 0.0608505 0.00849787 0.0157671 0.188275 -0.0905909 -0.100075 0.0727644 0.011036 0.0944105 -0.0757117 -0.183364 0.190897 0.191715 -0.0532887 0.0728036 -0.0794311 -0.0172401 0.0689441 -0.0412666 -0.0802353 0.0183741 0.0958089 -0.106012 -0.0011951 -0.180711 -0.00536052 0.154652 -0.015503 -0.0213057 0.156201 0.0460335 -0.203997 -0.150242 0.00548235 0.0854681 0.0130376 -0.0371068 0.09274 0.0834211 -0.0128414 0.0914626 -0.0589797 -0.155601 0.00855254 -0.0549399 0.263744 0.0260225 0.0335752 0.0168533 -0.00540856 -0.048115 -0.00220297 -0.0105449 -0.0905291 0.0300613 -0.111862 -0.0480312 0.0127984 -0.0427877 -0.041154 0.0698347 0.0571781 0.0927479 0.000643604 0.0609409 0.00374993 0.00842307 -0.0284869 -0.0144307 0.0558643 0.0169346 0.119863 0.0548846 0.066963 -0.0524562 -0.0934481 0.0593915 -0.131329 -0.0911854 0.00687392 0.0869651 0.112414 -0.0574041 0.153479 0.0543476 -0.0164238 0.0275394 -0.0966744 0.0792983 -0.000163257 0.140494 0.0379552 -0.0254748 0.0531221 0.0554133 -0.165993 -0.112166 0.10374 0.08679 -0.110045 -0.0847418 0.0456661 0.0390606 0.0465263 -0.105199 0.035264 -0.0400583 -0.115292 0.155633 0.018297 0.00737686 
-0.0424276 0.0519389 -0.0688032 -0.00624636 0.00492507 0.165471 0.0494184 -0.0661443 0.00386293 0.0641982 0.0390564 0.0210698 0.05465 -0.123217 -0.0950362 0.00120009 -0.207613 0.0876963 0.00216818 -0.000887733 0.206816 -0.138568 -0.0742235 0.0737472 0.0371014 0.0668651 -0.107353 -0.22119 0.12608 0.145004 0.0280527 0.0814858 -0.0758446 -0.0122494 0.0929109 0.0204845 -0.104583 -0.0111288 0.0595656 -0.156298 0.0423988 -0.174938 -0.0141711 0.150188 -0.0122993 -0.0883963 0.123644 0.0516372 -0.159981 -0.147389 -0.0610928 0.00373606 0.0681134 -0.0553599 0.108883 0.117223 -0.0244255 0.104145 -0.0645428 -0.17342 -0.00293262 -0.00894366 0.263525 0.0106643 0.0725709 0.077226 -0.0204757 -0.049601 -0.0118657 0.0461754 -0.0966033 0.0444966 -0.106727 -0.0685206 -0.019406 -0.0552866 -0.0429822 0.0382883 0.0399026 0.0551287 -0.0299485 0.0724951 -0.0258536 -0.0215483 -0.0674169 -0.0113071 0.0653698 0.0512767 0.0951923 0.0579531 0.1171 -0.0436342 -0.0681995 0.0153554 -0.109651 -0.0422642 -0.043872 0.0970211 0.0997109 -0.0111397 0.171515 -0.00272217 -0.0350521 -0.0516583 -0.0299028 0.0963523 0.00664572 0.071218 0.00504309 -0.00150424 0.00105867 0.0569691 -0.131487 -0.150893 0.141744 0.0896789 -0.0768337 -0.0679398 0.0831981 0.0512806 0.0789603 -0.115471 0.0254789 -0.0408426 -0.140603 0.165673 0.0335261 0.039112 
0.015711 -0.00543037 -0.108011 0.0125648 0.0519003 0.102436 0.114373 -0.0220721 -0.0735344 0.0641092 0.0417623 0.093457 0.101586 -0.123816 -0.137021 0.000151222 -0.165278 0.117256 -0.0443187 0.0923457 0.218361 -0.189734 -0.0288907 0.0930367 -0.00527991 0.0164482 -0.097131 -0.239689 0.0702108 0.17943 -0.0975892 0.104794 -0.0648795 0.0284766 0.0247419 -0.0436094 -0.121521 0.0232391 -0.00493117 -0.160839 0.0320678 -0.169814 0.00295879 0.144865 -0.0806308 -0.0293449 0.138483 0.0210141 -0.190217 -0.088635 -0.00359355 -0.0523237 -0.00596635 -0.0264151 0.128632 0.0805237 -0.0187275 0.0981338 -0.0494155 -0.09198 0.0546103 -0.0230052 0.225307 0.0155203 0.0953332 -0.0173316 -0.0893855 -0.0280127 -0.028387 0.009674 -0.0896447 0.0419197 -0.0981748 -0.0661705 -0.0516272 0.0174486 0.0183232 0.0709337 0.0348052 0.0313827 -0.0870194 -0.00148247 -0.0593393 -0.0235244 -0.114211 0.0474881 0.0826413 0.028342 0.0754178 0.0494162 0.089081 -0.0862583 -0.0979069 0.00102023 -0.136085 -0.0327038 -0.0510274 0.0724055 0.129404 -0.0248777 0.161835 0.0056738 -0.0134044 0.0353353 -0.00964598 0.0485255 -0.0455658 0.178528 -0.0279566 -0.0532501 -0.0286301 0.0705899 -0.11606 -0.13768 0.10143 0.100682 -0.0679127 -0.060508 0.0637935 0.106973 0.00151994 -0.066282 -0.0191081 0.018937 -0.107694 0.144743 -0.0214451 -0.0232634 
0.0349503 0.00923906 -0.0947264 -0.0149773 0.0787963 0.0963513 0.100604 -0.0177624 -0.155767 0.100227 0.0440796 0.109907 0.124186 -0.0879976 -0.0943098 0.0399168 -0.0870866 0.0954564 -0.0329486 0.10381 0.204072 -0.15518 -0.0115093 0.103125 0.0137448 0.0688042 -0.0720726 -0.214648 0.123532 0.164763 -0.098216 0.10906 -0.0812965 0.0214954 -0.0195804 -0.0482852 -0.150463 0.0698752 0.0192457 -0.116486 0.00156066 -0.119177 -0.00441565 0.147122 -0.0865582 -0.00445666 0.160344 0.00205566 -0.212169 -0.112548 0.0576866 -0.035995 -0.0608348 -0.0548756 0.107429 0.0577008 -0.0302796 0.172298 -0.0214264 -0.0765663 0.0377022 -0.0485818 0.222134 0.0104924 0.118653 -0.0299189 -0.0977887 0.0159392 -0.0410047 0.00763534 -0.0626999 0.095807 -0.0891056 -0.0536385 -0.0428198 0.0145265 0.0116299 0.0907033 0.0424058 0.0420418 -0.0727838 -0.00678336 -0.0311922 -0.0408972 -0.112782 -0.0288266 0.106211 0.0326564 0.0701932 0.00374769 0.0383351 -0.0602092 -0.111901 0.0421145 -0.0994381 -0.0279215 0.00645505 0.0727876 0.0956823 -0.0381812 0.0889693 0.016988 -0.0253244 0.0920183 -0.0872109 0.0548634 -0.0824285 0.171988 0.0439006 -0.117422 -0.00101916 0.114021 -0.125771 -0.0824085 0.12557 0.0819067 -0.114588 -0.0732947 0.0236632 0.121585 -0.028436 -0.0462984 -0.0221993 0.00388385 -0.101971 0.1481 -0.0455526 -0.0539617 
0.0438831 0.0209934 -0.0617021 0.00153697 0.0634049 0.107605 0.0765928 -0.0561988 -0.172044 0.0634685 0.0334228 0.0908646 0.122054 -0.102391 -0.0937102 0.0601723 -0.111129 0.075804 -0.0402177 0.111079 0.218972 -0.137755 -0.00266095 0.0783559 0.0139293 0.0778514 -0.108036 -0.226729 0.111917 0.170013 -0.095254 0.122341 -0.105572 0.0250757 0.0138425 -0.0439948 -0.141658 0.084316 0.0640445 -0.118502 -0.0211723 -0.125623 0.00410071 0.107146 -0.055133 0.0105945 0.175226 0.00285029 -0.228949 -0.0913984 0.0615722 -0.0183532 -0.0290258 -0.0313766 0.109167 0.0229641 0.00170854 0.141381 -0.0287535 -0.0917371 0.049634 -0.0214462 0.211442 0.00572622 0.116691 -0.0227817 -0.0803126 0.0206862 -0.0439229 -0.00707967 -0.0612628 0.0900802 -0.0901195 -0.0388854 -0.0380572 0.000504141 -0.00139725 0.045998 0.0563749 0.108971 -0.0290599 -0.0163217 -0.0287479 -0.0436756 -0.115304 -0.027776 0.0824654 0.0279223 0.0509195 0.0121894 0.0485546 -0.0495321 -0.0966304 0.0758916 -0.139686 -0.0260591 0.0181513 0.0969928 0.093148 -0.041206 0.102264 0.0308505 -0.0493242 0.104406 -0.0651741 0.0517686 -0.0574724 0.19671 0.0582192 -0.0922019 -0.00871253 0.105535 -0.145192 -0.0776216 0.123788 0.100383 -0.140362 -0.0447101 0.00192521 0.11171 -0.0368788 -0.04054 0.00796289 -0.0189671 -0.0853421 0.149456 -0.0181588 -0.0566652 
0.0313286 0.00173325 -0.0530647 0.00969525 0.0735421 0.114521 0.0894961 -0.0348412 -0.127923 0.0622342 0.0180667 0.0807995 0.112946 -0.13787 -0.0903464 0.0504383 -0.148171 0.10175 -0.0512746 0.0971965 0.241443 -0.149611 -0.00447181 0.0850569 0.0199289 0.0390611 -0.12931 -0.247503 0.0986085 0.168361 -0.0758686 0.121424 -0.0986607 0.0340448 0.0433499 -0.0517799 -0.132629 0.0392885 0.0459033 -0.150565 0.0144913 -0.150518 0.0189729 0.125023 -0.0664304 -0.0222397 0.158694 0.0224871 -0.198984 -0.0866695 0.0479825 -0.0510443 -0.0100584 -0.0349327 0.113731 0.0372473 0.0128487 0.0973073 -0.0270448 -0.108017 0.059287 -0.0206839 0.185126 0.0236236 0.105199 -0.0301863 -0.0874108 -0.0103039 -0.0323175 -0.0066966 -0.0845578 0.0870492 -0.097597 -0.0657394 -0.0559898 -0.000779853 -0.00832083 0.0580979 0.0575401 0.108871 -0.0259334 -0.00835046 -0.0273973 -0.0171849 -0.0957408 -0.000892464 0.0867828 0.0454314 0.052767 0.0296929 0.0667659 -0.0383302 -0.114018 0.0433608 -0.168749 -0.0224373 -0.0205982 0.110237 0.0879264 -0.0361964 0.144972 0.0144397 -0.0279622 0.072135 -0.0248278 0.0306104 -0.0482122 0.197069 0.0458305 -0.0552234 -0.0320727 0.0882065 -0.151192 -0.109975 0.118871 0.10879 -0.111578 -0.0423548 0.00189143 0.114624 -0.0087186 -0.0383849 0.000856703 -0.0108434 -0.104551 0.134084 -0.0142257 -0.0316894 
-0.0315004 0.06445 -0.03598 -0.0286318 0.0143888 0.143344 0.0430429 -0.0715823 -0.109544 0.0456601 0.0166121 0.0629267 0.0734843 -0.150113 -0.0950423 0.026133 -0.236409 0.0346058 -0.00141235 0.0489709 0.19086 -0.13524 -0.0114749 0.0104159 0.0116113 0.105458 -0.0912281 -0.233046 0.102651 0.133932 -0.0548501 0.0665671 -0.0720353 0.00418133 0.0756504 -0.0389611 -0.0995883 0.0603493 0.0914905 -0.111976 0.0289564 -0.187831 0.0102545 0.0995483 -0.0606432 -0.00808736 0.173196 -0.00542246 -0.235621 -0.0960442 -0.0252085 -0.0197609 0.033075 -0.000689165 0.104703 0.0595799 0.0297828 0.0937529 -0.0918506 -0.128609 0.029491 -0.00664559 0.247517 0.0130149 0.139384 0.0425557 -0.0565329 -0.0203768 -0.0287014 0.00200707 -0.0980249 0.0541645 -0.103881 -0.0314002 0.031397 -0.00800577 -0.0498825 0.000422973 0.0611639 0.113819 -0.0415397 -0.0068487 0.000870941 0.0177565 -0.116888 -0.0106906 0.0777074 0.0562442 0.0661768 0.0400008 0.0814388 -0.0566762 -0.0573236 0.063142 -0.164299 -0.0561647 -0.00989846 0.134376 0.112414 -0.0249188 0.120732 0.00543941 -0.0653015 0.0292058 -0.00924899 0.0707256 0.000859123 0.192913 -0.000779008 -0.0547675 -0.00313883 0.0654865 -0.128608 -0.114592 0.113929 0.107415 -0.13757 -0.0150927 0.0487178 0.0893011 0.0345418 -0.0885631 0.018992 -0.0546532 -0.0778912 0.166668 0.0171968 0.00971452 
-0.0500159 0.0898334 -0.0513785 -0.0529978 0.0192825 0.169277 0.0376881 -0.0530376 -0.105681 0.12175 0.0163611 0.00925969 0.0571562 -0.14493 -0.0178639 0.0346576 -0.188322 0.0711607 0.0597058 -0.0397367 0.163427 -0.0872993 -0.0607499 0.00348849 0.0341348 0.117195 -0.0856044 -0.228246 0.142137 0.120942 -0.015571 0.0764595 -0.0719235 -0.0234154 0.118391 -0.0156949 -0.0693745 -0.0295148 0.111416 -0.122182 0.0536723 -0.190261 0.029358 0.134334 -0.0438424 0.0100404 0.165827 0.0263886 -0.242789 -0.190451 -0.0138753 -0.0229106 0.0521823 -0.0491628 0.0691314 0.110245 0.01785 0.0793584 -0.0569147 -0.128288 0.0157219 -0.0153707 0.214266 0.0141985 0.135981 0.0722195 -0.0507365 -0.0268217 0.0122066 0.0102069 -0.100186 0.05545 -0.114856 -0.100215 0.0160529 -0.0215376 -0.0885061 0.0514088 0.0487344 0.052842 -0.0191497 0.0519983 -0.00824745 0.0226828 -0.0906001 -0.00946482 0.0816575 0.0321842 0.0557858 0.0591094 0.0815537 -0.00311632 -0.0953947 0.0319672 -0.144415 -0.0262549 0.00143133 0.13086 0.0840457 -0.0200609 0.130442 0.00774827 -0.0221407 -0.0385632 -0.0385877 0.062014 0.00417696 0.127493 -0.00842488 -0.0146258 0.0148849 0.0214167 -0.121147 -0.174073 0.133595 0.0663815 -0.140455 -0.0717884 0.0433765 0.0337839 0.0947105 -0.132209 0.0372516 -0.0523557 -0.0873714 0.151203 0.0101701 0.0204447 
-0.0379276 0.0823187 -0.0536138 -0.0423126 0.0254625 0.191789 0.0576486 -0.047326 -0.0750234 0.116313 0.023623 0.0165828 0.0522356 -0.136583 -0.0323072 0.00569055 -0.202617 0.120614 0.0325327 -0.0563322 0.18088 -0.0846128 -0.0789083 0.0245305 0.0434534 0.0587595 -0.0963159 -0.206647 0.112165 0.147837 -0.0294307 0.0692821 -0.0763747 -0.00676608 0.121837 -0.0202986 -0.0843372 -0.0899109 0.0874675 -0.137992 0.064434 -0.194762 0.0507185 0.146172 -0.0521736 -0.0276307 0.141875 0.0350205 -0.222802 -0.161239 0.0103636 -0.0286307 0.0410564 -0.04055 0.0778246 0.124102 0.00012165 0.0654145 -0.0551494 -0.125616 0.0232625 -0.00315052 0.20478 0.0155823 0.105944 0.0608149 -0.0608303 -0.0378233 -0.0114166 0.048451 -0.0838455 0.0554653 -0.10637 -0.122517 -0.0141442 -0.00322063 -0.07558 0.0295662 0.0361392 0.0241929 -0.014821 0.0636567 -0.000599135 0.0344564 -0.0968541 0.0212389 0.0802718 0.0170662 0.0683004 0.0980653 0.0789516 -0.0378547 -0.107804 0.00896129 -0.156979 -0.0225151 -0.0392769 0.117476 0.0873976 -0.00709684 0.168402 0.0248396 -0.000132397 -0.0581385 -0.0216302 0.0615108 -0.0128791 0.115188 -0.0507569 0.00224412 0.0166261 0.00234146 -0.113388 -0.176959 0.12116 0.0715226 -0.0934837 -0.05094 0.0583975 0.0413126 0.114205 -0.154343 0.0356307 -0.0537698 -0.0838044 0.147484 0.0310464 0.0323786 
-0.0751733 0.0771331 -0.026859 -0.0564341 -0.00507269 0.176078 0.0379181 -0.0340343 -0.0826547 0.114564 0.00616817 -0.00412635 0.0478904 -0.100726 -0.0180002 -0.0124676 -0.180121 0.108645 0.078591 -0.0663913 0.167466 -0.103854 -0.0802931 0.0335313 0.0340363 0.100226 -0.104021 -0.209705 0.148666 0.109097 0.00889224 0.0603453 -0.0653814 -0.03826 0.115355 0.00149379 -0.0892534 -0.0416179 0.0769601 -0.129885 0.056338 -0.163559 0.0223307 0.139582 -0.0390218 -0.041652 0.150609 0.0118116 -0.224151 -0.199755 -0.0369672 -0.0307666 0.0750743 -0.0533842 0.0675609 0.145156 0.0164855 0.101643 -0.0417739 -0.16106 0.0121382 0.0215586 0.207465 0.0146609 0.113171 0.110179 -0.0257513 -0.0650648 -0.00551612 0.0375131 -0.0931682 0.0406192 -0.102365 -0.0880907 0.00732951 -0.0357393 -0.0936826 0.0261756 0.0592999 -0.00246044 -0.0473434 0.0838837 -0.012388 0.00842914 -0.0614706 -0.0185226 0.0779726 0.0294882 0.0783075 0.0607893 0.0923945 -0.00261867 -0.0631613 -0.00495407 -0.101834 -0.026211 -0.0175301 0.151291 0.0693037 0.0124344 0.12784 0.0156348 -0.00698758 -0.0619028 -0.0496067 0.0896317 0.0101301 0.0622045 -0.0145899 -0.0202657 0.0180293 0.012106 -0.114295 -0.198982 0.131642 0.0659217 -0.0855794 -0.10412 0.0728436 0.0169794 0.101859 -0.163833 0.0168757 -0.0777577 -0.11846 0.161569 0.0188783 0.0471005 
-0.0912857 0.101264 -0.0285949 -0.0609994 -0.00943767 0.18396 0.0227235 -0.0461253 -0.0757115 0.121692 0.00455095 -0.0153979 0.0517327 -0.0888778 -0.0101248 -0.0208151 -0.190354 0.11345 0.0675667 -0.0655922 0.153652 -0.110561 -0.0621744 0.0456247 0.0379983 0.0802141 -0.103399 -0.204206 0.148195 0.107261 0.0222768 0.0472787 -0.0587324 -0.0445246 0.108152 0.0192882 -0.0979868 -0.0386584 0.0526793 -0.11156 0.0502694 -0.162801 0.0130488 0.148285 -0.0502892 -0.0347163 0.1575 0.0226727 -0.222873 -0.185584 -0.0338745 -0.026566 0.07001 -0.0647117 0.0611732 0.153172 0.0147596 0.108193 -0.0196443 -0.171069 -0.00664079 0.0361369 0.206381 0.0118975 0.1085 0.107928 -0.0201565 -0.0607517 -0.0187325 0.0590197 -0.0808142 0.0486299 -0.0909232 -0.0878171 0.0230657 -0.0332126 -0.111796 0.026141 0.0560326 -0.00705881 -0.0456773 0.0872469 -0.0196677 0.0127364 -0.0708215 -0.0113226 0.0693461 0.0215273 0.076211 0.0636537 0.0826001 -0.00949283 -0.0475025 -0.021826 -0.0959599 -0.0351078 -0.0304197 0.162545 0.0694729 0.00887655 0.124302 0.02004 -0.00137817 -0.066421 -0.0641098 0.0954538 -0.00619352 0.056002 -0.0090038 -0.0180666 0.0267802 0.0258603 -0.104396 -0.192343 0.110379 0.0691472 -0.0905143 -0.103271 0.0758364 0.0275667 0.10879 -0.171133 0.000181099 -0.0740724 -0.130113 0.165892 0.00927151 0.0571458 
-0.0696368 0.0917422 -0.0676095 -0.0780394 0.0171876 0.191978 0.0212656 -0.0404428 -0.0918441 0.0944516 -0.00563744 -0.0115369 0.0647535 -0.0672927 -0.029988 0.00301684 -0.164828 0.115929 0.0611337 -0.0696745 0.177154 -0.0937347 -0.0756712 0.0346312 0.0404111 0.0683326 -0.094222 -0.194442 0.13185 0.133658 0.00943462 0.0596188 -0.0709356 -0.0371036 0.0945464 0.0193199 -0.0956328 -0.0772344 0.0680905 -0.109873 0.041928 -0.141272 0.0578769 0.159433 -0.0254608 -0.0242832 0.172174 0.0190024 -0.237988 -0.184242 -0.0322768 -0.0635672 0.0665303 -0.0544512 0.0535847 0.15219 0.000344984 0.127471 -0.0113358 -0.169251 0.0140374 0.0533829 0.209022 0.00636691 0.0866319 0.0976065 -0.0377762 -0.0370486 -0.00749021 0.037727 -0.0681505 0.0453471 -0.0969788 -0.122803 0.00135471 -0.00770893 -0.0966747 0.0182132 0.0339187 -0.0208651 -0.0272442 0.102842 -0.0257224 0.0106778 -0.0950588 0.025386 0.0642027 -0.00550045 0.0640751 0.0647685 0.0844375 -0.0277439 -0.0860464 -0.0180117 -0.0807763 0.00841055 -0.0364326 0.169367 0.0489453 0.0186738 0.115938 0.0104991 0.00674708 -0.0435785 -0.0961971 0.0953271 -0.0458081 0.0703733 -0.0607142 -0.0230306 0.036869 -0.00258644 -0.116255 -0.184292 0.0991498 0.0714497 -0.0971918 -0.101497 0.0691931 0.0184397 0.106408 -0.160007 0.0230574 -0.0707961 -0.139858 0.145445 -0.0147642 0.0340028 
-0.0580054 0.0737135 -0.0646063 -0.0919175 0.00273779 0.199659 0.0262554 -0.0460558 -0.0709341 0.0775971 0.00310927 -0.00693109 0.0810691 -0.0274978 -0.0423493 -0.0397591 -0.166663 0.102013 0.0508952 -0.0793421 0.178862 -0.0878941 -0.102956 0.07291 0.040525 0.0561168 -0.0873659 -0.163929 0.120803 0.14991 0.0124384 0.0232504 -0.0894994 -0.0384714 0.0803057 0.0247742 -0.11718 -0.0880582 0.0683689 -0.0938108 0.0279044 -0.126883 0.0313181 0.151196 -0.00642185 -0.0570122 0.13505 0.0370094 -0.202282 -0.178757 -0.0390441 -0.0465795 0.0853178 -0.0521559 0.0564983 0.156994 -0.0217934 0.171981 -0.0221486 -0.178583 0.0145478 0.0741414 0.222583 0.0180503 0.0393252 0.115602 -0.00943877 -0.0239605 -0.0163543 0.0218492 -0.0530143 0.0375571 -0.091058 -0.127178 0.00409971 0.00353846 -0.0915271 -0.0236186 0.0527176 0.00770327 -0.0128879 0.092865 -0.00263523 0.00373687 -0.0917276 0.0134363 0.0764713 -0.0130276 0.0767571 0.0608311 0.0779464 -0.0482443 -0.0390754 0.00432846 -0.0998887 -0.0167966 -0.0528394 0.129867 0.0633832 0.0190466 0.139641 0.0307251 -0.00217691 -0.0461603 -0.114073 0.108456 -0.0583359 0.0435928 -0.0834465 -0.0206133 0.0764584 -0.00503855 -0.121741 -0.163444 0.0775561 0.108128 -0.10175 -0.0639363 0.0571713 0.0150981 0.0917608 -0.190466 0.00148752 -0.0896837 -0.159488 0.168388 -0.0381375 0.0402592 
-0.00148159 0.0225448 -0.0745285 -0.0943199 0.0402987 0.188317 0.0245569 -0.00898979 -0.150922 0.0219344 -0.00804027 0.0459197 0.101258 -0.0798078 -0.0627974 -0.0372643 -0.173087 0.0799777 0.0436029 0.00190912 0.209709 -0.0622868 -0.0574419 0.102244 0.0221255 0.0482218 -0.0583134 -0.212713 0.0771591 0.160228 -0.0398127 -0.0309276 -0.107654 -0.0175409 0.0678666 -0.0118785 -0.122691 -0.0907951 0.0561653 -0.0676037 0.0285108 -0.115852 0.0364047 0.189683 -0.0601038 -0.0223055 0.185832 0.0174333 -0.207689 -0.0943234 0.00271418 -0.0906684 0.0443729 -0.0161726 0.082022 0.0914452 -0.0015482 0.166855 -0.0116837 -0.156771 0.0486929 0.0662465 0.211953 0.0307074 0.0428854 -0.0192248 -0.0155015 -0.0241036 0.0109235 -0.0258975 -0.0481925 0.0609243 -0.0828366 -0.137787 -0.00276791 0.0305884 -0.0974068 0.00963063 0.0721933 0.10552 -0.00417991 0.0484084 0.0125087 0.0251259 -0.110035 0.0386686 0.102344 -0.00719791 0.0448661 0.0283841 0.0663274 -0.046183 -0.0819121 0.0162106 -0.153955 -0.0383268 -0.0327319 0.144113 0.0467656 -0.0203514 0.107633 0.0504825 0.00929685 0.00670452 -0.119141 0.0690755 -0.086387 0.136454 -0.111484 -0.0206371 0.0893417 -0.00625814 -0.129976 -0.141509 0.021746 0.14824 -0.11334 -0.0634027 -0.00582927 0.0472919 0.0322854 -0.145573 -0.00866593 -0.0838371 -0.158677 0.141011 -0.0625867 0.0258653 
-0.0231874 0.0189398 -0.0733149 -0.102057 0.0232863 0.147982 0.0122009 0.00123608 -0.142148 0.0309314 -0.00109446 0.0577441 0.112791 -0.085892 -0.104142 -0.0270477 -0.185992 0.0709653 0.0117563 0.0312604 0.211306 -0.0926804 -0.0585457 0.102482 -0.00122666 0.0771537 -0.0327987 -0.206224 0.0744889 0.144967 -0.0647528 -0.0338076 -0.0927869 -0.0107362 0.0398706 -0.0181896 -0.130504 -0.040856 0.0286815 -0.0633892 0.0220177 -0.129153 0.0282413 0.200719 -0.0457039 -0.0239157 0.190546 0.0144046 -0.216896 -0.0953431 -0.00189179 -0.0996566 0.0143699 -0.0101807 0.0976833 0.0871371 -0.0157173 0.153252 -0.00688563 -0.170302 0.0634984 0.035228 0.216262 0.0709195 0.0446973 -0.0372282 -0.0281169 -0.00808616 0.0331033 -0.0366238 -0.0561039 0.041573 -0.0683964 -0.130051 0.00871974 0.0285143 -0.0944245 0.0456409 0.0687153 0.0916459 -0.0194263 0.0388134 0.00432877 0.0182441 -0.136063 0.0360156 0.118438 0.01946 0.0690285 0.0167054 0.0451095 -0.0569221 -0.0729065 0.0124212 -0.15978 -0.0313149 -0.0321546 0.127592 0.0641757 -0.0358612 0.0988686 0.0382614 -0.0010416 0.0226552 -0.101375 0.0557161 -0.105644 0.158561 -0.110681 -0.0510399 0.0757434 0.0229821 -0.140225 -0.123662 0.0206577 0.142255 -0.126891 -0.07224 -0.00877931 0.0390364 0.00809179 -0.112552 -0.0121775 -0.0727868 -0.157844 0.139379 -0.0823153 0.0132345 
-0.0171575 -0.00130843 -0.0955537 -0.0801055 0.0209689 0.135558 0.0263922 -0.00174772 -0.123873 0.0196168 0.00738558 0.0729648 0.103946 -0.0925966 -0.130366 -0.0462415 -0.182922 0.0748889 0.0105048 0.0475221 0.203758 -0.11165 -0.0573996 0.122267 -0.00332182 0.0747574 -0.0247135 -0.218111 0.0660446 0.139774 -0.066718 -0.033337 -0.0970939 -0.0162457 0.0282711 -0.0184916 -0.144717 -0.0352573 0.00435314 -0.0689867 0.0310297 -0.124481 -0.00104514 0.21896 -0.0607108 -0.0309165 0.181748 0.0158589 -0.195315 -0.0923351 -0.0113285 -0.0913167 0.0151807 -0.0207555 0.102625 0.0851105 -0.0227383 0.163676 -0.00120653 -0.163736 0.0658796 0.0284376 0.234329 0.0762388 0.0391263 -0.0568529 -0.0194788 -0.0198057 0.0454166 -0.0253195 -0.0622102 0.0430357 -0.0586419 -0.111286 -0.00420881 0.0174994 -0.0894052 0.0629 0.0568457 0.087089 -0.0402077 0.0431406 -0.00856548 -0.00441321 -0.127322 0.0328238 0.122519 0.0223501 0.0650176 -0.00387249 0.0547615 -0.0532244 -0.0664826 -0.00898116 -0.144836 -0.0446259 -0.0278688 0.104521 0.0796963 -0.0436944 0.0961904 0.03627 0.00735193 0.0212418 -0.100772 0.0488092 -0.0981875 0.158539 -0.112314 -0.0432115 0.0823735 0.0383618 -0.130163 -0.129617 0.0167188 0.137809 -0.118327 -0.0874848 0.00574025 0.0384049 -0.00747221 -0.101204 -0.0269237 -0.06096 -0.165959 0.138314 -0.0937726 0.0128283 
-0.0269743 -0.0124971 -0.0710667 -0.0805506 0.0222857 0.143713 0.0407741 0.0181584 -0.119167 0.0419756 0.000411057 0.0610789 0.107103 -0.111617 -0.103586 -0.0424724 -0.210774 0.0870169 -0.00252298 0.0378233 0.207074 -0.125515 -0.0557609 0.0974624 -0.00758609 0.0627483 -0.0553 -0.231982 0.049176 0.124764 -0.0598267 -0.0184726 -0.0971695 0.000233484 0.0388967 -0.0151869 -0.137499 -0.0474668 0.00723283 -0.0854201 0.0533771 -0.153155 0.0106933 0.205482 -0.0683147 -0.0462546 0.169452 0.021429 -0.19609 -0.0910793 -0.0162866 -0.116776 0.00477797 -0.0102994 0.105446 0.0880658 -0.0200155 0.129721 -0.0086887 -0.155823 0.0691849 0.0278705 0.203655 0.0783596 0.053814 -0.0410098 -0.035143 -0.0170377 0.0418894 -0.0236638 -0.0667278 0.0515811 -0.0619322 -0.118028 -0.00895279 0.0195197 -0.091362 0.0607009 0.0654715 0.077141 -0.0432568 0.0261766 -0.00689 0.0142799 -0.142035 0.0513134 0.13488 0.0360751 0.0743115 0.0126849 0.0625994 -0.0531706 -0.0705047 -0.0198344 -0.176337 -0.0327376 -0.045083 0.109926 0.071235 -0.0290666 0.110449 0.0260651 0.00671851 0.00103779 -0.0555534 0.0437855 -0.0983737 0.16728 -0.110214 -0.0333592 0.0474592 0.029582 -0.133389 -0.148656 0.0332335 0.133513 -0.0973932 -0.0798547 0.00669988 0.0447393 0.0195935 -0.10941 -0.0161734 -0.0450052 -0.156628 0.128226 -0.0771127 0.0264119 
-8.6921e-06 0.0367282 -0.0960144 -0.0702466 0.0275632 0.17469 0.0470584 -0.0020973 -0.14618 0.0653693 0.0173379 0.0391765 0.110691 -0.114417 -0.105527 -0.0188699 -0.16556 0.122646 0.00436551 0.0355809 0.204643 -0.112453 -0.0551513 0.124784 -0.00573227 0.0306825 -0.0627644 -0.215785 0.0938944 0.152369 -0.0714543 -0.00370853 -0.112038 -0.00174916 0.0483562 -0.0238824 -0.13044 -0.0780323 0.0188245 -0.0883553 0.016178 -0.149673 0.0285259 0.199475 -0.0592172 -0.0380563 0.187445 0.0440692 -0.229244 -0.0798299 0.0149689 -0.0907474 0.00220567 -0.0264041 0.0747849 0.0942427 -0.00493612 0.135933 0.017584 -0.15148 0.0600826 0.0578387 0.220078 0.0341747 0.0406274 -0.035426 -0.0406354 -0.0519877 -0.00320421 -0.0133767 -0.0806541 0.0473527 -0.0720581 -0.103378 -0.0247782 0.00114091 -0.0576423 0.0716076 0.0658337 0.0526977 -0.0188433 0.0317601 -0.0289265 0.00252895 -0.114679 0.0640038 0.0817132 -0.0081791 0.0717419 0.0420311 0.0741438 -0.0520146 -0.0910866 -0.0100053 -0.137557 -0.0236857 -0.0413253 0.136469 0.0585833 -0.0227137 0.130923 0.0469022 0.0082125 0.0207614 -0.0762637 0.0602711 -0.0781766 0.149945 -0.0942452 -0.0235887 0.0564236 0.032522 -0.0976234 -0.13974 0.0232431 0.120786 -0.0882058 -0.0659939 0.0106257 0.0444671 0.0100531 -0.140127 -0.00545037 -0.0506261 -0.171146 0.13566 -0.0809537 -0.00143108 
-0.00618661 0.052719 -0.106564 -0.0815234 0.00234822 0.205802 0.029413 -0.055091 -0.137577 0.0845942 0.0112347 0.0289579 0.11547 -0.0700804 -0.089161 -0.0511202 -0.159469 0.116882 0.0500611 -0.00981735 0.171853 -0.0871174 -0.0826288 0.0971121 -0.00595827 0.0628372 -0.0831538 -0.203898 0.0804235 0.17522 -0.0479466 0.0185302 -0.124864 -0.0294127 0.0763817 0.00300498 -0.125011 -0.087085 0.0782958 -0.0729342 -0.00289085 -0.145964 -0.00235869 0.154622 -0.0421199 -0.0365655 0.157121 0.059422 -0.207912 -0.109738 0.0143468 -0.0359792 0.0568122 -0.0237212 0.0571135 0.106883 0.0165773 0.144969 -0.00586746 -0.147449 0.050173 0.0848765 0.231111 0.00755252 0.0283342 0.00324935 0.00159427 -0.0217722 -0.0104502 -0.00931425 -0.0578712 0.0444313 -0.0887336 -0.102426 -0.026605 0.00808538 -0.0805141 -0.000553323 0.0735873 0.0721978 -0.0114507 0.0496696 -0.00857165 0.0133537 -0.109246 0.0276053 0.08243 -0.0329674 0.0840656 0.0347357 0.054473 -0.0412011 -0.0211592 0.0263739 -0.14929 -0.0513888 -0.0263584 0.125389 0.0618216 -0.0125042 0.159858 0.0835561 -0.0149696 0.00457955 -0.0800598 0.0748433 -0.0597481 0.098311 -0.111561 0.0245463 0.0772147 -0.00508098 -0.103119 -0.149053 0.0138683 0.135388 -0.102197 -0.0550488 0.0121211 0.0237072 0.0362584 -0.195381 0.00578541 -0.0928962 -0.162911 0.159397 -0.0738511 0.0248794 
-0.00353836 0.0234848 -0.0735904 -0.0803286 0.00702378 0.184392 0.0388934 -0.00893067 -0.11694 0.0529156 0.0181558 0.021577 0.125295 -0.085918 -0.0805858 -0.0317427 -0.186504 0.0946015 0.000269842 0.00970946 0.211241 -0.0962168 -0.0642609 0.140472 -0.00202425 0.02485 -0.0653697 -0.210524 0.0743856 0.160675 -0.0546964 -0.0238098 -0.108696 0.00690485 0.0523586 -0.00991665 -0.119852 -0.0754335 0.0297207 -0.0702124 0.0127001 -0.15189 0.0181574 0.165246 -0.0344592 -0.0588192 0.157799 0.0523521 -0.195417 -0.08309 0.0068187 -0.0947859 0.0405214 -0.0091398 0.0863687 0.105076 0.0016144 0.136622 0.00564973 -0.165722 0.0501001 0.0671835 0.203042 0.0332219 0.0156385 0.00106943 -0.0144239 -0.0280754 0.00205929 -0.0336573 -0.0763712 0.0408286 -0.0860147 -0.121671 0.00488126 0.0166725 -0.0701262 0.0274716 0.078153 0.0915654 0.00548814 0.0224536 -0.00566535 0.00841869 -0.120505 0.0692931 0.0936549 -0.0125745 0.0634169 0.0465011 0.0684338 -0.0635245 -0.0494369 0.00946027 -0.179148 -0.0260909 -0.0650386 0.122348 0.0803407 -0.0168243 0.161313 0.0473787 -0.00190588 0.00747123 -0.0721233 0.057731 -0.0868475 0.121249 -0.116773 -0.0162075 0.0618797 0.0231816 -0.103577 -0.148694 0.0170964 0.164812 -0.101167 -0.0337368 -0.0175991 0.0437729 0.027436 -0.162599 -0.00699452 -0.0612446 -0.177712 0.159589 -0.0860109 0.0224162 
-0.0272084 0.0048466 -0.0635733 -0.0694749 0.0206078 0.162705 0.0529915 -0.0159591 -0.101335 0.0628249 0.00433183 0.039858 0.108203 -0.095363 -0.0863379 -0.0421813 -0.200797 0.100647 0.00648813 -0.0021689 0.20535 -0.10113 -0.0850826 0.128545 0.00514264 0.0448196 -0.0825837 -0.213292 0.0765508 0.155036 -0.0436942 -0.0158941 -0.121927 -0.013764 0.0665663 -0.0116586 -0.137387 -0.0905322 0.0330475 -0.0810823 0.0408438 -0.143592 0.00930894 0.180186 -0.0376101 -0.0607234 0.143809 0.0502553 -0.164416 -0.11535 -0.00262828 -0.0897638 0.0388369 -0.0303601 0.0936541 0.107095 -0.00940792 0.139583 -0.00415896 -0.146671 0.0621863 0.0518557 0.195286 0.068019 0.0272489 -0.0148393 -0.0151802 -0.0337139 0.0252595 -0.0328865 -0.0670493 0.0574401 -0.0704166 -0.123562 -0.0163592 0.0212702 -0.0873338 0.0404026 0.074038 0.0846839 -0.00115248 0.035324 0.00326338 0.0258481 -0.120069 0.0435502 0.11978 0.0118958 0.0608822 0.0226522 0.0584248 -0.0349751 -0.0451585 -0.00488722 -0.188294 -0.0371464 -0.0561693 0.0995003 0.0827444 -0.0152462 0.158152 0.0429755 0.00544191 -0.0129647 -0.0592915 0.0458964 -0.0759343 0.125303 -0.103158 0.00962127 0.0624066 0.00814414 -0.122979 -0.156594 0.0232381 0.159966 -0.0975801 -0.0394101 -0.0193583 0.0313161 0.0267324 -0.147677 -0.0229755 -0.0705397 -0.189311 0.161396 -0.0955081 0.0328783 
-0.0418306 0.0435488 -0.0726294 -0.0645911 0.0117764 0.16565 0.0313559 -0.0377396 -0.108333 0.0749178 0.00825741 0.0119083 0.100621 -0.0711338 -0.0719996 -0.0205015 -0.183511 0.0768579 0.038189 -0.00463849 0.196725 -0.131216 -0.0679217 0.117498 0.0359959 0.0547366 -0.078367 -0.206171 0.112148 0.147114 -0.0179338 -0.008442 -0.106425 -0.031678 0.0563262 0.00750497 -0.140492 -0.0643958 0.0408085 -0.0903846 0.020742 -0.144158 0.0133459 0.169496 -0.0214232 -0.0425446 0.16212 0.0457956 -0.192499 -0.144509 -0.0226054 -0.068788 0.0570012 -0.0535555 0.086917 0.118118 -0.0104195 0.163589 0.00579683 -0.166886 0.0397102 0.060295 0.218424 0.0443497 0.0487312 0.0500344 -0.0222358 -0.0332833 0.0103101 -0.0186357 -0.07682 0.0660839 -0.0856315 -0.114863 0.0146199 0.00378858 -0.0738055 0.0397813 0.0719104 0.0746132 -0.0153739 0.037096 -0.0132131 0.00243619 -0.110143 0.0274253 0.0843383 0.00988371 0.0674062 0.0212949 0.0669642 -0.0246169 -0.0432496 0.00269716 -0.145517 -0.0340297 -0.0414931 0.126061 0.084993 -0.0166865 0.140572 0.0262712 0.00102682 -0.0240315 -0.0936004 0.0869467 -0.0623195 0.109308 -0.0628882 -0.0210365 0.0642479 0.0305213 -0.112446 -0.15858 0.0533712 0.141971 -0.11581 -0.0448225 0.00765854 0.039006 0.026766 -0.15486 -0.0182368 -0.073387 -0.191762 0.18168 -0.0806392 0.0310611 
-0.0595824 0.0839342 -0.0950839 -0.0667842 0.030973 0.149515 0.00784061 -0.0689267 -0.109124 0.114049 0.0169268 0.00355946 0.0885575 -0.0723178 -0.0485784 0.0210538 -0.147043 0.0791866 0.076602 -0.00501508 0.174017 -0.12001 -0.0533355 0.0766154 0.04281 0.0921166 -0.065799 -0.215128 0.154566 0.151013 -0.00297385 0.019902 -0.0683995 -0.0566423 0.0787329 0.028987 -0.1044 -0.0412641 0.0681544 -0.0999913 0.00792126 -0.141298 0.0180346 0.171467 -0.0312785 0.0165512 0.190032 0.0498974 -0.211945 -0.19002 -0.0278653 -0.0332505 0.0522396 -0.0790414 0.078697 0.123165 -0.00076223 0.144879 -0.00706813 -0.145013 0.0177136 0.0225867 0.230373 0.0254001 0.0969573 0.0431328 -0.0420684 -0.016984 0.0216549 0.00261904 -0.0725541 0.0671953 -0.10839 -0.12821 0.0240813 -0.00176847 -0.0866378 0.0918286 0.056109 0.0400152 -0.024305 0.0698504 -0.0316579 0.0153543 -0.0975129 0.00907991 0.0626334 0.0183443 0.0601685 0.0235595 0.060462 0.00269875 -0.0664567 0.0130745 -0.104494 -0.0423696 -0.0202058 0.143697 0.0780465 -0.0305962 0.120098 0.0160299 -0.00143977 -0.039808 -0.102307 0.0952213 -0.0398743 0.0927581 -0.00604964 -0.016948 0.0454085 0.0207619 -0.109657 -0.156089 0.0757516 0.108462 -0.140078 -0.0882826 0.011399 0.0392311 0.0450007 -0.135717 -0.00920836 -0.0570864 -0.174638 0.180629 -0.0589161 0.0291465 
-0.046722 0.0886688 -0.088104 -0.0620847 0.0145693 0.16697 0.0298525 -0.0763123 -0.0954927 0.101765 0.013566 0.00547666 0.0862676 -0.0761864 -0.052465 -0.00208455 -0.168937 0.0826551 0.0569598 -0.0217288 0.168371 -0.0995695 -0.0688879 0.0866275 0.0281285 0.0788169 -0.0782155 -0.215726 0.141078 0.167839 -0.0149692 0.0374491 -0.0806058 -0.0460746 0.0806845 0.0186434 -0.104696 -0.0469166 0.0565709 -0.0891145 0.015794 -0.149897 0.0103528 0.169043 -0.035631 0.0145281 0.179537 0.045652 -0.213954 -0.178538 -0.0156603 -0.0238032 0.0654011 -0.0672314 0.084582 0.129424 0.00316998 0.147034 -0.0044042 -0.145333 0.0143205 0.0367417 0.228226 0.0225715 0.079873 0.0426689 -0.0200753 -0.0294127 0.00960016 0.0146974 -0.0728689 0.05498 -0.100713 -0.111442 0.0206221 0.00303027 -0.0927255 0.0593593 0.0503448 0.0415269 -0.00613031 0.073726 -0.0336407 0.00740364 -0.0916011 0.0140353 0.0666303 -0.00794628 0.049306 0.046501 0.0687463 -0.0176032 -0.0616441 0.00183154 -0.122513 -0.0323978 -0.0223942 0.130961 0.103437 -0.0200266 0.139387 0.0322895 0.00449424 -0.0304112 -0.110968 0.0800925 -0.0489564 0.0951099 -0.0347648 -0.00536865 0.0648996 0.0258508 -0.115548 -0.17313 0.0656547 0.117563 -0.12946 -0.0870639 0.0200616 0.034242 0.063018 -0.148696 -0.00012054 -0.0608096 -0.165532 0.179498 -0.0556569 0.0274782 
-0.0588017 0.134867 -0.0725361 -0.0375657 0.0151817 0.19568 0.0179725 -0.11678 -0.0632418 0.0810391 0.0141958 -0.0234515 0.0621942 -0.078788 -0.041517 0.0100049 -0.153776 0.0722374 0.0498095 -0.0458836 0.155451 -0.0927224 -0.1004 0.0552818 0.0494535 0.0557082 -0.134527 -0.177778 0.143442 0.160996 0.0374062 0.0671245 -0.0869447 -0.0481392 0.113616 0.0524021 -0.085026 -0.0856205 0.0900695 -0.108343 0.0209462 -0.144143 0.0398196 0.110598 0.01838 0.0152812 0.168365 0.0619186 -0.218249 -0.186237 -0.0518609 -0.00154727 0.0987625 -0.0819759 0.0620607 0.133493 -0.0270071 0.126244 -0.0317988 -0.142702 -0.0138118 0.084474 0.220089 -0.0269043 0.0750294 0.108863 -0.00898486 -0.042547 -0.0403138 0.00613935 -0.056424 0.0401428 -0.103922 -0.102303 0.0280881 0.00328796 -0.0785307 0.0108214 0.046322 0.0394316 0.0155971 0.0871317 -0.0348713 0.0141456 -0.0846953 0.0316058 0.0243862 -0.0238688 0.0353124 0.0780284 0.0893627 -0.0141662 -0.0450689 0.0320011 -0.101839 -0.0175146 -0.0223975 0.125504 0.0615278 7.75996e-05 0.145083 0.0254172 -0.0217769 -0.0588819 -0.105864 0.13214 -0.00185697 0.0693135 -0.0293156 0.0324065 0.0552604 -0.0144981 -0.111973 -0.161047 0.0766666 0.0936611 -0.13924 -0.0413697 0.0403951 0.0315363 0.0764547 -0.168885 0.023019 -0.0669909 -0.145542 0.188255 -0.0219785 0.0133461 
-0.066439 0.125764 -0.0747862 -0.0677918 0.00607166 0.197688 0.00971346 -0.0793924 -0.0789319 0.0993014 0.0129447 -0.0214775 0.0734309 -0.0911374 -0.042983 0.00953025 -0.169033 0.0787157 0.0506899 -0.0513474 0.16305 -0.0929317 -0.0780266 0.0683339 0.0357779 0.068373 -0.0957511 -0.194645 0.154825 0.143932 0.0271918 0.0427836 -0.0840385 -0.0412941 0.0918747 0.0371083 -0.0929031 -0.0736438 0.0815398 -0.0803173 0.0237428 -0.159344 0.0222725 0.140141 -0.00443306 -0.00419928 0.174414 0.0568001 -0.225418 -0.181884 -0.0355973 -0.00837219 0.0758262 -0.0729483 0.0502232 0.13862 0.00293249 0.132781 -0.0204552 -0.154051 -0.00978197 0.065355 0.227424 -0.0056787 0.072149 0.0811819 -0.0124588 -0.0381394 -0.0169701 0.0224577 -0.0768901 0.0456594 -0.111033 -0.100491 0.0373255 -0.0106155 -0.0912765 0.0439833 0.0449381 0.0366306 -0.00147731 0.0817872 -0.021342 0.0195467 -0.0939118 0.0345013 0.0473831 -0.0117793 0.0449294 0.0604541 0.0795537 -0.0179985 -0.054956 0.0186451 -0.101364 -0.021855 -0.0311265 0.14182 0.0648078 -0.00315255 0.137114 0.0203936 -0.0201644 -0.0327464 -0.0893867 0.108359 -0.0278902 0.0785776 -0.0342152 0.0017252 0.0488781 0.0104877 -0.107432 -0.163671 0.077072 0.101326 -0.13112 -0.0641353 0.0481711 0.0375917 0.0851972 -0.169935 0.0128237 -0.0697974 -0.161331 0.178569 -0.0445881 0.030079 
-0.0575801 0.159531 -0.0519423 -0.00681744 0.0345071 0.23272 0.0143749 -0.173126 -7.12269e-05 0.0813073 0.00702455 -0.0240855 0.0256781 -0.0676221 -0.00995274 -0.00901369 -0.128082 0.13551 0.0214822 -0.106849 0.12211 -0.0386781 -0.102422 0.0994881 0.0851494 -0.0208844 -0.145651 -0.134279 0.0998096 0.179786 0.08918 0.0758283 -0.0956005 -0.0296525 0.142452 0.0640399 -0.0803322 -0.164302 0.0911599 -0.0896155 0.0287428 -0.125608 0.0506111 0.0834699 0.0226968 -0.0172064 0.120037 0.0908176 -0.163884 -0.159349 0.0141358 0.0142346 0.12089 -0.111365 0.0275483 0.156528 -0.0398506 0.128327 -0.022671 -0.109733 -0.04549 0.110185 0.176627 -0.0774176 0.0570119 0.094421 -0.00365338 -0.0545681 -0.116924 0.0818704 -0.0217147 0.0581439 -0.0984472 -0.111961 -0.0147544 0.0138132 -0.0770112 -0.0305256 0.0158189 0.0119664 0.0413799 0.127493 -0.0185022 0.0301466 -0.0788213 0.0218104 -0.000907484 -0.0683903 -0.00304644 0.11482 0.055337 -0.0303214 -0.0165427 0.0203178 -0.0771426 0.00545222 -0.0622337 0.0903929 0.0466137 0.0215157 0.174303 0.0391186 -0.024968 -0.0625926 -0.0786514 0.107944 -0.00707809 -0.0119693 -0.0521144 0.0926609 0.0634597 -0.0318042 -0.0688884 -0.135691 0.0476466 0.0753566 -0.119119 0.00337006 0.0422491 0.0451486 0.129642 -0.18088 0.00547971 -0.0796178 -0.12365 0.182548 -0.0186124 0.00384072 
-0.0178778 0.109546 -0.039465 -0.0366799 0.0269553 0.27505 0.0384371 -0.0858038 -0.0832229 0.043445 -0.0127754 -0.00146106 0.0589294 -0.0753311 -0.0185736 -0.0374696 -0.128203 0.142805 0.0324105 -0.10236 0.166407 -0.03624 -0.0730456 0.127808 0.0595312 -0.0297047 -0.127086 -0.169563 0.0850368 0.157474 0.0505027 0.0428781 -0.12384 0.00334555 0.106666 0.0114411 -0.0802024 -0.165099 0.0886323 -0.0626695 0.0608592 -0.130801 0.0663778 0.0953677 -0.0374236 -0.0798408 0.144863 0.0412881 -0.187553 -0.110359 0.0480296 -0.0457157 0.0999857 -0.0385852 0.0313659 0.145557 0.0304261 0.149167 0.00170401 -0.140589 -0.0174914 0.132341 0.167109 -0.0973962 0.0451895 0.067951 0.00643756 -0.078186 -0.105409 0.0739229 -0.0581797 0.0642693 -0.109675 -0.0888796 -0.00691774 0.0192881 -0.0717171 -0.0277987 0.0407898 0.0301269 -0.00245692 0.099436 0.0392374 0.0326335 -0.0780142 0.0456572 0.0502459 -0.0669975 -0.00792057 0.080309 0.0641597 -0.0607539 -0.0268078 -0.00512246 -0.103669 -0.00516613 -0.0481229 0.155433 0.0201554 0.0416866 0.153727 0.063905 -0.00982043 0.0268142 -0.0623069 0.0755932 -0.0426146 0.039274 -0.119024 0.0333256 0.0460825 -0.0286119 -0.0707813 -0.149398 0.032932 0.0972117 -0.0847692 -0.0238693 0.032745 0.0642453 0.12106 -0.200606 -0.0066324 -0.109157 -0.143191 0.159176 -0.0436289 0.0346739 
-0.0235183 0.121285 -0.0350189 -0.0276406 0.0306664 0.268484 0.0373487 -0.0672192 -0.0435328 0.015566 0.00912042 0.0100678 0.069221 -0.0971054 -0.0200928 -0.0234677 -0.166512 0.0894474 -0.00796173 -0.0558826 0.189552 -0.0605991 -0.0417154 0.147994 0.0699891 -0.0801087 -0.11129 -0.178316 0.0789028 0.167681 0.0535301 -0.021831 -0.0843147 0.0184308 0.0809056 0.0200437 -0.0741221 -0.143583 0.0450247 -0.045147 0.0569749 -0.144685 0.06936 0.0928854 -0.0472545 -0.0819537 0.152067 0.0258111 -0.170688 -0.0604677 0.0293944 -0.0611675 0.0759938 -0.0253493 0.0589462 0.140314 -0.00839974 0.140629 -0.0217125 -0.136577 -0.0493829 0.100312 0.179645 -0.115428 0.0559661 0.0510523 -0.00604326 -0.0727338 -0.123599 0.0480836 -0.0470454 0.077219 -0.121582 -0.111474 0.0487571 0.0593531 -0.0587236 -0.0119199 0.0411588 0.0817846 -0.00549772 0.0485412 0.0504477 0.0606445 -0.0935417 0.0925447 0.046153 -0.0487984 -0.0135006 0.0866068 0.0508264 -0.114381 -0.0403483 0.0113916 -0.127558 -0.0340462 -0.082276 0.134573 0.0391166 0.0344112 0.144528 0.0316302 -0.0179387 0.0130388 -0.074283 0.0980328 -0.050948 0.0702616 -0.122348 0.00578624 0.030202 -0.0199228 -0.0638376 -0.127038 0.0264096 0.135168 -0.103627 0.0325459 0.0150647 0.121984 0.100057 -0.185362 -0.0300822 -0.0709545 -0.124244 0.182705 -0.0326886 0.0433821 
-0.00729829 0.0754091 -0.0315054 0.0331122 0.0594404 0.215338 0.0640692 -0.0546142 -0.0415716 0.0733785 0.0240276 -0.00324533 0.0991382 -0.102063 0.0423124 -0.00285821 -0.112045 0.1006 -0.00376644 -0.00398123 0.190289 -0.10406 -0.0373492 0.198524 0.102756 -0.120438 -0.156876 -0.217117 0.070215 0.177852 0.0658333 0.0186236 -0.0790582 0.033526 0.074657 0.0325224 -0.0578578 -0.147466 0.0227586 -0.0865289 0.0770378 -0.15589 0.0685202 0.0753073 -0.0554072 -0.0695829 0.141636 0.058598 -0.105415 -0.0910244 0.0518063 -0.084774 0.075393 -0.0584394 0.0903391 0.127789 -0.0174067 0.0809911 0.0355461 -0.108571 -0.0468187 0.0645956 0.0807181 -0.118757 0.0539612 0.0407993 -0.0113178 -0.0769999 -0.102591 -0.0147752 -0.0559537 0.116159 -0.12795 -0.143682 0.0416976 0.0671274 -0.0395451 0.0681387 0.0612789 0.123602 -0.00139552 0.0172491 0.0263858 0.0562966 -0.0618316 0.116606 0.0530232 -0.0338471 -0.027366 0.0557137 0.031347 -0.0564538 -0.0374727 -0.00445408 -0.188186 -0.0476727 -0.0966699 0.107028 0.051626 -0.00643824 0.17301 0.0198871 0.0233619 0.00242063 -0.0534807 0.0729244 -0.0422011 0.0794821 -0.0559538 0.0516439 -0.0234502 -0.012074 -0.0741658 -0.158902 0.0176981 0.137692 -0.100324 0.0195188 -0.0611222 0.135462 0.0728405 -0.148299 -0.057097 -0.00505184 -0.146975 0.178345 -0.0573444 0.0423424 
-0.0126595 0.0937329 0.00732013 0.0377613 0.0712358 0.232828 0.0641904 -0.0515282 -0.0434224 0.0590688 0.0149677 0.0123904 0.0760713 -0.120773 0.055099 0.0067942 -0.120845 0.123923 -0.0260351 -0.0196959 0.189919 -0.0827034 -0.0193639 0.185024 0.103607 -0.147686 -0.157596 -0.205624 0.0453409 0.166258 0.0669025 0.00628734 -0.0657437 0.0542304 0.084429 0.0225432 -0.034807 -0.16079 0.0206144 -0.0676584 0.0905874 -0.148078 0.10323 0.0520633 -0.0679531 -0.0771612 0.155078 0.0242136 -0.124199 -0.0541351 0.0771203 -0.122014 0.0456816 -0.0363796 0.081113 0.133676 -0.0117824 0.0663782 0.0188287 -0.085409 -0.0523641 0.0679234 0.0602237 -0.154466 0.0938911 0.0228674 -0.0291664 -0.0951801 -0.142056 0.0257845 -0.0414329 0.122673 -0.121543 -0.132049 0.0412052 0.0826634 -0.0341735 0.0629729 0.0473471 0.0840764 -0.0182278 0.0255647 0.0373716 0.0822006 -0.084004 0.128086 0.0489151 -0.0418322 -0.0518349 0.0789535 0.0201762 -0.0859607 -0.0465892 -0.0143175 -0.171735 -0.0256555 -0.10749 0.121967 0.0316316 0.0308728 0.139171 0.00751305 0.00989243 0.0133123 -0.0190157 0.0668244 -0.041082 0.075411 -0.0829636 0.039772 -0.0564136 -0.026592 -0.0477856 -0.140371 0.0169487 0.115692 -0.0848947 0.0410884 -0.0594076 0.153188 0.0934134 -0.13013 -0.0575375 -0.00711609 -0.104387 0.166089 -0.0361996 0.0330328 
-0.0205821 0.104328 -0.0381407 0.0202592 0.0959935 0.244416 0.0565031 -0.080397 -0.0759947 0.0830461 -0.014194 0.0110889 0.0693686 -0.0832915 0.0624777 0.0117577 -0.0913802 0.12113 0.0264118 -0.0300366 0.153561 -0.0841262 -0.0217494 0.156236 0.120198 -0.114003 -0.170311 -0.190606 0.0614285 0.166309 0.0752209 0.0280852 -0.0822007 0.0118951 0.0852475 0.0398653 -0.0498816 -0.171398 0.0560922 -0.0765125 0.0830816 -0.118506 0.112543 0.0423384 -0.069342 -0.0496218 0.164636 0.0360036 -0.127456 -0.0828216 0.0572113 -0.102171 0.0759446 -0.0575205 0.0737858 0.131898 -0.00251844 0.109328 0.0237092 -0.0902728 -0.0625993 0.105429 0.088641 -0.167474 0.0894076 0.0738157 -0.0357719 -0.0646091 -0.141477 0.0072232 -0.0185568 0.151911 -0.119155 -0.120203 0.0413051 0.0950195 -0.0459502 0.0294661 0.0535011 0.0566311 -0.0106213 0.0567848 0.0370979 0.0788758 -0.0796631 0.106656 0.0336457 -0.0343505 -0.0306184 0.0547708 0.0210447 -0.0458898 -0.0319142 -0.00177627 -0.129514 -0.0275553 -0.075212 0.143991 0.00908069 0.0211614 0.128852 0.00194392 0.0219833 -0.000703217 -0.0802403 0.0999176 -0.0456114 0.0500136 -0.070067 0.0581797 -0.0115974 -0.0290371 -0.0307037 -0.138444 0.0140587 0.102214 -0.106678 0.0382338 -0.0505681 0.131895 0.0967889 -0.159774 -0.0338893 -0.0396636 -0.142533 0.184002 -0.0575053 0.0283852 
-0.0396556 0.11652 -0.0336555 0.00205658 0.0616821 0.259435 0.0551612 -0.064563 -0.0447138 0.0535179 -0.00225861 -0.0072244 0.0712071 -0.11433 0.0355991 -0.0238505 -0.152467 0.101396 -0.0120032 -0.0465409 0.165483 -0.0854479 -0.0281296 0.149591 0.0981867 -0.12038 -0.160578 -0.202594 0.0644392 0.141358 0.0997154 -0.00853894 -0.0993978 0.0125314 0.0933515 0.043805 -0.0724386 -0.164824 0.0204796 -0.0521222 0.0923445 -0.139745 0.0672113 0.102927 -0.0715243 -0.0611388 0.155635 0.0527024 -0.134657 -0.0724319 0.028635 -0.0911231 0.0583147 -0.0641796 0.0533208 0.134138 -0.0244824 0.116465 0.0252407 -0.117047 -0.0660845 0.105498 0.11749 -0.128951 0.081554 0.031397 -0.000568079 -0.081031 -0.117839 0.035393 -0.0286135 0.126898 -0.0966346 -0.113332 0.0387046 0.0583871 -0.0836661 0.0361912 0.0454126 0.0846673 -0.0123988 0.0370213 0.0268749 0.0707091 -0.0992243 0.108579 0.053664 -0.0444996 -0.0358659 0.0547275 0.0413952 -0.0688784 -0.0308435 -0.0402602 -0.144163 -0.0459293 -0.0841643 0.131799 0.0116512 0.0287903 0.128611 0.0207677 0.0188993 -0.01005 -0.0645159 0.0880871 -0.0523254 0.0842446 -0.077691 0.0572558 0.00554255 -0.0189434 -0.0630077 -0.141555 0.00406322 0.118741 -0.100384 0.026626 -0.0126303 0.131741 0.0965446 -0.163254 -0.0529151 -0.0217579 -0.140344 0.156203 -0.0622686 0.048632 
-0.019777 0.0865717 -0.0352363 0.011937 0.04145 0.256235 0.0618669 -0.0734302 -0.0363742 0.0271276 -0.00834623 0.00773844 0.0783808 -0.0799124 0.0236132 -0.0303379 -0.136611 0.0889573 0.0031777 -0.0669446 0.169402 -0.0719474 -0.0290523 0.166496 0.0891898 -0.126492 -0.14828 -0.204269 0.0238333 0.175928 0.0819241 -0.00570136 -0.092844 0.0170042 0.0810377 0.0277951 -0.0579028 -0.165244 0.0306389 -0.0298597 0.073374 -0.128112 0.0695736 0.0639482 -0.05524 -0.0778115 0.134462 0.0240279 -0.101313 -0.0649885 0.0585277 -0.100006 0.0970288 -0.0322643 0.0636698 0.137919 0.00790277 0.118853 0.025166 -0.100791 -0.052365 0.110291 0.0918702 -0.153603 0.0652435 0.0243847 0.0125893 -0.0774837 -0.120351 0.0147388 -0.0320404 0.112277 -0.113765 -0.125792 0.0364069 0.0922465 -0.0633095 -0.00494524 0.0400344 0.107215 -0.010103 0.0195505 0.0463238 0.074889 -0.100189 0.113562 0.0580803 -0.0731732 -0.0597379 0.0395478 0.0095307 -0.0861895 0.00202732 -0.0228261 -0.157373 -0.0310785 -0.0870444 0.117848 0.0353052 0.0514157 0.146056 0.0328626 0.00826361 0.0217717 -0.052079 0.0570668 -0.0602891 0.0626241 -0.132692 0.0583955 -0.00429864 -0.0472051 -0.0474529 -0.151739 -0.0189333 0.154249 -0.0901777 0.053925 -0.0383068 0.129731 0.0905285 -0.1743 -0.0579355 -0.0490428 -0.128963 0.171001 -0.0811929 0.0579144 
-0.0424934 0.0766553 -0.0538968 -0.0265516 0.0175911 0.247644 0.0110378 -0.0054665 -0.0739708 0.0332707 -0.00469529 0.00116688 0.0945416 -0.108854 -0.0081762 -0.00719527 -0.134488 0.0650626 0.0209849 -0.0289308 0.202168 -0.115253 -0.0109221 0.161088 0.0801487 -0.0490509 -0.10865 -0.229979 0.0812754 0.117484 0.102693 -0.00136917 -0.0790767 0.00904141 0.0352273 0.0328939 -0.0842411 -0.109131 0.0358316 -0.0321189 0.0720677 -0.144727 0.0375032 0.112023 -0.0445011 -0.110844 0.18057 0.0109049 -0.153038 -0.0940841 0.0153318 -0.0937459 0.0848706 -0.0373794 0.0489707 0.140478 0.0351303 0.130653 0.0375701 -0.17524 -0.0524448 0.0952714 0.140392 -0.109617 0.0505126 0.041841 0.0142432 -0.0700016 -0.0701347 0.00907023 -0.0818226 0.0945179 -0.135281 -0.105655 0.0650263 0.0271315 -0.078208 0.0512544 0.043374 0.117891 -0.0616982 0.0298405 0.0475595 0.0453961 -0.0880112 0.111618 0.0757489 -0.0258682 -0.0101904 -0.00931905 0.0346222 -0.0575672 -0.0350121 -0.0119118 -0.113536 -0.0281111 -0.0651343 0.17371 -0.00519601 0.0245415 0.100578 0.0020845 -0.00357448 0.0559976 -0.0652868 0.0844323 -0.0690521 0.0835834 -0.087251 -0.0209473 -0.0248099 0.00817667 -0.0824646 -0.160731 0.025797 0.129012 -0.104804 -0.0369145 0.0144817 0.128234 0.0805366 -0.159106 -0.0462582 -0.0601779 -0.174816 0.154925 -0.0799882 0.0774964 
0.0185131 0.0671034 -0.0661596 0.0234194 0.0413766 0.275705 0.0768765 -0.0558998 -0.0849845 0.100331 -0.032877 0.0126286 0.0726003 -0.047899 0.0401167 -0.0224564 -0.020166 0.168356 0.0599837 -0.0871548 0.132705 -0.0799292 -0.0359068 0.164072 0.0839309 -0.0764278 -0.158166 -0.192509 0.031601 0.15255 0.0732598 0.138664 -0.116891 0.0396846 0.0515873 0.0197479 -0.0424983 -0.152438 0.0781811 -0.0708524 0.0812213 -0.122385 0.0794204 0.018464 -0.0590887 -0.126268 0.124107 0.0241361 -0.123093 -0.0939224 0.117322 -0.0838392 0.099829 -0.0328411 0.0513721 0.148272 0.0683655 0.125604 0.0609733 -0.110918 -0.042221 0.123859 0.079496 -0.221847 0.056204 0.0861665 0.00456243 -0.0780365 -0.151225 0.0691153 -0.07058 0.122716 -0.138499 -0.0469085 -0.0377254 0.0396173 -0.000679925 -0.00314901 0.0358355 -0.0087209 -0.064814 0.0836717 0.0420388 0.0171066 -0.0528844 0.0466817 0.0523593 -0.0822011 0.00410825 0.0334225 0.0163478 -0.0465964 0.00532231 -0.0293868 -0.0584454 0.0227758 -0.0311896 0.148832 -0.00167017 0.0591806 0.138055 0.0419595 0.00422347 0.0909519 -0.0465958 0.0458331 -0.0678245 -0.0262139 -0.115871 0.0466979 -0.0362648 -0.0124801 -0.0168127 -0.16437 0.0386575 0.052414 -0.0169208 -0.0510495 0.013484 0.0997175 0.136659 -0.179652 0.0035129 -0.0730553 -0.142029 0.132383 -0.0588316 0.0308597 
