0.105007 -0.00451437 -0.199254 0.0396591 0.133558 0.113342 -0.021077 -0.0420541 0.00788097 -0.114315 0.0747918 0.132406 0.0695292 -0.129386 -0.209008 -0.0227651 -0.018378 0.0890764 -0.131768 0.226784 0.182028 -0.125587 0.121846 0.12875 0.0142075 -0.0708275 0.0259891 -0.177106 0.00498339 0.0874817 0.00270646 0.00475268 -0.00959479 0.0567126 -0.0694344 -0.0167628 -0.103311 0.0924913 -0.0735448 -0.0886899 -0.00202988 -0.0237056 -0.0684089 0.165096 -0.163653 -0.0955444 0.117864 0.0383666 -0.0494016 0.131059 -0.00937595 0.0200955 -0.0547956 -0.018253 0.066546 -0.0478634 0.00937944 0.0844584 -0.0034747 -0.150728 -0.0569923 -0.0280653 0.255769 -0.0420019 -0.0292969 -0.178733 -0.0181479 0.0461097 -0.0250359 0.0816746 0.0037542 0.0489203 -0.0472334 -0.014554 -0.049791 -0.0285298 -0.0154869 0.0885617 -0.0483285 0.121822 -0.112202 0.0682735 -0.0123501 -0.0402241 -0.0270107 0.0681792 0.0309107 0.0770816 0.0555582 -0.0382156 0.0796849 -0.123527 -0.106717 -0.00618609 0.0201357 -0.143414 -0.0628551 0.0825529 -0.0336601 -0.123502 0.0323517 -0.00161431 0.00466492 0.134935 -0.0656714 0.0460173 -0.0683702 0.145304 0.0469514 -0.0404845 0.0198817 0.140295 -0.0683918 0.0880998 0.0139015 0.0523287 -0.0945737 -0.103967 0.0785313 0.157091 -0.0640422 0.0776281 -0.0429948 0.0404944 -0.0781555 0.0129986 0.010617 -0.00230119 
0.0966218 -0.0105467 -0.180168 0.0397228 0.12775 0.108394 -0.0252532 -0.0214863 0.0107631 -0.101453 0.0816782 0.129429 0.0692932 -0.125511 -0.190872 -0.0385742 -0.022078 0.0906017 -0.129342 0.225493 0.173932 -0.123639 0.119466 0.145398 0.0189579 -0.0727625 0.0311968 -0.168722 0.00766212 0.0707096 0.012192 -0.0182347 -0.00468051 0.0534797 -0.0767367 -0.00981257 -0.117312 0.0885942 -0.0961313 -0.0815249 0.00632582 -0.0211139 -0.0864401 0.182026 -0.17316 -0.107417 0.108841 0.0413623 -0.0344476 0.134032 -0.00366076 0.0244995 -0.0661872 -0.0287209 0.0684342 -0.0420186 -0.00486432 0.082576 0.0123755 -0.15709 -0.0645477 -0.0382169 0.242694 -0.022435 -0.0432164 -0.18299 -0.00780737 0.0411749 -0.0180405 0.0922474 0.00961342 0.0567178 -0.0348149 -0.0152165 -0.0478677 -0.0353124 -0.0312441 0.0978629 -0.0387077 0.129864 -0.116689 0.0637447 -0.00391938 -0.0422793 -0.0150768 0.0554352 0.0433318 0.0847829 0.0656358 -0.0424575 0.0710433 -0.109222 -0.0997543 -0.0170661 0.012328 -0.157618 -0.0645114 0.0738837 -0.0371539 -0.137365 0.0275012 0.00671132 0.0179926 0.114209 -0.0724223 0.0461273 -0.0711908 0.131798 0.065286 -0.0447247 0.0251736 0.149615 -0.0724152 0.0832572 0.0167999 0.0499305 -0.0814179 -0.116231 0.07743 0.159993 -0.0596378 0.0742225 -0.0601687 0.0486203 -0.0861626 0.0105003 0.0226018 0.0169551 
0.0874272 -0.0198816 -0.170164 0.035054 0.128827 0.107374 -0.0231061 -0.0149172 0.0330632 -0.123908 0.0752451 0.13497 0.0657075 -0.130761 -0.208245 -0.0408488 -0.0417708 0.0877891 -0.151177 0.2202 0.191234 -0.135497 0.115211 0.137245 0.0158071 -0.0869061 0.0222099 -0.16524 -0.00337863 0.0659346 0.016747 -0.0223796 -0.00367192 0.0590548 -0.0792512 -0.0128512 -0.121527 0.0847787 -0.0999972 -0.0846196 0.0154475 -0.0231007 -0.0827163 0.167433 -0.158189 -0.121611 0.0946391 0.033091 -0.0349521 0.132968 -0.0286369 0.00876653 -0.0590812 -0.0236322 0.0626752 -0.0372961 -0.00795637 0.0825437 -0.0134884 -0.155331 -0.0562003 -0.0267237 0.245469 -0.0161362 -0.0429671 -0.173524 -0.0145039 0.0465659 -0.0201693 0.0874853 0.0106899 0.0455725 -0.0389692 -0.0225695 -0.0463442 -0.0215415 -0.0257854 0.0807863 -0.0449016 0.122874 -0.128461 0.0625308 -0.00206908 -0.0328808 -0.0317892 0.0760246 0.0485508 0.0916621 0.0581589 -0.0394254 0.0820316 -0.128001 -0.0956795 -0.00926439 0.011255 -0.14793 -0.0835608 0.0653994 -0.0392667 -0.120304 0.0328499 -0.0136079 0.00145593 0.111736 -0.0517637 0.0510268 -0.0690822 0.135989 0.0428942 -0.0498495 0.013939 0.13676 -0.0747596 0.0864564 0.022302 0.0623007 -0.0886208 -0.093985 0.0871682 0.164779 -0.0644596 0.079315 -0.0690821 0.045015 -0.0818975 0.0172544 0.014698 0.0143346 
0.111345 -0.0255785 -0.185724 0.0357371 0.126253 0.125659 -0.0154796 -0.0176222 0.00811926 -0.132645 0.0537112 0.118321 0.0723418 -0.127377 -0.204941 -0.0395012 -0.0204049 0.10141 -0.125487 0.22263 0.200319 -0.131337 0.126062 0.158656 0.00408382 -0.1054 0.0165594 -0.187038 -0.00612386 0.0855504 0.00247274 -0.0228482 -0.00918181 0.0653677 -0.0556713 -0.019515 -0.103278 0.0699313 -0.101832 -0.109764 -0.0130952 -0.0278217 -0.0640606 0.161738 -0.153656 -0.102367 0.111219 0.0441121 -0.057718 0.155039 -0.0219162 -0.0127121 -0.0223079 -0.0149928 0.0681636 -0.0379745 0.020017 0.0840993 0.00013091 -0.169321 -0.0397711 0.0120446 0.244509 -0.0491313 -0.038809 -0.17375 -0.0207678 0.0243125 -0.0415767 0.0763457 -0.014889 0.0250714 -0.0648917 -0.0298884 -0.0650238 -0.0224514 0.00235543 0.0744135 -0.0235735 0.120451 -0.116245 0.0542153 -0.0315765 -0.0523811 -0.0158619 0.0809271 0.0138823 0.0683636 0.0547375 -0.0122897 0.107149 -0.123457 -0.100626 -0.0107998 0.0214807 -0.118935 -0.0764376 0.0998418 -0.0412383 -0.107254 0.064391 -0.000794325 -0.00209145 0.113342 -0.0607708 0.0450912 -0.0640479 0.119777 0.0213028 -0.0304772 0.0217171 0.128944 -0.0513956 0.060765 0.0100574 0.0797759 -0.0701303 -0.0979538 0.0778616 0.167932 -0.0732718 0.0565063 -0.049874 0.033172 -0.0956456 0.0180075 0.0121599 -0.0116628 
0.12281 0.0165765 -0.187998 0.0209429 0.117553 0.170915 -0.00490238 -0.0334228 -0.047521 -0.0765974 0.0673464 0.0937317 0.09612 -0.109902 -0.1448 -0.0475611 -0.00241942 0.113298 -0.0932568 0.201392 0.172846 -0.103727 0.124196 0.166269 0.00702003 -0.0894812 0.00363539 -0.190609 0.0289705 0.102474 0.0122067 -0.000123073 -0.0342023 0.0722553 -0.0392484 -0.00565431 -0.0852127 0.064351 -0.0667397 -0.08822 -0.0179036 -0.0480626 -0.0640365 0.173658 -0.184443 -0.0944816 0.137155 0.0695875 -0.0804348 0.146263 0.0216251 0.0133582 -0.044834 -0.0158404 0.0619362 -0.0258677 0.0255983 0.107145 0.0309079 -0.167906 -0.0660176 0.00965193 0.251853 -0.0928945 -0.0264382 -0.163728 0.00147212 0.00782598 -0.063067 0.103308 -0.0248165 0.0500548 -0.0728166 -0.000865128 -0.0582724 -0.0573155 -0.00882887 0.0844714 -0.00327528 0.11944 -0.0949708 0.0524185 -0.0201452 -0.0634446 -0.00492926 0.0488596 0.0142449 0.0344025 0.0648908 0.00104242 0.109056 -0.117656 -0.0886538 -0.028639 0.014232 -0.138821 -0.0542598 0.129935 -0.0379784 -0.108242 0.0560689 0.0478863 0.00953585 0.137751 -0.0845626 0.0506267 -0.0736027 0.116678 0.0494798 -0.0208244 0.0305356 0.141583 -0.0591506 0.0570915 0.0090671 0.0612972 -0.0426362 -0.130733 0.0758326 0.17344 -0.0322005 0.0103787 -0.0321213 0.0465226 -0.108333 0.004438 0.0191305 0.00604415 
0.122878 0.0213691 -0.164473 0.0094334 0.119297 0.167982 0.024412 -0.0124196 -0.0472387 -0.0694513 0.0677236 0.0892189 0.103987 -0.148243 -0.131473 -0.0476692 -0.0226654 0.104541 -0.124981 0.20889 0.174692 -0.097307 0.104825 0.135409 -0.0105723 -0.0772007 -0.0252025 -0.2018 0.0425699 0.0853781 0.00943585 0.0151252 -0.0456713 0.0894891 -0.0260365 -0.0246891 -0.0725715 0.0878861 -0.0567233 -0.0976628 0.00430179 -0.0702249 -0.0680303 0.179693 -0.188432 -0.0893469 0.126265 0.0732919 -0.0979497 0.135447 0.00812416 0.00513416 -0.070161 -0.0127399 0.0570638 -0.0414067 0.00236556 0.0929153 0.00398913 -0.160004 -0.0604274 -0.0151323 0.245684 -0.0789017 -0.00812763 -0.171359 -0.00161908 0.00424907 -0.0606395 0.077367 -0.024917 0.0427875 -0.0629219 0.0115808 -0.0658353 -0.0673144 -0.0170774 0.0908072 0.00879514 0.129427 -0.0907159 0.0384709 -0.018662 -0.0519999 -0.00206689 0.0371748 0.0362077 0.0487319 0.0671997 0.00870156 0.121191 -0.126445 -0.103288 -0.0244447 -0.0158169 -0.141755 -0.0434893 0.105835 -0.0440574 -0.102139 0.0508885 0.0478887 -0.00484562 0.145787 -0.0695939 0.0397241 -0.0626306 0.153174 0.0692751 -0.0220159 0.0246375 0.143634 -0.0900089 0.0602685 0.0228426 0.0473879 -0.0584063 -0.129568 0.0676804 0.167261 -0.0318475 0.0283755 -0.0272817 0.0735985 -0.0770053 -0.0164954 0.0233611 -0.0121366 
0.113217 0.0183287 -0.158993 0.0228311 0.106551 0.207777 0.00597625 -0.0309531 -0.0369286 -0.0772632 0.0663126 0.0825745 0.0877605 -0.124514 -0.11378 -0.0826623 -0.023951 0.118006 -0.0814173 0.175511 0.166614 -0.099751 0.112287 0.185909 0.0158136 -0.113599 -0.0113316 -0.194139 0.0217388 0.0879918 0.0461095 -0.0266426 -0.0475849 0.0816573 -0.00773309 0.00813242 -0.0794351 0.0276472 -0.0698613 -0.0957274 0.00967731 -0.0708206 -0.0712398 0.17611 -0.195639 -0.118105 0.120781 0.088217 -0.0780136 0.145363 0.0140578 0.0015979 -0.031271 -0.0242389 0.0602271 -0.00499873 0.00241743 0.117037 0.015656 -0.167713 -0.0760807 0.0254994 0.253055 -0.115602 -0.0109472 -0.147842 0.0129144 -0.0235968 -0.0896828 0.120873 -0.0381218 0.0508853 -0.0817634 -0.00309984 -0.0613224 -0.0683532 -0.0110834 0.0769943 0.0175301 0.128681 -0.104216 0.0373524 -0.0105325 -0.0623952 -0.000931572 0.0386339 0.0224739 0.0278048 0.0548197 0.0230131 0.132458 -0.121925 -0.0657931 -0.035697 -0.00232316 -0.147463 -0.0634291 0.120134 -0.0405405 -0.0923924 0.0689572 0.0634142 -0.00196877 0.10511 -0.0612795 0.0607046 -0.0525794 0.0995315 0.0361742 0.00337007 0.0314884 0.127382 -0.0520731 0.0391228 0.0114439 0.063122 -0.0234595 -0.120249 0.0834454 0.18677 -0.0084097 -0.025512 -0.0503055 0.0529813 -0.105158 0.0111163 0.0310612 0.0182345 
0.103886 0.0102794 -0.168846 0.0216459 0.0935984 0.197052 0.00818306 -0.0240059 -0.0113082 -0.0852873 0.080567 0.0886496 0.08447 -0.125981 -0.142412 -0.0867355 -0.0457898 0.113426 -0.106665 0.171284 0.164252 -0.106663 0.0987955 0.196839 0.00396308 -0.118263 0.000556609 -0.180955 0.0170458 0.0773787 0.0355172 -0.0371918 -0.057561 0.0769242 -0.036005 0.0153983 -0.107124 0.0099216 -0.0968623 -0.0714159 0.0166892 -0.0692688 -0.0908661 0.185941 -0.178246 -0.123879 0.106888 0.0917909 -0.073353 0.141757 -0.000468213 0.00692049 -0.0425598 -0.0321769 0.0501046 0.00365378 -0.0121303 0.126155 0.021658 -0.153449 -0.069899 0.0369532 0.262216 -0.0823659 -0.0382144 -0.151975 0.0201857 -0.0166 -0.0698161 0.125709 -0.036531 0.0464264 -0.0616474 0.00190787 -0.0545042 -0.0636644 -0.0186497 0.0802503 -0.00463562 0.116368 -0.101331 0.0416572 -0.0204456 -0.0702897 -0.0272319 0.0706797 0.0329735 0.0179179 0.0409181 0.0128119 0.135177 -0.128583 -0.0664356 -0.0457981 0.000340786 -0.140734 -0.0801672 0.0878643 -0.0231682 -0.0935701 0.0709969 0.048342 0.00331628 0.0942718 -0.059037 0.0628821 -0.0661436 0.108033 0.00948376 -0.00217193 0.0467855 0.134054 -0.0416141 0.032169 0.000137926 0.0716037 -0.029122 -0.108998 0.0978888 0.176282 -0.0178322 -0.0252982 -0.0633708 0.0575416 -0.121609 0.0202606 0.0041439 0.0191672 
0.0958159 -0.0284082 -0.16445 0.033522 0.12264 0.154862 0.00997171 -0.0325858 0.00247226 -0.111877 0.0590128 0.115452 0.0813664 -0.124417 -0.165436 -0.0766448 -0.064089 0.123152 -0.121494 0.182548 0.190585 -0.122416 0.110665 0.188578 0.0089843 -0.121191 -0.0111932 -0.200772 -0.0104606 0.0924699 0.0156725 -0.0312172 -0.0471766 0.0648942 -0.0334802 0.000662566 -0.123551 0.0149982 -0.10882 -0.0871871 0.0260643 -0.0443813 -0.082416 0.185315 -0.186169 -0.110034 0.105683 0.0683922 -0.0433659 0.133129 -0.0112663 -0.0248874 -0.028676 -0.0312519 0.0659361 -0.00935958 0.00680339 0.112153 0.0145424 -0.144177 -0.0391065 0.0301376 0.237544 -0.0371345 -0.0349057 -0.176063 -0.00148209 0.00217718 -0.0399721 0.107249 -0.0190967 0.0523891 -0.0489156 -0.033439 -0.0704026 -0.0261005 -0.0364674 0.0685463 -0.013927 0.122108 -0.10441 0.0559511 -0.0247178 -0.0460735 -0.0362121 0.0823944 0.0460497 0.04197 0.0180823 -0.00938656 0.118875 -0.113346 -0.0758803 -0.0547078 -0.0245895 -0.139162 -0.098471 0.088233 -0.0113721 -0.0973416 0.0767467 0.022809 0.0203858 0.0895173 -0.0467656 0.0380161 -0.0752891 0.128051 0.00384951 0.00345784 0.0386693 0.113565 -0.0558598 0.0232867 -0.00976253 0.0996679 -0.0489651 -0.0974582 0.0675018 0.174259 -0.0384533 0.0167726 -0.0868325 0.0457188 -0.130567 0.0275194 -0.0151791 0.0230498 
0.0746962 0.00909369 -0.15207 0.0151757 0.0880136 0.184574 0.0161003 -0.0442286 -0.00886089 -0.0618032 0.0651203 0.0690601 0.0887005 -0.102026 -0.12996 -0.107096 -0.0776421 0.12909 -0.0864395 0.14928 0.161812 -0.12378 0.0938119 0.207765 0.011273 -0.120198 -0.0200197 -0.18607 0.0233199 0.0846567 0.0383076 -0.0601206 -0.0712659 0.0497322 -0.00492236 0.025234 -0.124222 0.00296007 -0.106495 -0.0814287 0.0183627 -0.0682769 -0.0965866 0.201535 -0.183571 -0.111202 0.10455 0.111683 -0.0590747 0.115103 -0.0183598 0.0014075 -0.022978 -0.0439332 0.0612048 0.0177966 -0.00713224 0.138459 0.0337066 -0.165175 -0.0526862 0.0522819 0.257515 -0.0525036 -0.0282952 -0.135518 0.0218483 -0.0237887 -0.0575422 0.132068 -0.0364957 0.0607648 -0.0498179 -0.0140454 -0.0586839 -0.0621219 -0.0435853 0.0789119 0.0188892 0.102466 -0.0979882 0.0488977 -0.0361001 -0.0664333 -0.0353539 0.0529017 0.0342694 0.0239016 0.0430762 0.00937349 0.138992 -0.100081 -0.0302012 -0.0815352 -0.0227037 -0.159219 -0.0898747 0.105272 0.00734556 -0.0923051 0.0942509 0.0570247 0.0234386 0.0556036 -0.0563648 0.061318 -0.0646545 0.0979907 0.0196737 0.0227262 0.0614029 0.125764 -0.0431908 0.00266541 -0.0106158 0.0974912 -0.0210598 -0.10617 0.0800483 0.163019 -0.0148823 -0.0451724 -0.087098 0.0517455 -0.164736 0.0418218 -0.0173235 0.038234 
0.0889799 0.00187096 -0.172571 0.0290054 0.0878647 0.14836 0.00695782 -0.038438 0.00112174 -0.092568 0.0778272 0.106816 0.0789499 -0.108455 -0.178063 -0.0952318 -0.0575446 0.106253 -0.108248 0.173544 0.162676 -0.117518 0.0968954 0.192134 0.000940429 -0.0921724 0.0186997 -0.175864 0.0213235 0.0880098 0.00704459 -0.0455488 -0.0443907 0.0462011 -0.0495147 -0.00140265 -0.135393 0.0466618 -0.121692 -0.0668953 0.00791615 -0.0465076 -0.11744 0.202059 -0.17995 -0.0951271 0.104335 0.0737782 -0.0514152 0.114029 -0.00515637 0.0383316 -0.0291475 -0.0413538 0.0622244 -0.00567962 0.000602918 0.127874 0.0325528 -0.158325 -0.0542851 0.0158508 0.266263 -0.0213114 -0.0485564 -0.165772 0.0210437 -0.00154773 -0.0386024 0.123592 -0.0222918 0.0384423 -0.0367853 -0.00808951 -0.0492334 -0.0450138 -0.0475025 0.0721199 -0.0153557 0.12364 -0.10931 0.0518178 -0.0235081 -0.0699135 -0.0224443 0.0451265 0.0446729 0.0320165 0.0358658 -0.0155892 0.105784 -0.107073 -0.056247 -0.0602115 -0.00693232 -0.163796 -0.0694602 0.0783483 0.0171096 -0.116788 0.0724775 0.0557784 0.0311011 0.0915223 -0.079219 0.0441188 -0.0707067 0.12201 0.0289389 -0.0188599 0.0735252 0.14028 -0.059591 0.0252111 -0.00653883 0.0931099 -0.0542814 -0.113601 0.0919922 0.158864 -0.044266 -0.00295981 -0.089543 0.0354659 -0.127108 0.0420335 -0.00300854 0.0267335 
0.088789 -0.00716402 -0.158272 0.0261703 0.0861115 0.152987 0.00909179 -0.0298836 -0.000514338 -0.105771 0.0703494 0.107029 0.0735162 -0.133787 -0.182303 -0.0890362 -0.0805873 0.102419 -0.124175 0.174516 0.171488 -0.118255 0.0971159 0.188232 -0.00697386 -0.0919656 0.0113122 -0.187023 0.014478 0.0726759 0.00269623 -0.0465437 -0.0524555 0.0573441 -0.0455581 -0.00896696 -0.137005 0.0435685 -0.121312 -0.0685111 0.0169296 -0.0581881 -0.114467 0.197453 -0.170573 -0.0948739 0.10706 0.0695512 -0.0680584 0.123915 -0.0141233 0.0178208 -0.0290702 -0.0343238 0.0611046 -0.0124213 0.00464267 0.123004 0.0198324 -0.158134 -0.0403819 0.0273394 0.263648 -0.0110387 -0.0448689 -0.164815 0.0147987 -0.00377155 -0.0360202 0.119272 -0.0323595 0.032378 -0.0367624 -0.000686305 -0.0475979 -0.0458982 -0.0477414 0.0673834 -0.0118702 0.126799 -0.105207 0.0473898 -0.0283191 -0.070469 -0.0347324 0.0581173 0.048644 0.036907 0.0238625 -0.00859052 0.120656 -0.111476 -0.0646823 -0.056005 -0.0184232 -0.146686 -0.0739244 0.076401 0.0164107 -0.106955 0.0735112 0.0424702 0.0174762 0.0922383 -0.0603825 0.0389241 -0.069998 0.138048 0.0136987 -0.0217142 0.0704903 0.143946 -0.0563509 0.0175933 -0.000927253 0.0983567 -0.064086 -0.102083 0.0910851 0.159208 -0.0438967 0.00267618 -0.0835563 0.0343732 -0.121978 0.0398519 -0.00620554 0.0159222 
0.0901256 -0.0334166 -0.138472 -0.000202133 0.10509 0.208789 0.00186816 -0.0411333 -0.0083826 -0.103266 0.0406766 0.0948789 0.073865 -0.119902 -0.124342 -0.0977578 -0.0932696 0.116388 -0.0900599 0.14869 0.168813 -0.0844481 0.11386 0.190851 -0.0106196 -0.0948212 -0.0056292 -0.212721 -0.0160889 0.0630004 0.0411765 -0.0690355 -0.0656856 0.0656301 0.0184643 0.0277475 -0.104773 0.0147784 -0.0999315 -0.0865587 0.0257338 -0.0513584 -0.100289 0.192356 -0.196513 -0.108295 0.105271 0.0975956 -0.0593666 0.1487 -0.0226985 -0.0373075 -0.00731762 -0.0189896 0.0810018 0.00138413 0.0140933 0.142454 0.00539077 -0.167809 -0.0475375 0.0561881 0.265148 -0.0653285 -0.00363287 -0.159356 0.010783 0.00211665 -0.0486911 0.148654 -0.0315324 0.0551801 -0.0547497 -0.0200604 -0.0730731 -0.0495774 -0.0557831 0.0571012 0.0248692 0.107738 -0.0828018 0.0589159 -0.0249159 -0.0620018 -0.0401407 0.0285126 0.0501613 0.0467188 0.0264051 0.0270479 0.158246 -0.108928 -0.0421685 -0.063192 -0.0223604 -0.132404 -0.0863634 0.109952 -0.00593229 -0.07662 0.0913077 0.0481172 -0.00762736 0.0443832 -0.0415528 0.0423619 -0.0717618 0.0718363 -0.0105839 0.0325941 0.0626234 0.123197 -0.0293702 0.00883162 0.003861 0.109559 -0.0305386 -0.109703 0.0567825 0.164685 0.00450471 -0.0285118 -0.0563297 0.0338435 -0.140425 0.0319646 0.00248587 0.0354015 
0.0633393 0.0229575 -0.117545 0.015201 0.0791379 0.183116 0.00601289 -0.0625001 -0.0164056 -0.0678154 0.0500549 0.0597957 0.060312 -0.103206 -0.111386 -0.0863268 -0.109754 0.12169 -0.0499327 0.112743 0.180677 -0.101803 0.100316 0.21635 0.0379503 -0.097648 -0.00655765 -0.196657 0.0497268 0.102129 0.0373479 -0.0775072 -0.0590027 0.0270531 0.0297786 0.0159678 -0.127606 0.0031456 -0.0896593 -0.0880239 0.00540167 -0.0643098 -0.0731578 0.214104 -0.176292 -0.0867177 0.135862 0.0896357 -0.0722689 0.0963867 -0.00516205 0.0102649 0.0125143 -0.0479961 0.0878702 0.0252946 0.017051 0.15031 0.0287622 -0.188609 -0.05071 0.0422358 0.264877 -0.0328482 -0.0128444 -0.113992 0.0115006 -0.037898 -0.0597188 0.152867 -0.0433535 0.0723773 -0.0636824 -0.0303439 -0.0413248 -0.0638866 -0.0652581 0.0643057 0.0298894 0.120964 -0.0694309 0.0638639 -0.0281688 -0.0670089 -0.0221481 0.0184206 0.021689 0.0280976 0.0341416 0.0264833 0.134319 -0.0779777 -0.049975 -0.0775351 -0.0261425 -0.151415 -0.0802427 0.143188 0.033313 -0.0962548 0.0999356 0.058194 0.0340669 0.03075 -0.0809684 0.059381 -0.0510637 0.0864316 0.0432955 0.00450585 0.075346 0.128663 -0.0493147 -0.0297108 0.0228822 0.119833 -0.0278679 -0.103999 0.0719659 0.163109 0.0108505 -0.0492749 -0.0751906 0.0146467 -0.169875 0.0746913 0.0236256 0.0500301 
0.0639244 0.0189084 -0.105869 0.0186155 0.0758654 0.170034 0.0105259 -0.0603059 -0.00138359 -0.108552 0.0432948 0.0712546 0.0577406 -0.102193 -0.119963 -0.101943 -0.127467 0.0816563 -0.0761878 0.121033 0.179887 -0.0988995 0.0947062 0.210833 0.0418407 -0.106735 0.00171908 -0.18012 0.0373355 0.108227 0.0348583 -0.09197 -0.0542508 0.0329653 0.0173971 0.0106095 -0.131276 0.0142493 -0.107735 -0.0875623 0.0139664 -0.0673072 -0.0737743 0.210045 -0.168129 -0.0742967 0.123126 0.082611 -0.0635177 0.103554 -0.0184515 0.0163735 0.0265025 -0.046614 0.100773 0.0150512 -0.0134533 0.158046 0.0155101 -0.191087 -0.0566458 0.0384831 0.260541 -0.0136703 -0.027111 -0.108604 0.0164609 -0.0322445 -0.065819 0.13129 -0.0350017 0.0562171 -0.0552854 -0.0385006 -0.0234362 -0.039401 -0.0644324 0.0329392 0.0334422 0.161556 -0.0635556 0.0386329 -0.0174797 -0.0624957 -0.0184467 0.0125496 0.025335 0.0347459 0.0232592 0.0323486 0.132652 -0.0997402 -0.045367 -0.0606627 -0.0525333 -0.153563 -0.0787942 0.113367 0.0498376 -0.105575 0.0958048 0.0639629 0.0292551 0.0328705 -0.102634 0.0602374 -0.0589795 0.1092 0.03752 -0.0114912 0.0987408 0.126601 -0.075382 -0.0150446 0.0140363 0.135485 -0.0493065 -0.0744809 0.0727595 0.176684 -0.000808957 -0.0384364 -0.0937401 0.0128735 -0.146331 0.0790428 0.0308953 0.0388497 
0.0373647 0.0389289 -0.0683154 0.0161143 0.0457347 0.191455 0.0170293 -0.0715748 -0.0289968 -0.102092 0.0232606 0.0348149 0.0612647 -0.119425 -0.0856128 -0.101434 -0.17873 0.0646564 -0.0671389 0.0951868 0.17543 -0.112184 0.0830517 0.176905 0.0476694 -0.095908 -0.0558245 -0.206778 0.0364455 0.0933774 0.0590713 -0.0660249 -0.0777103 0.0364676 0.0543901 0.018645 -0.122894 0.0121841 -0.0757412 -0.0951327 0.0327782 -0.108011 -0.0566871 0.197423 -0.148226 -0.0596744 0.144099 0.0833934 -0.105168 0.0854322 -0.0444553 -0.0111482 0.0555757 -0.039133 0.0892227 0.0234331 -0.00880928 0.150259 0.0154424 -0.205551 -0.0514251 0.0765958 0.244668 -0.0217077 0.00298768 -0.0566121 0.0307611 -0.0607028 -0.0753963 0.10822 -0.0615719 0.0518333 -0.0548227 -0.0195039 -0.00318158 -0.0581103 -0.0816198 -0.00147806 0.0560004 0.181837 -0.0481307 0.0139994 -0.0316962 -0.0656883 -0.0404399 0.0174737 0.0195133 0.0138463 0.00892284 0.0435176 0.158174 -0.0885572 -0.0231106 -0.0715615 -0.0928631 -0.132258 -0.0714851 0.139931 0.0572146 -0.0820611 0.0967402 0.0614227 0.0169374 0.0253665 -0.0803777 0.0712302 -0.0412025 0.143695 0.0319678 -0.00062307 0.086389 0.119358 -0.0952336 -0.0559855 0.0169818 0.135453 -0.0545303 -0.0596499 0.0826642 0.166429 0.0233678 -0.0700819 -0.0778175 0.0122954 -0.143204 0.0770041 0.0304041 0.0422246 
0.104904 0.00909182 -0.0934014 -0.0228222 0.134134 0.15998 0.083715 -0.0330215 -0.0511434 -0.103631 -0.0130369 0.0271601 0.0904702 -0.088879 -0.049472 -0.092889 -0.103457 0.0717403 -0.118595 0.121773 0.176942 -0.081447 0.103012 0.134388 0.0311136 -0.110923 -0.0920399 -0.199116 0.0497571 0.0926359 0.0328795 -0.0175669 -0.100534 0.0613739 0.0559606 -0.0200537 -0.0889093 0.0766274 -0.0588707 -0.13374 0.0314936 -0.0373018 -0.046585 0.184348 -0.184781 -0.0133995 0.101404 0.108886 -0.0804852 0.0924555 -0.0593319 -0.0306139 0.0182739 -0.0368759 0.0868902 -0.0313908 -0.00473847 0.176833 0.00436181 -0.19649 -0.0381089 0.0582968 0.221959 -0.0284228 -0.0130574 -0.0716127 -0.00165427 0.0233891 -0.0545192 0.0624138 -0.0199469 0.0790533 -0.0408742 -0.0240729 -0.0645878 -0.0364907 -0.0720274 -0.00890105 0.08009 0.142095 -0.0336823 0.0335086 -0.0444349 -0.0727758 -0.000931615 -0.0281131 0.0361454 0.0552779 0.0307138 0.037716 0.191172 -0.0946418 -0.0577324 -0.0854397 -0.0752745 -0.13374 -0.040493 0.12783 0.019918 -0.0859602 0.0825725 0.0548584 0.0342303 0.0774919 -0.145942 0.0302631 -0.0889945 0.155239 0.0938307 -0.00386954 0.125854 0.141057 -0.139147 0.00216119 0.036221 0.128516 -0.0796736 -0.0796907 0.0288649 0.157172 -0.00783873 0.00586058 -0.0563084 0.0702063 -0.133503 0.00194363 -0.00558538 -0.0224605 
0.104647 -0.0121886 -0.0533303 -0.0209606 0.131153 0.120313 0.131645 0.0161905 -0.0423126 -0.110369 -0.0321055 0.0310143 0.127159 -0.111169 -0.0323375 -0.0776729 -0.104102 0.00810329 -0.199265 0.162712 0.169261 -0.092295 0.0527687 0.120504 -0.00462875 -0.111854 -0.169488 -0.190544 0.0372843 0.0707495 0.0355738 0.0310724 -0.138918 0.0949032 0.0117134 -0.0262139 -0.09068 0.115097 -0.080744 -0.102714 0.0621148 -0.0367148 -0.0427005 0.142637 -0.124891 -0.0175803 0.0713454 0.0924485 -0.0567536 0.0935522 -0.067086 -0.0867598 -0.027179 -0.0303742 0.0883398 -0.0507089 -0.0697801 0.166415 0.00885547 -0.156157 -0.0256615 0.0533524 0.143679 -0.0197692 -0.0192966 -0.0883398 0.022615 0.0200835 -0.0589567 -0.0348231 0.00421667 0.0845588 -0.011328 0.0129288 -0.0605609 -0.00587312 -0.0493605 -0.0119442 0.092037 0.168586 -0.00738007 -0.0185744 -0.0447704 -0.0522316 -0.0139221 -0.00945176 0.0807514 0.0576812 0.017966 0.00710829 0.16218 -0.114456 -0.0481783 -0.0676099 -0.123415 -0.080969 -0.0180624 0.0472546 0.0042109 -0.0471615 0.0443661 0.0343678 -0.00264944 0.128869 -0.152246 0.0118557 -0.124742 0.201308 0.086204 -0.00510298 0.089042 0.140057 -0.192223 0.020106 0.0141677 0.141055 -0.0896503 -0.0417382 -0.0254161 0.153003 -0.0571933 0.0607409 -0.0496269 0.119489 -0.113483 -0.0256579 -0.0702902 -0.0653023 
0.113684 0.0674108 -0.121713 0.0241868 0.10733 0.175009 0.121811 -0.0757151 -0.00216592 -0.0564111 0.0701911 0.0559722 0.125357 -0.116133 -0.0977736 -0.0987749 -0.0837485 0.0841617 -0.175813 0.149234 0.166621 -0.0998539 0.0320393 0.155902 0.0160898 -0.122998 -0.136938 -0.167865 0.0618854 0.140253 0.0173505 0.0482424 -0.129774 0.0938152 0.0146228 -0.0212646 -0.0785743 0.065226 -0.0310631 -0.0971479 0.0449744 -0.0766345 -0.0588245 0.130318 -0.160751 -0.0923239 0.073095 0.115419 -0.0482195 0.0909242 -0.0170425 0.0271481 -0.0464187 -0.0173493 0.0677449 -0.0231526 -0.0545117 0.138462 -0.0144428 -0.14126 -0.0584003 0.0210595 0.231137 -0.0751747 -0.0440981 -0.0871318 0.039605 -0.00824854 -0.0924539 0.0504014 -0.0144824 0.0793564 -0.0338755 0.0404158 -0.0546832 -0.0477807 -0.031381 0.00488861 0.0363876 0.141056 -0.033419 0.0325773 -0.0115012 -0.0434207 -0.00206559 0.0264416 0.0524957 0.0116066 0.0432036 0.0204138 0.150416 -0.152714 -0.0279646 -0.0522784 -0.0984834 -0.172634 -0.0603504 0.0499012 0.0322787 -0.0690829 0.0940487 0.0782017 0.0158155 0.141692 -0.0911548 0.0464032 -0.0610262 0.188737 0.0683915 0.0354044 0.0703836 0.121587 -0.138477 0.0407574 0.00388448 0.10051 -0.0629227 -0.0457178 0.0364612 0.152724 -0.0185137 -0.000586484 -0.0577594 0.103796 -0.121204 0.0167505 -0.0298145 -0.0121061 
