{
  "descriptor": [
    -0.10107659548521042,
    0.06514853984117508,
    0.03571572154760361,
    -0.01713375560939312,
    -0.1159776970744133,
    -0.06522555649280548,
    -0.02547771856188774,
    -0.08847448229789734,
    0.1063181459903717,
    -0.007408671546727419,
    0.1720123440027237,
    -0.024290477856993675,
    -0.22380562126636505,
    -0.08674473315477371,
    -0.02274179272353649,
    0.09977208822965622,
    -0.12400198727846146,
    -0.0631408840417862,
    -0.12198285758495331,
    -0.11272472888231277,
    0.043025027960538864,
    0.05844581127166748,
    0.02735697105526924,
    -0.021953897550702095,
    -0.13811706006526947,
    -0.2552984952926636,
    -0.06724292784929276,
    -0.08961369097232819,
    0.03527963161468506,
    -0.1368386447429657,
    0.03775171935558319,
    0.08849456161260605,
    -0.193919837474823,
    -0.07680191099643707,
    0.015533694066107273,
    0.06965890526771545,
    -0.06091158092021942,
    -0.07326077669858932,
    0.19817250967025757,
    -0.024048583582043648,
    -0.14479421079158783,
    0.030841125175356865,
    0.07298268377780914,
    0.21366192400455475,
    0.21700094640254974,
    -0.02070288173854351,
    -0.005434548016637564,
    -0.05274752527475357,
    0.10308601707220078,
    -0.25594422221183777,
    0.0032728449441492558,
    0.18539923429489136,
    0.09418851882219315,
    0.09897930175065994,
    0.05747238174080849,
    -0.11449137330055237,
    0.02359294332563877,
    0.12865464389324188,
    -0.171875461935997,
    0.04910917580127716,
    0.056805673986673355,
    -0.11493747681379318,
    -0.05247814953327179,
    -0.052459415048360825,
    0.14717921614646912,
    0.06890040636062622,
    -0.07516776025295258,
    -0.132047638297081,
    0.14451894164085388,
    -0.14167267084121704,
    -0.045864783227443695,
    0.09509341418743134,
    -0.11594472080469131,
    -0.18338920176029205,
    -0.25180020928382874,
    0.09175238013267517,
    0.328294962644577,
    0.13831493258476257,
    -0.16699491441249847,
    0.024045271798968315,
    -0.10452892631292343,
    -0.024652017280459404,
    -0.0019016059814020991,
    0.0036775560583919287,
    -0.04539482668042183,
    -0.07110942155122757,
    -0.0822906494140625,
    0.04167613387107849,
    0.1946782022714615,
    -0.06228504329919815,
    0.012533069588243961,
    0.22671638429164886,
    0.03343319520354271,
    -0.002952124224975705,
    -0.0008586462354287505,
    0.00927747506648302,
    -0.10312973707914352,
    -0.01518433727324009,
    -0.07760826498270035,
    -0.01381389144808054,
    0.09797955304384232,
    -0.14611461758613586,
    0.045311372727155685,
    0.13099610805511475,
    -0.14937712252140045,
    0.14702747762203217,
    -0.02221486158668995,
    -0.02857210673391819,
    0.006955146789550781,
    -0.03886813297867775,
    -0.05152231454849243,
    -0.016578417271375656,
    0.1690463125705719,
    -0.20007620751857758,
    0.2653956711292267,
    0.16867750883102417,
    -0.011299225501716137,
    0.12623827159404755,
    0.0521114207804203,
    0.11548059433698654,
    -0.03174622729420662,
    0.006340332794934511,
    -0.09628117829561234,
    -0.08013435453176498,
    0.032952696084976196,
    0.00038116934592835605,
    -0.012949179857969284,
    0.02447517029941082
  ]
}