{
  "descriptor": [
    -0.11447254568338394,
    0.013278097845613956,
    0.030086791142821312,
    -0.12190986424684525,
    -0.03609559312462807,
    -0.033954765647649765,
    0.003197505371645093,
    -0.09182382375001907,
    0.22230777144432068,
    -0.15024352073669434,
    0.1455351859331131,
    -0.06488597393035889,
    -0.23522789776325226,
    0.0812925472855568,
    -0.041909851133823395,
    0.16268609464168549,
    -0.13165389001369476,
    -0.11971890181303024,
    -0.07543735951185226,
    -0.06760381162166595,
    0.13010083138942719,
    0.021470461040735245,
    0.008020401000976562,
    0.15771661698818207,
    -0.1412193477153778,
    -0.2510296106338501,
    -0.1231769248843193,
    -0.1418902575969696,
    -0.03477233648300171,
    0.010329809971153736,
    0.04534875229001045,
    0.017258374020457268,
    -0.1598888784646988,
    0.027657359838485718,
    0.03699643537402153,
    0.062365807592868805,
    -0.04150641709566116,
    -0.10969100147485733,
    0.21466824412345886,
    0.038587652146816254,
    -0.23111817240715027,
    -0.057168129831552505,
    0.04328908771276474,
    0.191488578915596,
    0.13210691511631012,
    -0.011108395643532276,
    0.012343929149210453,
    -0.061363015323877335,
    0.21032832562923431,
    -0.2895568907260895,
    -0.026913633570075035,
    0.14913709461688995,
    0.052804961800575256,
    0.11987654864788055,
    0.15052781999111176,
    -0.13672001659870148,
    0.16267159581184387,
    0.10020152479410172,
    -0.20453886687755585,
    0.0743858814239502,
    0.050352465361356735,
    -0.09409735351800919,
    0.05726863071322441,
    -0.03663226589560509,
    0.141190767288208,
    0.04231290891766548,
    -0.1334458440542221,
    -0.09874098747968674,
    0.18391276895999908,
    -0.14012444019317627,
    0.01737247034907341,
    0.18468599021434784,
    -0.15172336995601654,
    -0.2590441107749939,
    -0.2164456695318222,
    -0.008441506884992123,
    0.47793325781822205,
    0.21999426186084747,
    -0.07806633412837982,
    0.0564580038189888,
    -0.07369866967201233,
    -0.0048111979849636555,
    0.08509930968284607,
    0.06679485738277435,
    0.009882017970085144,
    0.015914589166641235,
    -0.09257037937641144,
    0.04271341860294342,
    0.2189972847700119,
    -0.03989055007696152,
    -0.0006817564135417342,
    0.29678648710250854,
    -0.027671024203300476,
    0.05691278353333473,
    -0.018183499574661255,
    0.09436868876218796,
    -0.11461646109819412,
    -0.015843218192458153,
    -0.08456023782491684,
    0.049518682062625885,
    -0.03902816027402878,
    -0.03584706783294678,
    0.010842839255928993,
    0.01593257673084736,
    -0.18006733059883118,
    0.12927651405334473,
    -0.03279199078679085,
    -0.02407652698457241,
    -0.16067096590995789,
    0.050424616783857346,
    -0.15866346657276154,
    0.05961793661117554,
    0.11696168780326843,
    -0.24320273101329803,
    0.14046306908130646,
    0.1485821157693863,
    0.013223537243902683,
    0.10048344731330872,
    0.012356627732515335,
    0.009781012311577797,
    -0.026675216853618622,
    -0.12501776218414307,
    -0.1588364541530609,
    -0.09407775104045868,
    0.054001953452825546,
    0.005142257548868656,
    0.012701334431767464,
    -0.009137898683547974
  ]
}