0.00852457 0.0161977 -0.157417 -0.0208454 0.00188108 0.109134 -0.0116803 -0.0627637 -0.0419322 0.203283 0.142803 0.0623212 0.0555587 -0.0733367 -0.0301348 -0.0240348 -0.0156923 0.147716 0.15921 0.0597074 0.0510701 -0.00663484 -0.0465513 0.184159 -0.0203523 0.122603 0.100951 -0.200963 0.128518 0.151668 -0.0202055 -0.0674404 0.000338533 -0.0971503 0.0700009 0.0612985 -0.0781851 -0.0330375 0.0277037 0.000993614 -0.0757037 -0.0720579 -0.141585 0.22314 -0.11421 -0.0392136 0.131949 0.0637357 -0.0483453 -0.119 0.0963441 0.0834142 -0.0352437 -0.0917532 0.0580401 0.111364 -0.0167097 0.117368 0.00204713 -0.00646783 -0.0552412 -0.147338 0.260394 -0.0181503 0.0757413 -0.187774 0.0342132 -0.0569871 0.0317245 0.0835371 -0.0193464 0.0743146 -0.0903611 -0.0910634 -0.0488461 -0.0746382 -0.0666938 0.23279 0.0133558 0.014292 -0.0259599 0.0894337 -0.0349147 -0.00913257 -0.00286607 -0.0689778 0.0563806 -0.0153737 0.085246 -0.0150827 -0.0396122 0.0307123 -0.054781 0.0324094 -0.00246523 -0.125415 0.00496059 0.00319135 0.0958638 -0.066623 0.083783 0.0913419 0.00543613 -0.0880034 -0.0650589 0.054778 0.0320238 -0.102323 0.0512023 0.0598438 0.0381892 0.0390675 0.0184462 -0.0985291 0.0330707 0.0639548 -0.0187696 -0.184939 -0.0368354 0.0247577 0.0369812 -0.150402 -0.014711 -0.0261837 -0.106869 0.155602 -0.00682677 0.0718677 
0.0668375 0.00933964 -0.157936 -0.0398901 0.0400689 0.102471 -0.0120351 -0.0433815 -0.0768867 0.141283 0.13146 0.0972506 0.0836882 -0.0748846 -0.0815736 -0.00915432 0.0323509 0.14166 0.0845649 0.0988401 0.109596 0.0338157 -0.0646081 0.230587 -0.0251438 0.116611 0.12453 -0.168771 0.120803 0.192601 -0.0836117 -0.0623063 -0.0254693 -0.0438407 0.0351964 0.00681208 -0.0736256 -0.0237091 0.0257198 -0.00769937 -0.0850233 -0.0457308 -0.0868825 0.231713 -0.0892958 -0.0278197 0.1537 0.0574438 -0.0825192 -0.0743657 0.148596 0.0604453 -0.0567705 -0.0655541 0.093874 0.0648074 -0.0381205 0.134776 0.0165867 -0.0644735 -0.0102481 -0.141365 0.245021 0.0110637 0.00681338 -0.221818 0.0176006 -0.0141013 0.0383062 0.0441298 -0.0105994 0.0466166 -0.0790702 -0.123887 -0.0596984 -0.0431416 -0.0500861 0.228498 0.0276105 0.0562566 0.0136808 0.12232 0.00304457 -0.0311371 0.00369182 -0.0692359 0.0751304 -0.0077086 0.0889013 0.00782098 -0.0518013 -0.0178284 -0.099044 0.0700283 -0.0365811 -0.106878 0.0140892 -0.00726907 0.0709345 -0.116266 0.0958669 0.111305 0.00931688 0.00471629 -0.121473 0.0252652 -0.0337482 -0.0498721 0.00794865 0.0125961 0.0921589 0.0610319 -0.0386976 -0.0338071 0.0114585 0.0707654 -0.0884392 -0.186102 -0.0895791 0.0226167 -0.000191107 -0.0847307 0.00265538 -0.0379157 -0.0986034 0.134627 -0.0200695 0.000942718 
0.0498654 0.00454794 -0.157727 -0.0253909 0.0195136 0.120008 -0.0170213 -0.0361437 -0.0947158 0.165347 0.127155 0.0901395 0.0823118 -0.089492 -0.0610259 -0.0226428 0.0197278 0.130989 0.120717 0.100554 0.0865683 -0.00654337 -0.0417201 0.237704 -0.0131026 0.110527 0.122858 -0.194727 0.111364 0.166433 -0.060919 -0.0800058 -0.0163621 -0.0531864 0.0310085 0.0166374 -0.0894236 -0.0311914 0.00991594 -0.0147957 -0.0780912 -0.0785098 -0.100653 0.230811 -0.107827 -0.0360109 0.155159 0.0579051 -0.0857306 -0.0718453 0.146963 0.0532568 -0.0342765 -0.0802533 0.0873258 0.0786055 -0.0259064 0.130393 0.0353513 -0.0626862 -0.0264626 -0.127253 0.242461 -0.00971187 0.0338731 -0.200311 0.0149432 -0.0349775 0.0161052 0.0449649 -0.0341708 0.0564618 -0.0959054 -0.116636 -0.0390512 -0.0451391 -0.0456427 0.23057 0.0419403 0.0772905 -0.0211921 0.0722653 -0.00159258 -0.0289919 0.000400322 -0.0693757 0.0687898 -0.0112343 0.0925524 -0.000662446 -0.0582882 0.000740076 -0.0762377 0.0654958 -0.0404508 -0.111838 0.019829 0.00859925 0.0758293 -0.115281 0.0980313 0.112262 0.00836209 -0.019621 -0.103058 0.032503 -0.0164843 -0.0509326 0.0141705 0.0153982 0.0750758 0.0711987 -0.00354161 -0.0695337 0.015758 0.0740355 -0.0751123 -0.174266 -0.0671011 0.0476297 0.00472039 -0.125831 -0.0150988 -0.0439782 -0.105404 0.153113 -0.0156298 0.0240143 
0.0311946 0.021317 -0.168771 -0.0211456 0.0338078 0.112849 -0.00560429 -0.0893272 -0.0465748 0.161294 0.131224 0.0874847 0.0688652 -0.0537257 -0.0697233 -0.0196747 0.0116453 0.160763 0.134893 0.0728354 0.101798 -0.0013401 -0.0669268 0.190975 -0.00958094 0.108131 0.0857813 -0.184801 0.128384 0.217267 -0.0475423 -0.041842 0.00292597 -0.0797943 0.0798953 0.0418062 -0.0729524 -0.0408075 0.0408862 -0.0452872 -0.0851773 -0.0604463 -0.0888173 0.216429 -0.0983402 -0.0232466 0.143286 0.0577845 -0.0728239 -0.117408 0.103339 0.0810818 -0.0158358 -0.0841995 0.0905183 0.105485 -0.0332951 0.12653 -0.0187048 -0.0310473 -0.0301118 -0.132495 0.268986 -0.0201911 0.061789 -0.182145 0.0056011 -0.0401613 0.00573019 0.0682984 -0.00521223 0.0467554 -0.107861 -0.136341 -0.0688766 -0.0314837 -0.0408597 0.200059 0.0162911 0.0224724 -0.0183276 0.115531 -0.0209657 -0.0027779 0.000486245 -0.0732428 0.0504086 -0.0171397 0.0887234 0.0195089 -0.0380045 -0.00609412 -0.0752611 0.0642409 -0.0154169 -0.117938 -0.0012175 0.0127092 0.0896792 -0.0785378 0.118035 0.10824 0.0042081 -0.0602403 -0.0980223 0.0618977 0.0170908 -0.0819377 0.0278786 0.04716 0.0548723 0.0122778 -0.0241447 -0.0758008 0.0315086 0.0771808 -0.0491568 -0.176765 -0.0496966 0.0420533 0.0254732 -0.133814 -0.00961291 -0.0458178 -0.100285 0.168997 0.0111187 0.0389587 
0.0287813 0.0553264 -0.182803 -0.0356499 0.0276703 0.136734 -0.0216086 -0.115666 -0.0498503 0.165952 0.126133 0.0638678 0.0727463 -0.0434408 -0.0816222 -0.0126342 0.0109255 0.17367 0.132106 0.0521876 0.0951747 0.0059774 -0.0674668 0.166082 -0.0177904 0.101887 0.0667259 -0.165127 0.132331 0.22346 -0.0456531 -0.0345103 -0.0103064 -0.0876467 0.0995638 0.0476222 -0.0713095 -0.0602102 0.0661475 -0.0465489 -0.11235 -0.0601514 -0.0827499 0.202099 -0.0771222 -0.0153118 0.142293 0.0835932 -0.0877506 -0.105955 0.0956326 0.106007 -0.00499461 -0.082663 0.0637556 0.103152 -0.0166072 0.117499 -0.0192516 -0.0406052 -0.0265059 -0.0926189 0.282777 -0.0301374 0.0450252 -0.167353 0.00349549 -0.0299871 -0.00970801 0.0766036 0.000301752 0.0353055 -0.109389 -0.136098 -0.0828542 -0.0322679 -0.0429305 0.168087 0.0182854 0.0120817 0.00279193 0.121857 -0.0273436 0.006004 -0.00982683 -0.0615627 0.0232757 -0.0357033 0.0978154 0.0359666 -0.030866 -0.00523299 -0.0610176 0.0756164 -0.00314765 -0.115725 -0.00500708 0.0367301 0.0701683 -0.0715202 0.144757 0.121944 -0.00763171 -0.0627316 -0.0882953 0.0743982 0.02377 -0.0918264 0.0236754 0.0731337 0.0645053 -0.00551383 -0.0117171 -0.06408 0.0200765 0.0801601 -0.0495978 -0.152909 -0.0403193 0.0306414 0.0281728 -0.163146 0.00842821 -0.065226 -0.110761 0.166921 0.0110102 0.0360724 
0.0285449 0.0426264 -0.158784 -0.0261578 0.0257362 0.125131 -0.00834357 -0.104541 -0.0457292 0.180881 0.133772 0.0713701 0.0825806 -0.0675465 -0.0857694 -0.0183304 -0.0161936 0.186664 0.106922 0.0756656 0.113528 -0.0300323 -0.0658547 0.159051 -0.0135602 0.107946 0.048215 -0.179206 0.130628 0.215035 -0.0520049 -0.014251 -0.00656899 -0.0691802 0.0955546 0.0357687 -0.0835632 -0.030566 0.0675493 -0.0797204 -0.10067 -0.0973105 -0.0908356 0.196921 -0.0829488 -0.0391134 0.129359 0.0867224 -0.0988255 -0.107509 0.088528 0.109782 -0.0165879 -0.0769469 0.0758499 0.0955669 -0.0206805 0.095617 -0.0393996 -0.0507746 -0.0198865 -0.115458 0.28486 -0.0107786 0.0536031 -0.152039 -0.0118651 -0.0232203 -0.0153993 0.0746029 -0.0120203 0.0306609 -0.115826 -0.128557 -0.08749 -0.0453061 -0.0304619 0.164175 0.0289702 0.0246507 -0.0233089 0.103376 -0.0257675 0.00323295 -0.0144064 -0.068214 0.0374673 -0.00626043 0.127368 0.0435772 -0.0218483 -0.0110082 -0.057621 0.0845709 -0.0368676 -0.12475 -0.0162764 0.0310012 0.0824172 -0.0794642 0.162637 0.114392 -0.0178342 -0.0614918 -0.0508192 0.0746923 0.0315833 -0.0665127 0.0535766 0.053672 0.0377489 0.0170547 -0.034786 -0.0637154 0.0513101 0.0739955 -0.0479703 -0.149737 -0.0236898 0.0443471 0.0284466 -0.156565 0.00569041 -0.0542247 -0.0944076 0.167978 0.0394478 0.0355793 
0.0369145 0.0249449 -0.151735 -0.0187309 0.0315664 0.129526 -0.0115626 -0.0958289 -0.041826 0.154329 0.145788 0.0843143 0.0883994 -0.0579354 -0.105194 -0.0231259 -0.025638 0.178937 0.0877904 0.0758644 0.142754 -0.0466532 -0.0620808 0.182022 0.00852778 0.088061 0.0625514 -0.164319 0.123884 0.216474 -0.0526716 -0.0454462 -0.0103572 -0.0612067 0.0666867 0.0273788 -0.118363 -0.0478371 0.0576987 -0.0810266 -0.0954709 -0.0913441 -0.086271 0.200387 -0.0775689 -0.0792336 0.113892 0.077083 -0.0881022 -0.10238 0.0877962 0.0976565 -0.0142686 -0.0779104 0.0774254 0.0958487 -0.034786 0.117407 -0.0408556 -0.0618206 -0.019709 -0.109394 0.293009 0.00636741 0.0328993 -0.129825 -0.0205021 -0.0144541 -0.0212408 0.0676923 -0.00983695 0.0366104 -0.110411 -0.149939 -0.0778315 -0.0315811 -0.0190575 0.142028 0.0222332 0.0515829 -0.0281153 0.0837274 -0.00256501 0.00230019 -0.0288835 -0.0539788 0.0488216 -0.0013242 0.124754 0.0354998 -0.0235193 -0.0293816 -0.0615429 0.0999204 -0.0480883 -0.131037 -0.0413556 0.0230064 0.0809576 -0.0805149 0.171062 0.1079 -0.0149343 -0.0610991 -0.053229 0.0874219 0.0253628 -0.0579064 0.0395251 0.0224724 0.0454055 0.0225204 -0.0324468 -0.0477285 0.0563475 0.093481 -0.0610772 -0.106924 -0.0211058 0.0559108 0.0129217 -0.166238 -0.0182434 -0.0685431 -0.099378 0.192308 0.0362348 0.0454946 
0.0430593 0.0316099 -0.171513 -0.0142233 0.0349278 0.140986 -0.00184247 -0.0945044 -0.0531363 0.159084 0.131832 0.0830818 0.103811 -0.0586876 -0.110301 -0.0247985 0.0035053 0.183796 0.0927731 0.087192 0.143764 -0.0572054 -0.0669577 0.180992 -0.00762018 0.0804347 0.0244989 -0.176847 0.123392 0.226289 -0.0507263 -0.0130139 -0.0204754 -0.0646235 0.0757815 0.025196 -0.099863 -0.0447443 0.0617426 -0.0929 -0.095019 -0.0844183 -0.0823591 0.181142 -0.0798522 -0.0685156 0.125729 0.0832611 -0.0936609 -0.0995307 0.0883865 0.0954992 -0.0037488 -0.0731366 0.0763866 0.0919518 -0.0214714 0.1077 -0.032314 -0.0700073 -0.0141616 -0.0842315 0.283358 -0.0299264 0.032747 -0.13436 -0.00970427 -0.0202546 -0.0322654 0.0460607 -0.010759 0.0359102 -0.118758 -0.139911 -0.0905816 -0.0183989 -0.0147517 0.144514 0.0365982 0.0470267 -0.0358931 0.089369 -0.0109223 0.0055209 -0.0126747 -0.0449442 0.0421545 -0.00800698 0.128649 0.0256693 -0.026784 -0.0247134 -0.0502426 0.0952484 -0.0443968 -0.139326 -0.0216845 0.0379461 0.0571156 -0.0774208 0.180066 0.113729 -0.016297 -0.0392742 -0.0629869 0.0887238 0.0281474 -0.0545036 0.0300889 0.0489185 0.0354807 0.00549998 -0.0367635 -0.0596397 0.0417134 0.0897061 -0.0654527 -0.122172 -0.0299468 0.0559281 -0.00102311 -0.167751 -0.0099533 -0.0678463 -0.109049 0.184164 0.0155608 0.0350965 
0.0440603 0.0285165 -0.163424 -0.00157497 0.0289564 0.152297 -0.000739817 -0.0983669 -0.0492799 0.143218 0.127873 0.0626516 0.112528 -0.0534039 -0.107935 -0.013144 -0.0238223 0.176588 0.0745404 0.0778122 0.173107 -0.0886982 -0.0458991 0.181771 0.0111424 0.0621603 -0.00387403 -0.198788 0.123462 0.223352 -0.0374582 0.0100553 -0.0305065 -0.0535916 0.0691209 0.0282343 -0.115849 -0.0271563 0.0614866 -0.109161 -0.0931111 -0.0974526 -0.0835428 0.167707 -0.0695193 -0.0841111 0.123275 0.0863297 -0.100275 -0.106197 0.0735625 0.0878941 0.0192902 -0.0724596 0.0802199 0.0938476 -0.000287125 0.110987 -0.0199433 -0.101341 -0.0144063 -0.0626358 0.282191 -0.028636 0.0297101 -0.0893963 -0.0127831 -0.0100362 -0.0311729 0.048791 -0.028449 0.0423692 -0.126916 -0.139645 -0.0805641 -0.0289477 -0.0150435 0.11507 0.0344402 0.0695541 -0.0348249 0.0773546 -0.0204443 -0.0150928 -0.0239849 -0.0254701 0.0364344 -0.00781949 0.12156 0.0237683 -0.00191568 -0.0282682 -0.048309 0.0835065 -0.061267 -0.12959 -0.0370595 0.0644126 0.0686332 -0.0694476 0.200563 0.0978522 -0.0132144 -0.0323065 -0.0565765 0.0895132 0.0201241 -0.0358101 0.0434457 0.0318229 0.0209801 0.0268284 -0.0487852 -0.0771639 0.0624778 0.108824 -0.0740095 -0.106784 -0.0155009 0.064001 0.00374518 -0.169379 -0.00793329 -0.0635071 -0.124776 0.191585 0.019458 0.0452754 
0.0432359 -0.0118633 -0.132768 0.0096295 0.0517888 0.144476 0.0024185 -0.0897397 -0.065989 0.121381 0.120634 0.0944178 0.109138 -0.0446925 -0.114555 -0.0202809 -0.0407816 0.192404 0.06581 0.0861708 0.197478 -0.100329 -0.0328486 0.206351 0.0278952 0.0403312 -0.00243998 -0.189645 0.0940991 0.223798 -0.059032 -0.0217897 -0.0293685 -0.0338463 0.0541222 0.0179676 -0.139798 -0.0578767 0.0506586 -0.119162 -0.0785501 -0.0885747 -0.0544355 0.149199 -0.081054 -0.117579 0.116133 0.0691969 -0.0854037 -0.0823915 0.0806619 0.041621 0.0229855 -0.0575107 0.101686 0.0935453 0.00286561 0.119762 -0.0327755 -0.0906985 0.00427327 -0.0431362 0.265498 -0.0114148 0.0274541 -0.0729905 -0.0398335 -0.00629091 -0.0438297 0.0442721 -0.021114 0.0582502 -0.119787 -0.153174 -0.0775922 0.00307602 0.00119242 0.0876558 0.0443014 0.0682862 -0.0442429 0.0653493 0.00662102 0.000248551 -0.046488 -0.00750045 0.0523819 0.010625 0.116802 0.0268388 -0.00217965 -0.0357759 -0.0422364 0.0974424 -0.0853119 -0.121338 -0.0745252 0.0660696 0.0694891 -0.0655689 0.209998 0.0839577 -0.013882 -0.0399487 -0.031592 0.0948767 0.0107678 -0.0348304 0.0104523 0.0151581 0.0177625 0.0238471 -0.0294576 -0.0703829 0.0584471 0.130199 -0.0674063 -0.0612611 -0.0310268 0.0807288 -0.00683369 -0.171517 -0.0312634 -0.0854492 -0.140373 0.222636 0.0132611 0.0494835 
0.066505 -0.0211141 -0.0459301 0.0201879 0.0809098 0.181027 0.0212015 -0.0671989 -0.0659501 0.0692129 0.104855 0.057813 0.112154 -0.0558401 -0.0314029 -0.0252028 -0.0527179 0.184209 0.00313063 0.0653984 0.233751 -0.0676602 0.0165962 0.252034 0.0558998 -0.046587 -0.0516375 -0.213164 0.0897137 0.191688 -0.00234941 -0.0467247 -0.0584702 0.0159158 0.0731671 0.0278166 -0.147734 -0.0588901 0.0171568 -0.113302 -0.0517908 -0.0788621 -0.0746034 0.136098 -0.0990869 -0.104752 0.0928662 0.0873085 -0.089495 -0.0513852 0.0795458 0.0119901 0.0296063 -0.0723056 0.0897454 0.0772999 0.0050832 0.14278 -0.0221767 -0.0944453 -0.014414 -0.000311037 0.210274 -0.0311703 0.0367436 -0.0707262 -0.0341704 0.00641378 -0.078752 0.0781464 -0.0143907 0.0897265 -0.121223 -0.166634 -0.0735064 -0.00131464 -0.0229202 0.0677621 0.0691161 0.126159 -0.0215194 0.0339694 0.00957724 -0.0267635 -0.0466555 -0.00598952 0.0629689 0.00219973 0.0389463 0.0561313 0.0505559 -0.0478572 -0.0473382 0.0761938 -0.12325 -0.106111 -0.102321 0.0693828 0.0549382 -0.0473373 0.218018 0.0843941 -0.021013 -0.0379362 -0.0262292 0.0737469 -0.0080883 -0.0240525 0.0549955 0.000869989 0.0229264 0.0504784 -0.0497738 -0.0763832 0.0833017 0.171044 -0.0867542 -0.0332703 -0.0550886 0.138204 0.00597235 -0.155376 -0.0723903 -0.040935 -0.127569 0.208224 0.0205853 0.0402985 
0.00120834 0.0122753 0.0064718 -0.0147044 0.0674719 0.21721 0.0272958 -0.0822045 -0.0702958 0.0612817 0.0778232 0.0560861 0.0893272 -0.0202817 0.0279751 -0.0618669 -0.115546 0.128638 0.0252091 -0.0011131 0.184682 -0.0717335 -0.013285 0.198113 0.0869537 -0.0356814 -0.0690848 -0.159929 0.0780127 0.14609 0.0467061 -0.0900711 -0.0704233 -0.000172806 0.068636 0.0721775 -0.16524 -0.107544 0.0221123 -0.0694628 0.0100332 -0.0897627 -0.0524796 0.109254 -0.0914854 -0.0885612 0.0780296 0.0592016 -0.109353 -0.0917017 0.0285471 -0.0160164 0.0299619 -0.0843381 0.0750093 0.121818 -0.0604683 0.209587 -0.068639 -0.0486982 -0.0410856 0.0487852 0.212825 -0.0453425 0.095043 0.0238284 -0.0300721 0.00454119 -0.11605 0.0946874 0.0147858 0.120256 -0.107517 -0.152267 -0.00708913 0.0415056 -0.0430778 0.00494504 0.0688664 0.0911524 -0.0450235 0.00943805 0.0434122 0.0152693 -0.112205 -0.0194812 0.0914078 -0.0036369 0.0110548 0.0654874 0.0480232 -0.0608098 0.00409268 0.0791734 -0.128274 -0.0964592 -0.105603 0.0391879 0.0601363 0.00124118 0.157375 0.064923 -0.0480318 -0.0902694 -0.0411239 0.135977 -0.0152535 -0.0266785 0.00107473 -0.0213113 0.0437931 0.0171822 -0.0402754 -0.0826363 0.0874686 0.163132 -0.0925009 0.0335156 -0.0184571 0.156125 0.0449611 -0.210413 -0.0973441 -0.0587513 -0.107492 0.248412 0.00435688 0.0578404 
0.057037 -0.0545595 0.0230114 -0.00506136 0.092004 0.1669 0.00840296 -0.045082 -0.0980857 -0.0113061 0.0710042 0.119422 0.123472 -0.0511774 -0.0454945 -0.0446517 -0.0970175 0.144957 -0.0673774 0.106574 0.231307 -0.0642437 0.0363317 0.276346 0.0326941 -0.0391869 -0.0402887 -0.189997 0.0441483 0.149946 -0.0170708 -0.0751023 -0.075845 0.0570522 0.00645857 0.0248425 -0.186757 -0.0415589 -0.035035 -0.0494427 -0.0144099 -0.0641962 -0.0684692 0.126924 -0.105793 -0.110101 0.108762 0.0439741 -0.107818 0.0116924 0.0799813 -0.0589029 -0.008152 -0.0468997 0.101372 0.0596082 -0.0260725 0.200267 -0.0368023 -0.0726128 0.00229561 0.0432289 0.189081 0.00175424 0.0418383 -0.0940298 -0.0346208 0.0112991 -0.1073 0.0779525 -0.0039957 0.094376 -0.0846417 -0.119935 -0.0339692 0.0326476 -0.0308045 0.0271129 0.0756455 0.145911 -0.0278567 0.00452408 0.0326732 -0.0178238 -0.104944 -0.00232591 0.113497 0.0162433 -0.00342213 0.0464323 0.0438457 -0.0831584 -0.0236876 0.0857442 -0.147041 -0.0722001 -0.115066 0.0514521 0.0547825 -0.0348758 0.145146 0.0613401 -0.0597764 0.0173218 -0.0280692 0.0734666 -0.0736369 0.0307752 0.000443407 -0.0627344 0.0326666 0.0849807 -0.0620086 -0.0379403 0.0476982 0.187768 -0.10085 0.000841257 -0.0569907 0.183813 -0.015118 -0.119201 -0.11146 -0.0519132 -0.124709 0.209837 -0.0226718 0.0176023 
0.026082 -0.0151951 0.0853687 0.0100685 0.0568705 0.231501 0.0176509 -0.0891113 -0.105125 -0.0130504 0.06082 0.0818575 0.0852736 -0.0260656 0.0481237 -0.0485766 -0.143469 0.0971886 -0.0104098 0.0053665 0.196293 -0.0246404 0.0257187 0.205378 0.0825778 -0.0460239 -0.0871441 -0.175021 0.0473507 0.132527 0.0501324 -0.0648396 -0.101045 0.0352824 0.0454747 0.0571765 -0.168209 -0.0824437 0.0337902 -0.00651988 0.0229824 -0.0776418 -0.0664854 0.0558917 -0.100845 -0.104007 0.0888177 0.0129609 -0.106915 -0.0407136 0.0728801 -0.0304311 0.0327743 -0.0393748 0.0702204 0.0854261 -0.012993 0.211545 -0.0646811 -0.0280168 -0.0383146 0.0784232 0.16496 -0.0599808 0.097326 0.00396741 0.00792995 -0.00618659 -0.131233 0.114032 0.0127894 0.143339 -0.0927082 -0.0940255 0.0123297 0.0327692 -0.0568649 -0.0524247 0.0618032 0.164932 -0.0084546 -0.0110652 0.077308 0.00409622 -0.112387 -0.0191857 0.109649 -0.0150065 -0.0682223 0.0441282 0.0523461 -0.0716473 0.0200276 0.106671 -0.174152 -0.0798047 -0.0971065 0.0496785 0.0685117 0.0221633 0.125543 0.0599441 -0.0729908 -0.0188103 -0.0144215 0.107491 -0.0265019 0.00964957 -0.0108418 -0.0447725 0.0202346 0.0409889 -0.0530216 -0.0721486 0.0724695 0.182791 -0.0990672 0.0661381 -0.0427193 0.181017 0.0428091 -0.180492 -0.104062 -0.0820334 -0.0835889 0.24299 0.00639725 0.0697629 
0.0405093 -0.0460508 0.086209 -0.00128521 0.0469448 0.231296 0.0177694 -0.0615926 -0.119197 -0.0114717 0.0570365 0.0949981 0.0908895 -0.0391875 0.0492847 -0.0596312 -0.150747 0.0905129 -0.0082252 0.0193584 0.185633 -0.0172073 0.0302276 0.222658 0.0614966 -0.0203651 -0.0627764 -0.190439 0.0373855 0.112403 0.0319674 -0.065762 -0.103556 0.0502407 0.0300942 0.0505926 -0.173229 -0.0733642 0.0103529 -0.00911721 0.0293179 -0.0912522 -0.0805722 0.079447 -0.116952 -0.108123 0.0922588 0.017387 -0.119345 -0.0207176 0.0833145 -0.0505413 0.0269322 -0.0364393 0.0877205 0.0786947 -0.0163747 0.218493 -0.0544915 -0.0364705 -0.0307433 0.0706467 0.171461 -0.0429838 0.094625 -0.010563 0.00595907 -0.00881837 -0.120395 0.11467 -0.00993073 0.133671 -0.0910563 -0.0798029 0.00707467 0.0164984 -0.0571522 -0.0415731 0.0745777 0.16711 -0.00654192 -0.0211088 0.0690643 -0.0196151 -0.10918 -0.0379218 0.124793 -0.00820877 -0.0551018 0.0520772 0.0635285 -0.0637798 0.00613418 0.101736 -0.180724 -0.0613929 -0.0855772 0.0439707 0.0777569 0.00804097 0.124117 0.0625193 -0.0716779 -0.0232616 -0.0213624 0.089532 -0.0476274 0.00658885 -0.0213603 -0.0546728 0.0358581 0.0720619 -0.0471402 -0.0881471 0.0791358 0.177393 -0.0842662 0.0381175 -0.038518 0.181229 0.0493493 -0.180688 -0.0904369 -0.0772641 -0.0860498 0.228368 0.0130116 0.062811 
0.0487769 -0.0351756 0.069875 -0.0123537 0.0398027 0.222458 0.0242717 -0.0376768 -0.14599 0.00511202 0.054651 0.0851187 0.11455 -0.0649008 0.0251034 -0.0439136 -0.157452 0.103536 -0.0294794 0.0333153 0.200455 -0.0192583 0.0304223 0.229551 0.0327766 -0.0289497 -0.0670687 -0.199914 0.0394144 0.127355 -0.0120133 -0.0723573 -0.112609 0.0608823 0.0221288 0.0237147 -0.171097 -0.0746883 0.00368825 0.00411363 0.00966352 -0.103047 -0.0621383 0.0934765 -0.109497 -0.106494 0.111937 0.0245421 -0.137346 0.00406805 0.106723 -0.0701852 0.00349659 -0.0160728 0.082978 0.0667428 0.0045381 0.191835 -0.0289337 -0.0469053 -0.00651547 0.0757309 0.159188 -0.0252823 0.0691984 -0.0485306 -0.00191661 -0.0166919 -0.106579 0.0765262 -0.0228267 0.123084 -0.0817267 -0.0789741 0.00194407 0.0232278 -0.0561187 -0.024039 0.0837897 0.171783 0.0181181 -0.0378611 0.0610119 -0.00906079 -0.122007 0.00277479 0.121115 -0.0242796 -0.041878 0.0525713 0.0482767 -0.0711592 -0.012804 0.0911752 -0.202313 -0.0502397 -0.0912262 0.0617465 0.0737974 0.00665996 0.136549 0.0725514 -0.0593769 0.00685875 -0.0148151 0.0651592 -0.0679248 0.0468881 -0.0419234 -0.05118 0.0349087 0.0711096 -0.0475077 -0.0920286 0.0484225 0.193784 -0.0801583 0.0446906 -0.0611718 0.165623 0.028612 -0.178933 -0.0789654 -0.0746983 -0.102567 0.215171 -0.0185139 0.049359 
0.0211385 -0.00814624 0.0410582 0.0190919 0.0399814 0.240248 0.00694059 -0.0967472 -0.0870281 0.0127003 0.0812738 0.0759565 0.0792547 -0.0259575 0.0264034 -0.0348532 -0.118527 0.117551 0.0186415 -0.014382 0.192249 -0.0462221 0.0126188 0.212696 0.0907347 -0.0296309 -0.0648288 -0.186971 0.0556629 0.14201 0.0650122 -0.0481131 -0.0907554 0.0125722 0.038854 0.0622133 -0.174742 -0.0951986 0.0510822 -0.00553366 0.00818581 -0.0795588 -0.0755178 0.0681978 -0.0819645 -0.127422 0.0902143 0.00510083 -0.109916 -0.0792458 0.0785461 -0.0213695 0.0484664 -0.0578973 0.0496611 0.113486 -0.00501795 0.221649 -0.052177 -0.0338867 -0.0502091 0.0634216 0.192534 -0.0850066 0.0970317 0.0154617 0.0093796 -0.0198108 -0.131935 0.116042 0.00146545 0.136097 -0.108391 -0.108274 0.00272911 0.0162817 -0.0435435 -0.0339263 0.0347927 0.141615 -0.0302659 0.00394008 0.0655308 -0.00860722 -0.115049 -0.00883291 0.0954529 -0.0387031 -0.0550921 0.0267832 0.0314282 -0.0659119 0.0127138 0.10137 -0.128922 -0.066504 -0.0957028 0.0508847 0.0633193 0.0337876 0.123923 0.0495481 -0.0744392 -0.015022 -0.0110178 0.115537 -0.0110288 -0.0230719 -0.0233588 -0.0455378 0.00338269 0.0349275 -0.028615 -0.0876807 0.0830999 0.16757 -0.0978977 0.0471173 -0.01608 0.161385 0.0484881 -0.202844 -0.0925009 -0.0933927 -0.0851556 0.252867 -0.00448795 0.0744394 
0.0325932 -0.0424492 0.0483868 0.00465685 0.0673612 0.226866 0.00718556 -0.0828978 -0.108978 -0.0290018 0.0580276 0.115929 0.0855991 -0.0273821 0.0142545 -0.0368651 -0.123795 0.104419 -0.00154957 0.018983 0.203212 -0.030253 0.0244663 0.226603 0.0762297 -0.0200815 -0.0468157 -0.192427 0.0262686 0.142639 0.0297342 -0.0601113 -0.082359 0.0408347 0.0314249 0.0554549 -0.162704 -0.091589 0.0216763 -0.0146948 0.026819 -0.0684337 -0.0379917 0.0815496 -0.101182 -0.1004 0.117465 -0.00846429 -0.124459 -0.0401895 0.0799712 -0.0740298 0.0369817 -0.0344362 0.0972365 0.0996275 -0.0174598 0.232785 -0.0568763 -0.0378605 -0.0265728 0.0702993 0.185845 -0.0676319 0.105128 -0.0159215 -0.01971 -0.00507237 -0.122464 0.111323 -0.00163732 0.126102 -0.101824 -0.115324 0.00495762 0.0489787 -0.0414623 -0.0237382 0.0476683 0.134151 -0.0261965 0.00677157 0.0665288 -0.00568381 -0.134152 -0.0101694 0.114862 -0.0199672 -0.0672293 0.0450563 0.0439016 -0.0846707 -0.00557935 0.0977436 -0.146355 -0.0416885 -0.0942429 0.0579257 0.0729025 0.0175515 0.106944 0.0468417 -0.0702727 -0.00324389 -0.0280214 0.0965347 -0.0537114 0.00553911 -0.0618092 -0.0623845 0.0177517 0.0394488 -0.0378143 -0.0787059 0.0702706 0.172309 -0.0995306 0.0322736 -0.0399692 0.17854 0.0477627 -0.166999 -0.0902914 -0.0898276 -0.0957875 0.239913 -0.008734 0.0503399 
-0.0159254 0.0108751 0.0149739 -0.0159418 0.041592 0.210186 -0.0218399 -0.127292 -0.0804862 -0.0123347 0.0828945 0.0818997 0.0631115 0.00582638 0.00855736 -0.026783 -0.144451 0.0549766 0.0468153 -0.00316976 0.177034 -0.0401424 0.00699599 0.142601 0.0853568 0.0314302 -0.0401423 -0.165222 0.079936 0.133991 0.0619568 -0.0798737 -0.0579158 -0.035466 0.049961 0.0973343 -0.171803 -0.0563577 0.063711 0.00088697 -0.00246625 -0.0524162 -0.0781699 0.0810565 -0.0740112 -0.0603256 0.108703 -0.0107048 -0.120245 -0.111291 -0.00253145 0.0103884 0.0493569 -0.0570852 0.0610996 0.112174 -0.0310222 0.242435 -0.10146 -0.025655 -0.0600758 0.0489212 0.253887 -0.0493076 0.125882 0.0308952 0.00069375 0.015792 -0.091358 0.107164 0.0305979 0.118794 -0.100658 -0.115849 0.0456668 0.038395 -0.0758149 -0.0375833 0.0225554 0.128341 -0.0333322 0.0147144 0.0564798 0.0117765 -0.137761 -0.0242062 0.0948536 -0.0115435 -0.0523055 0.0155511 0.0438706 -0.0609943 0.0124495 0.119616 -0.10303 -0.0926163 -0.0753216 0.0515271 0.0792286 0.0205413 0.0812638 0.0404829 -0.0845778 -0.0601547 -0.0563736 0.158511 0.00380477 -0.00527628 -0.00476245 -0.0638115 0.0312188 0.0152002 -0.0479193 -0.070847 0.093522 0.177186 -0.12869 0.0412558 -0.00280984 0.147921 0.038677 -0.19052 -0.0887853 -0.0926938 -0.0898987 0.271917 0.0092121 0.08673 
-0.0196895 0.00684499 0.0256413 -0.00794527 0.0427634 0.215587 -0.0184946 -0.128773 -0.0671698 -0.0245611 0.0696597 0.0858627 0.0583999 0.00192521 0.0168354 -0.0267092 -0.142187 0.0460662 0.0383377 -0.00327577 0.171627 -0.0475637 0.0107872 0.15995 0.0919863 0.0222212 -0.0463248 -0.172441 0.0662443 0.123812 0.0808813 -0.0685768 -0.0579786 -0.0199478 0.0456259 0.10269 -0.158802 -0.052775 0.0556918 -0.00111711 0.0158317 -0.0565168 -0.0710296 0.0627088 -0.0659887 -0.0624943 0.109065 -0.0148153 -0.120748 -0.105355 -0.00818065 -0.0119324 0.0627701 -0.0582813 0.0710034 0.120395 -0.0361426 0.250778 -0.102122 -0.0305465 -0.0663294 0.0611958 0.24049 -0.0756339 0.132566 0.0470417 0.0029159 0.0120641 -0.105739 0.107769 0.0212538 0.120563 -0.111744 -0.106839 0.0554966 0.0441229 -0.0665387 -0.0347991 0.0260216 0.123335 -0.0434606 0.0199941 0.0539265 0.00537682 -0.138404 -0.0206416 0.0952183 -0.0096465 -0.0660689 0.0176449 0.0526027 -0.0692427 0.0263198 0.115313 -0.0994803 -0.0735405 -0.07491 0.0463789 0.0834095 0.0258475 0.074221 0.019817 -0.0960676 -0.0490153 -0.0543756 0.155474 -0.00422899 -0.0140513 -0.021617 -0.0612221 0.0205361 0.0219793 -0.0414237 -0.0749569 0.096145 0.172146 -0.135413 0.0394402 -0.00244408 0.159282 0.050777 -0.179102 -0.0911683 -0.0849868 -0.0937277 0.271032 0.000356251 0.0744158 
0.0266095 -0.0350762 0.0158368 -0.00405148 0.079042 0.232895 -0.0110812 -0.0986221 -0.082187 -0.0246799 0.0599807 0.102587 0.0698836 -0.0025358 0.0167652 -0.00622518 -0.0943664 0.0985205 0.0287427 0.00567092 0.208379 -0.0254257 0.0224632 0.220682 0.0936233 0.00664625 -0.0318724 -0.192689 0.0615737 0.141126 0.063907 -0.0401141 -0.0689208 0.0200178 0.0389486 0.085343 -0.15125 -0.0834198 0.0446581 -0.0301131 0.0146242 -0.0424965 -0.036976 0.0854693 -0.0787224 -0.0984145 0.124819 -0.00218862 -0.114926 -0.0761264 0.0486403 -0.0540904 0.0552087 -0.0542159 0.0969824 0.11766 -0.0142928 0.25785 -0.0633528 -0.0568359 -0.0508522 0.0544278 0.223758 -0.0875099 0.110032 0.0151969 -0.0226896 0.00542622 -0.108884 0.131898 -0.00628533 0.130344 -0.127087 -0.120311 0.00501881 0.0287403 -0.0362707 0.000288105 0.0290162 0.10026 -0.0229091 0.052811 0.0556151 -0.0215855 -0.116576 -0.0274769 0.0972354 -0.00507134 -0.0578599 0.0382753 0.0660345 -0.064125 -0.0270572 0.101687 -0.0826779 -0.0299444 -0.086348 0.0776627 0.0642421 0.0187131 0.0966931 0.0191011 -0.0744986 -0.0189537 -0.0605576 0.122009 -0.0475037 -0.0454571 -0.0305958 -0.0667801 0.0146006 0.0472672 -0.0376613 -0.0774149 0.106816 0.160647 -0.0980547 -0.0030153 -0.0244854 0.168501 0.0660844 -0.158103 -0.0610024 -0.0889897 -0.123634 0.243834 0.0039579 0.0559019 
-0.0162472 0.0324317 0.0123905 -0.00952297 0.0596997 0.211063 0.00427865 -0.12093 -0.0575734 -0.00377556 0.0797263 0.0810495 0.0736753 -0.00791681 -0.00599525 -0.0244219 -0.142076 0.0795621 0.00068321 -0.000660965 0.194896 -0.0602749 -0.00366887 0.169306 0.0941158 -0.0101716 -0.0568855 -0.152526 0.0893672 0.153532 0.0637523 -0.0618004 -0.0612256 -0.0112129 0.0446929 0.0828316 -0.164619 -0.0683003 0.0416402 -0.0212815 0.0216825 -0.0706927 -0.0374229 0.0938044 -0.0758746 -0.0774786 0.111194 0.0108361 -0.119788 -0.104303 0.0105845 0.000878899 0.0321749 -0.0639375 0.0813754 0.120056 -0.054948 0.238216 -0.0887782 -0.0501998 -0.0697846 0.0420881 0.241897 -0.0532105 0.110063 0.035302 -0.0200642 0.003275 -0.116477 0.11133 0.0238771 0.120464 -0.102997 -0.121196 0.0421398 0.0484992 -0.0565172 -0.0134179 0.0234348 0.107515 -0.0307779 0.0251335 0.063377 0.0203621 -0.136923 -0.00411334 0.0943051 -0.00285453 -0.0385564 0.0392256 0.0446585 -0.0890965 -0.00556117 0.0921804 -0.109111 -0.0866162 -0.0947414 0.0565339 0.0773635 0.0114674 0.100934 0.0389463 -0.0652826 -0.0353852 -0.0591357 0.152805 -0.0211559 0.0164907 -0.00243249 -0.0676818 0.02371 0.0237216 -0.0677863 -0.0552902 0.0927506 0.167227 -0.119704 0.0461443 0.00269928 0.16822 0.0508811 -0.177215 -0.092683 -0.0753342 -0.105867 0.261891 0.00268029 0.0722636 
-0.0146086 0.0173541 0.0258134 0.00127152 0.062997 0.211085 -0.00547242 -0.105497 -0.0653426 0.0205249 0.0839507 0.0733062 0.0698455 -0.0157952 0.0202022 -0.0164491 -0.111325 0.097862 0.023632 -0.00669342 0.1971 -0.0579717 0.0016073 0.188776 0.108788 -0.00566302 -0.0522966 -0.164835 0.0989616 0.139892 0.0793149 -0.0565672 -0.0546613 -0.00787156 0.0498754 0.0854157 -0.167977 -0.0812985 0.0410832 -0.0364732 0.0207838 -0.073202 -0.0480165 0.0993402 -0.0754184 -0.0879967 0.106335 0.0140506 -0.118975 -0.124812 0.0312175 -0.000512441 0.0391457 -0.0868082 0.0716374 0.12906 -0.0463601 0.22815 -0.072474 -0.0459548 -0.069976 0.0299434 0.22055 -0.0558984 0.122959 0.0312189 -0.0258026 -0.00563057 -0.116881 0.122507 0.008101 0.123289 -0.116384 -0.136736 0.0261218 0.0307126 -0.049877 0.0144365 0.0256042 0.107787 -0.043469 0.0236279 0.0622445 0.00977487 -0.118825 -0.0230442 0.0947911 -0.00162442 -0.042222 0.0381361 0.0404406 -0.0589174 -0.0172693 0.0978466 -0.099574 -0.0737363 -0.0918388 0.0579562 0.0634199 0.00830745 0.107255 0.0393767 -0.065392 -0.0479042 -0.0442418 0.143502 -0.00728835 -0.0145426 0.0241529 -0.0696961 0.00804798 0.030367 -0.0603546 -0.0719383 0.113965 0.15291 -0.114677 0.0226103 -0.000687564 0.170773 0.0551384 -0.180378 -0.0980724 -0.0761089 -0.0994783 0.262033 0.0140227 0.0721355 
0.0115053 -0.0289031 0.00647631 0.0269148 0.0776264 0.208828 0.00365628 -0.110624 -0.058736 0.00356054 0.0847167 0.110013 0.0618844 -0.0275832 -0.00885624 -0.0251717 -0.0954238 0.121051 0.0271773 0.0225472 0.195457 -0.0623493 -0.00662494 0.232777 0.0986263 0.000831023 -0.0359301 -0.191547 0.0619124 0.149645 0.0598962 -0.0448124 -0.0618418 0.00212402 0.0455921 0.0829862 -0.163947 -0.0984648 0.022683 -0.0554244 0.0301081 -0.0635237 -0.0460088 0.106854 -0.0849223 -0.0969806 0.117958 0.00557796 -0.109098 -0.104225 0.0488453 -0.0412703 0.0493948 -0.0821264 0.105217 0.128475 -0.0516809 0.236992 -0.0586567 -0.0454984 -0.048997 0.0301967 0.226366 -0.0678403 0.117103 0.00517533 -0.0262061 -0.017558 -0.11038 0.125455 -0.00287577 0.122225 -0.111113 -0.135526 -0.00161862 0.031962 -0.0325489 0.0366721 0.0230157 0.0897365 -0.0490484 0.0525832 0.0407741 -0.0172222 -0.110472 -0.0213318 0.0974185 -0.00036317 -0.0463692 0.0392981 0.050344 -0.0578734 -0.0219443 0.0851248 -0.0938902 -0.0528141 -0.08941 0.0417373 0.0787575 0.0028882 0.10907 0.0312164 -0.0587619 -0.0488432 -0.0450107 0.128343 -0.0186364 -0.033703 -0.0227801 -0.0463298 0.0106828 0.0374671 -0.0328516 -0.089124 0.101288 0.14423 -0.107649 -0.00668008 -0.0179025 0.158473 0.0510709 -0.158978 -0.0865477 -0.0757284 -0.108644 0.261321 0.00378045 0.0515869 
0.0293478 -0.033399 -0.00765128 0.00316314 0.0875405 0.198222 0.006066 -0.101633 -0.071801 0.00571584 0.0765303 0.109018 0.0793363 -0.0383166 -0.0159093 -0.0217145 -0.0958068 0.115825 0.00834521 0.0500529 0.199468 -0.0458511 -0.0144171 0.249028 0.0764329 0.00669378 -0.0255873 -0.196198 0.0652501 0.16308 0.0350398 -0.0557626 -0.0753606 0.00978385 0.0494787 0.0762505 -0.161405 -0.0930091 0.0165572 -0.061574 0.0123851 -0.0679458 -0.0421979 0.130653 -0.0767216 -0.0712197 0.127598 0.0357957 -0.121227 -0.0812498 0.0529617 -0.0514747 0.0379269 -0.08269 0.118464 0.110129 -0.0700774 0.24196 -0.0492694 -0.0590233 -0.0309387 0.0270924 0.233627 -0.0420866 0.0935087 -0.0300219 -0.0317643 -0.0014231 -0.0963102 0.0959156 -0.0046651 0.111898 -0.109673 -0.147888 -0.0150546 0.0314574 -0.0344172 0.0541579 0.0461087 0.10788 -0.0146848 0.0508109 0.0217361 -0.025274 -0.106259 -0.025509 0.097577 0.00426084 -0.0304072 0.0556199 0.0562551 -0.0577737 -0.0386458 0.0899866 -0.113411 -0.0442032 -0.0840361 0.0351508 0.0834844 -0.0213366 0.121512 0.040718 -0.0600489 -0.0451029 -0.0719374 0.113552 -0.0476046 -0.0172738 -0.0256955 -0.033366 0.042169 0.0504646 -0.0491648 -0.0778246 0.0833374 0.157661 -0.122902 -0.015354 -0.04779 0.149647 0.0374823 -0.145136 -0.0728469 -0.0592537 -0.126029 0.241835 -0.0139946 0.0225929 
0.000251381 -0.0128914 -0.00656208 -0.0138492 0.0574897 0.191567 -0.0236116 -0.093082 -0.0614131 -0.00080858 0.0929659 0.072214 0.0930371 -0.00646297 -0.00958505 -0.00540379 -0.123059 0.0725941 0.00660368 0.045208 0.211359 -0.077577 0.0151737 0.202187 0.0865467 0.00426976 -0.0233407 -0.177504 0.0806015 0.141953 0.0576998 -0.0775446 -0.0467207 -0.00168761 0.027768 0.102141 -0.173473 -0.0521685 0.0140983 -0.0472004 -0.00935418 -0.0772143 -0.0610784 0.119961 -0.0615943 -0.0745846 0.116265 0.0338164 -0.123414 -0.0887778 -4.84473e-05 -0.0255354 0.0357976 -0.0743143 0.0952029 0.109372 -0.0655894 0.22971 -0.0628638 -0.0727047 -0.0544467 0.0257193 0.247648 -0.0315768 0.0963633 0.0205232 -0.0320763 0.0269378 -0.0864199 0.09351 -0.00075436 0.106624 -0.115963 -0.151641 0.0267868 0.0260043 -0.039124 0.0258034 0.0384572 0.127151 -0.0288612 0.00839335 0.0245533 -0.0204847 -0.135412 -0.00241321 0.0882475 0.0110143 -0.0174319 0.0394501 0.0616984 -0.0704399 -0.0244962 0.101969 -0.107096 -0.0646348 -0.102006 0.0522772 0.0831159 -0.0184346 0.114129 0.0221372 -0.0716563 -0.0626669 -0.0629847 0.14759 -0.0387802 -0.00254003 0.00846995 -0.0769048 0.0199108 0.056508 -0.0577485 -0.0670134 0.106067 0.175721 -0.123451 0.0152876 -0.0137506 0.166532 0.0266867 -0.160584 -0.0824628 -0.0470971 -0.126684 0.251333 0.00591635 0.0575275 
0.0133462 -0.027553 0.00487595 0.00632241 0.0776633 0.210196 -0.000496582 -0.0903742 -0.0527353 -0.00853096 0.0791304 0.0878491 0.0799771 -0.0264597 -0.00530857 -0.0170296 -0.121048 0.103775 -0.00430379 0.0413297 0.211117 -0.0655407 0.0159533 0.231545 0.0851577 -0.0232563 -0.0403521 -0.193606 0.0636664 0.141502 0.0603185 -0.0631548 -0.0626262 0.0150603 0.0386814 0.0928583 -0.165416 -0.0812763 -0.000720928 -0.0530087 0.0173023 -0.0710972 -0.0515972 0.11526 -0.0814571 -0.0940599 0.116395 0.0326067 -0.111053 -0.0692689 0.0233525 -0.0498836 0.0399116 -0.0734817 0.107594 0.11339 -0.0528976 0.228819 -0.0517887 -0.0678126 -0.052554 0.0419753 0.229434 -0.0501737 0.0966161 0.00291245 -0.0300356 0.0029628 -0.101305 0.115045 -0.00520582 0.120521 -0.109588 -0.137642 0.00689287 0.0290903 -0.036667 0.0329422 0.0370785 0.108181 -0.027719 0.0324671 0.0269919 -0.0211679 -0.120866 0.00210317 0.0921577 0.0114389 -0.0359911 0.0510184 0.0728769 -0.0684109 -0.0295032 0.0791837 -0.1105 -0.0518938 -0.108132 0.0547316 0.0766393 -0.00643788 0.12515 0.0218861 -0.0610734 -0.055692 -0.0527713 0.129274 -0.0440115 -0.0171566 -0.0117989 -0.0502711 0.0167096 0.0588425 -0.0429781 -0.0805145 0.0950232 0.168815 -0.106139 0.00766406 -0.0240758 0.169863 0.0438916 -0.153796 -0.0798746 -0.051895 -0.131275 0.246795 -0.000567769 0.0527122 
0.0108345 -0.0270799 0.0165503 0.00707007 0.0746038 0.201424 -0.00108458 -0.0790118 -0.0662548 0.00493737 0.0835811 0.0904701 0.0794138 -0.0267133 0.00330554 -0.0209472 -0.106978 0.0950255 0.016067 0.0282008 0.216399 -0.067907 0.00771822 0.216446 0.0972186 -0.00710402 -0.0413497 -0.189385 0.0835289 0.137797 0.0650833 -0.0647708 -0.0590456 0.0041459 0.0338333 0.0785222 -0.177449 -0.07683 0.0175467 -0.0503458 0.0225481 -0.0689336 -0.0649043 0.115032 -0.0813629 -0.0942708 0.105441 0.0151608 -0.107964 -0.103952 0.029968 -0.0221465 0.0366098 -0.0841252 0.0899855 0.114273 -0.0479557 0.226546 -0.0618814 -0.0524737 -0.0508836 0.0227875 0.219945 -0.0389383 0.106152 -0.000535401 -0.0240403 0.00368691 -0.0936515 0.110457 0.000309971 0.124954 -0.117352 -0.14435 0.00767718 0.0310336 -0.0424402 0.0348246 0.0337413 0.129219 -0.050525 0.0189356 0.052144 -0.00755111 -0.110455 -0.0197977 0.110435 0.0132958 -0.0369044 0.0259459 0.0513979 -0.0545268 -0.0297028 0.0961187 -0.112322 -0.0740322 -0.0905848 0.0457137 0.067005 -0.00825808 0.116262 0.0334797 -0.0606579 -0.0486665 -0.0507839 0.130019 -0.0237125 -0.00847954 0.0160518 -0.0681336 0.0130754 0.0450094 -0.0638605 -0.0816965 0.113629 0.166325 -0.116162 0.00345913 -0.0176074 0.173731 0.0350138 -0.157159 -0.0998761 -0.0635772 -0.112614 0.253518 0.00750003 0.0657571 
-0.00257144 -0.0150836 0.0315916 0.0190515 0.0613436 0.207594 0.000206999 -0.0956212 -0.0512682 0.00156677 0.0848597 0.0839391 0.0708221 -0.0187469 0.0117232 -0.00856281 -0.115774 0.0883923 0.0170729 0.0100122 0.213882 -0.0718152 0.00260234 0.194672 0.108075 -0.000390966 -0.057299 -0.181446 0.0809752 0.136915 0.0789266 -0.0385537 -0.0491391 0.00642929 0.041335 0.0869859 -0.160075 -0.0669158 0.0349092 -0.056909 0.0307096 -0.0768036 -0.0463308 0.0847932 -0.0699557 -0.106036 0.104203 0.000920388 -0.110567 -0.11862 0.0226968 -0.0183801 0.0525646 -0.0714212 0.0980398 0.124607 -0.0444798 0.218564 -0.0777711 -0.0581633 -0.065772 0.0206337 0.216847 -0.062159 0.121197 0.0479719 -0.025586 -0.0019538 -0.108506 0.11672 -0.00591444 0.121461 -0.12407 -0.134591 0.0248132 0.0286959 -0.0343361 0.0135751 0.0256652 0.116591 -0.0488572 0.0243786 0.0593295 -0.00770656 -0.114775 -0.0173717 0.100419 0.0149664 -0.0406068 0.0372426 0.0555447 -0.0635955 -0.0199558 0.101262 -0.109785 -0.0626086 -0.0926034 0.0524353 0.0737597 0.00723485 0.113897 0.0193597 -0.0696162 -0.0494955 -0.0353746 0.141613 -0.00845184 -0.0173712 0.014965 -0.0746872 -0.0114822 0.0391165 -0.0635938 -0.0848393 0.133214 0.154305 -0.112196 0.0158804 -0.00394289 0.171781 0.0559481 -0.162005 -0.0843794 -0.0697903 -0.0979412 0.264214 0.0299504 0.0723235 
0.0157443 -0.0233475 0.0332097 0.0260273 0.0662942 0.20625 -9.14919e-05 -0.094752 -0.0488065 -0.00918837 0.0868009 0.102181 0.0766724 -0.0255033 -0.000500622 -0.00931339 -0.108075 0.104308 -0.0104594 0.0248985 0.220558 -0.0622108 0.0198374 0.225826 0.0942556 -0.00521392 -0.045519 -0.196151 0.0704065 0.142692 0.0681983 -0.022536 -0.0501038 0.0256232 0.0261238 0.0762627 -0.162654 -0.0450852 0.016007 -0.0434439 0.0265397 -0.0709415 -0.0627452 0.0919571 -0.0826883 -0.111204 0.111493 -0.00257369 -0.110434 -0.095708 0.0520588 -0.0192008 0.0410801 -0.0650772 0.106599 0.119318 -0.0285718 0.222983 -0.0602462 -0.0646327 -0.0654418 0.013267 0.2127 -0.064042 0.110919 0.0117452 -0.0201303 0.00300232 -0.111641 0.140108 -0.00876753 0.118971 -0.119657 -0.121549 0.0136498 0.0218601 -0.0380129 0.023212 0.0191782 0.119892 -0.0509289 0.0368408 0.0553371 -0.0251371 -0.112932 -0.0208296 0.109619 0.0101001 -0.0495004 0.0377106 0.0493246 -0.075588 -0.0247276 0.0918659 -0.109613 -0.0567593 -0.0947547 0.0537204 0.0810604 0.00237181 0.114075 0.0269383 -0.0683726 -0.0139207 -0.0347209 0.116094 -0.0320056 -0.0159606 0.0151983 -0.085372 -0.0135662 0.0673125 -0.0653728 -0.0774235 0.126794 0.156531 -0.110972 -0.00910487 -0.00790021 0.181906 0.0580673 -0.140714 -0.087163 -0.0653295 -0.0958294 0.252103 0.0262506 0.0642306 
0.0347614 -0.0408552 0.00447645 0.0360873 0.0969049 0.185062 0.00238312 -0.127221 -0.0438202 -0.0185147 0.0908239 0.132902 0.0711085 -0.00562121 -0.0462737 -0.00632359 -0.0621242 0.158343 -0.0110642 0.0369245 0.235553 -0.0475821 -0.00773838 0.246684 0.0842714 0.00133903 -0.0401297 -0.189395 0.0577656 0.189983 0.0340375 -0.00558954 -0.0505777 0.0173912 0.043756 0.0677818 -0.15882 -0.0648682 0.0255174 -0.0680252 0.00487618 -0.0279217 -0.0389003 0.0961501 -0.0728011 -0.101156 0.121193 -0.00585888 -0.099817 -0.100036 0.0720961 -0.0282481 0.0436463 -0.0636351 0.122319 0.119666 -0.0308386 0.228512 -0.0585746 -0.0592797 -0.031352 0.0138353 0.217765 -0.0600816 0.0966179 -0.0252052 -0.0327482 0.00693677 -0.107809 0.14161 0.0136874 0.101317 -0.10924 -0.150495 -0.0355126 0.038243 -0.0268344 0.0332573 0.00729708 0.0748117 -0.0396094 0.0961366 0.0380855 -0.0303375 -0.102 -0.0253694 0.0982936 0.00216219 -0.0448986 0.0452826 0.03806 -0.0764894 -0.0370634 0.0917094 -0.0849164 -0.0439004 -0.0987982 0.0478094 0.0771233 0.000919033 0.125698 0.0387861 -0.0581642 -0.00601164 -0.0472648 0.107742 -0.0374113 -0.0418015 -0.0124237 -0.0607422 -0.00190397 0.0400374 -0.0603611 -0.0637166 0.105593 0.149365 -0.114826 -0.0341829 -0.0345775 0.151664 0.0411096 -0.117451 -0.0758449 -0.0814976 -0.102086 0.253429 0.016377 0.0311521 
0.0250449 -0.0263797 -0.0291986 0.0290162 0.103867 0.165083 -0.0176367 -0.108028 -0.0469545 0.0283316 0.111939 0.123641 0.0797622 -0.0218202 -0.0544735 0.0109286 -0.0278227 0.181277 0.0135718 0.0613376 0.237042 -0.0621389 -0.00957054 0.23182 0.0818836 0.0142014 -0.0186136 -0.189629 0.0821156 0.193533 0.0314088 -0.0174603 -0.0160504 3.22198e-05 0.0572639 0.07227 -0.147224 -0.0681302 0.0281366 -0.100017 -0.0178217 -0.0386182 -0.0314443 0.134591 -0.0782313 -0.0971139 0.131154 0.0115394 -0.109379 -0.114959 0.0701195 -0.0212897 0.0178437 -0.0822029 0.109138 0.121932 -0.0493459 0.190597 -0.0562413 -0.0619609 -0.0347891 -0.0330616 0.229873 -0.0519083 0.110194 -0.0561922 -0.0616947 0.00472448 -0.0963736 0.126559 0.0120852 0.085597 -0.121028 -0.188976 -0.0559298 0.0276817 -0.0165701 0.0914995 0.00920534 0.0573509 -0.0613553 0.0913637 0.021958 -0.0139401 -0.0877744 -0.0256449 0.0832484 0.0142951 -0.00302406 0.0482354 0.0208267 -0.0626013 -0.070832 0.0980952 -0.0613443 -0.0564385 -0.0995928 0.056074 0.0469096 -0.0206588 0.129997 0.0442438 -0.0515221 -0.0328951 -0.0368014 0.115914 -0.0152901 -0.0496145 0.0222552 -0.0568235 -0.0220642 0.0228727 -0.0595286 -0.0517685 0.114206 0.121287 -0.106395 -0.0654569 -0.0313994 0.147471 0.0282072 -0.118024 -0.0728883 -0.0622213 -0.0932178 0.236481 0.0359871 0.0314445 
0.0432738 -0.00344801 -0.0135581 0.0479164 0.0937549 0.203808 0.0105398 -0.130467 -0.0530742 0.0560876 0.100961 0.102032 0.0808294 -0.0344997 -0.0321384 -0.0109958 -0.0202028 0.201791 0.0101035 0.0253511 0.214743 -0.0543756 -0.0381132 0.252309 0.0903373 -0.0198176 -0.0700567 -0.176856 0.0678788 0.203897 0.0418226 0.00521894 -0.0672025 0.0156965 0.072839 0.0566198 -0.143578 -0.114599 0.0601767 -0.0940481 -0.00823968 -0.0587488 -0.0241763 0.0863424 -0.0580674 -0.121718 0.102363 0.0417793 -0.0956991 -0.107858 0.112353 -0.00790581 0.041679 -0.0845683 0.0907512 0.123773 -0.0351188 0.183637 -0.038772 -0.0544689 -0.0285234 0.0149469 0.194063 -0.0895958 0.0764029 -0.0268057 -0.0333713 -0.0163325 -0.136747 0.111843 0.00913573 0.102104 -0.120513 -0.160927 -0.0696808 0.0292274 -0.00905596 0.0494376 0.0306301 0.0761701 -0.0363019 0.0880043 0.0440242 -0.00638791 -0.0719802 -0.0229959 0.0770972 -0.0201839 -0.00484328 0.0580943 0.00969271 -0.0569186 -0.020164 0.101235 -0.092962 -0.060257 -0.0931789 0.0398823 0.0416423 -0.00742002 0.169559 0.0729829 -0.051869 -0.0139925 -0.0197188 0.103611 -0.00562843 -0.0625532 -0.00146951 -0.000881636 -0.00622763 0.00863702 -0.0448565 -0.0621071 0.0892245 0.122389 -0.106088 -0.0228283 -0.0496386 0.133802 0.0442197 -0.15634 -0.0699807 -0.081281 -0.098646 0.24305 0.013579 0.0241124 
0.0157296 -0.036358 -0.0441028 0.0712838 0.0663505 0.201031 0.004905 -0.143289 0.00230388 0.0514039 0.0947912 0.0958069 0.0355539 -0.0228638 -0.0540097 -0.0462932 -0.0423542 0.206977 0.0720618 -0.0103667 0.19102 -0.0765352 -0.0526207 0.212607 0.0955028 -0.00239403 -0.068901 -0.183369 0.0438105 0.182234 0.0747272 0.00913465 -0.0559638 -0.0325565 0.094177 0.0749646 -0.155121 -0.131419 0.0511786 -0.116675 0.00501799 -0.0461104 -0.0567551 0.105653 -0.0606464 -0.158901 0.0699821 0.034945 -0.0359475 -0.131632 0.0730032 0.0148169 0.0864975 -0.0954013 0.0871922 0.140307 -0.0244741 0.1618 -0.0448417 -0.061825 -0.0310481 0.00971845 0.212073 -0.0762743 0.076526 -0.0142069 0.000724631 -0.0471623 -0.100748 0.139347 0.00766537 0.0941887 -0.102937 -0.152142 -0.100454 -0.00321774 -0.0202939 0.0256259 0.00112208 0.0535006 -0.0642743 0.116221 0.0297584 -0.0140395 -0.046223 -0.0493872 0.0680562 -0.0121955 0.0139354 0.0321012 0.0164684 -0.0208981 0.000120393 0.0615677 -0.0547902 -0.0802833 -0.0846678 0.0344709 0.0422912 0.00977322 0.180111 0.0669923 -0.033264 -0.0816328 -8.97143e-05 0.107057 0.0416372 -0.116986 -0.0103753 0.0507365 -0.00843258 -0.0193171 -0.0271639 -0.10361 0.0951914 0.104748 -0.0515208 -0.0532049 -0.0029157 0.0924585 0.059302 -0.170415 -0.0622056 -0.102564 -0.101672 0.236802 0.0437401 0.0769826 
0.0281321 0.0193378 -0.150455 -0.00434867 0.0501208 0.193495 0.00302673 -0.105634 -0.029199 0.116447 0.119191 0.0782244 0.0745024 -0.0376585 -0.0977751 -0.0100087 -0.023595 0.196575 0.0868268 0.0164464 0.18009 -0.0678894 -0.0377254 0.158697 0.0291431 0.0556373 -0.015247 -0.195441 0.124794 0.202172 0.0211419 0.0241069 -0.03702 -0.0598086 0.0786446 0.0505415 -0.13473 -0.0580511 0.0857795 -0.0828935 -0.0679269 -0.0582374 -0.0898195 0.151678 -0.0700695 -0.118663 0.10219 0.0535378 -0.0890052 -0.128 0.0500263 0.0855926 0.0237787 -0.0817703 0.0420855 0.124366 0.0150776 0.158648 -0.0643089 -0.0612114 -0.0392878 -0.0400298 0.304846 -0.0739921 0.0657395 -0.0724243 -0.0144548 -0.0192697 -0.060532 0.114701 -0.00825551 0.0703366 -0.136157 -0.122429 -0.0983449 -0.0330575 -0.018509 0.0804067 -0.00299291 0.0199471 -0.068628 0.108906 -0.000400668 -0.00424782 -0.0506714 -0.0380409 0.0461019 -0.0205681 0.0845142 0.00947027 0.0140837 -0.0314278 -0.0528218 0.0788266 0.0134414 -0.106144 -0.0479295 0.071807 0.0348788 -0.00550625 0.160332 0.0700566 -0.044282 -0.0341292 -0.0348497 0.110565 0.0328911 -0.0832455 0.0346473 0.0183398 -0.00325889 0.00428342 -0.0282707 -0.0748848 0.0990067 0.10178 -0.0424919 -0.100788 0.0328421 0.0875385 0.0407992 -0.182385 -0.0131496 -0.0827883 -0.12309 0.197106 0.023998 0.0643118 
0.0271683 0.0504688 -0.175554 -0.0485877 0.0223379 0.191749 -0.0077911 -0.0727255 -0.0637638 0.145378 0.127121 0.0672143 0.0832479 -0.0812295 -0.0806022 -0.0302371 -0.040313 0.144667 0.10689 0.0296814 0.126062 -0.0263818 -0.0610188 0.152245 0.00564405 0.0740599 0.0440887 -0.186468 0.127985 0.193948 -0.00761067 -0.0571553 -0.042105 -0.0817694 0.0747678 0.0375743 -0.131003 -0.0842925 0.0725205 -0.027967 -0.0762675 -0.0912266 -0.109202 0.205672 -0.0769944 -0.0590029 0.118693 0.0711763 -0.113122 -0.111028 0.067122 0.0977233 -0.00203029 -0.0933673 0.0172859 0.112248 -0.0302643 0.154278 -0.0434212 -0.0448878 -0.0422385 -0.0629423 0.310797 -0.0422408 0.0477595 -0.137217 0.00779425 -0.0277136 -0.0349744 0.0597344 -0.00469388 0.0571116 -0.120604 -0.137699 -0.0698914 -0.0213424 -0.052088 0.11211 0.0155356 0.0772922 -0.0374396 0.0602385 0.00211704 0.0201924 -0.054314 -0.0330868 0.0571832 -0.0458506 0.0922875 0.00763029 -0.0173195 -0.0278508 -0.062383 0.0941995 -0.0233445 -0.126382 -0.0134616 0.0281776 0.0457406 -0.0485932 0.134301 0.105106 -0.0316106 -0.0540569 -0.0796467 0.0963521 0.0252907 -0.0402887 0.00414529 0.0381541 0.0633335 -0.00424512 -0.0283824 -0.0751886 0.0423553 0.105886 -0.0737629 -0.0929135 0.0114937 0.068022 0.024844 -0.208879 -0.0202765 -0.0695007 -0.104095 0.180511 -0.00290787 0.0526113 
0.0290334 0.0959229 -0.181564 -0.083545 0.0246204 0.156452 -0.00600406 -0.0464421 -0.0602642 0.179073 0.161562 0.0479487 0.0711552 -0.0939983 -0.0578846 -0.0133608 -0.0321942 0.114829 0.0938198 0.0133002 0.0918883 -0.00336525 -0.0558806 0.0982594 0.0125924 0.0915576 0.110366 -0.153922 0.157834 0.157864 -0.0131627 -0.0813648 -0.0316899 -0.0829564 0.0480021 0.0218035 -0.109414 -0.0484069 0.0992545 0.032974 -0.0741221 -0.093705 -0.129256 0.225378 -0.0814068 -0.01597 0.109235 0.0603226 -0.124912 -0.132686 0.0657553 0.154579 -0.082062 -0.0963745 -0.0275774 0.0917582 -0.0464181 0.149047 -0.0740411 -0.00288811 -0.0521594 -0.138157 0.317081 -0.0189752 0.0543045 -0.174351 0.00169624 0.0162814 0.00863579 0.0796055 0.0119939 0.0718926 -0.115536 -0.126141 -0.0431217 -0.0407988 -0.0671576 0.171493 -0.0189066 0.063255 -0.05252 0.0581629 0.0155594 0.0345782 -0.0693106 -0.035862 0.0728736 -0.0412485 0.0885287 -0.0203824 -0.036722 -0.0420114 -0.0934423 0.0957441 0.00748275 -0.151104 0.00322931 -0.0137287 0.0490642 -0.0637147 0.0648247 0.0915982 -0.0340447 -0.0202369 -0.0724032 0.0829751 0.0175778 0.00174112 0.0447223 -0.0118389 0.0639808 0.0115056 -0.0434018 -0.0173296 0.0648969 0.0737348 -0.0965637 -0.111657 0.0308151 0.0635339 0.026652 -0.157945 -0.0291527 -0.0131284 -0.0522772 0.131552 -0.0045691 0.0465601 
0.0369974 0.0760537 -0.192642 -0.066832 0.0338137 0.18411 -0.0111112 -0.0492475 -0.082433 0.162857 0.139026 0.0695418 0.095354 -0.0910058 -0.0867705 -0.0198268 -0.0265338 0.130922 0.0756624 0.0595794 0.107545 -0.0348568 -0.0397506 0.138392 0.000311261 0.0642027 0.074325 -0.165575 0.127886 0.168754 -0.01866 -0.082817 -0.0420303 -0.0728717 0.0438261 0.0306552 -0.135499 -0.0587395 0.0574678 -0.00800832 -0.0886645 -0.0938979 -0.109703 0.223556 -0.092722 -0.0415048 0.12401 0.0799052 -0.13304 -0.0774974 0.0750834 0.107488 -0.0627327 -0.0944436 0.00497043 0.085248 -0.0572414 0.16285 -0.038324 -0.0396983 -0.0531687 -0.0847646 0.322894 -0.0468377 0.0509427 -0.163092 -0.0138032 0.00670143 -0.0427507 0.0638645 0.0121363 0.0739767 -0.109483 -0.127875 -0.0603217 -0.0187765 -0.0442564 0.141286 0.01353 0.0746189 -0.0502549 0.0320457 0.0019224 0.0215607 -0.0769112 -0.0308581 0.0560611 -0.0356794 0.116236 0.00320635 -0.0351609 -0.0493928 -0.079201 0.0982198 -0.000831005 -0.136972 -0.0031419 0.0153785 0.0274053 -0.069502 0.100718 0.106058 -0.0372546 -0.0316429 -0.091046 0.101392 0.00148468 -0.00930941 0.0236772 0.00742323 0.0714092 0.0253592 -0.0179439 -0.0248034 0.0449418 0.0875329 -0.0891241 -0.0816196 0.0181643 0.0865651 0.00229614 -0.188107 -0.0197841 -0.0352357 -0.0827044 0.155721 -0.0082483 0.0306058 
