0.133056 0.0847969 -0.182038 -0.0358684 0.0931583 0.227249 0.030245 -0.109243 -0.0759478 -0.0386769 0.0964581 0.0605299 0.0814049 -0.0869771 -0.0884737 -0.0336605 -0.0978592 0.0481472 -0.0902155 0.0851855 0.10681 0.0106781 0.0200148 0.132474 0.0167218 -0.0417772 0.0121782 -0.142254 0.0603335 0.14878 -0.0223961 -0.0165964 -0.152083 0.0235869 -0.000102779 0.0315288 -0.133796 -0.0577095 0.00906761 0.0234 -0.0135677 -0.0670614 -0.0718213 0.200001 -0.125112 0.0257266 0.135585 0.113115 -0.131027 0.0761166 0.0525606 0.07644 -0.0717218 -0.0426535 0.0381312 -0.0189714 -0.0613162 0.21254 0.0141497 -0.0759765 -0.0637345 0.0402709 0.308463 -0.0490687 -0.0482089 -0.137761 0.02739 0.0446948 -0.0468724 0.115876 0.022924 0.109578 -0.0283978 -0.0110335 -0.0297301 -0.0335217 -0.07199 0.0232252 -0.0210316 0.149068 0.0734447 0.0486597 -0.0135706 -0.0609314 -0.0929239 0.0421879 0.0340525 -0.073295 -0.0194161 0.0465224 0.103793 -0.11906 -0.108726 -0.00256256 -0.0506784 -0.113994 -0.0219341 0.0359006 0.0592974 -0.0985229 0.0568175 0.090242 0.00768219 0.0774548 -0.166239 0.0770313 -0.107666 0.163161 -0.0140639 0.0142901 0.163327 0.104382 -0.0651227 0.0302136 -0.011298 0.105493 -0.0997043 -0.0271798 0.0411226 0.119922 0.0221187 -0.0796272 0.0147805 0.04155 -0.108047 0.0517883 -0.0229825 -0.0048033 
0.120021 0.112223 -0.190889 -0.0337579 0.0806194 0.23095 0.0352609 -0.131435 -0.0840004 -0.0101147 0.0976764 0.0450954 0.0756328 -0.0731823 -0.0715716 -0.0399898 -0.0932598 0.0559207 -0.0502216 0.0550339 0.0887083 0.0125413 -0.00702638 0.121362 0.0322972 -0.0351409 0.00269178 -0.13196 0.0753348 0.173193 -0.0159093 -0.00102616 -0.155618 0.000663545 0.0164173 0.0384555 -0.135464 -0.0916551 0.0354089 0.0229562 -0.0194229 -0.080994 -0.061194 0.19996 -0.112343 0.0439361 0.138879 0.117074 -0.139796 0.0384708 0.060811 0.104608 -0.0527979 -0.06038 0.0254925 0.00277157 -0.0701127 0.215525 0.0156661 -0.0611096 -0.064755 0.0442655 0.309828 -0.0574761 -0.0451873 -0.116285 0.0321446 0.027513 -0.0565005 0.115777 0.0236166 0.110608 -0.0393048 -0.017421 -0.0318789 -0.033328 -0.0700255 0.0160273 -0.0240627 0.141646 0.0763415 0.0529066 -0.0180937 -0.0544005 -0.0884286 0.0351627 0.0199641 -0.101829 -0.0162664 0.0500944 0.0915555 -0.102333 -0.0997293 0.000317989 -0.0470332 -0.113661 -0.0110678 0.0351049 0.0711722 -0.0970343 0.0612966 0.107062 0.0165987 0.0619046 -0.177939 0.0890517 -0.0922327 0.154413 -0.015135 0.0307163 0.170255 0.0775684 -0.0709572 0.00725389 -0.0124208 0.095628 -0.0893466 -0.0298942 0.0553479 0.113346 0.0381718 -0.11126 0.0148576 0.0332268 -0.107812 0.0629785 -0.0173938 0.000243826 
0.141613 0.0656926 -0.174845 -0.0212224 0.0885466 0.218919 0.0328274 -0.0919152 -0.0663052 -0.0612249 0.0975546 0.0777948 0.0799379 -0.118986 -0.106948 -0.0191852 -0.111092 0.0384027 -0.116445 0.106767 0.123368 0.00351487 0.0382594 0.138756 -0.00213337 -0.04272 0.0185822 -0.167523 0.044379 0.14227 -0.0409015 -0.012118 -0.136193 0.0460298 -0.0121929 0.0136296 -0.124281 -0.0250264 -0.0126631 0.0247187 -0.00742265 -0.0742464 -0.0758731 0.190695 -0.130276 0.0160146 0.138521 0.0915738 -0.135352 0.099449 0.0575587 0.0563073 -0.0759936 -0.0239487 0.0533753 -0.0263977 -0.0451591 0.190522 0.00613345 -0.0758534 -0.0600006 0.0235229 0.300733 -0.0486746 -0.0368897 -0.15782 0.0208328 0.0411679 -0.0454971 0.109861 0.00692006 0.0937085 -0.0322108 -0.00486337 -0.0221398 -0.0268013 -0.0659725 0.0282931 -0.0278965 0.164169 0.0640345 0.0369988 -0.0161706 -0.0634866 -0.097641 0.0575428 0.0430467 -0.0633893 -0.0310758 0.0498977 0.101839 -0.13666 -0.123731 0.000510343 -0.0630583 -0.103679 -0.0274348 0.0294952 0.0672909 -0.0949678 0.0593426 0.0736238 -0.0018449 0.0948778 -0.14297 0.0545855 -0.108687 0.181052 -0.0257658 -0.00341741 0.142061 0.120367 -0.0605067 0.0241586 -0.00493044 0.114293 -0.109238 -0.0273368 0.0373907 0.12937 0.0136721 -0.0539835 0.016498 0.0479211 -0.0859572 0.0511359 -0.0158518 -0.0127345 
0.141979 0.0710718 -0.173553 -0.0180381 0.0862969 0.225206 0.0349224 -0.0966974 -0.068288 -0.0620201 0.0975373 0.0716292 0.0798665 -0.117675 -0.105127 -0.0206675 -0.113033 0.0398665 -0.111244 0.101918 0.127269 -0.00121418 0.0382047 0.138109 0.00374341 -0.050137 0.0113451 -0.167958 0.0445482 0.147183 -0.0369833 -0.0134976 -0.138899 0.0455785 -0.00594523 0.0144909 -0.122829 -0.0317648 -0.0078937 0.0185698 -0.00988669 -0.0783928 -0.0697207 0.186304 -0.128043 0.0136702 0.139424 0.0927781 -0.137777 0.0997275 0.0563195 0.0574514 -0.0697079 -0.0233744 0.0531264 -0.0246974 -0.0432184 0.190321 0.0062445 -0.0787863 -0.0593352 0.030052 0.302127 -0.0564473 -0.035254 -0.148742 0.0202691 0.0357657 -0.0516509 0.111123 0.00423837 0.0954563 -0.0363965 -0.00522131 -0.0226589 -0.0281273 -0.0612555 0.0232316 -0.0251965 0.165421 0.0636601 0.03293 -0.0158327 -0.0632027 -0.0978708 0.0600921 0.0362826 -0.0672303 -0.029906 0.0534242 0.106393 -0.137866 -0.120177 -7.25496e-05 -0.0644614 -0.104373 -0.0289351 0.0365915 0.0674743 -0.0914163 0.064304 0.0772757 -0.0014226 0.092199 -0.140768 0.0590926 -0.102817 0.181194 -0.0267195 1.62235e-05 0.139201 0.11518 -0.0586541 0.0205499 -0.0032984 0.116935 -0.103668 -0.0202967 0.0403982 0.131382 0.0151377 -0.0616907 0.017329 0.0456252 -0.087594 0.0544645 -0.011793 -0.0108659 
0.146221 0.0644123 -0.17643 -0.0151093 0.0988856 0.219932 0.0392131 -0.0935852 -0.0702163 -0.060172 0.0932421 0.075457 0.0892267 -0.12072 -0.102125 -0.0136045 -0.101483 0.0450157 -0.129044 0.11875 0.124105 -0.00460675 0.0442704 0.139377 -0.00251681 -0.0567334 -0.00655598 -0.171661 0.0418397 0.142709 -0.0289664 0.0068189 -0.145276 0.0494848 -0.0153936 0.0169973 -0.128391 -0.0250956 -0.0102431 0.0219745 -0.00940754 -0.068972 -0.0744303 0.181079 -0.128099 0.00869093 0.134971 0.0974236 -0.128003 0.107907 0.0579196 0.0446213 -0.0792155 -0.0289595 0.0418881 -0.0342718 -0.0451289 0.190436 0.0168177 -0.0707309 -0.0630115 0.0352354 0.288594 -0.0624164 -0.0405188 -0.159991 0.0213826 0.0397239 -0.0579758 0.0975185 0.0114318 0.103179 -0.0290146 0.00436188 -0.0343252 -0.0296546 -0.058869 0.0215931 -0.0265929 0.167091 0.0675266 0.0293198 -0.0234464 -0.0621632 -0.0949751 0.0640895 0.0375146 -0.068028 -0.0326375 0.04085 0.103199 -0.132556 -0.122475 -0.0013979 -0.0588049 -0.0965506 -0.0299863 0.0334417 0.049878 -0.0865323 0.0562639 0.0683422 -0.00597376 0.108091 -0.14126 0.0562878 -0.110284 0.184249 -0.0130694 0.0068624 0.129064 0.121009 -0.0614554 0.0296527 -0.0119679 0.113135 -0.104875 -0.0197835 0.0318018 0.135906 0.00619229 -0.0494549 0.0159714 0.0551071 -0.0942788 0.0406517 -0.0283854 -0.0195313 
