{
  "descriptor": [
    -0.07578415423631668,
    0.03920075297355652,
    0.09557048976421356,
    -0.04352506250143051,
    -0.18110400438308716,
    0.02930746041238308,
    -0.04762449860572815,
    -0.04802759364247322,
    0.15649710595607758,
    -0.17372730374336243,
    0.15138381719589233,
    -0.030421119183301926,
    -0.26067978143692017,
    0.10571513324975967,
    -0.07076627761125565,
    0.17162500321865082,
    -0.14133456349372864,
    -0.17180879414081573,
    -0.06001013144850731,
    -0.09866473823785782,
    0.00765810813754797,
    0.07943762093782425,
    -0.04996151849627495,
    0.06998792290687561,
    -0.1477072685956955,
    -0.3867589235305786,
    -0.08474679291248322,
    -0.056223656982183456,
    0.06725268065929413,
    -0.06842347979545593,
    -0.06534578651189804,
    0.1069624274969101,
    -0.1262659877538681,
    0.054063521325588226,
    0.07578199356794357,
    0.056587789207696915,
    -0.06236766651272774,
    -0.1435181349515915,
    0.24021467566490173,
    0.07772435992956161,
    -0.23395252227783203,
    -0.02182813733816147,
    0.03874379023909569,
    0.2302812784910202,
    0.1533256322145462,
    -0.007128650322556496,
    0.07557540386915207,
    -0.08371841907501221,
    0.1464795023202896,
    -0.28177300095558167,
    0.027276620268821716,
    0.20611277222633362,
    0.03476330637931824,
    0.06692565977573395,
    0.06720830500125885,
    -0.17019033432006836,
    -0.021437469869852066,
    0.08399497717618942,
    -0.15579578280448914,
    0.036141250282526016,
    0.03708566352725029,
    -0.10056132078170776,
    -0.04381120949983597,
    -0.06598304957151413,
    0.19236640632152557,
    0.10022993385791779,
    -0.11084862798452377,
    -0.1500256359577179,
    0.26350751519203186,
    -0.18863976001739502,
    -0.04446173831820488,
    0.047776538878679276,
    -0.11257841438055038,
    -0.164826899766922,
    -0.20151567459106445,
    0.06410054117441177,
    0.4275844991207123,
    0.14636743068695068,
    -0.10577911138534546,
    0.08345308154821396,
    -0.009941588155925274,
    -0.046918392181396484,
    0.044203486293554306,
    0.13366442918777466,
    -0.11180344223976135,
    -0.005819155368953943,
    -0.02740112692117691,
    0.07074137777090073,
    0.2599574327468872,
    -0.0010364355985075235,
    -0.0030272118747234344,
    0.20722399652004242,
    0.013342383317649364,
    0.032529812306165695,
    0.09385751187801361,
    0.08435443788766861,
    -0.13209562003612518,
    -0.07937353104352951,
    -0.1301400363445282,
    -0.005344192497432232,
    0.046951062977313995,
    -0.06077314168214798,
    -0.008515419438481331,
    0.14494970440864563,
    -0.17112155258655548,
    0.15429657697677612,
    -0.08962900936603546,
    -0.09624195098876953,
    -0.031567227095365524,
    -0.001637946697883308,
    -0.13087816536426544,
    -0.02325250208377838,
    0.14998336136341095,
    -0.21242834627628326,
    0.13117927312850952,
    0.1344514787197113,
    0.046205099672079086,
    0.15283742547035217,
    0.09828760474920273,
    0.021861597895622253,
    0.03127964958548546,
    -0.0793938934803009,
    -0.16828984022140503,
    -0.12547066807746887,
    0.09782737493515015,
    -0.05089782550930977,
    -0.017392367124557495,
    -0.020545432344079018
  ]
}