{
  "descriptor": [
    -0.07738564163446426,
    0.1492283046245575,
    0.08411350101232529,
    -0.05518944934010506,
    -0.1496530920267105,
    0.11611252278089523,
    -0.06873629987239838,
    -0.05944925546646118,
    0.12453826516866684,
    -0.09095671772956848,
    0.18243712186813354,
    0.011204415000975132,
    -0.24675853550434113,
    -0.04572217911481857,
    -0.02326899580657482,
    0.08759679645299911,
    -0.09989780187606812,
    -0.1308528631925583,
    -0.10278280079364777,
    -0.12137863039970398,
    -0.03632177412509918,
    0.08718683570623398,
    -0.01341019943356514,
    -0.0747697651386261,
    -0.07959906756877899,
    -0.29529476165771484,
    -0.03225713223218918,
    -0.06167761608958244,
    0.13219565153121948,
    -0.11933815479278564,
    0.051554787904024124,
    0.056907281279563904,
    -0.1437297761440277,
    -0.04161521792411804,
    0.010352632962167263,
    0.0739406943321228,
    -0.07993293553590775,
    -0.04810057953000069,
    0.25369521975517273,
    -0.07834077626466751,
    -0.10202573239803314,
    0.028846634551882744,
    0.058071255683898926,
    0.2621590197086334,
    0.1301681250333786,
    -0.04296090453863144,
    0.03449103981256485,
    -0.010755958966910839,
    0.10542120784521103,
    -0.3045389950275421,
    0.1378386914730072,
    0.1814284324645996,
    0.14598557353019714,
    0.14425648748874664,
    0.056528959423303604,
    -0.11729517579078674,
    0.010840211994946003,
    0.22784383594989777,
    -0.16831257939338684,
    0.1662125438451767,
    0.11721810698509216,
    -0.08458878099918365,
    -0.10556461662054062,
    -0.04014785215258598,
    0.1884138137102127,
    0.09845729917287827,
    -0.12113893032073975,
    -0.19613152742385864,
    0.10288116335868835,
    -0.12141009420156479,
    -0.04219077527523041,
    0.12148746848106384,
    -0.09439020603895187,
    -0.12115798890590668,
    -0.19715142250061035,
    0.1576557159423828,
    0.37315797805786133,
    0.14387807250022888,
    -0.1771470457315445,
    -0.017368681728839874,
    -0.028982629999518394,
    -0.03389690816402435,
    0.05083143338561058,
    0.031017206609249115,
    -0.06005459278821945,
    -0.1633508950471878,
    -0.0030097898561507463,
    0.02376941405236721,
    0.180059015750885,
    0.02319294959306717,
    -0.058541007339954376,
    0.22146978974342346,
    0.08573511242866516,
    0.0046549271792173386,
    -0.00904941651970148,
    0.07950357347726822,
    0.0055001783184707165,
    -0.05030076205730438,
    -0.04580531269311905,
    0.0768977478146553,
    0.03190747648477554,
    -0.16071783006191254,
    -0.029232289642095566,
    0.0937095358967781,
    -0.15474830567836761,
    0.24383653700351715,
    -0.03456363081932068,
    0.05917807295918465,
    0.09548643231391907,
    -0.0038612117059528828,
    -0.045403651893138885,
    -0.021278761327266693,
    0.23579032719135284,
    -0.3063456416130066,
    0.21195703744888306,
    0.17311207950115204,
    0.003888835432007909,
    0.144301638007164,
    0.0643998384475708,
    0.12625548243522644,
    0.0904076024889946,
    -0.012757467105984688,
    -0.15251365303993225,
    -0.13890916109085083,
    0.01612509787082672,
    -0.07847990095615387,
    -0.07489508390426636,
    0.07169022411108017
  ]
}