0.0221468 0.0203182 -0.102222 -0.0367861 0.0817025 0.165841 0.0481967 -0.0769769 -0.0524004 -0.102597 -0.0431536 0.0477697 0.0825364 -0.0501988 -0.0352438 -0.0812868 -0.204419 -0.0050443 -0.0965223 0.121078 0.0989667 -0.128693 0.106517 0.0803016 0.0159901 -0.05264 -0.0776893 -0.19916 -0.0401216 0.0555957 0.0349876 0.0112198 -0.0809643 0.0486829 0.0181293 0.0580812 -0.0833308 0.0781646 -0.0970562 -0.0790425 0.0707387 -0.0888707 0.00398144 0.154559 -0.175369 0.0283801 0.165281 0.0687299 -0.120014 0.113958 -0.0828363 -0.108999 0.0195112 0.00849571 0.146643 0.0109811 -0.0408551 0.192435 0.0189348 -0.181789 -0.0550931 0.103615 0.227332 -0.054275 0.0551868 0.0031714 -0.00566668 0.0300557 -0.0602765 0.0834591 -0.0198908 0.0910022 -0.0253174 0.0207484 0.0441573 0.0120497 -0.091153 -0.0460028 0.0515903 0.0909242 -0.0303922 0.0111874 -0.0697498 -0.0640588 -0.117374 0.0296642 0.0419178 0.0315143 0.0131945 0.049079 0.158862 -0.125407 -0.00988628 -0.129562 -0.090951 -0.0676717 -0.0351762 0.146128 0.0825446 -0.0596458 0.0231128 -0.000522357 0.0235545 0.0360378 -0.138001 0.0733087 -0.156265 0.184374 -0.0342968 -0.017378 0.0860525 0.151446 -0.0926192 -0.0499615 0.00907535 0.105935 -0.0588136 -0.0648328 0.0717541 0.171957 0.0638526 -0.0326067 -0.00499717 0.0676493 -0.143322 0.0246567 -0.0239645 0.0190809 
0.0518209 0.00889378 -0.0949004 -0.0291924 0.0588297 0.162804 0.0750718 -0.0527496 -0.0540552 -0.12223 -0.0451819 0.0417576 0.101015 -0.053224 -0.048243 -0.0897956 -0.185377 -0.0511932 -0.114079 0.138464 0.106711 -0.144234 0.10119 0.0667467 -0.00440777 -0.0478488 -0.110063 -0.198364 -0.0354468 0.0487417 0.0258656 0.0292172 -0.101185 0.065168 -0.00346052 0.0326046 -0.085873 0.149683 -0.0838115 -0.0800395 0.0562403 -0.0874369 -0.0278371 0.109089 -0.148278 0.0136019 0.128842 0.0497519 -0.111003 0.126539 -0.0908226 -0.0810794 0.0216236 0.0305025 0.143755 -0.0205513 -0.0337775 0.19432 -0.0019525 -0.185025 -0.0480066 0.0963383 0.224265 -0.076633 0.0489634 0.0160819 0.0149909 0.0372895 -0.0673048 0.0485278 -0.0241816 0.0798267 -0.0332704 0.0663706 0.039764 0.00280638 -0.0589015 -0.0799909 0.074754 0.134011 -0.0469941 -0.0320652 -0.0549463 -0.0845443 -0.093158 -0.00158936 0.0520837 0.0404311 0.0344863 0.0267256 0.162163 -0.148156 0.017327 -0.100665 -0.0942389 -0.0800119 0.00617412 0.120246 0.0824896 -0.0404496 0.0221688 0.016295 -0.00881479 0.085657 -0.136663 0.0666562 -0.142741 0.197031 -0.0158383 -0.0370402 0.0778171 0.161817 -0.118201 -0.0342991 0.0324679 0.117043 -0.0594746 -0.0506428 0.0725117 0.176142 0.0181945 -0.0187111 0.00653241 0.0767535 -0.106182 0.017259 -0.0140416 0.00330223 
0.0546795 0.003651 -0.0817853 -0.0529962 0.0649487 0.171867 0.0760265 -0.0287733 -0.0264157 -0.15268 -0.0560921 0.0391995 0.0817915 -0.0572684 -0.0276405 -0.100921 -0.196543 -0.0654209 -0.139774 0.112078 0.0986024 -0.104496 0.0786113 0.0750983 -0.00472053 -0.0660369 -0.0887058 -0.179583 -0.0555436 0.0306069 0.0467518 0.00859521 -0.107258 0.0838283 -0.00538799 0.0409848 -0.075366 0.106803 -0.102466 -0.0549771 0.0819111 -0.0808276 -0.0165559 0.126401 -0.130885 0.0195671 0.117302 0.0574306 -0.110039 0.137707 -0.0966469 -0.106426 0.016052 0.0217559 0.140411 -0.00548443 -0.0727739 0.212664 -0.00445 -0.179953 -0.0543064 0.107294 0.208368 -0.0696202 0.024999 0.00732232 0.02346 0.040745 -0.064873 0.0576557 -0.0158658 0.0701355 -0.0245095 0.0505925 0.0397598 0.00911443 -0.0652627 -0.0863703 0.0635803 0.12429 -0.0274767 -0.0175323 -0.0576931 -0.0834475 -0.103795 0.012371 0.0614314 0.0241653 0.0119099 0.0502616 0.173674 -0.168681 -0.00282839 -0.11079 -0.0875246 -0.0425947 -0.00876239 0.0859301 0.0715854 -0.0307502 0.00508639 0.000576919 -0.0107016 0.0734664 -0.155473 0.0593776 -0.175665 0.183276 -0.0612295 -0.0381761 0.108196 0.153009 -0.125157 -0.0292654 0.0214578 0.113726 -0.0568497 -0.050736 0.0785834 0.173185 0.0495062 -0.00604788 0.00986802 0.0927178 -0.0988141 -0.0109688 -0.022558 -0.0135258 
0.0492745 0.00531186 -0.0816393 -0.0321875 0.0594181 0.160413 0.0784347 -0.0412381 -0.0235656 -0.164309 -0.0524745 0.05518 0.0813052 -0.0835497 -0.0627897 -0.101709 -0.211119 -0.0553687 -0.156483 0.137234 0.0975124 -0.11534 0.0812091 0.074572 -0.023492 -0.0773308 -0.0922926 -0.181348 -0.0704632 0.0441981 0.0269212 0.00194122 -0.102332 0.0868558 -0.00267172 0.0297178 -0.0704391 0.109006 -0.114595 -0.057088 0.0786601 -0.0923025 -0.0107153 0.120867 -0.137424 0.0127032 0.124147 0.0513073 -0.102219 0.163947 -0.087325 -0.112157 0.00825392 0.0346024 0.14624 -0.0160128 -0.0702779 0.18747 -0.00977319 -0.164065 -0.0461601 0.103131 0.206083 -0.0664828 0.0332276 -0.0246586 0.0183699 0.0114653 -0.0800147 0.0456167 -0.0203472 0.0574717 -0.0118625 0.064479 0.0370136 0.0189155 -0.0558234 -0.0796852 0.0607724 0.129901 -0.0218751 -0.0372681 -0.059082 -0.065752 -0.108033 0.0293135 0.0508104 0.0246703 0.00642188 0.054687 0.16235 -0.180676 0.00229518 -0.107392 -0.10141 -0.0469283 -0.0192082 0.0802054 0.0785329 -0.0266144 0.00999534 0.0115399 -0.0177465 0.0831276 -0.121625 0.0543703 -0.157909 0.205607 -0.0685496 -0.0195631 0.0903046 0.142525 -0.113536 -0.0188307 -0.00635552 0.120789 -0.0453013 -0.0262992 0.0706948 0.174941 0.0296602 -0.00255363 0.0009646 0.0828641 -0.0862948 -0.00345811 -0.0264582 -0.0212753 
0.0446168 0.0152344 -0.106982 -0.0468261 0.0563488 0.160981 0.0552646 -0.0311505 -0.0426331 -0.138405 -0.0475341 0.0538632 0.0853247 -0.0958936 -0.0808671 -0.0865729 -0.210919 -0.0444043 -0.143353 0.14858 0.0975419 -0.126716 0.109204 0.0590401 -0.0298969 -0.0567232 -0.069711 -0.188476 -0.0516482 0.0289832 0.0170505 -0.000770184 -0.093969 0.0749379 -0.0144525 0.0206848 -0.0811793 0.127214 -0.103977 -0.0537622 0.0589586 -0.100444 -0.0243197 0.137141 -0.149523 0.0087775 0.137078 0.0576491 -0.112786 0.17286 -0.0819184 -0.0887331 -0.00801217 0.036196 0.130376 -0.0288791 -0.0312132 0.174254 -0.000612914 -0.176926 -0.045281 0.0935487 0.229126 -0.0519919 0.0300217 -0.0437372 0.00904033 0.0256706 -0.0618089 0.0617645 -0.0308268 0.0622547 -0.0167889 0.0742546 0.0372837 -0.00114426 -0.0620681 -0.0570941 0.0550717 0.126252 -0.0355126 -0.0358259 -0.0562758 -0.0601402 -0.1064 0.0295393 0.0458122 0.0425388 0.0344802 0.0354132 0.156126 -0.164986 -0.00845037 -0.105203 -0.081863 -0.0656032 -0.0157261 0.112229 0.0647568 -0.0447496 0.0106305 0.0117243 -0.0189845 0.0937672 -0.108403 0.0548041 -0.155318 0.212655 -0.0452288 -0.0313835 0.0820394 0.16421 -0.100486 -0.00792391 -0.00148663 0.114106 -0.0411749 -0.0429627 0.0874785 0.173996 0.0228684 -0.00457408 0.0118936 0.0716737 -0.102422 -0.00915914 -0.0260197 -0.0043144 
0.0488546 0.00676517 -0.0464828 -0.0577765 0.0444479 0.165507 0.0593646 -0.00165374 -0.0374699 -0.171812 -0.0715484 0.0440646 0.0674962 -0.117614 -0.0525869 -0.101213 -0.21213 -0.0816468 -0.161005 0.141816 0.0911934 -0.086263 0.0900221 0.0602816 -0.0444765 -0.0454516 -0.0901357 -0.183788 -0.0497278 -0.0109535 0.0435959 -0.0197121 -0.11337 0.0950208 0.00035318 0.0188367 -0.0730522 0.152294 -0.110754 -0.0381182 0.0694043 -0.0838858 -0.0440363 0.128689 -0.117794 0.00966467 0.115346 0.0521749 -0.113102 0.18324 -0.0893344 -0.100866 -0.0074651 0.0326368 0.128032 -0.0420328 -0.0592265 0.187716 -0.0145491 -0.18122 -0.0441431 0.0987335 0.204251 -0.0507094 0.0402124 -0.0594691 0.0341537 0.00994147 -0.0682094 0.0518446 -0.0265177 0.0505723 2.11457e-05 0.0976237 0.0247183 -0.0214263 -0.0697968 -0.0680976 0.0832029 0.149212 -0.0218033 -0.0414467 -0.0506347 -0.0709152 -0.084474 -0.0234613 0.0635104 0.0555842 0.0236154 0.0431348 0.170493 -0.162481 0.00336274 -0.0928038 -0.0850304 -0.0423291 0.0141922 0.0759741 0.0419588 -0.0188802 -0.0123231 0.0248514 -0.0524783 0.0925964 -0.120665 0.0392543 -0.150192 0.186872 -0.0367642 -0.0304077 0.104292 0.168019 -0.127463 0.00313198 0.00703578 0.110293 -0.045911 -0.0470624 0.0648016 0.159924 0.0139765 0.0225132 0.014355 0.0756498 -0.0650412 -0.030727 -0.0124495 -0.0349354 
0.0332593 0.0405018 -0.105831 -0.0473651 0.0584626 0.156156 0.051608 -0.0559419 -0.0473919 -0.127981 -0.0494407 0.0402999 0.0808318 -0.0847426 -0.0648988 -0.0752531 -0.213355 -0.0458393 -0.130133 0.139635 0.0936175 -0.119812 0.0909031 0.052742 -0.0135012 -0.0437987 -0.0785915 -0.186917 -0.0345263 0.0458575 0.0167233 0.0214899 -0.0910912 0.0664617 -9.47731e-05 0.0319177 -0.069616 0.11388 -0.0909759 -0.0640889 0.0650259 -0.105501 0.00722567 0.140385 -0.139097 0.0369329 0.162836 0.0613567 -0.135647 0.143596 -0.0879426 -0.0899665 0.00494831 0.029511 0.140032 -0.0165116 -0.0468187 0.173197 0.00631735 -0.189763 -0.0481423 0.0966807 0.227836 -0.0500733 0.0331966 -0.00896407 0.00875238 0.020785 -0.0596019 0.0518088 -0.0331868 0.0622567 -0.0175636 0.0660685 0.0539286 -0.000742934 -0.0728658 -0.0564274 0.0541064 0.113535 -0.0142498 -0.0086162 -0.0708655 -0.0652031 -0.105595 0.0355337 0.0320766 0.0331902 0.0310866 0.0523476 0.161042 -0.153891 -0.0196314 -0.111299 -0.0880848 -0.0549599 -0.0114935 0.125377 0.0772594 -0.0548558 0.00649335 0.00296748 0.000354409 0.080406 -0.140451 0.067521 -0.158733 0.221229 -0.0445137 -0.0299458 0.0953078 0.159644 -0.116421 -0.0269656 0.00112141 0.0991383 -0.0584659 -0.055335 0.0865866 0.159711 0.0433256 -0.00394563 0.0265563 0.0759362 -0.114028 -0.00485089 -0.0197774 -0.0103951 
0.0604424 0.0081642 -0.0913205 -0.0488422 0.073386 0.156849 0.0812685 -0.0332695 -0.0307911 -0.160349 -0.0625012 0.0387048 0.0749824 -0.0563446 -0.043529 -0.0951581 -0.187777 -0.0732075 -0.154356 0.132333 0.0818555 -0.104294 0.0846572 0.0624792 -0.0167303 -0.0696217 -0.0903883 -0.161503 -0.0535989 0.0219819 0.0316657 0.01195 -0.118854 0.0834571 -0.0144806 0.037588 -0.071402 0.122245 -0.110272 -0.0527773 0.0747404 -0.0667206 -0.0124663 0.11665 -0.12819 0.0319042 0.117232 0.0650585 -0.0993376 0.161272 -0.0988504 -0.103062 0.000869389 0.0266012 0.14024 -0.0268239 -0.0721738 0.211084 0.00217655 -0.174053 -0.0493094 0.114323 0.210125 -0.0673039 0.0157176 -0.000724706 0.0245226 0.0393028 -0.0634855 0.0516714 -0.0127559 0.0766335 -0.00170207 0.0834142 0.0327851 0.00534621 -0.0519101 -0.0813536 0.0617579 0.106326 -0.00947623 -0.0145651 -0.0705891 -0.0881986 -0.0941529 0.00953931 0.044336 0.0366887 0.0186088 0.0484667 0.181934 -0.166201 -0.00244689 -0.116881 -0.0720668 -0.0420861 0.00135951 0.0794995 0.0707104 -0.0312047 -0.00764749 0.000159095 -0.0109025 0.0827986 -0.163082 0.0593305 -0.177376 0.19075 -0.0524957 -0.026081 0.117112 0.166103 -0.116622 -0.00309288 0.00473598 0.105583 -0.0455729 -0.0398791 0.0716422 0.158841 0.0265385 0.0166803 0.0222035 0.097605 -0.10541 -0.0242061 -0.0370484 -0.0330514 
0.0565172 -0.029285 -0.0698715 -0.0640093 0.0681768 0.160143 0.0478397 -0.00666154 -0.0490733 -0.168476 -0.0830837 0.0437634 0.0633616 -0.0646583 -0.0330899 -0.104622 -0.185541 -0.0848417 -0.119166 0.141428 0.0846041 -0.0849333 0.10499 0.0579076 -0.0234259 -0.0274557 -0.0766082 -0.182702 -0.0586482 -0.0182214 0.0354664 -0.0190037 -0.111316 0.0812417 -0.00548619 0.0421092 -0.0770208 0.150246 -0.110715 -0.0582619 0.0666313 -0.0505843 -0.0404027 0.127667 -0.135527 0.0249913 0.117854 0.0559002 -0.0923876 0.17384 -0.0990037 -0.107931 0.00861081 0.0358349 0.149758 -0.0433439 -0.0464265 0.208748 -7.59951e-05 -0.19726 -0.0342333 0.111125 0.213983 -0.0480402 0.0344116 -0.0303981 0.030095 0.0482639 -0.0318145 0.0684711 -0.0165771 0.0762813 9.94517e-06 0.0862004 0.0174631 -0.0149145 -0.072175 -0.0739168 0.0848159 0.12167 -0.0254061 -0.00627754 -0.0563115 -0.092466 -0.07498 -0.0437166 0.0642475 0.0803688 0.0359543 0.0314573 0.187564 -0.137349 0.00809845 -0.103711 -0.0686818 -0.0512147 0.0265547 0.093065 0.0509807 -0.0354885 -0.0150895 0.0133801 -0.0247069 0.0632941 -0.16019 0.0472683 -0.168425 0.152498 -0.0403035 -0.02814 0.126353 0.177317 -0.119274 -0.00493973 0.0212634 0.102085 -0.0416207 -0.0766548 0.0569893 0.146233 0.0183632 0.0270926 0.0319925 0.071181 -0.098247 -0.0286187 -0.0109537 -0.0217595 
0.05689 -0.0123735 -0.0661556 -0.0618977 0.0622609 0.163418 0.0635525 -0.000457295 -0.0456751 -0.165352 -0.0781346 0.0385421 0.068563 -0.0805508 -0.0301178 -0.0995914 -0.1879 -0.0813431 -0.137899 0.136105 0.0895513 -0.0839894 0.0926329 0.0573156 -0.0297789 -0.0404184 -0.0885754 -0.185662 -0.0548973 -0.00884587 0.0330452 -0.00789382 -0.110925 0.091345 -0.00210401 0.0344635 -0.0669823 0.147054 -0.114151 -0.0557096 0.0732672 -0.0631517 -0.0289808 0.128846 -0.130038 0.0284541 0.122531 0.05291 -0.110358 0.171218 -0.0942586 -0.113928 -0.00101634 0.0349349 0.14623 -0.0362483 -0.0588302 0.199179 -0.00260542 -0.192007 -0.0380865 0.104021 0.204399 -0.0578106 0.0391394 -0.0311 0.0279438 0.037099 -0.0465885 0.0579389 -0.018277 0.0659706 -0.00311688 0.083876 0.0215467 -0.0110983 -0.0692717 -0.0676433 0.0819369 0.118365 -0.0227897 -0.0132639 -0.0615375 -0.0892897 -0.0813485 -0.0253146 0.0638232 0.0599756 0.0280125 0.0449337 0.183327 -0.154784 -0.00521453 -0.109885 -0.0752498 -0.0372002 0.0228678 0.0852948 0.0485198 -0.0257303 -0.0147387 0.0125646 -0.0255577 0.0751934 -0.157886 0.0431627 -0.171475 0.169835 -0.0474632 -0.0329014 0.117417 0.170091 -0.126199 -0.0123187 0.0216799 0.100203 -0.0423181 -0.0751254 0.0612629 0.151165 0.0246457 0.0278462 0.033985 0.0870483 -0.0826931 -0.0358001 -0.0105013 -0.0332588 
0.0530781 0.00443061 -0.076159 -0.0561668 0.0683597 0.159274 0.0743053 -0.0356847 -0.0339225 -0.174389 -0.0872245 0.0229542 0.067812 -0.0508753 -0.0183407 -0.0956305 -0.199569 -0.0848389 -0.135188 0.115533 0.0766947 -0.0852074 0.0806454 0.0429109 -0.0180046 -0.0631192 -0.103488 -0.172213 -0.0768215 0.0229144 0.0308516 0.00874804 -0.106615 0.0838908 0.0108019 0.045848 -0.0420376 0.111787 -0.104814 -0.06139 0.0811332 -0.0676896 0.0164578 0.101372 -0.119543 0.0559149 0.130545 0.0576948 -0.107046 0.160663 -0.109844 -0.132077 0.0321531 0.046491 0.157472 -0.0211701 -0.0634661 0.194812 -0.000933663 -0.184437 -0.0418919 0.130388 0.18715 -0.0743024 0.0274002 0.0217145 0.0225477 0.039453 -0.0536162 0.0341712 -0.0140617 0.0637925 -0.0063547 0.0672474 0.0473021 0.0223096 -0.0622488 -0.0985142 0.0743409 0.101237 0.0064426 -0.0052089 -0.07757 -0.0818655 -0.0978741 0.0196778 0.0374239 0.0342459 0.00844039 0.0695479 0.189001 -0.162226 0.000385464 -0.1205 -0.091416 -0.0173305 0.00440875 0.093859 0.0740355 -0.0211366 -0.00439571 -0.00594399 -0.00516339 0.059997 -0.168953 0.0553493 -0.183094 0.180302 -0.081765 -0.0137627 0.123873 0.144853 -0.118147 -0.0328834 0.001259 0.111073 -0.0486539 -0.0419606 0.0552963 0.144256 0.0469008 0.0130379 0.0446546 0.0916475 -0.0972412 -0.0263678 -0.0236231 -0.0353414 
0.00326122 0.064704 -0.0780985 -0.0192996 0.0574143 0.151813 0.0605087 -0.105472 -0.0412282 -0.134856 -0.0602185 0.0246867 0.0598072 -0.0630406 -0.0368807 -0.0937729 -0.235327 -0.0534166 -0.0979649 0.114354 0.0785548 -0.125287 0.0741003 0.0177608 0.0187233 -0.0481403 -0.126773 -0.174991 -0.0404423 0.0590273 0.0401601 0.0299498 -0.0848782 0.0421372 0.0433374 0.0541841 -0.0599227 0.0880919 -0.0756895 -0.0925863 0.0843639 -0.107786 0.0362543 0.120074 -0.144094 0.0688055 0.168332 0.0511096 -0.130807 0.110913 -0.118038 -0.0781038 0.0417767 0.0253178 0.153195 -0.00460762 -0.0588582 0.163032 -0.00345182 -0.179481 -0.0579753 0.113466 0.212764 -0.05652 0.0589187 0.0473147 0.0125377 0.0013258 -0.069961 0.0542226 -0.013464 0.0695956 -0.0105032 0.0634793 0.0738218 0.016154 -0.0905833 -0.0885884 0.0554029 0.108901 -0.013504 -0.00232559 -0.070735 -0.0500767 -0.104633 0.0308998 0.0173403 0.0257945 0.0109392 0.0650453 0.171852 -0.131623 0.00683407 -0.128237 -0.1101 -0.0701844 -0.0103421 0.141121 0.0934618 -0.0521902 0.00377588 0.0152038 0.0236165 0.0331876 -0.14706 0.0924922 -0.121596 0.227564 -0.0291466 0.00124884 0.0936354 0.119867 -0.130212 -0.0574842 0.00709598 0.0923893 -0.0510391 -0.040601 0.0941617 0.157039 0.068927 -0.0234903 0.0178649 0.067978 -0.107314 0.0180104 0.0177782 0.0113504 
-0.00449912 0.0645653 -0.0793815 -0.0300421 0.0519698 0.157782 0.0451055 -0.0891996 -0.0493685 -0.109634 -0.052937 0.028664 0.0589868 -0.0765639 -0.0294333 -0.110132 -0.23713 -0.0449353 -0.0768309 0.117373 0.0673231 -0.119895 0.0787187 0.0313404 0.0175072 -0.0301585 -0.0996508 -0.184083 -0.0309531 0.0434923 0.0441556 0.000902256 -0.0764628 0.0322584 0.0425921 0.0558292 -0.0683031 0.0882454 -0.0852603 -0.0849965 0.0880827 -0.114035 0.0102515 0.148877 -0.168401 0.0600469 0.173516 0.0572487 -0.133767 0.10572 -0.107902 -0.0669801 0.0363996 0.0148862 0.15049 0.00109924 -0.0594475 0.163149 0.00345085 -0.190867 -0.0659219 0.0985814 0.225955 -0.042337 0.0620439 0.026222 0.020283 -0.000707912 -0.0596708 0.0677256 -0.0174067 0.0701955 -0.0102255 0.0548725 0.0752278 0.00659648 -0.112579 -0.0632898 0.0615628 0.115252 -0.0309278 0.00255682 -0.0609559 -0.0458275 -0.0929528 0.0124382 0.0315308 0.0381788 0.0267442 0.0569859 0.163211 -0.118287 0.00786734 -0.125622 -0.111406 -0.0939007 -0.00624895 0.141446 0.0892543 -0.0721899 0.0023378 0.0277927 0.0282891 0.017429 -0.151957 0.0924802 -0.11578 0.21294 -0.0190911 -8.50681e-05 0.107945 0.131177 -0.124808 -0.0618316 0.00608226 0.0851572 -0.0580531 -0.0675501 0.09584 0.154413 0.0739103 -0.0359812 0.00628929 0.0598896 -0.107502 0.0226328 0.0234151 0.027332 
0.0241601 0.0384715 -0.0619741 -0.0423623 0.0305907 0.137588 0.0734327 -0.0540124 -0.046109 -0.14932 -0.0721478 0.02108 0.0865096 -0.065484 -0.0520539 -0.0969983 -0.228197 -0.0872757 -0.131372 0.132862 0.0888448 -0.126147 0.0707065 0.0312634 -0.02277 -0.0452079 -0.125394 -0.171719 -0.0482095 0.0428174 0.0155812 0.0129089 -0.104805 0.0687321 0.011537 0.0297177 -0.0568931 0.143682 -0.085802 -0.0658733 0.0637987 -0.105768 0.0150409 0.10093 -0.113463 0.0455628 0.142489 0.0475125 -0.119052 0.145112 -0.109472 -0.0955833 0.0193496 0.0557195 0.158396 -0.0286646 -0.0569023 0.170293 -0.00805007 -0.191375 -0.0344448 0.108408 0.195304 -0.0491099 0.0378157 0.0217716 0.0269282 0.00774285 -0.0638456 0.0130546 -0.0249827 0.0552192 -0.00758102 0.0911623 0.0680004 0.00998467 -0.0614978 -0.0922142 0.0869675 0.133946 -0.00642556 -0.0412813 -0.0657152 -0.0619049 -0.101736 0.0177853 0.0347761 0.0399122 0.0360629 0.0493743 0.163474 -0.15736 0.0275802 -0.112131 -0.120438 -0.0559685 0.00720224 0.112469 0.0890044 -0.0308757 0.00294221 0.0210595 -0.00896692 0.0813763 -0.136397 0.0684296 -0.149342 0.229487 -0.0436393 -0.0237488 0.0920399 0.14115 -0.141536 -0.0330231 -0.00148293 0.115843 -0.0406643 -0.0268506 0.0656678 0.150262 0.0241343 -0.00264473 0.0274629 0.0759199 -0.0977546 -0.00107697 -0.01316 -0.0154647 
0.0267499 0.0351057 -0.0711039 -0.0228533 0.0477766 0.1255 0.086656 -0.0759143 -0.0523738 -0.137369 -0.0651179 0.0205605 0.100353 -0.0290752 -0.0504926 -0.0969205 -0.206945 -0.0700012 -0.124169 0.138546 0.0931451 -0.147649 0.0749572 0.0560906 -0.0027637 -0.0713662 -0.136578 -0.159325 -0.035375 0.0732078 0.0132439 0.0261737 -0.108001 0.0531902 0.00609134 0.0342561 -0.0723684 0.12897 -0.0925456 -0.0829189 0.0514031 -0.0928125 0.0173089 0.0943463 -0.12118 0.0457615 0.135779 0.05752 -0.101174 0.129376 -0.103926 -0.0882588 0.0358862 0.0363437 0.1594 -0.0226094 -0.0606683 0.184062 0.00832648 -0.183278 -0.0372779 0.120022 0.189071 -0.051299 0.02684 0.0446581 0.0206575 0.0055377 -0.0789816 0.00617987 -0.0207585 0.0694202 -0.00772627 0.0760284 0.0605121 0.0239071 -0.0474447 -0.100519 0.0883763 0.132835 0.000664789 -0.0477819 -0.075184 -0.071957 -0.092804 0.0182289 0.0193063 0.0315702 0.0297554 0.0479713 0.160923 -0.143435 0.0337796 -0.111221 -0.122232 -0.0657665 -0.00655272 0.118331 0.105707 -0.0398297 0.0217313 0.0229888 0.00774595 0.0740106 -0.15131 0.0795843 -0.144125 0.225643 -0.0188943 -0.0173419 0.0910942 0.142335 -0.135669 -0.034876 -0.0069124 0.127468 -0.0419392 -0.00629379 0.0579637 0.161908 0.00695074 -0.0158825 0.0019633 0.0742767 -0.125438 0.0231904 -0.0287928 -0.0151076 
0.02779 0.0236755 -0.0714133 -0.0240507 0.0571063 0.12774 0.0867915 -0.0661836 -0.0510734 -0.139791 -0.0665158 0.0271006 0.090792 -0.0299813 -0.0443127 -0.108414 -0.20542 -0.0654332 -0.113481 0.137869 0.091759 -0.141757 0.072164 0.0597191 0.00125174 -0.0671983 -0.13023 -0.162378 -0.0387598 0.0653514 0.0177201 0.0160894 -0.102649 0.0505353 0.010207 0.0382579 -0.0757347 0.117197 -0.102004 -0.0906491 0.0624936 -0.0843225 0.0131497 0.11126 -0.132881 0.0473045 0.137585 0.0553738 -0.0989521 0.127272 -0.111824 -0.0902646 0.0373213 0.0305099 0.165719 -0.0177808 -0.0685942 0.189949 0.00617485 -0.185026 -0.0389333 0.118384 0.194358 -0.0451492 0.0271748 0.0406768 0.0206271 0.00448499 -0.0709633 0.0142909 -0.0154744 0.0700902 -0.00516296 0.0692681 0.0545922 0.0238536 -0.0566332 -0.0952103 0.0885656 0.125231 -0.0096293 -0.035447 -0.0755025 -0.0745098 -0.0857695 0.0114907 0.0266554 0.0372141 0.031396 0.0502791 0.169763 -0.135678 0.0242288 -0.119301 -0.115859 -0.0708349 -0.00423382 0.115799 0.101051 -0.0458181 0.0162754 0.0225533 0.0187513 0.0547651 -0.164503 0.0837462 -0.144194 0.215194 -0.0195138 -0.0149079 0.103944 0.139206 -0.138562 -0.043065 -0.00103572 0.12074 -0.0369077 -0.027416 0.0653111 0.16034 0.0161794 -0.0154859 -0.00086913 0.0759628 -0.12646 0.0195989 -0.0157529 -0.00981222 
0.0377394 -0.00834388 -0.0211837 -0.0594353 0.0255386 0.163481 0.0710468 0.0131631 -0.0659133 -0.124805 -0.0699805 0.0155638 0.0780256 -0.137398 -0.0130024 -0.104814 -0.236617 -0.0577407 -0.124388 0.129607 0.0981247 -0.0861067 0.0760219 0.0572984 -0.0480633 -0.0204873 -0.119255 -0.229164 -0.0377757 -0.007985 0.0290563 -0.0198035 -0.120055 0.090529 0.038577 0.0156375 -0.0706988 0.143866 -0.0964081 -0.0638791 0.0689665 -0.113589 -0.048933 0.14112 -0.120955 0.0125049 0.125689 0.0597199 -0.13937 0.15234 -0.0977376 -0.127194 0.0104035 0.0324052 0.127952 -0.0334167 -0.0529965 0.158207 -0.0129017 -0.192202 -0.0217852 0.0905768 0.194823 -0.0291859 0.0591706 -0.0357602 0.0325772 -0.00627176 -0.044352 0.0219273 -0.0501849 0.0484107 -0.00555108 0.0839148 0.00924582 -0.0453035 -0.0898611 -0.0601873 0.112588 0.152087 -0.0153918 -0.0405983 -0.0730803 -0.0848679 -0.0839936 -0.0318079 0.0707264 0.052445 0.0406528 0.0546682 0.189845 -0.121917 0.00270533 -0.0946536 -0.127027 -0.0386124 0.0135772 0.0886094 0.0549724 -0.0208196 0.0120252 0.0250431 -0.0405216 0.046508 -0.104566 0.0296746 -0.12373 0.182833 -0.0242002 -0.0124418 0.100207 0.162752 -0.133999 -0.0613507 0.0295735 0.113162 -0.0441148 -0.0717679 0.0461659 0.132007 0.0257808 -0.000593138 0.0247031 0.0850629 -0.0751258 -0.0226811 0.0053962 -0.0307501 
0.0399097 -0.0162035 -0.0316951 -0.0424102 0.0322267 0.153925 0.0685202 -0.00419949 -0.0715521 -0.123061 -0.0645657 0.0260867 0.0841501 -0.111064 -0.0302649 -0.102095 -0.224854 -0.053961 -0.11619 0.149593 0.105481 -0.117838 0.0886376 0.0524232 -0.0363591 -0.0176135 -0.127533 -0.225321 -0.0417455 0.000806869 0.0213257 -0.00847411 -0.117531 0.0815929 0.0273249 0.0220335 -0.0874573 0.163763 -0.0934832 -0.0799591 0.0541706 -0.104201 -0.0515784 0.127753 -0.126349 0.00735816 0.124684 0.0523887 -0.127453 0.15076 -0.0957948 -0.111211 0.00913904 0.0366772 0.139144 -0.040808 -0.0450042 0.162895 -0.0120807 -0.190615 -0.0188236 0.087525 0.204766 -0.0328845 0.0651917 -0.0263705 0.0237645 0.00576573 -0.0497227 0.0306014 -0.0403143 0.0621935 -0.0052466 0.0867824 0.00632932 -0.0394616 -0.0769185 -0.0679777 0.110164 0.15475 -0.0333198 -0.0487749 -0.0702388 -0.0880917 -0.0887147 -0.0412314 0.0686731 0.0675195 0.0541795 0.0379866 0.179654 -0.119084 0.018192 -0.0897141 -0.123661 -0.0572251 0.0188306 0.0977618 0.0618805 -0.0264356 0.0125591 0.0324664 -0.0405268 0.0508425 -0.100733 0.0435562 -0.118186 0.184695 -0.00375747 -0.0206682 0.0851115 0.167851 -0.134177 -0.0504088 0.0404327 0.115662 -0.0401379 -0.065388 0.0500798 0.145076 0.00616897 -0.000688243 0.0190281 0.0760283 -0.0773484 -0.00563647 0.0147957 -0.0198993 
0.0397057 0.0062815 -0.0454306 -0.0436326 0.0409886 0.161011 0.0677236 -0.0224521 -0.0600696 -0.133893 -0.0629083 0.0270606 0.0812535 -0.0865624 -0.0384172 -0.100545 -0.209473 -0.0543755 -0.115979 0.139193 0.110598 -0.120678 0.0923945 0.0543997 -0.0223418 -0.030811 -0.122601 -0.206486 -0.0301877 0.0135211 0.0305914 -0.00151842 -0.105595 0.0754196 0.0261473 0.0258292 -0.0807948 0.161391 -0.0931539 -0.0878677 0.0510074 -0.0903313 -0.0351582 0.124637 -0.129978 0.0183449 0.129554 0.0490025 -0.132566 0.145092 -0.10508 -0.0924331 0.0179199 0.0332403 0.141419 -0.0302602 -0.042735 0.176914 -0.0125626 -0.200675 -0.0331483 0.0959161 0.216964 -0.0509241 0.0599576 -0.00512081 0.0212476 0.0114956 -0.0629947 0.0502054 -0.0313846 0.0589394 -0.0154674 0.0801702 0.0198304 -0.0274772 -0.0722 -0.0751777 0.101198 0.138786 -0.040324 -0.0339594 -0.068239 -0.0887787 -0.0805495 -0.0368497 0.0536732 0.0596943 0.0495385 0.0481586 0.183436 -0.130721 0.0137707 -0.097839 -0.0995106 -0.0660725 0.0165098 0.116977 0.0652485 -0.0301642 0.0118375 0.0302279 -0.0282152 0.057469 -0.125695 0.0571031 -0.122401 0.182022 0.000702829 -0.0319835 0.0906499 0.164272 -0.135931 -0.0406512 0.0457642 0.111163 -0.0433589 -0.0695437 0.06886 0.159328 0.0162309 -0.00153967 0.0149995 0.0737715 -0.0854783 -0.00111766 0.0218171 -0.0152366 
0.0336794 0.013901 -0.0465638 -0.0382276 0.0391989 0.156138 0.0920176 -0.0211017 -0.0682195 -0.114986 -0.0655408 0.0230198 0.093281 -0.0895198 -0.0368066 -0.11615 -0.208028 -0.0533023 -0.117489 0.140587 0.0973461 -0.137691 0.0829489 0.0509958 -0.0282226 -0.0442572 -0.146964 -0.202764 -0.0248526 0.0156462 0.0288232 0.00529245 -0.123513 0.0675056 0.0232671 0.0190758 -0.087467 0.157004 -0.0950673 -0.0848014 0.0610288 -0.100117 -0.0437131 0.120231 -0.139183 0.0210545 0.117809 0.0583039 -0.12137 0.1351 -0.10299 -0.0843145 0.0108216 0.0241409 0.130034 -0.0335919 -0.0489772 0.175694 -0.00484216 -0.185203 -0.0311378 0.101067 0.203238 -0.0505377 0.058209 -0.00850582 0.0288666 0.000315009 -0.0694785 0.0296067 -0.0293663 0.0676345 -0.00671192 0.0928731 0.0162547 -0.0203944 -0.0702508 -0.0716667 0.10976 0.144998 -0.046068 -0.0549545 -0.0676087 -0.0775432 -0.0755244 -0.0354719 0.0595313 0.05461 0.0490335 0.0332143 0.175607 -0.123999 0.032846 -0.106444 -0.114444 -0.0831542 0.0229259 0.106433 0.0657868 -0.0277599 0.0164952 0.0453738 -0.0236655 0.0687047 -0.118133 0.0557838 -0.115122 0.203225 0.00951998 -0.0144667 0.0872469 0.156964 -0.139667 -0.0429441 0.0273346 0.112576 -0.0406244 -0.0564112 0.0650938 0.160554 0.00142007 -0.0137842 -0.00525008 0.080539 -0.0894988 -0.000824989 -0.00444037 -0.0162567 
0.0307622 0.0130883 -0.0436746 -0.0413652 0.0447969 0.132547 0.0742767 -0.0280861 -0.0622505 -0.13275 -0.0774668 0.0205318 0.08933 -0.0737822 -0.0457637 -0.0960757 -0.207416 -0.0655932 -0.120755 0.151831 0.114439 -0.142673 0.0851564 0.0389858 -0.0165333 -0.0369281 -0.144915 -0.194594 -0.0269722 0.0237385 0.026001 0.00905259 -0.111429 0.0656187 0.0198926 0.0205801 -0.0848522 0.172715 -0.0882055 -0.0963233 0.0421282 -0.0845246 -0.0156605 0.11472 -0.113309 0.0282096 0.13146 0.0507457 -0.117591 0.138249 -0.109304 -0.0924591 0.016511 0.0330033 0.148652 -0.0429512 -0.0475909 0.171671 -0.00658089 -0.205446 -0.0193095 0.0967855 0.197723 -0.0342756 0.0504749 0.000997909 0.018217 0.0124062 -0.0609481 0.0187054 -0.0241781 0.0664468 -0.00677691 0.0847991 0.0208855 -0.0169894 -0.0626854 -0.0792798 0.10999 0.148089 -0.0325509 -0.0431867 -0.0736982 -0.0775265 -0.0747553 -0.0371806 0.0447297 0.071457 0.0636413 0.0327803 0.169139 -0.121498 0.023158 -0.100482 -0.108306 -0.0679787 0.0230392 0.120508 0.0636181 -0.0337396 0.0080373 0.027784 -0.0224434 0.0689996 -0.136328 0.0616498 -0.127839 0.203171 0.0196255 -0.0292883 0.0857841 0.159709 -0.15671 -0.0317101 0.0349576 0.11641 -0.0424884 -0.0514313 0.0567662 0.154077 -0.00599299 0.0159997 0.0130054 0.0737167 -0.0993676 -0.00605335 0.00618153 -0.0227919 
0.0261894 0.00307526 -0.0599753 -0.035911 0.0609473 0.133099 0.0789208 -0.0363855 -0.0655185 -0.128912 -0.0738976 0.0256504 0.0916624 -0.0497449 -0.0366583 -0.102261 -0.200547 -0.0655288 -0.107004 0.138913 0.107728 -0.149177 0.0723444 0.0654019 0.00603258 -0.0458259 -0.134464 -0.183127 -0.0250484 0.0330173 0.0371089 0.00639108 -0.120285 0.0501091 0.00331527 0.0368246 -0.0984636 0.125879 -0.0942428 -0.0874903 0.0664098 -0.0744356 -0.00775156 0.125891 -0.119474 0.028427 0.136195 0.0532891 -0.101349 0.110675 -0.115513 -0.10661 0.0255909 0.0131476 0.149329 -0.0210316 -0.065143 0.204036 0.0106955 -0.196617 -0.0250404 0.117704 0.195296 -0.0302787 0.0326411 0.0281867 0.0253794 0.0144169 -0.050372 0.0102968 -0.0196836 0.0888838 -0.00280189 0.0678783 0.0368515 0.00418778 -0.0674565 -0.0741344 0.0990885 0.134069 -0.0276314 -0.0290453 -0.0696387 -0.0815041 -0.0839759 -0.0117703 0.0519898 0.0605446 0.0416018 0.0187337 0.171206 -0.113314 0.0232523 -0.111803 -0.107068 -0.0681421 0.00911629 0.113606 0.0745701 -0.0397616 0.000634618 0.0113748 0.00429244 0.0599989 -0.165215 0.0792089 -0.146494 0.203193 -0.0046235 -0.0270823 0.102061 0.154362 -0.148646 -0.0434992 0.019789 0.120036 -0.0538293 -0.0447349 0.0547057 0.152482 0.00180195 -0.00131526 -0.00593532 0.0741709 -0.137365 0.0124038 -0.0332772 -0.0126939 
0.039365 -0.00443268 -0.0786052 -0.0558941 0.0702754 0.14394 0.0739705 -0.0126371 -0.0553487 -0.142675 -0.0663571 0.039707 0.0792698 -0.0716756 -0.0552158 -0.0902131 -0.200985 -0.0763398 -0.126821 0.139092 0.1077 -0.134505 0.0807322 0.0461341 -0.00598514 -0.0356286 -0.098874 -0.180241 -0.0288194 0.00784438 0.0357356 -0.00289788 -0.121577 0.0629242 -0.0140617 0.0269606 -0.102552 0.139745 -0.0925541 -0.069255 0.0711222 -0.0677182 -0.0218097 0.13583 -0.122684 0.0203625 0.125014 0.0473092 -0.108656 0.12765 -0.114826 -0.0987216 -0.00463633 0.0167843 0.136129 -0.032716 -0.064533 0.211959 -0.00975846 -0.186809 -0.0309082 0.0977467 0.222722 -0.0319587 0.0369111 -0.00322482 0.0129169 0.0404502 -0.0388749 0.0339672 -0.0143211 0.0899232 -0.0045531 0.0756374 0.028545 -0.00179342 -0.0667968 -0.063562 0.0753538 0.126899 -0.0382472 -0.0275135 -0.0559715 -0.0790186 -0.0978006 -0.0145527 0.0668909 0.0714437 0.0442529 0.0119813 0.172019 -0.134577 -0.00494015 -0.104266 -0.0763301 -0.0619621 0.0165392 0.0958098 0.055218 -0.035313 -0.0189608 -0.00121268 -0.0165281 0.0770279 -0.156593 0.0696933 -0.156487 0.206233 -0.0156441 -0.0469397 0.10348 0.164509 -0.13907 -0.0144479 0.0370325 0.109726 -0.0589815 -0.0478995 0.0737595 0.156313 0.00295643 0.0180159 0.0107932 0.0789997 -0.114294 -0.0103915 -0.0299953 -0.0191719 
0.0511326 -0.00375819 -0.0545266 -0.0805529 0.0321326 0.175401 0.0621623 0.0192641 -0.053841 -0.14974 -0.0691903 0.0275968 0.0607256 -0.140182 -0.0246885 -0.102921 -0.228251 -0.0820291 -0.121987 0.11425 0.0840825 -0.0485523 0.0679268 0.0557748 -0.0572329 -0.0133951 -0.0676455 -0.212313 -0.0440489 -0.0108615 0.0155265 -0.0382217 -0.10437 0.0928619 0.0274185 0.0128371 -0.0446006 0.125781 -0.101066 -0.0433725 0.085635 -0.0968052 -0.0343684 0.147864 -0.13006 0.0323936 0.135128 0.0516292 -0.145033 0.158853 -0.10112 -0.125894 0.0130594 0.0462124 0.135952 -0.0255301 -0.0524941 0.17194 -0.0258227 -0.193425 -0.0354783 0.0922203 0.21282 -0.0394463 0.0473204 -0.0368189 0.0337855 0.00725192 -0.0292975 0.0211616 -0.0459837 0.032376 -0.00896462 0.0740255 0.0412075 -0.0212605 -0.0935008 -0.0573203 0.0934088 0.131311 -0.00193925 -0.0159933 -0.0590406 -0.0816875 -0.0843335 -0.00531294 0.0698101 0.0462371 0.0229607 0.0677379 0.194539 -0.148256 -0.0255722 -0.0945682 -0.104554 -0.0289044 0.0200433 0.0773824 0.0554083 -0.0268885 0.00405592 0.0113414 -0.0293898 0.0531105 -0.139989 0.0315284 -0.146341 0.17784 -0.0771971 -0.0195338 0.139858 0.156898 -0.115806 -0.0483601 0.0147213 0.109996 -0.0632328 -0.0762071 0.052541 0.119909 0.0439514 -0.00238721 0.0498915 0.0766103 -0.0658188 -0.0275182 -0.00581277 -0.0384477 
0.0346315 -0.00356524 -0.0644039 -0.0502375 0.0519034 0.171149 0.0618779 -0.0223474 -0.0726422 -0.11963 -0.0707277 0.0159152 0.0740236 -0.0515039 -0.000310181 -0.107869 -0.198726 -0.0725686 -0.0662929 0.103949 0.0909622 -0.120056 0.0758105 0.0795545 0.0174759 -0.0331823 -0.0969176 -0.196979 -0.0291236 0.0152208 0.0493299 -0.012158 -0.109022 0.052692 0.0093777 0.0469073 -0.0869683 0.0953004 -0.0899336 -0.0822711 0.0745411 -0.0852272 -0.0160265 0.130795 -0.125753 0.0294063 0.139976 0.0550118 -0.124629 0.106151 -0.11395 -0.110828 0.0564742 0.0103817 0.145016 -0.000247503 -0.0573079 0.213489 0.0112856 -0.206409 -0.0409263 0.127985 0.209095 -0.0551348 0.0339344 0.0606637 0.029516 0.0191832 -0.0447239 0.0336369 -0.0408507 0.0851616 -0.0297205 0.053955 0.0525587 -0.00585742 -0.0744053 -0.0789437 0.101693 0.131058 -0.0327951 -0.0145911 -0.0665869 -0.10295 -0.0769848 -0.0181095 0.0498796 0.0446011 0.0346622 0.0397701 0.188709 -0.102668 0.00997375 -0.105268 -0.0929869 -0.0518519 0.0150909 0.121032 0.0774057 -0.0443688 0.00795564 0.000312203 0.00632617 0.0244778 -0.181928 0.0834775 -0.14666 0.161661 -0.0346242 -0.0328666 0.126873 0.161284 -0.116585 -0.0771253 0.040965 0.11055 -0.0591233 -0.0663803 0.0686408 0.149585 0.0406776 -0.0346475 0.0141463 0.0663754 -0.134322 0.0168715 -0.0103887 -0.000252828 
0.0414346 0.0147694 -0.0801784 -0.0523867 0.051053 0.152048 0.0751736 -0.0210234 -0.0656008 -0.121355 -0.0542702 0.0204765 0.0902771 -0.0636179 -0.0427796 -0.0856587 -0.198141 -0.0765626 -0.112009 0.126244 0.108796 -0.143815 0.0700699 0.0595524 0.00466561 -0.0365356 -0.10047 -0.184485 -0.0128169 0.0241608 0.0336709 0.01153 -0.119319 0.0610347 -0.0143655 0.0263789 -0.0994164 0.127364 -0.0833913 -0.0758867 0.0607296 -0.0920471 -0.0148833 0.130859 -0.108451 0.0256353 0.13276 0.05368 -0.131797 0.107275 -0.110112 -0.0901215 0.0164904 0.0110108 0.130832 -0.0179846 -0.0665236 0.207652 0.00403618 -0.196582 -0.0360165 0.103436 0.220523 -0.0418737 0.0278566 0.0373733 0.0173101 0.0277178 -0.0512093 0.0209442 -0.0371891 0.0794987 -0.0236191 0.0680793 0.0458504 -0.0100747 -0.0561683 -0.0705827 0.0827555 0.138232 -0.0324504 -0.0380748 -0.0670447 -0.0951255 -0.0925265 -0.00364184 0.0506578 0.0441953 0.0464021 0.0256373 0.172987 -0.127117 -0.00585871 -0.0974622 -0.0869989 -0.0538344 0.0145814 0.107108 0.073398 -0.0410701 0.00010232 -0.00035557 -0.00850149 0.0709179 -0.1665 0.079909 -0.15077 0.208721 -0.0144072 -0.0562307 0.104633 0.168169 -0.137844 -0.0412122 0.0445258 0.109854 -0.0662016 -0.0452851 0.08238 0.157137 0.0112317 -0.0099055 0.0148576 0.0805846 -0.121183 0.00373668 -0.0244893 -0.0168327 
0.0621765 -0.0510704 -0.074306 -0.065344 0.06585 0.13051 0.0598294 0.017015 -0.033591 -0.190394 -0.0865629 0.0334056 0.0655623 -0.0678619 -0.0464771 -0.0946052 -0.173597 -0.11518 -0.131479 0.148224 0.0977097 -0.100358 0.0863656 0.028155 -0.028266 -0.0136879 -0.0829779 -0.184655 -0.0617218 -0.0328492 0.038173 0.00135995 -0.106748 0.0897142 -0.0202497 0.0255396 -0.0636229 0.183418 -0.103603 -0.0728768 0.0833643 -0.0436709 -0.0355304 0.11395 -0.107208 0.0265542 0.099778 0.0415567 -0.0829603 0.144589 -0.133283 -0.122449 0.0180987 0.0445741 0.145662 -0.0527142 -0.0516817 0.189865 -0.0135242 -0.203804 -0.0225403 0.0937115 0.195123 -0.0336399 0.0304347 -0.0101153 0.0320413 0.0592752 0.00153033 0.0144594 -0.023269 0.0565754 0.00193041 0.0812749 0.022246 -0.0137723 -0.0623148 -0.0772978 0.0782843 0.129455 -0.0361466 -0.0161963 -0.0562005 -0.100604 -0.0715318 -0.0350391 0.0777983 0.0948009 0.0376905 0.00730997 0.192916 -0.140255 0.00297195 -0.104006 -0.0697348 -0.0381613 0.0384293 0.0725523 0.0448903 -0.0283785 -0.0275043 -0.00986263 -0.0271724 0.0850374 -0.158789 0.0358778 -0.165751 0.17465 -0.0437728 -0.04618 0.116016 0.171041 -0.149229 -0.00391742 0.0352801 0.0963625 -0.0624263 -0.0799703 0.0534535 0.124259 -0.00444924 0.0630072 0.0398818 0.0860595 -0.0829379 -0.0498296 -0.0246509 -0.036678 
0.0630189 -0.046599 -0.0821039 -0.0714693 0.0748884 0.128576 0.0647613 0.0188557 -0.0286616 -0.193263 -0.0870068 0.0328765 0.0711334 -0.076909 -0.0554142 -0.0891174 -0.176159 -0.108234 -0.146572 0.147756 0.105752 -0.097022 0.0845053 0.0336757 -0.0314988 -0.0308408 -0.081416 -0.179799 -0.0542303 -0.0228147 0.0331104 -0.00207661 -0.109931 0.0895978 -0.021108 0.0166193 -0.0654621 0.166919 -0.107493 -0.0681193 0.0840571 -0.0468589 -0.0269178 0.12147 -0.104628 0.0264256 0.0986656 0.0516322 -0.0810158 0.146347 -0.131614 -0.129227 0.0127013 0.0390466 0.135824 -0.0524892 -0.0526043 0.187521 -0.0132919 -0.198617 -0.0191511 0.0987267 0.192714 -0.0240097 0.0178357 -0.0228523 0.0262077 0.0544175 0.00068888 0.00311056 -0.0251592 0.053211 0.00278897 0.0731752 0.0199606 -0.00488838 -0.0610715 -0.0721171 0.0739579 0.127569 -0.0236498 -0.0155471 -0.0599566 -0.0899647 -0.0742894 -0.013646 0.073035 0.0902647 0.0288355 0.0104464 0.194254 -0.143687 -0.00903988 -0.104802 -0.0719304 -0.0341228 0.0250761 0.0716608 0.0440356 -0.0291271 -0.0180707 -0.0169156 -0.0242753 0.0923182 -0.157348 0.0290381 -0.173489 0.188907 -0.047928 -0.0402279 0.118735 0.165498 -0.147751 0.000691312 0.0189902 0.105593 -0.0674293 -0.0640962 0.0473714 0.126917 -0.010472 0.0643438 0.0313699 0.0897851 -0.0963151 -0.0518589 -0.0481979 -0.0452909 
0.0668094 -0.0224594 -0.0804951 -0.0427784 0.0823492 0.15399 0.0902383 -0.00469392 -0.0606664 -0.155301 -0.0814847 0.0175117 0.0864234 -0.0471301 -0.0178282 -0.0970213 -0.161111 -0.0854829 -0.114279 0.12635 0.108392 -0.12506 0.072572 0.0542005 0.0111361 -0.0565925 -0.131808 -0.187472 -0.0396138 0.00965102 0.0493169 0.0253927 -0.134809 0.0699545 -0.00967464 0.0306219 -0.081602 0.128397 -0.0858194 -0.0839321 0.0855338 -0.0484628 -0.0123047 0.107306 -0.115463 0.0270884 0.113294 0.0513212 -0.091054 0.110384 -0.117204 -0.115101 0.032157 0.0188029 0.133839 -0.0343656 -0.054505 0.209908 0.0115809 -0.199429 -0.0309492 0.124071 0.18301 -0.0608488 0.0193269 0.0357267 0.0351016 0.0451222 -0.0297089 0.00360247 -0.015459 0.0928959 -0.00994759 0.0661646 0.0245643 0.00536748 -0.060985 -0.0886801 0.0870361 0.136225 -0.0299106 -0.0151138 -0.0590967 -0.0994653 -0.068882 -0.00641909 0.0642414 0.060059 0.0220298 0.0090113 0.190478 -0.123194 0.00199957 -0.110576 -0.0889436 -0.0519949 0.0302046 0.0963033 0.0483115 -0.0281434 -0.0079185 -0.00379153 0.00508914 0.084504 -0.186574 0.062274 -0.162756 0.192627 -0.0274887 -0.0317653 0.114315 0.153634 -0.150712 -0.0361095 0.0333214 0.109867 -0.0708263 -0.0574703 0.0510116 0.142955 0.00240009 0.020879 0.0197609 0.0897789 -0.115931 -0.0231644 -0.0414835 -0.0256313 
0.0641502 -0.0425224 -0.0904665 -0.0754433 0.0826432 0.133288 0.0615651 0.0168964 -0.0398469 -0.178949 -0.0902398 0.037414 0.0659009 -0.0859534 -0.0487401 -0.0854385 -0.165615 -0.101066 -0.13964 0.148072 0.091324 -0.0841173 0.0900896 0.0152015 -0.0367681 -0.00691754 -0.0775752 -0.187504 -0.0527191 -0.0357583 0.0332594 0.015768 -0.111368 0.0894138 -0.0145259 0.0154165 -0.0568948 0.179674 -0.0984453 -0.0691525 0.0924511 -0.0405272 -0.0326872 0.130738 -0.123983 0.0354307 0.10574 0.0523553 -0.0871768 0.141139 -0.12052 -0.122299 -0.00039117 0.0365827 0.131764 -0.0597453 -0.0447692 0.185072 -0.00972179 -0.198735 -0.0235313 0.084489 0.198178 -0.0273255 0.0350526 -0.0375231 0.0256942 0.0638701 0.00965244 0.016132 -0.0217296 0.0586544 0.0108685 0.080085 0.0100315 -0.0161033 -0.0753001 -0.0588095 0.0682732 0.115769 -0.0257914 0.000135002 -0.054988 -0.0891559 -0.0693674 -0.0360571 0.0817779 0.0962297 0.0318071 0.00696389 0.188973 -0.135797 -0.0175514 -0.112775 -0.0645528 -0.0398944 0.0433573 0.0752767 0.032009 -0.0340668 -0.0308234 -0.00886545 -0.0202154 0.0986489 -0.160218 0.0185396 -0.17257 0.187486 -0.039503 -0.0352235 0.124057 0.171709 -0.149692 0.00757378 0.0253019 0.0819315 -0.0733339 -0.0932064 0.0504739 0.115939 0.00195399 0.0743445 0.0446578 0.0898493 -0.0808111 -0.0680794 -0.0429986 -0.0464195 
0.0567535 -0.0400399 -0.0821143 -0.0703347 0.0762419 0.125592 0.0512803 0.00643935 -0.034837 -0.177126 -0.0812386 0.0542691 0.06288 -0.0927928 -0.0672876 -0.0799872 -0.176663 -0.0944254 -0.151652 0.155835 0.0932685 -0.0847167 0.0876321 0.0156692 -0.0417898 0.0115167 -0.0681107 -0.185062 -0.0534911 -0.0328695 0.022791 0.0226955 -0.10957 0.0910694 -0.0205539 0.0135391 -0.0718388 0.191518 -0.100694 -0.0629468 0.0852082 -0.0461657 -0.0435585 0.135845 -0.120925 0.0310864 0.107968 0.0439735 -0.0932887 0.141336 -0.106294 -0.110803 -0.0155374 0.0350631 0.135195 -0.0612063 -0.0532768 0.184756 -0.0154511 -0.19098 -0.0206136 0.0664816 0.207159 -0.0115339 0.0428517 -0.0553423 0.02075 0.0670908 0.00424325 0.0333337 -0.0188186 0.0558948 0.0177594 0.0823677 0.00594651 -0.0190102 -0.0794724 -0.0572652 0.0586496 0.119535 -0.0262757 0.000664068 -0.0503854 -0.0887885 -0.0821315 -0.0491919 0.0910327 0.100571 0.0347306 0.00673134 0.171277 -0.14003 -0.0188319 -0.101711 -0.0677093 -0.0380547 0.043118 0.0628642 0.0395523 -0.0391971 -0.0351227 -0.00445273 -0.0338273 0.102327 -0.147418 0.0156178 -0.171716 0.192127 -0.0356575 -0.0463801 0.118431 0.179124 -0.153602 0.0173938 0.0316863 0.0781067 -0.0792037 -0.0927242 0.0554786 0.11791 3.85981e-05 0.0819385 0.042112 0.0820769 -0.0633567 -0.0599622 -0.0313213 -0.0483267 
0.0546596 0.0187383 -0.101196 -0.0487198 0.0752701 0.158967 0.0854324 -0.0224904 -0.0754631 -0.13978 -0.0586961 0.049164 0.093094 -0.0824183 -0.0812661 -0.0825794 -0.165293 -0.0572746 -0.134021 0.142294 0.118998 -0.119238 0.0569565 0.0512718 -0.0158387 -0.0338046 -0.107773 -0.17882 -0.00625628 0.0384439 0.0110992 0.0336584 -0.131541 0.0680707 -0.0139606 0.00566812 -0.0914253 0.130577 -0.0813016 -0.0745284 0.0724391 -0.0677421 -0.0031061 0.135701 -0.123536 0.02521 0.143012 0.0422754 -0.134681 0.108114 -0.0842963 -0.0880496 -0.0077262 0.0156875 0.123421 -0.0317951 -0.0628813 0.204749 -2.70139e-05 -0.192834 -0.0298831 0.0998142 0.225046 -0.0498613 0.0342293 -0.0142607 0.0204085 0.0216655 -0.0516887 0.0144142 -0.019797 0.0707137 -0.00494837 0.0723591 0.0193314 0.00703364 -0.0601313 -0.0581309 0.0657045 0.12076 -0.0265292 -0.0100143 -0.048655 -0.0770141 -0.0827799 -0.00378502 0.0655271 0.0483467 0.0306523 0.0188874 0.163417 -0.149289 -0.0257509 -0.0931595 -0.0797034 -0.0564824 0.0328079 0.0988169 0.0459052 -0.0337838 -0.00720394 0.0213331 -0.00996045 0.121689 -0.177419 0.0625547 -0.154941 0.228294 -0.0354631 -0.0421947 0.110852 0.148417 -0.153189 -0.00801842 0.0192671 0.0945281 -0.0830312 -0.0589262 0.0674144 0.144132 -0.00871971 0.0142381 0.0200653 0.0663936 -0.0991136 -0.00796701 -0.0472439 -0.0458056 
0.0620192 -0.0181646 -0.0877557 -0.0665135 0.0775892 0.130004 0.0722782 0.0100318 -0.0561147 -0.172757 -0.0815351 0.0504602 0.0717712 -0.103868 -0.0731814 -0.0751379 -0.169955 -0.0902107 -0.16632 0.158099 0.0905076 -0.0847338 0.0745289 0.0111857 -0.0499508 -0.010114 -0.0846857 -0.176556 -0.0455928 -0.0147649 0.00350911 0.0362432 -0.121557 0.0954546 -0.0281688 0.000670928 -0.071366 0.171955 -0.104733 -0.0550035 0.0872791 -0.0578761 -0.0213786 0.133555 -0.119149 0.0442889 0.118517 0.04284 -0.113905 0.144257 -0.0896679 -0.116754 -0.0282809 0.0328139 0.123699 -0.0630146 -0.0631818 0.179127 -0.00650965 -0.175948 -0.0183 0.079857 0.195679 -0.0207183 0.0410571 -0.0585455 0.015434 0.0467278 -0.0176013 0.0113539 -0.018338 0.0510452 0.0241083 0.0879707 0.00780581 -0.0033077 -0.0653515 -0.0557815 0.0552402 0.114399 -0.0112805 -0.0152462 -0.057234 -0.0803031 -0.0866733 -0.0217405 0.0818058 0.0760766 0.0211236 0.0193247 0.163656 -0.152127 -0.0363908 -0.101321 -0.0764064 -0.0233926 0.0468686 0.0585128 0.0345764 -0.0277598 -0.0342066 0.005136 -0.0299731 0.124954 -0.155309 0.0164788 -0.177237 0.224238 -0.0483921 -0.0442469 0.118298 0.168764 -0.153546 0.0159213 0.0105022 0.0751731 -0.0796453 -0.0702658 0.0538357 0.120439 -0.0119697 0.0712305 0.0428449 0.0857872 -0.0538266 -0.0628561 -0.0490143 -0.0712737 
0.065293 -0.00544821 -0.0921972 -0.0613956 0.077022 0.123279 0.0791355 -0.00205325 -0.04175 -0.180356 -0.0796827 0.04799 0.0730796 -0.102737 -0.078668 -0.0721015 -0.173268 -0.0892562 -0.176127 0.154212 0.0968566 -0.0868312 0.0725875 0.0193342 -0.0457117 -0.0289624 -0.0856348 -0.17525 -0.0426747 0.0058002 0.0037151 0.0412191 -0.115802 0.0920513 -0.0238978 -0.00730106 -0.0640055 0.169374 -0.104034 -0.0560707 0.0802842 -0.0584529 -0.0128346 0.130321 -0.111128 0.0501296 0.118832 0.0431277 -0.113769 0.142991 -0.091446 -0.113743 -0.0154406 0.031095 0.123958 -0.0594567 -0.0629723 0.177075 -0.00878897 -0.17607 -0.0215691 0.0798841 0.193244 -0.02364 0.0295263 -0.0536583 0.0155337 0.0400771 -0.0276368 0.00230027 -0.0192582 0.042528 0.0157183 0.0807055 0.0143442 0.00365614 -0.0613942 -0.0644586 0.051173 0.121303 -0.00252279 -0.0151309 -0.0670298 -0.0791152 -0.0826352 -0.00606322 0.0671577 0.0601289 0.01199 0.0257594 0.162856 -0.160319 -0.0410707 -0.102759 -0.0772225 -0.0205727 0.035594 0.0610362 0.0472929 -0.0291872 -0.0252341 -0.0029275 -0.0241928 0.129686 -0.161183 0.0148964 -0.17596 0.232565 -0.0467968 -0.0438646 0.119074 0.163916 -0.155599 0.0116275 0.00286594 0.0869309 -0.0859825 -0.0571241 0.0558289 0.125548 -0.0106379 0.0737732 0.0356599 0.0904432 -0.058105 -0.0598394 -0.0523618 -0.0758963 
0.0544646 -0.0255791 -0.0868705 -0.0598414 0.0797266 0.104661 0.0682892 0.00586015 -0.0402973 -0.166817 -0.0796452 0.0684917 0.0705471 -0.121364 -0.0960806 -0.0597589 -0.174238 -0.0830894 -0.192961 0.173434 0.0886566 -0.0953587 0.0813083 0.0103659 -0.0653524 -0.00469601 -0.0820667 -0.181062 -0.0478545 -0.0164867 -0.00565948 0.0576608 -0.118084 0.0928661 -0.0467746 -0.0109005 -0.0863535 0.189328 -0.114921 -0.0393275 0.0842298 -0.059178 -0.0437781 0.127768 -0.111233 0.0434464 0.106999 0.0404549 -0.103491 0.13902 -0.0751646 -0.114757 -0.0407519 0.0210318 0.110377 -0.0701651 -0.0556266 0.168592 -0.00688507 -0.15297 -0.00827658 0.0661923 0.184427 0.00319293 0.0465681 -0.0917822 0.00648356 0.0520976 -0.0158059 0.00949663 -0.0178874 0.0457133 0.034259 0.0890512 -0.000358585 0.0028325 -0.0649809 -0.0443796 0.0389718 0.113083 -0.0144099 -0.0199048 -0.0642073 -0.0717071 -0.0966645 -0.0169649 0.0897119 0.0818262 0.00758107 0.00138831 0.137789 -0.146702 -0.0374749 -0.0936855 -0.0786036 -0.0150706 0.0414976 0.0361137 0.0411043 -0.0269095 -0.0297263 -0.00889467 -0.0457966 0.143886 -0.127676 -0.00545767 -0.17999 0.234339 -0.041354 -0.0482741 0.10079 0.18095 -0.149786 0.0245581 -0.000797585 0.0781945 -0.100288 -0.0572355 0.0466804 0.118892 -0.0301416 0.0941025 0.0262667 0.084628 -0.0424774 -0.0594425 -0.0767569 -0.0843391 
0.045008 -0.0533445 -0.0749022 -0.0624339 0.0777235 0.0879559 0.0634605 0.00602713 -0.0108567 -0.183587 -0.0877953 0.0667968 0.064986 -0.113903 -0.0987268 -0.0742679 -0.194156 -0.0898875 -0.191858 0.171391 0.0937488 -0.0992151 0.0790053 0.00977851 -0.06643 -0.00451685 -0.0804385 -0.181626 -0.0638208 -0.0241487 0.00348861 0.0375569 -0.112475 0.0886391 -0.0335741 -0.00458433 -0.0849082 0.189709 -0.124973 -0.0542959 0.0883181 -0.0541965 -0.0542701 0.132224 -0.102278 0.0378589 0.08791 0.0477705 -0.0772497 0.138341 -0.106494 -0.131059 -0.0221467 0.0225902 0.120314 -0.0673459 -0.0652961 0.164454 -0.018952 -0.157738 0.00488833 0.0669034 0.180448 0.0288011 0.0429938 -0.0891616 0.0122689 0.0550592 0.0038904 0.00324611 -0.0203453 0.0353313 0.0384498 0.0748317 -0.00724313 0.00329737 -0.0711386 -0.0554641 0.0466273 0.116957 -0.0149274 -0.0198239 -0.0728106 -0.0738245 -0.0964799 -0.0274884 0.0942315 0.0985296 0.00981326 0.000575629 0.154693 -0.137697 -0.0204837 -0.0975761 -0.0874354 -0.0166356 0.0272103 0.0237571 0.0543722 -0.0259504 -0.0206743 -0.0199613 -0.0470312 0.11043 -0.11434 -0.010944 -0.173555 0.218733 -0.0456381 -0.0345699 0.10506 0.172708 -0.153881 0.018024 -0.000451752 0.0932472 -0.0950844 -0.0528011 0.0388196 0.109463 -0.0335405 0.102614 0.0148252 0.0857858 -0.0519193 -0.0593084 -0.0779972 -0.078583 
0.0434696 0.00310997 -0.0661392 -0.0552863 0.0561646 0.127477 0.0818248 -0.0127054 -0.0448475 -0.1703 -0.0703535 0.0588753 0.0791463 -0.112887 -0.0984552 -0.0885362 -0.202183 -0.082238 -0.179519 0.158875 0.101033 -0.104497 0.0667951 0.0104868 -0.0600871 -0.0193528 -0.108864 -0.172941 -0.0325493 0.0030716 -0.000832998 0.0359351 -0.123573 0.0895282 -0.0177944 -0.00815011 -0.0746674 0.174728 -0.0993819 -0.0549791 0.0871201 -0.0816985 -0.0295254 0.122425 -0.120971 0.0305366 0.114635 0.03868 -0.117117 0.138221 -0.0987081 -0.0989095 -0.0305248 0.0413433 0.120413 -0.0574815 -0.0600227 0.16941 -0.0239667 -0.165098 -0.0143395 0.0822599 0.202853 -0.0135996 0.0509383 -0.0597276 0.0221076 0.0175807 -0.0389634 0.0174327 -0.0246296 0.0382701 0.0247112 0.101936 0.0179864 -0.00281237 -0.0632223 -0.063197 0.0595099 0.120771 -0.0188782 -0.0350405 -0.051795 -0.0619961 -0.0910522 -0.0131374 0.0808588 0.0716262 0.0160545 0.0240231 0.165887 -0.163523 -0.0129036 -0.0947937 -0.0990719 -0.0476615 0.0285777 0.0632922 0.0549765 -0.0159902 -0.0157078 0.0216087 -0.0397636 0.129518 -0.115658 0.0249321 -0.146344 0.250426 -0.0394139 -0.0389159 0.0952844 0.155082 -0.158996 0.0154214 5.371e-05 0.0903379 -0.0713273 -0.045092 0.0602122 0.130524 -0.0195731 0.0527814 0.01615 0.0771352 -0.0533657 -0.0383356 -0.0491499 -0.0578111 
0.0264276 0.0469003 -0.0542426 -0.036812 0.0421203 0.154361 0.109284 -0.0351293 -0.0469421 -0.123392 -0.0546593 0.0463978 0.101575 -0.100737 -0.07308 -0.118353 -0.201663 -0.0477975 -0.157685 0.123192 0.107992 -0.12348 0.0426402 0.076194 -0.0308097 -0.0624559 -0.137524 -0.180928 -0.00242745 0.0538598 0.0235695 0.0307746 -0.129701 0.0703693 0.00753854 -0.00818669 -0.0779149 0.126175 -0.0952422 -0.0578063 0.0892869 -0.105626 -0.0216735 0.130887 -0.131399 0.00892604 0.124874 0.0491152 -0.127034 0.0994517 -0.0779361 -0.0868376 0.00504003 0.0100938 0.11257 -0.00857383 -0.074327 0.190231 -0.00221878 -0.178647 -0.038436 0.0991824 0.194871 -0.0457512 0.0414883 -0.0202745 0.0441528 -0.0303382 -0.0889851 0.00989784 -0.0347423 0.0471196 0.00114088 0.0768958 0.0325017 0.00848681 -0.0715913 -0.0675851 0.0828497 0.140193 -0.0278263 -0.0389831 -0.048598 -0.0553393 -0.0739662 -0.00335066 0.0709902 0.0238163 0.00924209 0.0340931 0.154975 -0.158902 0.0136265 -0.102293 -0.123648 -0.0738984 0.00822789 0.0836884 0.0728177 -0.0173421 0.0220448 0.0436242 -0.013616 0.122332 -0.132819 0.0449364 -0.128239 0.239746 -0.0290695 -0.0242537 0.0947038 0.138068 -0.16131 -0.028151 -0.0144333 0.110842 -0.077435 -0.0356814 0.0618118 0.154647 0.00173826 -0.0123965 -0.0328774 0.0708758 -0.0877486 0.00680236 -0.0624827 -0.0372652 
