-0.0124099 0.125909 -0.0883406 -0.0627371 0.0196591 0.141836 0.00993951 -0.0816826 -0.0976355 0.0919036 0.0608612 0.0124093 0.111865 -0.0699301 -0.0561318 0.0302055 -0.153004 0.0414132 0.0174628 0.0348832 0.18665 -0.100299 -0.0308069 0.0772325 0.0424481 0.0708349 -0.0332276 -0.178752 0.153893 0.191926 -0.0482006 0.0369956 -0.0274823 -0.005772 0.0342272 0.00712844 -0.0841597 0.0161772 0.0624627 -0.0839606 -0.0177765 -0.180836 0.0246158 0.145453 -0.0427826 0.0446349 0.18972 0.0379095 -0.235981 -0.131659 0.00805538 0.0473707 0.0175539 -0.0350886 0.104691 0.0909892 -0.00606895 0.110833 -0.0366338 -0.142361 -0.0104532 -0.0247458 0.239275 0.0171072 0.0618439 0.033432 -0.0463312 0.0158386 -0.0146597 0.0242195 -0.0701469 0.0366781 -0.135834 -0.111828 0.0733279 0.0172374 -0.0533908 0.0683052 0.0454206 0.0971475 -0.0099542 0.0368288 -0.00606159 0.0205729 -0.0942596 0.0316397 0.045769 0.00285513 0.0663294 0.0762553 0.0496077 -0.0689833 -0.0878495 0.0651434 -0.142694 -0.0681534 -0.0350627 0.129104 0.129638 -0.0770336 0.136439 0.0376219 -0.00553793 0.0228161 -0.112092 0.097446 -0.0657917 0.152188 0.0262967 -0.0781606 0.045775 0.0615945 -0.141344 -0.106081 0.0886937 0.115648 -0.142356 -0.071652 0.0316421 0.103462 0.0608864 -0.113384 0.00414771 -0.0235762 -0.120242 0.175146 0.0155558 0.0239428 
-0.0260475 0.116058 -0.073213 -0.065815 -0.0118883 0.128246 0.00118908 -0.0773069 -0.0964752 0.0681139 0.042919 0.015096 0.109708 -0.0731484 -0.0803248 0.0117905 -0.17917 0.0189915 0.0215698 0.0357413 0.187608 -0.11451 -0.0233179 0.0610839 0.0186819 0.0991248 -0.0385284 -0.197915 0.138122 0.174063 -0.0485663 0.0420653 -0.028858 -0.00741623 0.0354106 -0.00347699 -0.0781351 0.0640145 0.0634284 -0.0738284 -0.0162366 -0.185507 0.000215597 0.133224 -0.0363837 0.04161 0.194563 0.017561 -0.23831 -0.127607 -0.0119074 0.0476578 0.0387791 -0.00965944 0.108741 0.0843333 0.0306969 0.100771 -0.0405481 -0.166203 0.00896381 -0.0156673 0.237453 0.0281398 0.0643889 0.0322634 -0.0182133 0.0120036 0.0118905 0.0197643 -0.0860763 0.0157009 -0.132132 -0.0800562 0.0828003 0.00229636 -0.069531 0.0509544 0.0531574 0.113311 -0.0336544 0.0352635 -0.00725042 0.0120932 -0.0936388 0.020721 0.0589768 0.0131587 0.0716731 0.0507137 0.0552796 -0.0672352 -0.0512878 0.054272 -0.152404 -0.0779732 -0.0206894 0.142092 0.138357 -0.0692457 0.12819 0.0379343 -0.0194705 0.0422167 -0.0913635 0.0808184 -0.0603346 0.164741 0.0112694 -0.0822826 0.0359929 0.0669312 -0.159031 -0.119186 0.0808691 0.125811 -0.143701 -0.0921801 0.0428041 0.0868863 0.0515991 -0.0967507 0.00327551 -0.0380631 -0.117924 0.166579 0.011028 0.0357038 
-0.00943337 0.107751 -0.0608364 -0.0539061 0.00384005 0.136573 0.0265488 -0.0664285 -0.0965385 0.0597209 0.0383487 0.0116898 0.100845 -0.104884 -0.0659908 0.0217322 -0.185716 0.00767342 0.00246558 0.0444248 0.194245 -0.108258 -0.0357501 0.0624809 0.022285 0.0915689 -0.0621136 -0.203709 0.141371 0.162958 -0.0453626 0.0494292 -0.053692 0.0120681 0.0467461 -0.0047307 -0.0701548 0.0551232 0.0609796 -0.0959411 0.00436472 -0.189325 0.0154212 0.132962 -0.0297049 0.0450918 0.194924 0.0293266 -0.243548 -0.117704 -0.0179468 0.0267076 0.0228897 -0.0136304 0.125625 0.0725677 -0.00111689 0.100875 -0.0465625 -0.162927 0.0133866 -0.0172097 0.233975 0.0217422 0.0739629 0.0340391 -0.0237063 0.001062 0.00750544 0.0100078 -0.0923979 0.030772 -0.126093 -0.0672575 0.0707852 -0.00780134 -0.0570716 0.065338 0.0630021 0.116827 -0.0131946 0.032734 -0.0152702 -0.0015793 -0.0885538 0.0133512 0.0605016 0.0233869 0.0668651 0.0684033 0.0854005 -0.0653288 -0.075018 0.0485367 -0.162514 -0.0612476 -0.00754529 0.125942 0.134933 -0.0675286 0.123127 0.0294912 -0.0220449 0.0311357 -0.0988238 0.0811922 -0.0579149 0.179236 0.0179728 -0.0683233 0.0420092 0.0757813 -0.165763 -0.120594 0.101693 0.114019 -0.139998 -0.0883491 0.0298883 0.0877724 0.0515082 -0.077232 0.0238274 -0.0137141 -0.114029 0.154533 0.0213479 0.0118419 
-0.0266682 0.112597 -0.0722196 -0.0410429 0.0104529 0.138161 0.0278645 -0.0740806 -0.0877274 0.0755204 0.0451499 0.019088 0.0922563 -0.103457 -0.0860246 0.00639663 -0.202506 0.0390804 0.00944349 0.0414669 0.19111 -0.128455 -0.0289521 0.087717 0.0408996 0.0519678 -0.054864 -0.18741 0.14976 0.179218 -0.0429144 0.00552065 -0.0517987 -0.0203947 0.0430126 -0.0071795 -0.116154 0.00496794 0.0327771 -0.0944084 -0.00597045 -0.185458 0.0129722 0.167758 -0.0519137 0.0156879 0.183148 0.0408968 -0.210839 -0.103851 -0.00367986 0.0395206 0.0193445 -0.0422877 0.116407 0.0823823 -0.00818997 0.113276 -0.0304369 -0.149887 0.000853419 -0.0102041 0.247929 0.0404964 0.0620437 0.0162448 -0.0397689 -0.0306008 -0.0201217 0.0226894 -0.0766978 0.0519421 -0.108932 -0.0805022 0.056901 0.00292101 -0.0524854 0.06309 0.0565749 0.114499 -0.0105321 0.0122818 -0.00836235 0.0247221 -0.0862928 0.0215451 0.0449285 0.0202856 0.0769448 0.0625043 0.0595467 -0.0553847 -0.0763827 0.0353857 -0.149866 -0.0848522 -0.0355063 0.129591 0.132456 -0.0675389 0.142409 0.0430783 -0.000362236 0.000218873 -0.0975452 0.0943818 -0.0418988 0.16956 0.0309951 -0.0526176 0.0525767 0.069393 -0.135066 -0.114189 0.0767316 0.128203 -0.108354 -0.0421656 0.0406065 0.103657 0.0378531 -0.115222 -0.0115217 -0.0394019 -0.142317 0.182488 0.0121503 0.0367655 
-0.0192975 0.132404 -0.0684909 -0.0514267 -0.00380266 0.128864 0.0251756 -0.0726857 -0.0831612 0.0798701 0.0630334 0.00872752 0.0887064 -0.0921586 -0.0696239 0.0104585 -0.198304 0.0100009 0.0154774 0.0323804 0.176514 -0.112354 -0.0383954 0.0726244 0.0438042 0.0723604 -0.0293751 -0.167872 0.163745 0.17486 -0.0512509 0.0116192 -0.0387559 -0.00945336 0.0286866 -0.00640442 -0.0910498 0.0262468 0.0528045 -0.0789539 -0.00562646 -0.196192 0.0104563 0.150785 -0.0434199 0.034441 0.179001 0.0326146 -0.221534 -0.116636 -0.0117085 0.0727297 0.0134107 -0.0287539 0.118657 0.0812377 -0.0102618 0.105369 -0.0480715 -0.146831 -0.00971357 -0.0336119 0.252419 0.0400008 0.0500681 0.0414771 -0.029926 -0.0140735 -0.00683132 0.0253578 -0.0829883 0.0402543 -0.121967 -0.0689673 0.0907357 -0.00291257 -0.0505777 0.0650568 0.0493096 0.115676 -0.0085257 0.0184999 0.00252564 0.0199943 -0.0793589 0.0220438 0.0456246 0.0177531 0.0788034 0.0696507 0.0667137 -0.0676982 -0.07744 0.0518905 -0.150329 -0.0922806 -0.0274991 0.115066 0.154618 -0.080324 0.128163 0.0399636 -0.00205031 0.0110244 -0.107462 0.100532 -0.0430324 0.174454 0.0382561 -0.0781186 0.0584866 0.0758727 -0.144824 -0.106647 0.0922051 0.118229 -0.116167 -0.0554967 0.0505367 0.0993487 0.0536571 -0.107345 -0.000412056 -0.0243573 -0.12407 0.177559 0.032922 0.0405867 
-0.0274547 0.117393 -0.0768559 -0.0481661 0.011131 0.148323 0.0150027 -0.0853846 -0.089531 0.0783804 0.0435406 0.00867175 0.0935692 -0.0949255 -0.059894 0.0185271 -0.175699 0.0375841 0.029492 0.0271198 0.186113 -0.113834 -0.0388542 0.0639981 0.0424585 0.0784482 -0.0598541 -0.20109 0.14845 0.175128 -0.0248321 0.0417289 -0.0416095 -0.0166082 0.059853 0.0107463 -0.0844044 0.0106339 0.0650813 -0.100718 0.00399646 -0.187319 0.0179635 0.14729 -0.0380537 0.038095 0.191877 0.0362006 -0.232909 -0.141673 -0.017233 0.0347653 0.0408172 -0.040874 0.105959 0.0941559 -0.00188468 0.101769 -0.041053 -0.152088 -0.000363812 -0.00862125 0.238388 0.0172919 0.0795136 0.0405387 -0.031955 -0.010231 -0.00519083 0.0204202 -0.0829477 0.036172 -0.129689 -0.0982444 0.0636671 0.00137815 -0.0646192 0.0657436 0.0502666 0.102379 -0.0216955 0.0424456 -0.0159428 0.0171506 -0.0865774 0.0222741 0.0477463 0.0121921 0.0593127 0.066345 0.0697814 -0.0493045 -0.0757473 0.0477763 -0.147501 -0.0690057 -0.0231272 0.134669 0.12306 -0.0652537 0.135729 0.0324752 -0.0108111 0.00210008 -0.0960626 0.096264 -0.0385227 0.155012 0.0204127 -0.0498824 0.0382851 0.0500881 -0.145429 -0.130316 0.0915274 0.110064 -0.140208 -0.0788005 0.0390656 0.0895628 0.0612444 -0.110719 0.00433192 -0.0313171 -0.123998 0.172154 0.0164819 0.0298951 
-0.0277735 0.106102 -0.05911 -0.0494698 0.00313772 0.141044 0.0226706 -0.0813435 -0.0745254 0.0574475 0.0431601 0.0169879 0.105231 -0.0873207 -0.0763753 0.0107344 -0.218 0.0197939 -0.0199571 0.0417974 0.193819 -0.118943 -0.0345947 0.0733921 0.0265817 0.0602822 -0.0645675 -0.187989 0.120521 0.176552 -0.0477194 0.0298607 -0.0475427 0.00398305 0.0398382 0.010155 -0.0951769 0.023146 0.0312868 -0.0888133 0.00756676 -0.193475 0.0195729 0.140217 -0.0371126 0.0312168 0.182143 0.0378751 -0.221531 -0.102502 -0.0169884 0.0176543 0.0236336 -0.0164878 0.132198 0.0851861 -0.0155461 0.100668 -0.0384249 -0.156337 0.00258522 -0.00123857 0.230451 0.0379211 0.0624014 0.0373879 -0.0337574 0.00190386 -0.00667791 0.0213522 -0.073152 0.0351747 -0.108326 -0.0873187 0.0771412 0.0202251 -0.0635895 0.0437607 0.054233 0.111008 0.00174171 0.0178847 -0.0128058 0.017036 -0.112535 0.0418312 0.0589678 0.017137 0.0618994 0.0825163 0.0696864 -0.0822922 -0.0634146 0.0379927 -0.180598 -0.062093 -0.0454451 0.11959 0.1496 -0.0637975 0.146181 0.0328372 -0.00904705 0.00560491 -0.0897785 0.0897062 -0.0687404 0.177678 -0.00327823 -0.0598981 0.0421454 0.0696675 -0.150682 -0.118687 0.0784643 0.132506 -0.128839 -0.0454958 0.0313906 0.100146 0.0573625 -0.10286 0.00725129 -0.0216785 -0.126993 0.176634 0.012824 0.0322475 
-0.0249966 0.124409 -0.0736593 -0.0574169 0.0129002 0.141455 0.0126301 -0.0911066 -0.0895982 0.061163 0.0443322 0.013126 0.0985816 -0.0826646 -0.0580666 0.0266209 -0.184975 0.0172618 0.0118682 0.026698 0.186567 -0.0982268 -0.0310431 0.0561502 0.0403027 0.0783024 -0.051151 -0.194374 0.140362 0.181732 -0.0333763 0.0399453 -0.0366224 -0.0101207 0.0482601 0.00839073 -0.0815441 0.0239168 0.0629007 -0.076347 0.000865555 -0.180957 0.0225078 0.144044 -0.0383243 0.0581595 0.196988 0.0231608 -0.238987 -0.134847 -0.014276 0.0335353 0.0322207 -0.0281859 0.107122 0.0911402 -0.00391585 0.111946 -0.0435631 -0.142484 -0.00680088 -0.0138097 0.236272 0.0192681 0.0794631 0.0323687 -0.0308961 0.00763498 -0.00255669 0.0197568 -0.0709355 0.0358651 -0.126533 -0.100122 0.081012 0.0176214 -0.0734752 0.0522988 0.0395922 0.112884 -0.00943113 0.0348851 -0.0108346 0.0219054 -0.105738 0.0329283 0.0539529 0.000834491 0.0412165 0.0671432 0.0618924 -0.0690109 -0.0796923 0.0503379 -0.154912 -0.0627373 -0.0270363 0.129962 0.136509 -0.064259 0.118895 0.0293991 -0.0108667 0.020998 -0.10979 0.0909835 -0.0589391 0.175003 0.0107578 -0.0687356 0.0438276 0.0522262 -0.155988 -0.12001 0.0843184 0.121757 -0.152692 -0.0709896 0.0362926 0.0980651 0.0647015 -0.0988129 0.00258363 -0.0231004 -0.113588 0.169516 0.0118344 0.0278297 
-0.0114491 0.101281 -0.0747451 -0.053872 0.0177839 0.137121 0.0221478 -0.0657761 -0.0804682 0.0515587 0.0511466 0.026765 0.111083 -0.0918805 -0.0883131 0.028344 -0.188104 0.0254307 -0.0219243 0.0514429 0.212208 -0.114757 -0.02791 0.080268 0.0297256 0.0656284 -0.0486931 -0.191401 0.135201 0.181383 -0.0487813 0.036985 -0.0400516 0.0108228 0.027807 -0.00790563 -0.0902949 0.0372011 0.0418673 -0.0886732 0.000381201 -0.178415 0.0260246 0.147865 -0.0363299 0.0154583 0.190002 0.0246509 -0.225361 -0.107185 -0.0093817 0.0145384 0.0139089 -0.0146558 0.122062 0.0820037 -0.0109862 0.110609 -0.0405296 -0.161645 0.00123176 -0.021813 0.240948 0.0286744 0.0599323 0.025146 -0.0392859 0.00424205 -0.00560011 0.0120048 -0.0806209 0.033482 -0.120608 -0.0906676 0.069992 0.0126282 -0.0505225 0.0572836 0.0440303 0.111887 -0.00920316 0.0271942 -0.00601559 0.0119904 -0.102315 0.0392768 0.0611074 0.0204658 0.0657568 0.0681808 0.0676577 -0.0875951 -0.089752 0.0496494 -0.156392 -0.0582592 -0.0414226 0.128456 0.133315 -0.0639143 0.13173 0.0218343 -0.0108704 0.0363783 -0.0999304 0.0870687 -0.0712379 0.178641 0.00735923 -0.0838489 0.0355318 0.0747664 -0.156369 -0.103719 0.0892652 0.126337 -0.137177 -0.0619568 0.0327963 0.102875 0.0482806 -0.0833119 0.0083229 -0.0199814 -0.124164 0.166611 0.00872254 0.0211524 
-0.0223415 0.121689 -0.0643515 -0.0437583 0.0148544 0.133942 0.0280584 -0.0824512 -0.0774171 0.0685639 0.0486781 0.0142109 0.0934612 -0.100895 -0.068041 0.0137423 -0.199415 0.0285018 -0.000539044 0.0364161 0.19116 -0.1018 -0.0486948 0.0783855 0.0413738 0.0565873 -0.0618715 -0.18185 0.149081 0.189819 -0.043303 0.0259212 -0.0469613 -0.0079747 0.0512737 9.4551e-05 -0.0904858 -0.000309181 0.0473419 -0.0908334 0.00935214 -0.188982 0.0263956 0.153992 -0.0388743 0.0397798 0.185854 0.0403834 -0.216392 -0.12009 -0.00778928 0.0452626 0.0235169 -0.0335605 0.123023 0.0847408 -0.0179746 0.0955495 -0.0411287 -0.144657 -0.0020082 -0.0178932 0.230494 0.0418351 0.0525472 0.0224306 -0.0300187 -0.0172435 -0.00573987 0.0150721 -0.0702768 0.0402684 -0.11465 -0.0922627 0.0713781 0.0155103 -0.0645329 0.0638178 0.0503109 0.118663 0.00739678 0.0332023 -0.00476554 0.0305637 -0.0850937 0.0374142 0.0511049 0.0139148 0.0566957 0.0789871 0.0667958 -0.0634613 -0.0846675 0.043602 -0.173211 -0.0783532 -0.0369853 0.116552 0.142341 -0.0769015 0.143052 0.0400765 0.0035409 0.00452349 -0.105569 0.0908912 -0.0487208 0.178557 0.020831 -0.0471631 0.0522548 0.0541544 -0.159938 -0.117643 0.076001 0.123933 -0.128073 -0.0566821 0.0296064 0.0954982 0.0570089 -0.100262 -0.00144868 -0.0237875 -0.131057 0.174894 0.0203311 0.0316648 
-0.0283383 0.0924325 -0.068989 -0.0536019 0.026271 0.147586 0.0113916 -0.0829585 -0.0902822 0.0656096 0.0270124 0.0224403 0.103752 -0.0902597 -0.0599115 0.0206075 -0.186413 0.0376276 0.0113232 0.035089 0.198555 -0.104969 -0.0261122 0.0798245 0.0372123 0.0695833 -0.0671465 -0.214047 0.125599 0.181335 -0.0269243 0.037719 -0.0473654 -0.00875371 0.0584831 0.0131704 -0.0912636 0.00520344 0.0517564 -0.0936313 0.00882435 -0.176828 0.0178068 0.145062 -0.0403591 0.0379769 0.192533 0.0389003 -0.217467 -0.128132 -0.00735298 0.00574362 0.0466593 -0.0370276 0.116313 0.0907091 0.00675972 0.106585 -0.0310231 -0.150364 0.00721943 0.00371134 0.219404 0.0266112 0.0773171 0.0190914 -0.0360644 0.00690456 0.00159227 0.0145192 -0.0768779 0.0459491 -0.125929 -0.114045 0.057353 0.0231599 -0.0765227 0.0579864 0.0558715 0.116505 -0.00801543 0.0380719 -0.0124625 0.0254262 -0.10187 0.0271695 0.0637375 0.01663 0.044926 0.0630655 0.0608672 -0.050002 -0.0700615 0.0466771 -0.17081 -0.0560898 -0.0354361 0.135015 0.125073 -0.0631835 0.14605 0.0270572 -0.0124242 0.00673399 -0.0942641 0.07808 -0.0649779 0.156256 0.00161471 -0.0392818 0.0387609 0.0517024 -0.150815 -0.132562 0.0747049 0.134699 -0.14921 -0.0690076 0.0133446 0.0978503 0.0596016 -0.101369 -0.00137773 -0.0363115 -0.13861 0.175526 -0.00719638 0.0283202 
-0.0149339 0.110897 -0.0910154 -0.0431985 0.0210432 0.154094 0.0155377 -0.102617 -0.0938473 0.0797264 0.0505407 0.0207464 0.100252 -0.0793497 -0.0699618 0.0242788 -0.166734 0.0435082 0.0298484 0.0306527 0.186118 -0.105885 -0.0457314 0.0748691 0.0442741 0.0677127 -0.056536 -0.191544 0.133841 0.200087 -0.0462184 0.0378872 -0.0454303 -0.0217334 0.0570237 0.0111589 -0.0931607 -0.016345 0.0676854 -0.0992893 -0.0106655 -0.177189 0.0277038 0.138149 -0.0344196 0.0413838 0.187255 0.0378761 -0.223911 -0.135029 0.00421428 0.0309154 0.0442005 -0.0391763 0.110211 0.0929346 -0.0061492 0.10823 -0.0377936 -0.134222 0.00434998 0.000793418 0.240301 0.011479 0.0713396 0.0354674 -0.0413297 -0.00149798 -0.0148645 0.0106844 -0.0694971 0.0407083 -0.127746 -0.117055 0.0572999 0.0286458 -0.0531787 0.0499707 0.0468403 0.105788 -1.15887e-05 0.0336528 -0.0115213 0.0253717 -0.0946867 0.034936 0.0412955 -0.00301264 0.0531557 0.0738726 0.0521699 -0.0564119 -0.0752442 0.0662216 -0.157219 -0.0645062 -0.0312149 0.122654 0.131057 -0.0633031 0.154216 0.0406951 -0.00807996 -0.00355183 -0.103022 0.0990465 -0.0442683 0.148311 -0.00351506 -0.0393967 0.0468458 0.0363211 -0.129448 -0.125475 0.076551 0.12514 -0.145293 -0.0456915 0.0213243 0.0902835 0.0521323 -0.128391 0.00814855 -0.044286 -0.123107 0.192066 0.00619922 0.0255907 
-0.0145198 0.140478 -0.0777246 -0.0477257 0.0151653 0.144294 0.0287843 -0.0885032 -0.0788733 0.0841597 0.0552225 -0.000124198 0.0977451 -0.100385 -0.0690148 0.0399203 -0.177742 0.0349477 -0.00680471 0.017754 0.194166 -0.106363 -0.0411967 0.0617385 0.0454374 0.0596754 -0.0604415 -0.179504 0.161444 0.187758 -0.0371582 0.0582 -0.0494778 -0.0027866 0.0481294 -0.0104613 -0.084009 0.013733 0.0721119 -0.0923611 -0.00665084 -0.193442 0.0310054 0.138293 -0.0220806 0.0372267 0.178451 0.0438955 -0.233788 -0.134829 0.00397244 0.0572743 0.0209133 -0.0398991 0.0973942 0.0842167 -0.00251967 0.0965078 -0.0397421 -0.146502 -0.00493548 -0.0204324 0.233709 0.0210417 0.0598832 0.0387618 -0.0432367 -0.000582814 -0.0165573 0.0231699 -0.0812787 0.0373826 -0.12917 -0.0922216 0.06383 0.00228712 -0.0503545 0.0595975 0.0378714 0.108854 0.00415423 0.0321193 -0.0066858 0.0201401 -0.0904233 0.0301636 0.0396206 0.00231132 0.0590678 0.0791004 0.0624744 -0.0665201 -0.0950435 0.0533081 -0.149484 -0.0610482 -0.0292907 0.126635 0.130547 -0.0661376 0.147986 0.0332868 -0.00990326 0.030689 -0.0924496 0.0850166 -0.0476144 0.176511 0.0340684 -0.0642877 0.0393638 0.0630379 -0.151066 -0.108205 0.101353 0.112142 -0.14172 -0.0504722 0.0426482 0.0980921 0.0622151 -0.100111 0.0139776 -0.0234069 -0.116728 0.165656 0.0176152 0.0175115 
-0.0180772 0.132296 -0.0786275 -0.0592156 0.00758063 0.137486 0.0126415 -0.0766455 -0.0955034 0.0884187 0.0608974 0.00583851 0.0908229 -0.103083 -0.0645449 0.0263366 -0.177972 0.0246858 0.0286789 0.034502 0.17753 -0.106253 -0.0401525 0.053553 0.0382944 0.0833225 -0.0307478 -0.180457 0.159722 0.172156 -0.0507599 0.0162807 -0.030943 -0.0136802 0.0540971 -0.00421309 -0.075222 0.0159016 0.0726919 -0.0949107 -0.0111675 -0.195522 0.024751 0.147498 -0.0379961 0.0493645 0.190536 0.0355883 -0.245463 -0.126103 -0.0159677 0.0514929 0.0176366 -0.0304046 0.104321 0.0817163 -0.00825903 0.0916109 -0.0576287 -0.142357 0.000785138 -0.0316352 0.252353 0.0263197 0.0721507 0.0349487 -0.0456706 -0.00567837 -0.00594684 0.0123025 -0.0822412 0.0276432 -0.132039 -0.0973592 0.0770889 0.00274994 -0.0533128 0.0754286 0.0531309 0.103528 -0.0147986 0.0284085 -0.00921443 0.0271275 -0.0858552 0.0273357 0.0374473 0.0144638 0.0764857 0.0785634 0.0663385 -0.0599064 -0.0887498 0.0634171 -0.143659 -0.0800142 -0.0215121 0.125149 0.131013 -0.0791095 0.128822 0.0339715 -0.0142256 -0.000651868 -0.095705 0.100806 -0.0302594 0.168186 0.026521 -0.0658219 0.0477149 0.052212 -0.133384 -0.110375 0.0952902 0.107286 -0.139157 -0.0633332 0.0383006 0.0891672 0.0538191 -0.111913 0.0126893 -0.0236336 -0.108055 0.170626 0.0332032 0.0257024 
-0.0151071 0.116292 -0.0681956 -0.0551576 0.00901156 0.125469 0.00942146 -0.0601084 -0.0870469 0.0581162 0.0599157 0.026316 0.0990813 -0.11054 -0.0927996 0.0434876 -0.194373 0.0175357 -0.0108674 0.0524687 0.20986 -0.114482 -0.0144861 0.0524773 0.029009 0.0742546 -0.029436 -0.186927 0.140886 0.173336 -0.0625181 0.0246526 -0.0191194 0.0124909 0.0304027 -0.0239999 -0.0759792 0.051771 0.0636672 -0.0820817 -0.012418 -0.193536 0.0325013 0.130961 -0.037329 0.0234939 0.193778 0.00955942 -0.23838 -0.0944509 -0.00466277 0.0386773 0.00258915 0.000589665 0.114172 0.0701612 0.0147713 0.0765521 -0.064127 -0.150067 0.0044654 -0.0447097 0.241394 0.0288608 0.0711619 0.0140001 -0.0532798 0.00492665 -0.00525176 0.0179234 -0.083708 0.0240281 -0.136875 -0.0846322 0.0831129 0.0120541 -0.043599 0.0650456 0.0388723 0.118884 -0.0255985 0.0150283 0.0087551 0.0342234 -0.103643 0.0454367 0.051275 0.0274178 0.0728487 0.067031 0.0560694 -0.0888143 -0.096205 0.0664234 -0.152396 -0.0714234 -0.037859 0.140084 0.130412 -0.0713826 0.125861 0.020592 -0.0237807 0.0451502 -0.0665858 0.0825429 -0.0482707 0.194304 0.0170639 -0.097677 0.012215 0.0670252 -0.14673 -0.0923817 0.0998755 0.122749 -0.133722 -0.053326 0.0426755 0.111094 0.0465041 -0.0771599 0.0129959 -0.0250216 -0.100338 0.163533 0.0382419 0.0306599 
-0.0145801 0.110199 -0.0845073 -0.0495452 0.0048369 0.150838 0.0170869 -0.0742264 -0.0953428 0.0706949 0.0441671 0.0126927 0.0993558 -0.0976657 -0.0785396 0.0186003 -0.185716 0.030597 0.01929 0.0301435 0.195132 -0.111956 -0.039045 0.0734229 0.0369338 0.0705758 -0.05061 -0.19792 0.139255 0.181633 -0.0457511 0.0304165 -0.0523303 -0.0125999 0.0460355 -0.00429025 -0.0950355 0.00401293 0.0563984 -0.0910883 -0.00433022 -0.186181 0.0205805 0.151841 -0.0341231 0.0248671 0.191623 0.0318088 -0.226614 -0.121101 0.000410709 0.029789 0.0357848 -0.0270123 0.109827 0.0859567 0.00598035 0.102432 -0.0270828 -0.160795 0.0104784 -0.00510514 0.240197 0.0267329 0.0589875 0.0295813 -0.0291105 -0.0129155 0.001039 0.0120217 -0.0878296 0.0379463 -0.122314 -0.0946397 0.063691 0.00544563 -0.0587243 0.0561044 0.0487236 0.116784 -0.00662164 0.0297733 -0.00791328 0.0157273 -0.0881205 0.0332974 0.049287 0.00708513 0.065108 0.0628319 0.0616538 -0.0574 -0.0818757 0.0461031 -0.158136 -0.0663304 -0.0246341 0.134998 0.13068 -0.0643952 0.142669 0.0385714 -0.0032326 0.0140102 -0.100957 0.0863091 -0.0521598 0.166738 -0.00127201 -0.0546054 0.0471908 0.0565037 -0.141962 -0.128973 0.079786 0.123419 -0.132447 -0.0620469 0.0344178 0.0849432 0.0506383 -0.112576 0.013079 -0.0409207 -0.127908 0.171874 0.00878956 0.0326247 
-0.0163346 0.159293 -0.103138 -0.0670389 0.0229548 0.153293 0.0131234 -0.114894 -0.103169 0.106214 0.0587479 0.0236817 0.0913416 -0.0831241 -0.0563154 0.0217019 -0.15129 0.0459095 0.0366244 0.0121198 0.145744 -0.0618268 -0.0592411 0.0610826 0.0335672 0.0808118 -0.0243364 -0.161737 0.152848 0.212238 -0.0651673 0.0373406 -0.0337816 -0.0223964 0.0574374 0.00435969 -0.0666656 -0.0256206 0.0854602 -0.0613551 -0.01377 -0.182102 0.0381621 0.145001 -0.0453775 0.0813888 0.197457 0.0409136 -0.245443 -0.136283 0.0283308 0.0687969 0.0164786 -0.0410595 0.0954865 0.0971535 -0.0140532 0.108639 -0.051472 -0.103487 -0.011987 -0.0197116 0.246959 0.00571543 0.070855 0.0065878 -0.0426492 0.00307276 -0.02607 0.0279065 -0.0566508 0.0306149 -0.130596 -0.107792 0.0721772 0.0367632 -0.0618932 0.0677838 0.0323889 0.0794365 0.00910919 0.0537465 -0.00136709 0.0490279 -0.0935065 0.0297162 0.0354188 -0.0263567 0.048305 0.0957617 0.0324383 -0.0714906 -0.0852751 0.07404 -0.139956 -0.0701155 -0.021692 0.107496 0.136234 -0.0742888 0.133384 0.0618257 -0.00756027 0.0159913 -0.120422 0.0932958 -0.0515195 0.152869 -0.00876216 -0.0397213 0.0704888 0.0270232 -0.125475 -0.102196 0.0577711 0.10302 -0.146039 -0.0642059 0.0285458 0.0888916 0.0782576 -0.132536 0.0116221 -0.037729 -0.100384 0.178142 0.00820854 0.0149723 
-0.0134431 0.133244 -0.0881895 -0.0587854 0.022656 0.148407 0.0101326 -0.0960842 -0.0902943 0.0902692 0.0551292 0.0175369 0.0974954 -0.0837283 -0.0663145 0.0333123 -0.145287 0.0505664 0.0284877 0.0164152 0.188607 -0.0831153 -0.0486423 0.0654396 0.0380788 0.0822426 -0.0408915 -0.182331 0.155942 0.204982 -0.0477983 0.0493072 -0.02977 -0.0131728 0.0608015 -0.00132186 -0.0692595 0.00374337 0.0868086 -0.090668 -0.0171292 -0.175891 0.0298915 0.133536 -0.0281223 0.0506716 0.189988 0.0318163 -0.240593 -0.148777 0.0128624 0.0565924 0.0345108 -0.0371448 0.0998114 0.0955659 0.00315501 0.0985606 -0.0557719 -0.134498 -0.000282124 -0.0248484 0.239134 0.00681349 0.0739364 0.0214062 -0.044349 0.0089733 -0.0152617 0.0228162 -0.0691737 0.0224092 -0.144171 -0.122394 0.0569348 0.0242313 -0.0545535 0.0649257 0.0408185 0.0909999 -0.0103722 0.0561685 -0.00179793 0.033527 -0.0851377 0.0208418 0.0427655 -0.00301739 0.0579277 0.0833031 0.0452508 -0.0651544 -0.089027 0.079782 -0.139537 -0.0633888 -0.0228248 0.122902 0.122041 -0.0652667 0.149088 0.0447622 -0.0196593 0.0207034 -0.102471 0.089822 -0.0433293 0.140407 0.0103889 -0.0557639 0.043899 0.033163 -0.142878 -0.110025 0.0902051 0.112629 -0.155321 -0.0745357 0.0267801 0.0888855 0.0654906 -0.112887 0.012439 -0.043622 -0.102775 0.180221 0.0207027 0.0141412 
-0.0216628 0.151991 -0.0933809 -0.0637596 0.0091576 0.142864 0.00439511 -0.0860034 -0.0798592 0.0754054 0.057143 0.00936095 0.0973523 -0.0836669 -0.0843874 0.038031 -0.148189 0.0393423 0.0175661 0.0125567 0.195992 -0.0925178 -0.0457067 0.0643065 0.0378184 0.0774441 -0.0303372 -0.172514 0.167183 0.199244 -0.0405563 0.0491246 -0.021883 -0.0100396 0.0438119 -0.009252 -0.0636125 0.0191918 0.0829446 -0.0763666 -0.0185117 -0.177735 0.0395324 0.137506 -0.0155003 0.0384263 0.198687 0.0192304 -0.246192 -0.143992 0.0021964 0.0609849 0.0292787 -0.027915 0.0914038 0.100359 0.00854606 0.100883 -0.0497115 -0.153297 -0.00596829 -0.0262413 0.244343 0.00646556 0.0601647 0.0277848 -0.0374782 -0.00158621 -0.0143801 0.0246959 -0.0801383 0.0106172 -0.146036 -0.105389 0.0745061 0.0119384 -0.0501702 0.0699775 0.0279261 0.086561 -0.021254 0.0597384 0.000686454 0.0311453 -0.0844937 0.035644 0.0359212 -0.00643874 0.0608667 0.0730795 0.0466128 -0.080342 -0.0938615 0.0670272 -0.118169 -0.0600146 -0.0274896 0.139376 0.117917 -0.0607742 0.129171 0.0354089 -0.0170821 0.0497983 -0.10507 0.0922311 -0.0490174 0.15485 0.007942 -0.0813295 0.0352073 0.0414197 -0.149173 -0.101284 0.0889536 0.107084 -0.147915 -0.082909 0.0491277 0.0906761 0.0658435 -0.0998897 0.0116383 -0.0410357 -0.110414 0.168236 0.0162467 0.0181095 
-0.0161908 0.132132 -0.0860441 -0.0467435 0.00602807 0.132548 0.0209298 -0.0781393 -0.0926788 0.0992813 0.0659903 0.00380694 0.0900501 -0.103995 -0.0609591 0.0318379 -0.171642 0.0204707 0.034498 0.039211 0.172427 -0.11892 -0.0351258 0.0534217 0.0406096 0.0855377 -0.036746 -0.188355 0.165457 0.170542 -0.0461278 0.0322574 -0.0313603 -0.0160896 0.0485658 -0.00148905 -0.0755472 0.0284938 0.0702513 -0.0988009 -0.0132739 -0.197811 0.0128545 0.143344 -0.0400515 0.0504459 0.187852 0.0377313 -0.239169 -0.13474 -0.016624 0.06104 0.017524 -0.0385733 0.10419 0.0823027 -0.00808028 0.0910176 -0.05206 -0.135974 -0.00507572 -0.0384572 0.252611 0.0162707 0.0812749 0.0397322 -0.042579 -0.00901945 -0.00740687 0.0122045 -0.0892864 0.0352586 -0.134788 -0.0862606 0.0742737 -0.00653085 -0.0434556 0.0837617 0.0498832 0.104139 -0.0207216 0.0211425 -0.018601 0.0173738 -0.0792497 0.0197869 0.0330817 0.0136685 0.0779862 0.0701306 0.0690706 -0.052328 -0.0880818 0.0619708 -0.137099 -0.0828374 -0.0138593 0.120224 0.138087 -0.0772935 0.127384 0.0299985 -0.0140049 -1.31151e-05 -0.0961623 0.102129 -0.0233375 0.164989 0.0438532 -0.0636205 0.0408061 0.0630152 -0.130329 -0.117027 0.103133 0.101489 -0.13491 -0.0682296 0.0432671 0.0920106 0.0495043 -0.107935 0.0121523 -0.014599 -0.107063 0.172786 0.0331397 0.0239555 
-0.0204881 0.131692 -0.0602372 -0.047018 0.00106387 0.132285 0.0122667 -0.0690029 -0.0955327 0.0810417 0.0621669 0.0133977 0.0999431 -0.0998868 -0.0702105 0.0341656 -0.183911 0.0199824 0.00380892 0.0483827 0.190615 -0.118311 -0.0344582 0.0656804 0.035906 0.0739504 -0.044392 -0.17606 0.148975 0.172965 -0.0584115 0.031662 -0.0266011 0.00730691 0.030563 -0.00351491 -0.0751697 0.0299147 0.0594366 -0.0875959 -0.00427303 -0.202166 0.0362862 0.123837 -0.0315003 0.0340665 0.197454 0.0223203 -0.24628 -0.114736 -0.00185353 0.0422136 0.00892019 -0.0122292 0.120659 0.08373 -0.00636714 0.0793665 -0.0488364 -0.148465 -0.00285405 -0.0290093 0.230956 0.0203596 0.0677431 0.0456364 -0.043458 -0.00595539 -0.0146823 0.0139943 -0.0844118 0.0286879 -0.129416 -0.0828092 0.0946334 0.011902 -0.0419001 0.073086 0.0496218 0.105918 -0.0160997 0.0209567 0.000922425 0.0253993 -0.0957074 0.0464606 0.0449483 0.0192378 0.074547 0.0820923 0.0598776 -0.0778267 -0.0842213 0.0663333 -0.160283 -0.0692416 -0.0309875 0.128634 0.13664 -0.0741162 0.127964 0.0305036 -0.015382 0.0233792 -0.0846455 0.102573 -0.0450908 0.178819 0.0182433 -0.0848632 0.0236016 0.0665663 -0.14129 -0.108933 0.0957513 0.107958 -0.134861 -0.0586712 0.0374414 0.100234 0.0535078 -0.099599 0.0131385 -0.0221611 -0.106284 0.179327 0.0372803 0.0265275 
-0.00619538 0.125261 -0.0600481 -0.0396994 0.0209146 0.15604 0.0339816 -0.0850537 -0.0859338 0.0723677 0.0479828 0.0170674 0.0932039 -0.0958558 -0.071206 0.023922 -0.183228 0.0537329 -0.00536471 0.0248161 0.202573 -0.100475 -0.0389758 0.0801956 0.0436323 0.0431921 -0.0667154 -0.178195 0.146898 0.200756 -0.0560397 0.0456302 -0.0453498 0.00663974 0.052525 -0.0136871 -0.0874962 0.000346596 0.0595765 -0.103538 -0.00496712 -0.186484 0.0390657 0.125939 -0.0371468 0.0249064 0.180032 0.0307571 -0.234877 -0.112128 0.014593 0.0429575 0.0290064 -0.0251157 0.115155 0.0879382 0.00282842 0.0956208 -0.0494483 -0.143974 0.00180998 -0.00452826 0.229747 0.0113464 0.063313 0.0408735 -0.0475185 -0.0121876 -0.0380373 0.03175 -0.0755848 0.0376702 -0.127517 -0.0942685 0.0590366 0.0206425 -0.0402175 0.0395754 0.0482353 0.0989951 0.00259298 0.0359803 0.000426384 0.0250162 -0.0833175 0.0335465 0.037926 0.00484697 0.0600837 0.100435 0.066696 -0.0780637 -0.0904355 0.0612846 -0.158571 -0.058624 -0.0410483 0.129099 0.135467 -0.057762 0.16307 0.0404184 -0.011356 0.0193994 -0.0911797 0.0903768 -0.04443 0.160201 0.012384 -0.0616042 0.0421726 0.0570244 -0.137689 -0.111718 0.0944292 0.121605 -0.128109 -0.0392429 0.0346869 0.105533 0.0627769 -0.113074 0.0109411 -0.0408918 -0.111695 0.18467 0.031079 0.0159519 
-0.00865236 0.132891 -0.095106 -0.055527 0.0204044 0.1214 0.0367806 -0.0816814 -0.0910384 0.0890381 0.0511176 0.0251496 0.097731 -0.0938721 -0.0878122 0.0295268 -0.17147 0.0367407 0.00323188 0.0425764 0.183228 -0.103282 -0.0436353 0.0656916 0.0263531 0.0793621 -0.0376029 -0.175949 0.160873 0.199301 -0.0757198 0.0519094 -0.0411213 -0.00525281 0.0387475 -0.0196362 -0.0758632 0.0306013 0.0581727 -0.0908542 -0.0118975 -0.184017 0.0377415 0.158213 -0.0465395 0.0529701 0.198225 0.0337473 -0.23342 -0.117377 0.00987511 0.0524267 -0.00278007 -0.0238048 0.123393 0.0778956 -0.00709383 0.102704 -0.0412064 -0.141109 0.00889664 -0.0417858 0.247948 0.0314584 0.0615725 0.0069651 -0.0491981 -0.00698183 -0.00344692 0.0229177 -0.0786615 0.0350501 -0.119791 -0.0770919 0.0594489 0.00705018 -0.0428224 0.083383 0.0417838 0.0794674 -0.00161302 0.0458664 -0.0143727 0.0217145 -0.0822189 0.0187279 0.0419961 0.0116956 0.0814691 0.0787483 0.057711 -0.0739808 -0.101107 0.0408767 -0.138451 -0.0699494 -0.0204033 0.124045 0.146599 -0.0768944 0.127453 0.039946 0.00331741 0.0370659 -0.114499 0.0791488 -0.0624652 0.182439 0.0235756 -0.0677902 0.0524538 0.0692937 -0.152712 -0.0991811 0.083441 0.103342 -0.117484 -0.0810663 0.0377079 0.0904523 0.053739 -0.0827116 0.0209018 -0.0180338 -0.121973 0.155632 0.0167983 0.0109119 
-0.0178124 0.150375 -0.0753028 -0.0552289 -0.00198317 0.146449 0.0105695 -0.0815631 -0.0921195 0.0742158 0.0632501 0.0127912 0.0885586 -0.109327 -0.0795964 0.017654 -0.189515 0.0263667 0.0137065 0.0228374 0.182565 -0.0940308 -0.0416037 0.0643174 0.0404762 0.0684363 -0.030853 -0.169648 0.158604 0.183846 -0.0519872 0.0132697 -0.0354543 -0.00940634 0.0418442 -0.0180208 -0.0831732 0.00655245 0.0750373 -0.0657693 -0.00942669 -0.194571 0.026091 0.146073 -0.0380511 0.0323029 0.191928 0.0237462 -0.236899 -0.11099 0.0057854 0.0729707 0.0135957 -0.0197883 0.0941474 0.0825302 0.00667297 0.0914417 -0.0526702 -0.144508 -0.00751526 -0.0233462 0.249986 0.0267862 0.0496625 0.0192779 -0.0288922 -0.0189135 -0.0153513 0.0242776 -0.0768833 0.027542 -0.126142 -0.0793715 0.0887625 0.00568136 -0.0612238 0.0580695 0.0396698 0.12128 -0.00971088 0.0313325 0.0150311 0.0412604 -0.0845302 0.0417011 0.0402772 -0.00101292 0.0651422 0.0711974 0.0508881 -0.0764507 -0.0834015 0.0627242 -0.149855 -0.0915022 -0.0295381 0.130307 0.130858 -0.0765011 0.1281 0.0483579 -0.00759105 0.0329179 -0.0932386 0.094385 -0.0348227 0.184077 0.0148028 -0.070861 0.051242 0.0520671 -0.141062 -0.0999904 0.0775267 0.114836 -0.132334 -0.0528166 0.0512687 0.0971759 0.0608961 -0.114712 0.00397469 -0.0410229 -0.1094 0.172475 0.0303534 0.0383891 
-0.0135765 0.165313 -0.0930293 -0.063308 0.00956451 0.141749 0.0219657 -0.0866561 -0.0804148 0.0937911 0.0685966 0.00535238 0.0901133 -0.0904656 -0.0719544 0.0372393 -0.158126 0.0401238 0.0161473 0.00383506 0.179074 -0.0806783 -0.0650829 0.0467897 0.0392274 0.0759152 -0.0321808 -0.153846 0.174743 0.20328 -0.0535088 0.052306 -0.0289066 -0.00971896 0.0479014 -0.0125841 -0.0623806 -0.000730814 0.092908 -0.077893 -0.0142179 -0.188594 0.0482888 0.142249 -0.0197293 0.0475576 0.188461 0.0280582 -0.248016 -0.144175 0.00550035 0.0796341 0.0108368 -0.0285063 0.0906215 0.0969429 -0.0107226 0.0929172 -0.0599204 -0.13225 -0.0126834 -0.0397863 0.249715 0.0137815 0.0523686 0.033316 -0.0431564 -0.00740544 -0.0178713 0.0245214 -0.0728044 0.0154921 -0.139258 -0.0976296 0.0720002 0.0101737 -0.0447051 0.0663644 0.0239656 0.0783691 -0.00125706 0.0545749 0.00165591 0.0385721 -0.0827894 0.0397393 0.0320144 -0.0135531 0.0702118 0.0912571 0.0525898 -0.0814813 -0.108942 0.0666058 -0.123093 -0.0644951 -0.0266698 0.121519 0.127769 -0.0642958 0.128864 0.0429106 -0.00652179 0.0333659 -0.107731 0.0977921 -0.0414406 0.164131 0.0164662 -0.0724548 0.0463535 0.0356463 -0.151339 -0.0981841 0.0952558 0.0952728 -0.127678 -0.0712159 0.05805 0.0847987 0.0776939 -0.11334 0.0243561 -0.0294689 -0.0990528 0.16157 0.0355537 0.0205207 
-0.00608365 0.132201 -0.0671739 -0.0545626 0.00224951 0.154661 0.019218 -0.0651972 -0.0969087 0.0658554 0.0538074 0.0152977 0.0992044 -0.122551 -0.0936501 0.0339718 -0.188488 0.0403246 -0.0160057 0.0363923 0.206767 -0.100238 -0.0353777 0.0676974 0.0210767 0.0665193 -0.0507135 -0.186097 0.146041 0.178996 -0.058883 0.0350421 -0.0494721 0.013381 0.044462 -0.0235821 -0.0800889 0.0262311 0.0660288 -0.0808264 -0.0138605 -0.193614 0.0349366 0.138972 -0.0278648 0.0149471 0.199049 0.0249448 -0.251157 -0.0924745 0.0157079 0.0397868 0.00209652 -0.00673444 0.105297 0.0735501 0.0101508 0.0853339 -0.0466027 -0.161816 0.00788278 -0.0175751 0.242191 0.0169114 0.0594031 0.00880755 -0.0374696 -0.0147575 -0.0199951 0.0255561 -0.0861662 0.024645 -0.124722 -0.0718572 0.0632373 -0.00259771 -0.0465585 0.0629865 0.0467983 0.108866 -0.00486255 0.0308433 0.00146232 0.0224464 -0.0955325 0.041159 0.0448361 0.00840334 0.0743689 0.0829366 0.0619995 -0.0857175 -0.0950158 0.0581132 -0.151002 -0.0587214 -0.027096 0.140093 0.116561 -0.0597381 0.135955 0.0417807 -0.0227523 0.0490155 -0.0765536 0.0808944 -0.0521263 0.183141 0.00712661 -0.0743151 0.0310975 0.0683745 -0.144673 -0.0989043 0.0901787 0.113801 -0.127403 -0.0590455 0.0412816 0.0948454 0.0528827 -0.0953643 0.0281376 -0.0351209 -0.104917 0.158125 0.0292935 0.0154212 
-0.0271703 0.170046 -0.0854348 -0.0416875 0.0132866 0.160591 0.0341632 -0.114478 -0.0731378 0.0981278 0.0573875 0.00548632 0.0659275 -0.105217 -0.0536239 0.0168085 -0.180879 0.0425329 0.0309795 -0.00574738 0.1507 -0.0792007 -0.078003 0.0409008 0.0510662 0.0632446 -0.0694873 -0.161412 0.168523 0.200824 -0.034245 0.0515598 -0.0445671 -0.030644 0.0736824 0.00534432 -0.0748804 -0.0377996 0.0905716 -0.0838118 0.00648101 -0.188783 0.0351248 0.133533 -0.0282616 0.0603017 0.179053 0.0376846 -0.235418 -0.152671 -0.00929353 0.0839563 0.0365717 -0.0530367 0.0861074 0.104473 -0.0217842 0.0946088 -0.0648947 -0.109143 -0.0237866 -0.00564857 0.249314 0.00411092 0.0660929 0.0509489 -0.0308957 -0.0295445 -0.0356187 0.0232152 -0.0601472 0.0356716 -0.121496 -0.0856912 0.0695453 0.0182851 -0.0599149 0.0408811 0.0288909 0.081397 0.00822253 0.0544495 -0.00733502 0.0474963 -0.0745906 0.035539 0.0238751 -0.0207984 0.0510956 0.095948 0.062629 -0.0589187 -0.0871527 0.0638743 -0.135166 -0.0749145 -0.023211 0.103525 0.131961 -0.055162 0.137461 0.0448118 -0.00477569 -0.0128369 -0.114007 0.114619 -0.0111668 0.152305 0.0140053 -0.0215382 0.0667106 0.0188651 -0.134288 -0.121329 0.079463 0.095207 -0.132103 -0.0448081 0.0569537 0.0794431 0.0835617 -0.139587 0.014564 -0.0387974 -0.101473 0.183375 0.0306989 0.0236753 
-0.0248492 0.133822 -0.0657358 -0.0420917 0.0229069 0.15244 0.0190901 -0.0874588 -0.0853086 0.0658869 0.0477587 0.0135054 0.0840581 -0.1167 -0.0686306 0.0344043 -0.188211 0.0314144 0.00696458 0.031722 0.195007 -0.104924 -0.0393804 0.0710252 0.0461167 0.0595611 -0.0643158 -0.189447 0.153506 0.177676 -0.0285134 0.0280407 -0.0450447 -0.00450495 0.0608408 0.00304276 -0.0791686 -0.00186071 0.065581 -0.0929047 0.00618101 -0.183966 0.0415585 0.137712 -0.0302998 0.0370115 0.200281 0.0344762 -0.23591 -0.11895 -0.0137317 0.0313245 0.0229849 -0.0353374 0.112574 0.0878382 -0.0090855 0.0992151 -0.0515945 -0.143537 -0.00600994 -0.00519573 0.240506 0.0108166 0.0772197 0.029031 -0.0433492 -0.0216233 -0.0236483 0.0202091 -0.0772402 0.042616 -0.127317 -0.0888139 0.0735454 0.0107822 -0.0559837 0.0726244 0.0480467 0.105385 -0.00555514 0.0394393 -0.0049713 0.0341915 -0.0929959 0.0388554 0.0392792 0.0134497 0.0521396 0.0791841 0.072863 -0.0629289 -0.0893379 0.0535506 -0.146289 -0.0650388 -0.0318579 0.135695 0.118157 -0.0622894 0.128893 0.0268748 -0.0174494 0.0107074 -0.0934719 0.101675 -0.034781 0.169116 0.018271 -0.0507659 0.0382891 0.0493963 -0.138378 -0.112767 0.0902799 0.115355 -0.137347 -0.0517995 0.0324365 0.102678 0.0605693 -0.101739 0.00841122 -0.0302474 -0.125979 0.17944 0.0209385 0.0220464 
-0.022693 0.143302 -0.0797055 -0.0504386 0.00342686 0.152926 0.0173126 -0.0813001 -0.0921307 0.101143 0.070841 0.00756325 0.0956639 -0.103998 -0.0628122 0.0422432 -0.17613 0.0316944 0.0176558 0.0182314 0.180539 -0.114865 -0.0332975 0.0503255 0.0430815 0.0731868 -0.0443436 -0.181981 0.162956 0.172922 -0.0338087 0.0391057 -0.035355 -0.0124912 0.0433699 -0.00209048 -0.0874181 0.0150179 0.0857971 -0.0772836 -0.0162837 -0.197751 0.0163038 0.127159 -0.029858 0.0288856 0.179794 0.0301867 -0.244254 -0.137263 -0.0025777 0.0619477 0.0146537 -0.0383997 0.0812545 0.0925586 0.00264221 0.0987355 -0.0575155 -0.125998 -0.0189157 -0.025667 0.251007 0.000651536 0.0821368 0.046468 -0.0458873 -0.00191717 -0.0296085 0.0213486 -0.0800208 0.0411115 -0.140659 -0.0883178 0.0772966 0.0037405 -0.0441688 0.0609109 0.0383165 0.104905 -0.0211376 0.011217 -0.000383399 0.0314988 -0.103052 0.0358719 0.0384887 -0.000530066 0.0668288 0.0675934 0.0516298 -0.0662263 -0.0839762 0.076568 -0.13427 -0.0707087 -0.0286742 0.125385 0.121764 -0.0567614 0.130701 0.0277104 -0.0288359 0.0211956 -0.0751222 0.106013 -0.0269274 0.162976 0.0340027 -0.0758718 0.0224552 0.0566672 -0.123894 -0.107197 0.106606 0.110632 -0.139725 -0.0389803 0.0544117 0.104938 0.0593243 -0.128907 0.00903537 -0.0300969 -0.1013 0.182811 0.0227702 0.0294644 
-0.00342197 0.111077 -0.0444465 -0.0421758 0.0174566 0.163455 0.0227747 -0.0603354 -0.092919 0.0505626 0.0476608 0.0214928 0.10044 -0.127922 -0.0709502 0.0456574 -0.186521 0.0360694 -0.0308197 0.0445591 0.21938 -0.0967043 -0.0333208 0.0827495 0.0267416 0.0590889 -0.0748513 -0.198836 0.135071 0.168311 -0.0398377 0.0523457 -0.0553548 0.0345339 0.045702 -0.0057048 -0.0729633 0.0191821 0.0611088 -0.091092 0.00973767 -0.189853 0.0418147 0.119485 -0.0215576 0.00841685 0.201339 0.0256489 -0.249917 -0.0936429 0.00747757 0.00542879 0.00791503 -0.00821703 0.119394 0.0778792 -0.00278435 0.0898083 -0.0491194 -0.157723 0.00229131 -0.00515548 0.22348 0.00176817 0.0712415 0.0271725 -0.0387298 -0.0110309 -0.0269464 0.0223532 -0.0896139 0.0352901 -0.128579 -0.0738357 0.0644841 0.00139905 -0.0441492 0.06519 0.0520738 0.110971 0.000506081 0.035668 -0.000763614 0.0104811 -0.102416 0.0475931 0.0563422 0.0163285 0.0515693 0.0915258 0.0834144 -0.0848226 -0.0997662 0.0630744 -0.162688 -0.035647 -0.0343255 0.134108 0.109999 -0.051646 0.132993 0.0218711 -0.0330019 0.0441842 -0.0726529 0.0870301 -0.0574942 0.174129 0.00204496 -0.0715986 0.0159065 0.0723826 -0.148769 -0.109875 0.105321 0.111852 -0.135084 -0.0605468 0.0268096 0.105989 0.0630854 -0.0833177 0.0303081 -0.0217988 -0.108276 0.163766 0.0293317 0.00590335 
-0.0212483 0.140961 -0.0576549 -0.0387644 0.0146867 0.164634 0.00551826 -0.101559 -0.0920737 0.072956 0.0529245 0.0075334 0.0793534 -0.0920021 -0.0468741 0.027006 -0.171838 0.0467912 0.0294342 0.0143696 0.184124 -0.0879701 -0.0453076 0.06888 0.0567005 0.0623296 -0.0613599 -0.177111 0.149065 0.186348 -0.0309341 0.0361234 -0.0343645 -0.0113456 0.0666569 0.0155024 -0.0790784 -0.024109 0.0754378 -0.0942806 0.000808052 -0.18471 0.0410275 0.126834 -0.0314337 0.045348 0.195959 0.0284575 -0.244744 -0.133253 0.00310954 0.0477472 0.0418652 -0.0363505 0.103224 0.100147 -0.00356012 0.0916131 -0.0495699 -0.137106 -0.0116486 0.00417289 0.230927 0.00276302 0.0738286 0.0520621 -0.0370666 -0.0183847 -0.0337573 0.0359575 -0.0701997 0.0339917 -0.131049 -0.10628 0.07653 0.0170245 -0.0604439 0.0488733 0.0431197 0.0995643 -0.00200835 0.0517836 -0.000405278 0.0310441 -0.0854774 0.0396287 0.0317445 -0.0047191 0.0412746 0.09757 0.0654913 -0.0593219 -0.0853223 0.0691045 -0.149217 -0.0618009 -0.0325248 0.135036 0.121126 -0.0611809 0.14064 0.0416867 -0.0111297 -0.00490941 -0.0982386 0.110762 -0.0276932 0.144477 0.011797 -0.0494831 0.0430598 0.034408 -0.132239 -0.124882 0.0911432 0.1068 -0.140501 -0.0571315 0.0372318 0.097252 0.077418 -0.128861 0.00929543 -0.0455765 -0.10535 0.190614 0.0438931 0.0299541 
-0.0125313 0.137935 -0.0516744 -0.0349804 0.0236528 0.176124 0.0246105 -0.0749456 -0.092202 0.0903181 0.0586521 0.018766 0.0920867 -0.122583 -0.056338 0.0339132 -0.166269 0.0697288 -0.0103622 0.0241592 0.198776 -0.102308 -0.0326725 0.0973346 0.0490733 0.037566 -0.0597753 -0.185099 0.148356 0.178353 -0.0327621 0.0396884 -0.0452113 0.0163761 0.0539397 -0.00669401 -0.0828299 -0.0106388 0.057148 -0.0943827 0.00414823 -0.194398 0.0390782 0.13073 -0.0406825 0.00855578 0.191448 0.0340757 -0.249961 -0.113857 0.0352213 0.0261194 0.00904683 -0.0394341 0.101008 0.0986046 -0.00976381 0.0939487 -0.0406483 -0.143022 -0.0130031 -0.0102615 0.225626 -0.0122656 0.0861865 0.0301669 -0.0520146 -0.0204241 -0.0588995 0.0490406 -0.080855 0.0466158 -0.132014 -0.0963083 0.0576986 0.00956145 -0.0416991 0.0761661 0.0468606 0.0895659 -0.0156527 0.0347119 0.00326186 0.0234177 -0.0930415 0.0350998 0.0446468 0.00358347 0.0542842 0.101185 0.057216 -0.0808532 -0.0952858 0.06363 -0.145973 -0.0513122 -0.03959 0.128519 0.108816 -0.0526843 0.145065 0.037665 -0.0249507 0.0265912 -0.0718163 0.0920947 -0.0420384 0.147378 0.0161994 -0.068 0.0215697 0.0667709 -0.119448 -0.10724 0.103113 0.099802 -0.139472 -0.0472268 0.0354268 0.115926 0.0712738 -0.116385 0.00442399 -0.0323697 -0.096799 0.182442 0.0290818 0.00839732 
-0.0146462 0.140196 -0.0774959 -0.0435227 0.0117824 0.150079 0.0265173 -0.0773825 -0.0956816 0.0917687 0.0493792 0.0124322 0.0931852 -0.118363 -0.0803387 0.0359452 -0.168065 0.0504956 0.0124006 0.0273198 0.196174 -0.109661 -0.0396543 0.0701943 0.0365252 0.0653379 -0.0620243 -0.190858 0.162856 0.187966 -0.0482266 0.0495034 -0.0441426 -0.00697755 0.0538706 -0.022278 -0.079462 0.010956 0.0783183 -0.0936375 -0.0137774 -0.189921 0.032543 0.131861 -0.0301255 0.0266832 0.195048 0.0285059 -0.241134 -0.124797 0.0149166 0.0549834 0.0226643 -0.0308239 0.0965212 0.0852123 0.0212339 0.0853901 -0.042314 -0.148061 0.00476604 -0.0147851 0.234867 0.00684434 0.0668257 0.0237114 -0.0422258 -0.0208661 -0.0253641 0.0170561 -0.0871549 0.0347444 -0.135794 -0.0814585 0.0609004 0.00458352 -0.0448589 0.0700021 0.0495303 0.101643 -0.0156448 0.0380228 -0.0013115 0.0323102 -0.0750003 0.032417 0.0345513 0.00638605 0.0715131 0.0717081 0.0531645 -0.0585892 -0.0895976 0.0621539 -0.141196 -0.0686399 -0.0214649 0.141231 0.115987 -0.0618109 0.14565 0.0383822 -0.0159764 0.0375964 -0.0844282 0.0851976 -0.0309709 0.166388 0.0257722 -0.0571732 0.0305552 0.0566448 -0.134744 -0.114756 0.0911482 0.109125 -0.135431 -0.0611013 0.0389027 0.0946514 0.0543275 -0.106713 0.014279 -0.0435794 -0.116232 0.173955 0.0177524 0.0168978 
-0.000958642 0.135936 -0.069454 -0.0418714 0.0110877 0.138806 0.0122952 -0.0667074 -0.0992799 0.0742617 0.0624053 0.0150132 0.106596 -0.119767 -0.0856032 0.0573817 -0.174855 0.0389337 -0.0277375 0.0625081 0.207445 -0.113178 -0.00471601 0.0689571 0.0268499 0.0578682 -0.0487902 -0.188377 0.14825 0.175777 -0.0609425 0.049091 -0.0335704 0.0222619 0.0302796 -0.0208466 -0.0762757 0.0536155 0.0572766 -0.084076 -0.0272307 -0.194646 0.0359287 0.129654 -0.0374973 0.0225207 0.2059 0.0281257 -0.247864 -0.076026 0.0246484 0.0441107 -0.012683 -0.00622982 0.109578 0.0624375 0.0167476 0.0720038 -0.0351094 -0.157499 -0.00277039 -0.0340861 0.23367 0.0074829 0.0672923 0.00578104 -0.0528012 -0.00355765 -0.0294631 0.0314314 -0.0879045 0.0340178 -0.129547 -0.0651274 0.0685261 -0.00795286 -0.034554 0.077589 0.0431034 0.112362 -0.00752166 0.0171181 -0.0072918 0.0150749 -0.0945425 0.0432482 0.0310313 0.0145318 0.0773415 0.0814495 0.0559308 -0.0848524 -0.10376 0.0588076 -0.143232 -0.0591491 -0.0323638 0.151854 0.118894 -0.0720338 0.128831 0.0320741 -0.0214743 0.062408 -0.0710066 0.0802014 -0.0554639 0.190151 0.0420793 -0.0889606 0.00991928 0.0918134 -0.138375 -0.0865422 0.0985041 0.10587 -0.124503 -0.0604893 0.0386348 0.115751 0.0466514 -0.0753318 0.0280319 -0.0145025 -0.101277 0.153192 0.0413407 0.0129505 
0.0137198 0.0819242 -0.0800235 -0.0608933 0.0407553 0.151941 0.00880118 -0.0455982 -0.0880685 0.0162378 0.056282 0.0475854 0.106533 -0.116544 -0.116645 0.0503404 -0.170939 0.0428861 -0.0474318 0.065073 0.244505 -0.0877009 -0.019671 0.0836048 0.0206679 0.0513743 -0.0302245 -0.190311 0.119648 0.180289 -0.0656283 0.0138602 -0.0422171 0.0330663 0.0332085 -0.0209419 -0.086585 0.0262662 0.0511771 -0.0883388 -0.0103696 -0.156287 0.0476746 0.144401 -0.0298794 -0.00373129 0.195505 0.0183205 -0.237143 -0.0652124 0.0047407 -0.00564114 -0.00689824 0.00301736 0.118474 0.0579085 -0.00753212 0.103585 -0.0662454 -0.161346 0.0118342 -0.0221215 0.253001 0.0186784 0.05913 -0.0179291 -0.0646958 0.0211495 -0.0158328 0.0163567 -0.0662481 0.0251109 -0.126896 -0.107269 0.0433802 0.0229486 -0.0368156 0.0608269 0.0364002 0.113287 -0.00581855 0.0341402 0.0100592 0.0168739 -0.123101 0.0572429 0.06256 0.026391 0.0607122 0.0790347 0.0691316 -0.113951 -0.121756 0.0743069 -0.140062 -0.0428358 -0.0459294 0.129662 0.0930741 -0.0611413 0.129081 0.0193942 -0.0356128 0.056468 -0.0783791 0.0792516 -0.072237 0.179876 -0.0208173 -0.0926444 0.0257621 0.0620703 -0.142929 -0.0684445 0.095809 0.130147 -0.144347 -0.0456473 0.022711 0.111574 0.0331349 -0.0679561 0.0262639 -0.0296155 -0.105246 0.153909 0.0214706 -0.00152964 
-0.0127354 0.120094 -0.0863343 -0.0641235 0.0225384 0.169546 -0.00951269 -0.0794479 -0.110968 0.0616982 0.0442585 0.0224705 0.0968246 -0.0964676 -0.0731045 0.0378021 -0.158092 0.0545844 0.0209446 0.0291408 0.197025 -0.0839376 -0.0116433 0.0843185 0.0321747 0.0688572 -0.0260157 -0.200713 0.140668 0.177234 -0.039462 0.0239061 -0.0341394 -0.000643964 0.0510779 0.0039669 -0.0778791 0.00308132 0.0645941 -0.073343 -0.01336 -0.170831 0.0349277 0.147467 -0.0445413 0.0327168 0.215615 0.0271819 -0.252381 -0.104532 0.014412 0.0175992 0.0277227 -0.0231239 0.0967929 0.0903234 0.0238285 0.110521 -0.0347162 -0.154284 -0.00373216 0.00248771 0.247409 -0.00225816 0.0776429 0.00617056 -0.045677 -0.000408775 -0.0200856 0.0430467 -0.0822714 0.0315503 -0.139718 -0.102768 0.0638387 0.00900105 -0.0624149 0.0719686 0.0393426 0.0908997 -0.0165781 0.0532965 -0.00581808 0.0197703 -0.104922 0.0396664 0.041481 -0.0018975 0.0440688 0.0765085 0.0605601 -0.0705144 -0.0944097 0.0562088 -0.123759 -0.0484969 -0.0322644 0.162187 0.105683 -0.0607908 0.127573 0.0344177 -0.0199866 0.0374408 -0.0931237 0.0848152 -0.0624637 0.146663 -0.0095062 -0.0691191 0.0368205 0.0566753 -0.119531 -0.109758 0.078811 0.116748 -0.142523 -0.0814405 0.0351973 0.104057 0.0662992 -0.112311 0.0133814 -0.0479235 -0.124848 0.168403 0.00957271 0.0218047 
-0.0131786 0.140187 -0.0736659 -0.043925 0.0187093 0.157146 0.00343853 -0.0845263 -0.101041 0.0749801 0.0472796 0.000295779 0.0859287 -0.115218 -0.062874 0.0600605 -0.158773 0.0424063 0.0212779 0.0191135 0.200994 -0.0919933 -0.0246716 0.0533032 0.0437416 0.0751831 -0.0565227 -0.198711 0.159621 0.174539 -0.0343251 0.0553495 -0.0372594 -0.0013788 0.0661437 -0.00598263 -0.0601041 0.0118293 0.0913732 -0.094593 -0.0116547 -0.183354 0.045618 0.124238 -0.022585 0.0421879 0.209452 0.0272868 -0.256289 -0.129907 0.00712968 0.0412872 0.0301434 -0.0254418 0.0940497 0.0823257 0.0284572 0.0766531 -0.0439347 -0.151182 0.00127637 -0.012216 0.230093 -0.0042171 0.0836722 0.0305831 -0.0462037 -0.00759929 -0.0128003 0.0269664 -0.0913071 0.0325275 -0.143178 -0.0942093 0.0657506 -0.00291621 -0.0542495 0.0771337 0.0383221 0.100349 -0.00722584 0.0514144 -0.0060497 0.0233863 -0.0857794 0.0371435 0.0293795 0.00553365 0.0471685 0.0778063 0.0683029 -0.0530981 -0.105465 0.0628283 -0.133566 -0.0506431 -0.0160863 0.158824 0.104226 -0.060074 0.132597 0.0277668 -0.0209629 0.0316703 -0.080548 0.0851042 -0.0303202 0.16272 0.0245995 -0.0604204 0.0202913 0.0493952 -0.133633 -0.118091 0.105929 0.100377 -0.149187 -0.0750342 0.0335052 0.0915287 0.0657779 -0.0952434 0.0298632 -0.0379917 -0.106528 0.164588 0.0321719 0.0166956 
-0.00807648 0.10731 -0.0687841 -0.0669161 0.0341926 0.179529 0.0128032 -0.0520861 -0.102443 0.040129 0.0391023 0.0309112 0.0951615 -0.12181 -0.0910333 0.0468057 -0.180116 0.0517964 -0.0236976 0.0295852 0.222541 -0.0885441 -0.0262321 0.0807977 0.0245667 0.0526066 -0.0473958 -0.192066 0.131731 0.165254 -0.0407523 0.0218565 -0.0577154 0.0252074 0.0459525 -0.0066271 -0.0821387 -0.00757518 0.0606094 -0.0796984 0.00692571 -0.171247 0.0574344 0.140589 -0.0273825 0.00168982 0.206231 0.0265229 -0.255752 -0.0849068 0.00397803 -0.0160215 0.00210512 -0.0118646 0.105462 0.084034 -0.0022477 0.11621 -0.0538463 -0.155623 0.00359351 0.0097758 0.246806 -0.00111809 0.0767144 0.00774059 -0.0596445 -0.00208843 -0.0313678 0.0339938 -0.0806414 0.0371184 -0.128927 -0.0916441 0.0512636 0.0142617 -0.0434739 0.0677014 0.0396355 0.0829711 -0.00841227 0.0432613 0.00609134 0.0226374 -0.127679 0.0543682 0.0579758 0.0148111 0.0498749 0.08724 0.0800835 -0.0952321 -0.111539 0.0564657 -0.129158 -0.0245286 -0.0414725 0.148234 0.0857933 -0.0380367 0.122829 0.0191388 -0.0365107 0.046042 -0.0749138 0.0886278 -0.0713142 0.164921 -0.0308579 -0.0781373 0.0274528 0.0564029 -0.126718 -0.0931483 0.0945582 0.117933 -0.132539 -0.0501221 0.0360779 0.108941 0.0596232 -0.0978802 0.0265483 -0.0397791 -0.122149 0.160599 0.00464998 0.00229043 
