0.062929 0.0833464 -0.0626878 -0.0068996 0.0823437 0.193575 0.095947 -0.171957 -0.155276 0.0409244 -0.0340149 0.0354931 0.0849134 -0.0234077 0.0824519 -0.0937139 -0.0991985 0.0637573 0.0331468 0.0575069 0.00305168 0.012126 -0.0123631 0.11092 0.00993817 0.0259672 -0.169066 -0.171864 0.049937 0.158667 -0.0129577 0.10781 -0.147784 -0.00917321 0.110697 0.0623225 -0.0444245 -0.0173111 0.0334413 -0.0635388 0.0545777 -0.0726108 0.00271422 0.0893319 -0.179545 0.116502 0.171165 0.104384 -0.122697 -0.00115178 0.0424805 0.0110558 0.0575816 -0.0280508 0.140223 0.0160789 -0.0258855 0.182148 0.0394313 -0.0868191 -0.0626241 0.111534 0.167753 -0.090036 0.0475963 0.0157269 0.0663605 -0.0216164 -0.0912139 0.0327809 0.00972028 0.122526 -0.0157285 0.0527478 0.0149599 0.01111 -0.116709 -0.0410319 0.10527 0.0871634 0.101085 0.0865416 -0.0486015 -0.0450043 -0.0114115 -0.0604684 0.0309672 -0.0498178 -0.0142966 0.0839381 0.109221 -0.0111223 0.0287234 -0.0579892 -0.152305 -0.104307 0.0519097 0.108819 0.112393 -0.0758223 0.0752385 0.12739 0.0621615 0.0171138 -0.213105 0.0684708 -0.0786981 0.112221 0.024534 0.123604 0.162852 0.0792038 -0.0966441 -0.11265 -0.0363113 0.078814 -0.0683146 -0.0987148 -0.0325996 0.0822455 0.0910492 -0.129568 0.0312034 0.00615466 -0.133853 0.0900682 -0.0193807 -0.00531575 
0.0575512 0.0804796 -0.0754429 -0.0034336 0.0757872 0.187311 0.0931155 -0.177453 -0.15434 0.0356381 -0.0362691 0.0415392 0.0828187 -0.0283694 0.0585315 -0.0902123 -0.105186 0.0667724 0.0395379 0.0589382 0.0114672 0.00389728 -0.012939 0.108636 0.00514144 0.0370185 -0.163724 -0.183078 0.05052 0.16807 -0.0194535 0.112555 -0.146177 -0.0170491 0.110911 0.0539522 -0.0500062 -0.013082 0.0352723 -0.0641027 0.0487487 -0.0730082 0.00437692 0.100473 -0.174711 0.11183 0.180689 0.0959699 -0.12362 -0.00530107 0.041809 0.0102299 0.0620432 -0.025988 0.142017 0.0189784 -0.0136851 0.18248 0.0424744 -0.0920469 -0.0528111 0.107956 0.17875 -0.0817768 0.0488289 0.00419311 0.0655999 -0.0307438 -0.080608 0.0315681 0.00133102 0.116862 -0.0167487 0.0544391 0.00965953 0.00633117 -0.117105 -0.0374227 0.0965348 0.0867759 0.0957476 0.0905125 -0.0530547 -0.0457446 -0.0157383 -0.0597867 0.0303153 -0.051149 -0.0120681 0.0725932 0.104776 -0.00693789 0.0245421 -0.0640397 -0.146337 -0.101482 0.0541999 0.118782 0.11659 -0.0733654 0.0746891 0.126678 0.063251 0.0244449 -0.209139 0.0611232 -0.0757098 0.120458 0.0169209 0.124 0.159162 0.0766915 -0.0998492 -0.118707 -0.039737 0.0826227 -0.0648302 -0.106614 -0.0272846 0.0761319 0.0860157 -0.124109 0.031935 -0.00415256 -0.143159 0.0906 -0.0257399 -0.0012406 
0.0632148 0.0795244 -0.0639918 -0.00867138 0.0817307 0.188341 0.0902248 -0.174256 -0.157741 0.0261039 -0.0394216 0.0368998 0.086741 -0.0233794 0.0714806 -0.0857661 -0.0964616 0.0648565 0.0280939 0.0618342 0.0121413 0.0170134 -0.0115905 0.107684 0.00265429 0.0343101 -0.169157 -0.17911 0.0485101 0.162441 -0.0185953 0.116135 -0.144285 -0.00836014 0.115274 0.0584564 -0.0395451 -0.00642993 0.0337857 -0.0668853 0.0512509 -0.0658136 0.00886433 0.0901568 -0.171597 0.123195 0.181603 0.0971478 -0.131281 -0.00319977 0.0390167 0.0010414 0.064582 -0.0216187 0.14112 0.0132576 -0.0177555 0.178964 0.042632 -0.0956732 -0.0556587 0.114795 0.166316 -0.0858957 0.0483167 0.0108332 0.0653255 -0.0199656 -0.0832276 0.0251387 0.00814517 0.109051 -0.0149938 0.0465017 0.0130335 0.0131593 -0.121709 -0.0429396 0.102547 0.0858842 0.105695 0.09477 -0.0547508 -0.0502154 -0.0129076 -0.0556532 0.029912 -0.0507526 -0.022903 0.0834579 0.111185 -0.0119425 0.02314 -0.0590347 -0.152439 -0.0925539 0.0547149 0.118896 0.111172 -0.0743591 0.0732308 0.124078 0.0612885 0.0281206 -0.215571 0.0616598 -0.082387 0.118906 0.0168544 0.119063 0.160752 0.0765609 -0.104263 -0.114567 -0.0389304 0.0812099 -0.0802436 -0.107898 -0.0378515 0.0751371 0.0868166 -0.118452 0.0367325 0.00216125 -0.133781 0.0857682 -0.0232357 -0.0119249 
0.0628581 0.0718422 -0.0576382 -0.00850054 0.0862461 0.188386 0.0948392 -0.169348 -0.153304 0.0238246 -0.039259 0.0426474 0.084542 -0.0290159 0.071025 -0.0931403 -0.104514 0.0688735 0.0258027 0.0646277 0.018545 0.0150191 -0.00915896 0.114691 0.00268658 0.0302211 -0.168456 -0.182608 0.0457841 0.160382 -0.0161467 0.10198 -0.146078 -0.00608816 0.119963 0.0572262 -0.0442307 -0.00773159 0.0274568 -0.0696823 0.0539016 -0.063963 0.00456925 0.098037 -0.180608 0.115155 0.178456 0.0983251 -0.124106 0.00416339 0.0379821 -0.00321641 0.0582955 -0.0229242 0.147076 0.0126571 -0.0209821 0.182433 0.0367419 -0.0937618 -0.0534953 0.109339 0.169925 -0.0821496 0.0529771 -0.0017575 0.063411 -0.0233269 -0.0843157 0.0320479 0.0107194 0.115399 -0.0135998 0.0458138 0.00516276 0.0117974 -0.122997 -0.0377282 0.107069 0.0877188 0.0994751 0.0922055 -0.051012 -0.0458804 -0.0148202 -0.0632869 0.0362267 -0.0427461 -0.0182843 0.0825854 0.113007 -0.0120591 0.0232688 -0.0634005 -0.154046 -0.100461 0.050649 0.116095 0.109423 -0.0744435 0.0738678 0.12634 0.0592917 0.0209459 -0.209804 0.0592393 -0.0799877 0.1162 0.0201351 0.121669 0.160297 0.0772885 -0.104649 -0.111762 -0.0358875 0.086905 -0.0716674 -0.107445 -0.0405975 0.08152 0.0853357 -0.116673 0.0293523 0.0038532 -0.136189 0.0860752 -0.0204784 -0.00820198 
0.0606971 0.0830144 -0.05904 -0.00637377 0.0883277 0.195975 0.0884039 -0.183561 -0.147387 0.0190172 -0.0377829 0.0278499 0.0758015 -0.00548053 0.0820226 -0.0905221 -0.0857262 0.0706837 0.0336642 0.0551389 0.00400162 0.024521 -0.00402999 0.101259 0.00420941 0.0220887 -0.182259 -0.163398 0.0558582 0.151127 -0.00181877 0.113009 -0.142504 -0.0186871 0.12186 0.0776209 -0.0432682 -0.0074732 0.0284042 -0.0639348 0.0498846 -0.0424144 -0.0053324 0.0741218 -0.175399 0.126342 0.168906 0.103122 -0.120447 -0.00275412 0.0159973 0.0185425 0.070592 -0.0281118 0.129069 0.0135814 -0.0138642 0.185804 0.0330528 -0.0847606 -0.0696503 0.134339 0.171696 -0.100179 0.0517233 0.0244125 0.0735098 -0.020453 -0.0942268 0.0485458 0.0235072 0.114311 -0.011063 0.0591175 0.0101185 0.0113999 -0.124769 -0.0551441 0.0991874 0.0625557 0.102375 0.108411 -0.0597683 -0.0514093 -0.00414615 -0.0583845 0.0180897 -0.0510999 -0.0315666 0.0853621 0.127034 -0.00360022 0.0349663 -0.062128 -0.125666 -0.103007 0.0544694 0.123434 0.103187 -0.065607 0.0730608 0.124029 0.0589634 0.00837185 -0.219927 0.0796167 -0.0656907 0.0903177 0.0353889 0.12925 0.163193 0.0707177 -0.0901234 -0.111953 -0.0351736 0.081059 -0.0701645 -0.106913 -0.0304207 0.0765381 0.0873332 -0.126668 0.03221 0.00433144 -0.138274 0.093151 -0.0144008 -0.00513183 
0.0598064 0.0834606 -0.0584958 -0.00675918 0.0845842 0.196078 0.0915477 -0.18726 -0.139856 0.0142291 -0.0384128 0.0283886 0.0769777 -0.0106852 0.0734511 -0.0910384 -0.094826 0.0702786 0.0252758 0.0527537 0.0078229 0.0247573 -0.00722753 0.100287 -0.00115122 0.0221256 -0.184993 -0.167609 0.0528975 0.153649 -0.00197119 0.113463 -0.146888 -0.0184379 0.126438 0.0735292 -0.0446515 -0.00347607 0.0296462 -0.0630639 0.0485775 -0.0435331 -0.00891282 0.076514 -0.170927 0.124838 0.166228 0.103676 -0.121202 -0.0034079 0.0141562 0.016792 0.0723374 -0.0272988 0.127239 0.0123568 -0.0139392 0.185954 0.0306011 -0.087027 -0.0661545 0.134104 0.17452 -0.0947561 0.0503187 0.0193076 0.0752333 -0.0186265 -0.091343 0.046016 0.0244891 0.110736 -0.00887292 0.0576602 0.00568051 0.0108709 -0.128491 -0.0593418 0.0983945 0.0670671 0.105716 0.107311 -0.0611264 -0.0517803 -0.00831803 -0.0590381 0.0207243 -0.0522751 -0.0333102 0.0839449 0.127045 -0.00694662 0.0375302 -0.0627587 -0.131304 -0.101591 0.0526291 0.12024 0.105568 -0.0621864 0.0772171 0.12439 0.0546559 0.0114349 -0.215135 0.0734966 -0.0654643 0.0953842 0.0315114 0.132175 0.16359 0.0703688 -0.0943356 -0.110676 -0.0365156 0.0863807 -0.0759111 -0.102145 -0.0321323 0.0735761 0.0848826 -0.124468 0.0308849 0.00346992 -0.136467 0.0917863 -0.0191719 -0.00650979 
0.0524685 0.0882305 -0.0668704 0.000148058 0.0826552 0.196585 0.0867814 -0.1876 -0.143779 0.0109118 -0.0482405 0.0226488 0.079904 -0.00865416 0.0646103 -0.0755771 -0.0934353 0.0660548 0.0195548 0.0463538 0.0140376 0.0106102 -0.0110715 0.102412 0.0101545 0.0124627 -0.190848 -0.16589 0.0415757 0.158579 -0.00361504 0.126817 -0.150413 -0.0134786 0.11386 0.0721579 -0.0432526 -0.0213284 0.0276819 -0.0678522 0.0569375 -0.0527961 0.021378 0.0685488 -0.151641 0.121688 0.17507 0.101332 -0.128108 -0.0092796 0.0222288 -0.00512056 0.0831234 -0.0262894 0.133795 0.0204617 -0.0136562 0.180586 0.052986 -0.101373 -0.0611567 0.15049 0.156716 -0.0992117 0.0416529 0.0423901 0.0645023 -0.0166755 -0.0900439 0.0311091 0.0154772 0.111196 -0.0106041 0.0470259 0.016959 0.0266092 -0.11979 -0.0621666 0.0909507 0.0647402 0.112241 0.104637 -0.05976 -0.0527292 -0.0234649 -0.0301917 0.0180891 -0.0577547 -0.0402861 0.0833664 0.120095 -0.0115544 0.0335182 -0.0672434 -0.138906 -0.0749624 0.0480702 0.128798 0.102586 -0.0608348 0.0836397 0.112191 0.0620046 0.0225505 -0.216986 0.0716992 -0.0836422 0.106648 0.00346006 0.127953 0.158889 0.0673428 -0.0913859 -0.11879 -0.0433752 0.0831583 -0.0859357 -0.0872394 -0.0345758 0.0692225 0.0869524 -0.122021 0.0380932 -0.0023331 -0.148428 0.0957297 -0.0351083 -0.0122622 
0.0450509 0.0764606 -0.0502938 -0.00792971 0.0815123 0.191701 0.0828047 -0.186654 -0.136697 0.0174027 -0.0422894 0.0301764 0.0686489 -0.011781 0.0819495 -0.0959014 -0.102559 0.0692906 0.0402623 0.0481914 0.00103468 0.0289596 -0.00581778 0.0970605 0.000550186 0.0340705 -0.180656 -0.173735 0.0526981 0.143853 0.0069565 0.101436 -0.141 -0.0326871 0.134091 0.0803963 -0.0491145 -0.00327671 0.0252949 -0.0579745 0.0522544 -0.0372711 -0.0197506 0.0844618 -0.176854 0.125483 0.168155 0.0966719 -0.113858 -0.0135507 0.00828403 0.0120704 0.0779552 -0.033414 0.126609 0.017975 -0.012332 0.186998 0.0298093 -0.0853091 -0.0674063 0.130561 0.173236 -0.0865622 0.0616695 0.0152296 0.0812147 -0.023377 -0.0826735 0.0484828 0.0283084 0.116398 -0.00390081 0.0564835 0.00727091 0.00881214 -0.145364 -0.0557486 0.0991419 0.0668136 0.102466 0.112461 -0.0606732 -0.0473462 -0.00482085 -0.0690352 0.0263301 -0.0458145 -0.0352403 0.073766 0.122152 0.0076138 0.0428338 -0.0669844 -0.128856 -0.106615 0.0548696 0.121118 0.104866 -0.0608941 0.0687317 0.120702 0.0567027 -0.00794587 -0.21632 0.0738096 -0.0571819 0.081943 0.036308 0.138812 0.164327 0.0660779 -0.0927129 -0.122204 -0.0372808 0.0860502 -0.0769375 -0.110109 -0.0355669 0.0665059 0.0882385 -0.125103 0.0238431 -0.00217019 -0.137938 0.0971278 -0.0192809 0.00500993 
0.0524792 0.0856358 -0.075161 -0.0072428 0.0728817 0.183954 0.0895289 -0.18077 -0.152547 0.0429982 -0.0347701 0.036913 0.0861335 -0.023121 0.0629923 -0.0874417 -0.0982314 0.07321 0.0378171 0.0588418 0.00558786 0.00814279 -0.0119472 0.10855 -0.00148328 0.0390051 -0.164564 -0.182995 0.054403 0.168043 -0.0196875 0.1195 -0.139774 -0.0188721 0.115319 0.0576139 -0.045149 -0.0047529 0.0303583 -0.0634025 0.0438677 -0.0723018 -0.000255443 0.100102 -0.174284 0.11973 0.181452 0.1003 -0.128821 -0.0101011 0.0422704 0.0116715 0.0631126 -0.0294365 0.137359 0.0218118 -0.0137006 0.178246 0.0469548 -0.092338 -0.0557883 0.107513 0.174517 -0.0831901 0.0526215 0.00237553 0.0662762 -0.0289919 -0.082899 0.0335254 0.00348005 0.108288 -0.0158716 0.0511361 0.0086131 0.0047467 -0.121837 -0.0328831 0.0971362 0.0766486 0.0974122 0.0951407 -0.0622229 -0.0486657 -0.0143701 -0.0605631 0.026302 -0.0557577 -0.0142687 0.0770988 0.101961 -0.00523929 0.0266778 -0.0669384 -0.142643 -0.0976556 0.0544215 0.120461 0.116775 -0.0744928 0.0782356 0.127351 0.0621678 0.0227142 -0.208804 0.0587209 -0.0766173 0.112936 0.0219386 0.125587 0.156208 0.0775533 -0.0980746 -0.12104 -0.0428486 0.078724 -0.0694204 -0.115911 -0.0288187 0.0730938 0.0872045 -0.124757 0.0316061 0.000307531 -0.140851 0.0893374 -0.027879 -0.00574445 
0.0501636 0.0817443 -0.0564954 -0.00329053 0.080622 0.193525 0.0882803 -0.188581 -0.13651 0.0154308 -0.0376314 0.025929 0.0709103 -0.00953021 0.0793087 -0.0947582 -0.0963456 0.0660087 0.0343277 0.0476967 0.000417227 0.022979 -0.0056383 0.0972474 0.00315419 0.027245 -0.184534 -0.170643 0.054653 0.144723 0.00872806 0.109858 -0.144622 -0.0297385 0.127192 0.0791306 -0.0506061 0.00127896 0.025204 -0.0560525 0.0523853 -0.0376793 -0.0228187 0.0793321 -0.17313 0.126898 0.164507 0.0983976 -0.115461 -0.015342 0.00788356 0.019877 0.0776554 -0.0353841 0.121949 0.0157619 -0.0128218 0.190295 0.0315418 -0.0850037 -0.0716509 0.133811 0.174365 -0.0929706 0.0582054 0.0216496 0.0837638 -0.0223656 -0.0870742 0.0490318 0.0283325 0.115701 -0.00443396 0.0618692 0.0101528 0.0077849 -0.1401 -0.0584329 0.0940496 0.0688745 0.0990043 0.108733 -0.0619977 -0.0534166 -0.00631296 -0.0645527 0.0234189 -0.0519933 -0.0385786 0.0708367 0.123984 0.00261934 0.0438042 -0.0683117 -0.12546 -0.107076 0.0576645 0.117405 0.105061 -0.0596763 0.0689056 0.121678 0.0569789 0.00266539 -0.218031 0.0768296 -0.0582106 0.0881694 0.0393599 0.13351 0.164561 0.0698635 -0.0936367 -0.118626 -0.0360181 0.0856173 -0.0801709 -0.106233 -0.0283704 0.0701634 0.0846179 -0.124913 0.0230149 0.00263631 -0.134958 0.0966885 -0.0216655 0.00131554 
0.0511958 0.0797585 -0.0613999 -0.00245355 0.0808641 0.191207 0.0855462 -0.191301 -0.133762 0.0133346 -0.0380258 0.0286291 0.0695438 -0.00812746 0.0748333 -0.0946914 -0.101193 0.0620632 0.0348808 0.0530643 -0.00282023 0.0215768 -0.00406602 0.0969348 0.00252368 0.0294534 -0.179486 -0.169186 0.0502499 0.145592 0.00570111 0.10909 -0.143972 -0.0300998 0.12268 0.0819353 -0.0501831 -0.00029943 0.0234126 -0.0559731 0.0521627 -0.0389682 -0.0203456 0.0809412 -0.174155 0.126171 0.165463 0.0995676 -0.110546 -0.00897315 0.00643587 0.019411 0.0767171 -0.0321314 0.128621 0.0142813 -0.0144999 0.190845 0.032878 -0.0853467 -0.0721441 0.132918 0.178607 -0.090855 0.0532387 0.0222862 0.0826751 -0.0211569 -0.0835122 0.0486718 0.0267083 0.117603 -0.00230931 0.0651006 0.0127176 0.00769991 -0.13754 -0.0585697 0.0923712 0.0689047 0.103292 0.108558 -0.0634953 -0.0542368 -0.00795062 -0.0614609 0.0220882 -0.0494151 -0.035134 0.0715894 0.125651 0.00190496 0.0435803 -0.0695124 -0.125107 -0.106703 0.0548162 0.116469 0.11089 -0.0627547 0.0682129 0.118632 0.059304 9.36999e-05 -0.219131 0.0779645 -0.0628217 0.0890794 0.0356224 0.135888 0.167008 0.0735029 -0.0911581 -0.117509 -0.0385193 0.0851435 -0.0750203 -0.105256 -0.0276838 0.0688107 0.08648 -0.123081 0.0270046 0.00265247 -0.13954 0.0958783 -0.0206437 0.0036262 
0.0484699 0.0816553 -0.063793 -0.0068304 0.0725547 0.187047 0.0919069 -0.181853 -0.148356 0.0362137 -0.035627 0.0406312 0.076121 -0.0255736 0.0640643 -0.0938682 -0.104212 0.0746009 0.0430461 0.052043 0.00561028 0.0168993 -0.0177859 0.10826 -0.00529495 0.0436739 -0.169067 -0.182136 0.057916 0.163318 -0.0152444 0.10974 -0.142136 -0.0241382 0.124468 0.0609655 -0.0470706 -0.00634889 0.0316551 -0.0591945 0.049438 -0.0617014 -0.00785423 0.0970903 -0.176098 0.118513 0.17934 0.0936028 -0.125844 -0.014394 0.0323709 0.0120157 0.0648427 -0.0293499 0.1372 0.0242037 -0.0128278 0.184016 0.0332112 -0.0844127 -0.0555351 0.111227 0.179631 -0.0832338 0.0605727 -0.000295243 0.0728379 -0.036692 -0.0819114 0.0405025 0.010344 0.110382 -0.0127388 0.0588692 0.00655805 0.00366892 -0.129133 -0.0340574 0.0986427 0.0684193 0.0945141 0.104677 -0.0587053 -0.0446874 -0.0111999 -0.067781 0.0308917 -0.0526642 -0.0203195 0.0745549 0.109016 -0.00159808 0.032006 -0.0671747 -0.135891 -0.102816 0.0568981 0.116971 0.115808 -0.0659968 0.0723491 0.128214 0.0575138 0.0122202 -0.207378 0.0633601 -0.0641587 0.101827 0.0214382 0.13116 0.158584 0.0697405 -0.0956849 -0.123687 -0.0398442 0.0820951 -0.0653377 -0.118245 -0.0306207 0.0683815 0.0875813 -0.126633 0.0280652 -0.0047328 -0.141088 0.0962204 -0.0251482 -0.00124603 
0.0559994 0.0856726 -0.0570049 -0.00464744 0.0760787 0.185236 0.0957 -0.184993 -0.147601 0.028338 -0.0352176 0.0391499 0.0782564 -0.0189875 0.0676706 -0.0944339 -0.096909 0.0717774 0.0323264 0.0503162 0.00726603 0.0226168 -0.0216211 0.106396 -0.000371585 0.0382313 -0.174199 -0.174471 0.0564518 0.167082 -0.0168331 0.119605 -0.144458 -0.0188188 0.122364 0.0580124 -0.0441485 -0.00260026 0.0342792 -0.0607396 0.051962 -0.0583632 -0.00524697 0.0890893 -0.17184 0.126037 0.174646 0.0898516 -0.129594 -0.0182798 0.0367158 0.0186226 0.0668013 -0.0273567 0.137158 0.0201375 -0.0170905 0.183325 0.0328823 -0.0853541 -0.0554715 0.112084 0.170253 -0.0831402 0.0556862 0.00528207 0.0749221 -0.028847 -0.0853319 0.0393178 0.0168166 0.105928 -0.0106809 0.0545103 0.0073938 0.010303 -0.129393 -0.0439862 0.0963105 0.0741138 0.0987045 0.107631 -0.0552391 -0.0484993 -0.00764108 -0.0681885 0.0321859 -0.056178 -0.0288201 0.0798624 0.108543 -0.00905475 0.0309805 -0.0620253 -0.143894 -0.100494 0.0592131 0.11012 0.11755 -0.067317 0.0734217 0.131819 0.0585712 0.0231914 -0.214279 0.0621387 -0.0682285 0.108533 0.0240319 0.124281 0.162274 0.0687186 -0.106728 -0.117882 -0.0377418 0.080016 -0.0778901 -0.11622 -0.0318053 0.0686935 0.0874782 -0.119638 0.0270674 -0.00221247 -0.127555 0.0933755 -0.0204627 -0.00839934 
0.0525626 0.0791365 -0.0580724 0.000515615 0.079203 0.183773 0.0951134 -0.180899 -0.149226 0.023465 -0.0389457 0.0419671 0.0778914 -0.0237708 0.063261 -0.0929957 -0.102371 0.068925 0.031769 0.0627781 0.0114046 0.00673043 -0.00922733 0.11034 0.00114256 0.0362988 -0.174688 -0.18279 0.0533181 0.159109 -0.0129018 0.11524 -0.1438 -0.0159826 0.118772 0.0599009 -0.046377 0.00575403 0.0259647 -0.0673581 0.0529603 -0.0603685 -0.00321105 0.0911733 -0.177171 0.119433 0.180325 0.0900845 -0.126556 -0.00797651 0.0287762 0.00735957 0.0648246 -0.0271796 0.144506 0.0177415 -0.0160578 0.185958 0.035107 -0.0919968 -0.0565378 0.11366 0.1758 -0.0870634 0.0615811 0.00750578 0.0700652 -0.0326083 -0.0874222 0.0396099 0.00977532 0.113029 -0.0112218 0.0614953 0.00973761 0.0066634 -0.123657 -0.0381219 0.100485 0.0756468 0.0896142 0.10045 -0.0592269 -0.0512346 -0.0114475 -0.0680528 0.0304255 -0.045174 -0.0219853 0.0751646 0.114192 -0.00727755 0.0332605 -0.0679855 -0.139199 -0.101328 0.0568808 0.118872 0.116205 -0.0678851 0.0682233 0.123847 0.0571149 0.0228522 -0.209838 0.0650044 -0.0692362 0.112394 0.0282824 0.120548 0.155237 0.07989 -0.10168 -0.117329 -0.0341651 0.0820481 -0.0717024 -0.115136 -0.0292042 0.0766709 0.0821902 -0.114285 0.0249408 0.00115567 -0.137195 0.094041 -0.0218569 -0.00760573 
0.0580018 0.0828093 -0.0592287 -0.00379558 0.081308 0.1874 0.0967127 -0.187548 -0.143787 0.0213154 -0.0389397 0.0423848 0.0753828 -0.0209243 0.0699739 -0.0912887 -0.0914664 0.06988 0.0294206 0.0530498 0.00418987 0.0280162 -0.0179615 0.113812 -0.00331691 0.0339581 -0.172894 -0.175321 0.0507855 0.165881 -0.0141459 0.120129 -0.141701 -0.0120636 0.123442 0.0604522 -0.034791 -0.00530885 0.0309003 -0.0605799 0.055347 -0.0554705 0.00116733 0.0845114 -0.172632 0.127981 0.176351 0.0926538 -0.125962 -0.0100855 0.0348071 0.00829916 0.0703453 -0.0262018 0.140491 0.02 -0.0170844 0.184428 0.034188 -0.0834261 -0.0592896 0.116882 0.167414 -0.0928094 0.0559689 0.00545784 0.0729824 -0.0292381 -0.0897106 0.0378536 0.0149298 0.104037 -0.0136575 0.0556472 0.00975078 0.0146016 -0.126037 -0.041711 0.0958873 0.0688838 0.101934 0.111478 -0.0571917 -0.0494428 -0.00761573 -0.0638415 0.029736 -0.0579208 -0.0366992 0.0848534 0.112548 -0.0125023 0.031261 -0.0635864 -0.13948 -0.0935093 0.0569852 0.110209 0.116171 -0.0667893 0.0731239 0.126681 0.0567658 0.0258269 -0.214524 0.0589505 -0.0712262 0.103362 0.015046 0.128791 0.162686 0.0702193 -0.0982233 -0.115943 -0.042717 0.0802559 -0.0783504 -0.115803 -0.0372654 0.0720491 0.0906132 -0.115682 0.02897 0.00157382 -0.13199 0.0919371 -0.0257148 -0.0141457 
0.0537257 0.080857 -0.0583219 -0.00665295 0.086418 0.187699 0.0911743 -0.185026 -0.14885 0.020069 -0.0389136 0.042795 0.0752727 -0.0153804 0.0655492 -0.0907824 -0.102549 0.0669419 0.0335163 0.0584791 0.0120767 0.0163136 -0.0118625 0.107577 0.0042856 0.0364835 -0.173936 -0.171638 0.055509 0.160156 -0.0122361 0.105709 -0.145702 -0.0193335 0.118643 0.066083 -0.0469177 -0.00383296 0.0338164 -0.0623807 0.0523329 -0.049516 0.00227194 0.0866457 -0.174297 0.118914 0.178983 0.0913853 -0.120769 -0.00716018 0.0242469 0.00914959 0.0617783 -0.0245919 0.144161 0.0184246 -0.0186545 0.194738 0.0277101 -0.0873432 -0.0576955 0.11994 0.180801 -0.0868855 0.0569056 0.0124439 0.0681926 -0.0252977 -0.0849921 0.041765 0.0187576 0.119232 -0.0095157 0.060192 0.0131898 0.0125957 -0.124278 -0.0442224 0.100198 0.0688444 0.0983041 0.108761 -0.0519763 -0.044822 -0.0131666 -0.0659595 0.0297603 -0.0423984 -0.0237779 0.076807 0.117323 -0.00925103 0.0343931 -0.0613178 -0.134628 -0.10417 0.0535104 0.118689 0.113716 -0.0658279 0.0655858 0.122015 0.0564812 0.0171508 -0.216291 0.0740095 -0.0705831 0.104198 0.0246574 0.122225 0.162952 0.0734814 -0.0976514 -0.1084 -0.0356562 0.0848897 -0.0715452 -0.106165 -0.0352946 0.0745225 0.0844275 -0.116701 0.0277596 -0.00341434 -0.14447 0.0994432 -0.0231099 -0.00491092 
0.043136 0.0851716 -0.0576314 -0.00447719 0.0758647 0.196142 0.0624956 -0.196274 -0.138615 0.0354722 -0.0307254 0.0224723 0.0714629 -0.0161984 0.0800648 -0.0735258 -0.089309 0.0834167 0.0449807 0.0542734 0.00101191 0.0302505 0.005077 0.101034 -0.00835109 0.0405323 -0.178429 -0.18415 0.0618383 0.145063 0.00606886 0.115789 -0.129134 -0.0356816 0.135522 0.0912159 -0.048263 0.00269226 0.0283752 -0.0499355 0.0331114 -0.0414078 -0.033288 0.0736145 -0.168019 0.134572 0.177185 0.105681 -0.126448 -0.020006 0.0192914 0.0261643 0.0797286 -0.0379508 0.113682 0.0188465 0.009365 0.168459 0.0340431 -0.0798313 -0.0717055 0.131969 0.173754 -0.0960667 0.0684881 0.00518866 0.0784066 -0.0175485 -0.0860204 0.0585711 0.0261019 0.110228 -0.0160738 0.050616 0.00959772 0.00228796 -0.147934 -0.0375174 0.0928488 0.0614407 0.104944 0.119655 -0.0721883 -0.0497606 -0.00901114 -0.0538986 0.0136334 -0.0540585 -0.0420323 0.0765256 0.11213 0.0183926 0.0405564 -0.0549978 -0.120534 -0.101956 0.0550021 0.130982 0.1031 -0.0634656 0.0837014 0.11714 0.0469691 -0.00851609 -0.20102 0.0747775 -0.0507811 0.0680664 0.0486925 0.142465 0.146724 0.0693929 -0.0761758 -0.131221 -0.0351261 0.0854267 -0.0893054 -0.117409 -0.0379954 0.0677082 0.0874568 -0.132833 0.0327584 -0.00450031 -0.138868 0.108779 -0.0178328 0.00592599 
0.03135 0.100894 -0.10048 0.00166447 0.0791559 0.154984 0.0511673 -0.229795 -0.130852 0.0493755 -0.026053 0.0230701 0.074532 0.0269474 0.0498832 -0.0619219 -0.0652185 0.079855 0.0674913 0.0741071 -0.022397 0.0137502 -0.00598006 0.0556663 -0.0154498 0.0600464 -0.187792 -0.160203 0.0666753 0.172039 -0.0128655 0.142424 -0.107807 -0.0753636 0.130616 0.10595 -0.0449257 0.0124819 0.0388142 -0.0555348 0.00580988 -0.0152311 -0.0248253 0.0620994 -0.154947 0.16889 0.184534 0.10136 -0.110536 -0.0403912 0.00040782 0.0569643 0.0764983 -0.0400987 0.110952 0.0140437 0.00640251 0.156196 0.0351603 -0.0605328 -0.0623975 0.126915 0.183609 -0.0849453 0.0604031 0.00583558 0.0713125 -0.00139359 -0.0659331 0.0419175 0.0518946 0.102511 -0.00390017 0.046126 0.00633166 0.0218774 -0.1386 -0.0402691 0.0740244 0.0287841 0.107597 0.136131 -0.0954557 -0.0363165 -0.00178487 -0.0441786 -0.0125469 -0.0566136 -0.0259182 0.058187 0.0912166 0.0301969 0.0508225 -0.0530018 -0.09397 -0.117634 0.0658502 0.132349 0.111852 -0.0689817 0.0721239 0.117555 0.0621321 -0.0249224 -0.223161 0.0967493 -0.0388793 0.0675427 0.0588827 0.162021 0.143609 0.0391797 -0.0737111 -0.123511 -0.0553186 0.072045 -0.0860809 -0.120024 -0.0410197 0.044542 0.0625142 -0.121248 0.0417944 -0.00514213 -0.14799 0.112259 -0.0195209 0.00976262 
0.0235507 0.118026 -0.0951197 0.0132296 0.0914099 0.151336 0.0465103 -0.248045 -0.136044 0.042211 -0.0384388 0.0187624 0.0648699 0.0406246 0.0489298 -0.0457767 -0.0510653 0.0875301 0.0624388 0.0621668 -0.0204999 0.00383318 0.00375584 0.0490188 0.00658741 0.0402334 -0.205778 -0.137184 0.0734358 0.175596 -0.00425816 0.16834 -0.104188 -0.0718821 0.120335 0.105533 -0.0465729 -0.00418826 0.045485 -0.0652697 0.011052 -0.0151456 0.00830816 0.037567 -0.142766 0.171166 0.185377 0.103371 -0.112153 -0.0424014 0.0048198 0.0666666 0.0869987 -0.0475892 0.107622 0.0148979 0.0171393 0.151342 0.0415543 -0.0562317 -0.0682882 0.15229 0.164652 -0.0929227 0.0576099 0.0355401 0.0531477 -0.00438872 -0.0878988 0.0581149 0.0470271 0.106257 -0.00941827 0.0565782 0.0129837 0.0312981 -0.121024 -0.0563261 0.0626119 0.0109429 0.108498 0.141897 -0.0897761 -0.029087 -0.0022769 -0.0335363 -0.0297035 -0.0562641 -0.0378587 0.0679233 0.0928008 0.0350258 0.0482019 -0.0514725 -0.0770964 -0.098844 0.0559955 0.153095 0.102823 -0.0660512 0.0776583 0.109129 0.0661436 -0.010609 -0.215559 0.104908 -0.0396411 0.0718068 0.070403 0.154318 0.133554 0.0373821 -0.0691758 -0.116002 -0.0544303 0.0619868 -0.0770604 -0.100289 -0.0253652 0.0590697 0.0698805 -0.115465 0.0402125 -0.0166826 -0.158554 0.11822 -0.0156067 0.00448179 
0.026685 0.11891 -0.0798342 0.0129997 0.0947862 0.163079 0.045154 -0.239866 -0.140413 0.0344804 -0.0419989 0.0150738 0.0615829 0.0354729 0.0573573 -0.0501927 -0.0472229 0.0950852 0.0577788 0.0599074 -0.0170582 0.0109512 0.0103016 0.0528305 0.00673661 0.0307313 -0.211142 -0.134013 0.0744767 0.162329 0.00369193 0.16429 -0.106618 -0.0652732 0.125507 0.104771 -0.044781 -0.00582848 0.0431908 -0.0661853 0.0184565 -0.0114483 0.00885827 0.0309445 -0.14939 0.163724 0.184895 0.102823 -0.118087 -0.0335592 0.00488803 0.064785 0.0873329 -0.0442614 0.10093 0.0122392 0.0239354 0.14822 0.040581 -0.0634113 -0.0726589 0.162481 0.159859 -0.100786 0.0583053 0.0384087 0.0567726 -0.0097067 -0.0981287 0.0698207 0.0474699 0.104877 -0.00878936 0.0613163 0.0118285 0.0284614 -0.124466 -0.0598065 0.0680129 0.00836275 0.103982 0.146815 -0.0837701 -0.0285302 0.00469856 -0.034423 -0.0301836 -0.0523937 -0.0435008 0.0741579 0.102033 0.0350869 0.0492613 -0.0523618 -0.0742772 -0.101461 0.0565534 0.163943 0.0902764 -0.0639387 0.0764309 0.111477 0.0634039 -0.00600291 -0.210053 0.106038 -0.0348624 0.0678676 0.0742829 0.151511 0.130281 0.0391192 -0.0665241 -0.112906 -0.0513895 0.057795 -0.0764737 -0.103264 -0.0231927 0.0639701 0.0743311 -0.118361 0.0389821 -0.0195359 -0.153879 0.114139 -0.00824778 0.00499251 
0.0245195 0.118237 -0.087441 0.0104104 0.0949611 0.161062 0.0516348 -0.238634 -0.138839 0.0379821 -0.0410176 0.0216797 0.0629834 0.0273584 0.0508219 -0.045543 -0.0578326 0.0895321 0.0557087 0.0583038 -0.0110855 0.00611873 0.00925457 0.0593947 0.00798906 0.0375869 -0.204154 -0.14475 0.0783999 0.169174 0.00202089 0.162581 -0.111097 -0.062282 0.119686 0.0993032 -0.0479812 -0.000282753 0.0443997 -0.0615493 0.0184151 -0.0163302 0.00945007 0.043376 -0.148738 0.159349 0.189079 0.0998314 -0.11796 -0.0375164 0.00707788 0.0582931 0.0814807 -0.0462292 0.109526 0.0175504 0.0211475 0.162428 0.0390773 -0.0632699 -0.0715309 0.151139 0.170642 -0.0990394 0.0627505 0.0319832 0.0523072 -0.00913361 -0.092286 0.0676092 0.0415961 0.113766 -0.0120611 0.0641335 0.0131547 0.0258087 -0.123004 -0.0504657 0.0646367 0.0117735 0.103198 0.14396 -0.0828312 -0.0306759 -0.00607015 -0.0386821 -0.0218625 -0.0512011 -0.0397825 0.0679507 0.100095 0.0301877 0.0427712 -0.0564537 -0.0733278 -0.0969892 0.0552834 0.158984 0.0991636 -0.0620574 0.0723018 0.105068 0.0611599 0.00143236 -0.213236 0.100906 -0.0442833 0.0735701 0.0707332 0.144878 0.133352 0.0483763 -0.0709191 -0.113263 -0.0460899 0.0643483 -0.076086 -0.104473 -0.0230159 0.0665722 0.0754494 -0.111694 0.0379145 -0.0159034 -0.162605 0.116419 -0.0183562 0.00309282 
0.0127542 0.126727 -0.108731 0.00559709 0.0833277 0.155469 0.0622767 -0.230026 -0.131499 0.0557562 -0.0397906 0.0187025 0.0733357 0.0371729 0.0441182 -0.0557535 -0.0473009 0.0803936 0.0569299 0.0639227 -0.03294 -0.00572651 -0.0125767 0.0382757 -0.0114718 0.0439552 -0.215133 -0.131167 0.0833723 0.166543 0.000318029 0.180787 -0.108027 -0.0741135 0.112313 0.10744 -0.0445238 0.00597202 0.0321785 -0.0610454 0.0227911 -0.015399 0.000468451 0.0404541 -0.143103 0.164246 0.181867 0.106064 -0.115958 -0.0517131 -0.0119108 0.064921 0.0739075 -0.0536095 0.0976789 0.0236965 -0.00226661 0.157723 0.0379409 -0.0581434 -0.0783866 0.15181 0.173976 -0.102298 0.0612947 0.0450931 0.0624319 -0.0137234 -0.0926809 0.0458714 0.0461251 0.100305 -0.00248813 0.0719455 0.012278 0.0320088 -0.116517 -0.0508032 0.0648243 -0.0107586 0.0948722 0.137907 -0.0973419 -0.0288879 0.000630027 -0.0353251 -0.0229729 -0.0565314 -0.0240423 0.0614868 0.0959899 0.02814 0.0533174 -0.0598827 -0.062488 -0.101735 0.0687264 0.143509 0.0938644 -0.0544349 0.06623 0.108939 0.0629542 -0.00642355 -0.227823 0.115068 -0.0398958 0.0713157 0.0649968 0.154788 0.129901 0.037717 -0.0733724 -0.11556 -0.0557453 0.0487231 -0.0699919 -0.110159 -0.0110995 0.0549719 0.0663055 -0.123604 0.0426359 -0.00555171 -0.157143 0.111115 -0.0283867 -0.00219195 
0.00999961 0.120067 -0.118502 0.00196924 0.0750166 0.156526 0.0670774 -0.220973 -0.133691 0.0625205 -0.0404601 0.0216989 0.0834595 0.0473291 0.0414505 -0.0610457 -0.0468076 0.0739089 0.0666331 0.0621894 -0.0319689 -0.016343 -0.014318 0.0367974 -0.0157117 0.0465584 -0.213015 -0.13662 0.0819416 0.171227 -0.00279058 0.181807 -0.105394 -0.0792063 0.103739 0.10606 -0.050264 0.0122418 0.0258602 -0.0594974 0.0166426 -0.0174381 -0.00894636 0.0417763 -0.14298 0.159226 0.177617 0.100066 -0.116256 -0.0595121 -0.0142869 0.0615592 0.0784204 -0.0537812 0.0958377 0.0301874 -0.00347885 0.164008 0.0391502 -0.0594539 -0.0768 0.150324 0.176423 -0.106269 0.0643437 0.0507353 0.067028 -0.0126996 -0.0930397 0.0331718 0.0435443 0.0991445 -0.00599331 0.0663413 0.011633 0.0386737 -0.11219 -0.0582283 0.0678751 -0.00631116 0.0853264 0.123968 -0.100435 -0.0300452 -0.0012724 -0.0386875 -0.0183783 -0.0623417 -0.0150308 0.0526024 0.0879842 0.0259975 0.0593478 -0.0568069 -0.0622931 -0.102833 0.0730956 0.140007 0.0973821 -0.0477677 0.069122 0.108137 0.0607602 -0.00759437 -0.234657 0.116949 -0.0418682 0.0670455 0.0562049 0.149518 0.126623 0.035668 -0.0729263 -0.124721 -0.0567284 0.0543162 -0.0699746 -0.109343 -0.00788705 0.0556597 0.0586654 -0.13538 0.0393082 -0.00736164 -0.155866 0.116786 -0.0366809 -0.000380064 
0.0103671 0.123032 -0.117073 0.00134259 0.076667 0.158241 0.0711163 -0.21896 -0.125772 0.0624371 -0.0371904 0.0162642 0.0833669 0.0456079 0.0403439 -0.0609695 -0.0469835 0.0702791 0.0534098 0.058098 -0.0325781 -0.0128722 -0.0221976 0.0339039 -0.0133245 0.0458753 -0.218504 -0.130943 0.089008 0.167099 0.006117 0.187357 -0.117568 -0.0825322 0.098967 0.10921 -0.0581536 0.0135394 0.0249846 -0.0542647 0.02223 -0.0118141 -0.0211682 0.0429512 -0.133062 0.156971 0.168411 0.104564 -0.111919 -0.0718895 -0.016452 0.0712549 0.0745057 -0.0647021 0.0872494 0.0294044 -0.0141143 0.171444 0.0415454 -0.0591073 -0.0798092 0.149294 0.177157 -0.0999728 0.0579548 0.0523835 0.0742608 -0.00681037 -0.0895779 0.03518 0.048669 0.103456 0.00161851 0.0703563 0.00682581 0.0350051 -0.116594 -0.0581286 0.061935 -0.00527938 0.0901795 0.127298 -0.100176 -0.0351809 7.37109e-05 -0.0428068 -0.0121043 -0.061144 -0.0186051 0.0446387 0.0899936 0.0273882 0.05957 -0.0558703 -0.0609869 -0.102275 0.0775136 0.125256 0.0956971 -0.0451029 0.0666542 0.107551 0.0581111 -0.00556875 -0.240636 0.118219 -0.0440281 0.0669366 0.0658126 0.148964 0.132036 0.0395942 -0.0826843 -0.11864 -0.0529049 0.0522818 -0.0796923 -0.105912 -0.00715974 0.0510537 0.0556325 -0.129325 0.0373967 -0.00392416 -0.152949 0.114325 -0.0433613 -0.00482216 
0.00465273 0.124937 -0.115119 0.00415527 0.0814035 0.152612 0.0626485 -0.225976 -0.122713 0.0604354 -0.0336086 0.0173874 0.0749699 0.0519118 0.0407829 -0.0538127 -0.0454988 0.074749 0.0567637 0.0607754 -0.0342666 -0.00818422 -0.0190254 0.0368541 -0.00945542 0.0419475 -0.215792 -0.121971 0.0927181 0.169691 0.00419803 0.179358 -0.107884 -0.0893171 0.0980782 0.116421 -0.0607889 0.00567192 0.0214685 -0.04963 0.0170007 -0.00301906 -0.0167545 0.0382199 -0.130793 0.163185 0.17191 0.101801 -0.108646 -0.071278 -0.0192671 0.0739769 0.0747122 -0.0669694 0.0882123 0.0327198 -0.0144715 0.170593 0.0375478 -0.0490801 -0.083231 0.153564 0.177711 -0.0981367 0.0573008 0.0528849 0.0684606 -0.00827865 -0.092685 0.0399545 0.0571242 0.106254 0.00310099 0.0689067 0.0130299 0.0409783 -0.115803 -0.0564787 0.056615 -0.0163789 0.0958105 0.135577 -0.102402 -0.0306424 -0.00081338 -0.0329294 -0.0210251 -0.0605156 -0.0248331 0.0478563 0.0885043 0.0302248 0.0564422 -0.0519895 -0.0503478 -0.100073 0.068831 0.126344 0.0972243 -0.0451908 0.0637655 0.10128 0.060642 -0.0170249 -0.242744 0.128156 -0.0395119 0.0563789 0.0688358 0.14944 0.133503 0.0342963 -0.0722002 -0.118191 -0.0560922 0.0537358 -0.0763051 -0.0997069 -0.0096034 0.0524242 0.0548949 -0.128911 0.0349816 -0.00783075 -0.160176 0.126392 -0.039916 -0.00311405 
0.00715954 0.122307 -0.125322 0.00255543 0.078315 0.150769 0.0625554 -0.219322 -0.129432 0.0675203 -0.0323586 0.0177059 0.083017 0.0502156 0.0341759 -0.0510689 -0.0407254 0.0767937 0.0616151 0.0644253 -0.0304049 -0.0139088 -0.0200961 0.0366658 -0.0129274 0.0506424 -0.210559 -0.129948 0.0951487 0.172416 -0.00107163 0.184472 -0.109315 -0.0908613 0.0957288 0.111377 -0.0586268 0.0099305 0.0225567 -0.0527955 0.0135956 -0.00536583 -0.0151945 0.0484219 -0.131899 0.157713 0.178166 0.101207 -0.110589 -0.0738566 -0.0135241 0.0691788 0.0708922 -0.0653276 0.0889269 0.0328935 -0.0105059 0.169053 0.0473425 -0.0575099 -0.0782689 0.145415 0.180817 -0.0955796 0.0560945 0.047583 0.0691486 -0.00931896 -0.0821511 0.0333561 0.0490755 0.10473 0.00318228 0.0651396 0.00813479 0.0347113 -0.115181 -0.0461897 0.0565202 -0.0156982 0.0939823 0.135101 -0.105171 -0.0341297 0.000838067 -0.0336501 -0.0190471 -0.0602079 -0.0158772 0.0417395 0.0850318 0.0324938 0.0501437 -0.0570905 -0.0507596 -0.100282 0.0730434 0.131931 0.0960092 -0.0472692 0.0636091 0.103464 0.0662779 -0.0110083 -0.245013 0.122832 -0.043559 0.0610175 0.0668261 0.147417 0.130268 0.0365568 -0.0751519 -0.121682 -0.0563217 0.0508465 -0.0749651 -0.111047 -0.0105582 0.0451586 0.0516079 -0.1275 0.0399423 -0.00794367 -0.162839 0.119785 -0.0448181 -0.00218598 
-0.000805043 0.1221 -0.119537 0.00929279 0.0725193 0.15151 0.0653343 -0.218828 -0.122251 0.0650368 -0.0376179 0.0128865 0.0796354 0.051979 0.0342667 -0.0577473 -0.0468196 0.0738236 0.060418 0.0586876 -0.0328336 -0.0234404 -0.0194665 0.0301388 -0.00958372 0.0442947 -0.223167 -0.128825 0.0924222 0.165153 0.00868479 0.188705 -0.111907 -0.0930279 0.0955975 0.113681 -0.0628344 0.01358 0.0180854 -0.0558994 0.0191731 -0.00514321 -0.0200408 0.0414295 -0.129674 0.150995 0.170027 0.100217 -0.10465 -0.0763762 -0.0226785 0.0724438 0.0786624 -0.0676389 0.0877712 0.0332758 -0.00923841 0.165509 0.0486997 -0.0623864 -0.0798957 0.152715 0.176055 -0.0972965 0.0563762 0.0591536 0.0748696 -0.0127551 -0.0846626 0.0367959 0.0493591 0.107326 0.00719024 0.0742202 0.00768889 0.0328289 -0.116862 -0.0567896 0.0568765 -0.0166968 0.0861495 0.133228 -0.105039 -0.0350902 0.00284633 -0.0366008 -0.0193576 -0.0572615 -0.0135001 0.0360858 0.0878789 0.0359268 0.0606827 -0.0627684 -0.0498236 -0.102498 0.0731471 0.131224 0.093583 -0.0420316 0.06446 0.101416 0.066104 -0.0157208 -0.241053 0.124751 -0.0380985 0.0582385 0.0714222 0.151543 0.127432 0.0377173 -0.0769742 -0.126159 -0.0541821 0.0495956 -0.0696349 -0.107199 -0.00252171 0.0442302 0.0517066 -0.127267 0.0369241 -0.0100099 -0.162548 0.12045 -0.0416436 0.00241402 
0.00545981 0.12433 -0.124343 0.00454254 0.0763023 0.154461 0.0706817 -0.216635 -0.118495 0.0632342 -0.033953 0.0130653 0.081433 0.0481152 0.0335358 -0.060804 -0.0494297 0.0704539 0.0536479 0.0605516 -0.0305733 -0.020894 -0.023139 0.0330192 -0.00952765 0.0389978 -0.220215 -0.126544 0.0940336 0.167933 0.00871512 0.181862 -0.116478 -0.0903976 0.0947108 0.112736 -0.0649629 0.0100662 0.0186725 -0.0555056 0.020098 -0.0077707 -0.0226899 0.0478288 -0.131115 0.151831 0.16597 0.105914 -0.104003 -0.0732888 -0.0250282 0.075515 0.0727761 -0.069338 0.0867979 0.0315468 -0.0191013 0.172446 0.042293 -0.0596949 -0.0824805 0.149412 0.183207 -0.0967958 0.0527404 0.0541965 0.074195 -0.011005 -0.0870245 0.0339319 0.0516169 0.108257 0.00557526 0.0722898 0.00638974 0.0333376 -0.113626 -0.0555799 0.0577786 -0.0102308 0.0896563 0.127232 -0.103377 -0.0346035 0.00159735 -0.0357461 -0.0171988 -0.0582756 -0.0119542 0.0389218 0.0914162 0.0283934 0.0564372 -0.0605381 -0.05227 -0.106325 0.0719545 0.123597 0.0936757 -0.0436345 0.0660553 0.10369 0.0637886 -0.0144603 -0.244424 0.126904 -0.0406047 0.0636864 0.0713081 0.151124 0.133424 0.0378831 -0.0813142 -0.118954 -0.0542128 0.0533004 -0.0702339 -0.101709 -0.00148802 0.0492457 0.0504348 -0.128761 0.035253 -0.00356862 -0.161758 0.117889 -0.0435493 -0.000506443 
0.0102459 0.108253 -0.131054 0.00281162 0.0740291 0.151765 0.062311 -0.20857 -0.136566 0.0709814 -0.037344 0.0204788 0.0972552 0.0483458 0.0370057 -0.0553984 -0.0466758 0.0689597 0.0682933 0.0754539 -0.0223013 -0.0319707 -0.00990444 0.0327074 -0.0133549 0.0576795 -0.212686 -0.153204 0.0791969 0.169903 -0.00260301 0.184974 -0.106808 -0.0854044 0.0943334 0.107849 -0.0544883 0.0295412 0.0244439 -0.0613968 0.0131218 -0.0129114 -0.0180788 0.0496369 -0.144005 0.147493 0.184079 0.0958224 -0.1077 -0.0692725 -0.013662 0.0518968 0.0738322 -0.051046 0.0981517 0.0259744 9.70541e-05 0.161875 0.0505213 -0.0762576 -0.0726253 0.135372 0.177266 -0.0999949 0.0616971 0.0490522 0.0728277 0.000722255 -0.0695877 0.0153921 0.0434948 0.111395 -0.00128325 0.0565759 0.0114772 0.0363155 -0.121137 -0.0481489 0.0692983 0.00775313 0.0812911 0.122194 -0.10081 -0.0347086 -0.00242198 -0.0348886 -0.0091197 -0.0508787 -0.000926547 0.0281756 0.0786735 0.0300396 0.0588472 -0.0600887 -0.0728211 -0.112113 0.0771513 0.141971 0.094379 -0.0530016 0.0653569 0.100192 0.0681598 -0.00476996 -0.240781 0.116297 -0.0511277 0.0728152 0.0600189 0.146433 0.118698 0.041288 -0.0830426 -0.129142 -0.0542646 0.0581898 -0.0825576 -0.118596 -0.0185694 0.0457974 0.0483521 -0.126142 0.0436048 -0.00392172 -0.160257 0.11332 -0.0485998 0.0080395 
0.014911 0.107288 -0.114439 0.0202249 0.0856178 0.146162 0.0659 -0.22539 -0.126498 0.0603387 -0.0388275 0.0168704 0.0695711 0.0484565 0.0476199 -0.0619258 -0.0401191 0.0819797 0.0757847 0.0685479 -0.0341416 -0.0221952 -0.0099059 0.0339902 -0.00168339 0.0389927 -0.223611 -0.13795 0.0751988 0.166099 0.00532686 0.176938 -0.103723 -0.0889172 0.111068 0.113823 -0.0562785 0.00328449 0.023466 -0.0741992 0.0167756 -0.0059072 -0.0137766 0.0396513 -0.144157 0.163494 0.168475 0.101299 -0.0973486 -0.059717 -0.0208956 0.066845 0.0866809 -0.0620522 0.100082 0.0229098 -0.00326271 0.154639 0.0424573 -0.0519775 -0.0733682 0.148468 0.169377 -0.10126 0.0635964 0.0479595 0.0654728 -0.0126836 -0.0861048 0.0402323 0.0526396 0.110745 -0.000410787 0.0641769 -0.00075335 0.0344719 -0.112518 -0.054896 0.0647018 -0.00620932 0.082402 0.131126 -0.106505 -0.0337132 0.00976224 -0.0417594 -0.0261985 -0.0540657 -0.0143806 0.0476384 0.0934107 0.0446843 0.0582288 -0.0629964 -0.057588 -0.108749 0.0716133 0.134519 0.0952384 -0.0546184 0.0707784 0.105896 0.0717683 -0.0334703 -0.232371 0.119807 -0.0274956 0.0550884 0.076803 0.165763 0.1282 0.0320637 -0.0692127 -0.132313 -0.0510077 0.0515569 -0.0627577 -0.110383 -0.0119341 0.0499921 0.0530137 -0.124273 0.0367924 -0.00346983 -0.156436 0.118273 -0.0211905 0.00473296 
0.0141095 0.105594 -0.133285 0.00191752 0.0809508 0.146837 0.0654628 -0.221866 -0.137967 0.0671387 -0.0404123 0.0271882 0.0879635 0.0447424 0.0304237 -0.0510379 -0.0589803 0.0759196 0.0669966 0.073493 -0.0256412 -0.025365 -0.00938077 0.0215031 -0.016717 0.0605143 -0.210976 -0.1535 0.0694563 0.176334 -0.0163544 0.184334 -0.107983 -0.0868345 0.102823 0.103517 -0.0574885 0.0164126 0.0326679 -0.0630089 0.0113965 -0.0169044 -0.00728565 0.0535276 -0.146132 0.161963 0.183924 0.0962306 -0.1115 -0.0596661 -0.011364 0.0493683 0.0705759 -0.0474504 0.102823 0.0217255 0.00421127 0.159469 0.0439039 -0.0590216 -0.0619634 0.13634 0.181945 -0.0910711 0.0648168 0.0357603 0.0565028 0.00491007 -0.0660551 0.0237425 0.0478156 0.112273 0.000553908 0.0560195 0.00146802 0.0394627 -0.118796 -0.0524674 0.0624098 -0.00208524 0.0894055 0.124794 -0.10657 -0.0289575 -0.0140144 -0.03091 -0.0122865 -0.0537724 -0.0051931 0.0376831 0.0806413 0.0303789 0.0495658 -0.0639766 -0.0743441 -0.102641 0.0722894 0.141377 0.103831 -0.053404 0.0677186 0.10057 0.0687939 -0.0134301 -0.232094 0.108537 -0.0516688 0.0831528 0.0501917 0.154702 0.123013 0.0350341 -0.0776303 -0.131143 -0.056454 0.0588596 -0.0745985 -0.109813 -0.0181644 0.0446174 0.0534653 -0.12297 0.0500526 -0.00512209 -0.160966 0.110561 -0.0431085 0.00577673 
0.0196555 0.1081 -0.110074 0.00745587 0.0831021 0.16777 0.0717252 -0.220191 -0.14419 0.0438196 -0.0517564 0.0356672 0.0784191 0.0221673 0.0248535 -0.0620506 -0.0708707 0.0782612 0.0458522 0.0727443 -0.0164295 -0.0300159 0.00346522 0.0461274 -0.0125924 0.0467785 -0.209941 -0.156209 0.0603555 0.157707 -0.0080266 0.184909 -0.125795 -0.0555272 0.0993885 0.0910314 -0.0517311 0.0204156 0.0299919 -0.065815 0.0351444 -0.034779 0.00516195 0.0456161 -0.155378 0.14005 0.188903 0.098705 -0.123958 -0.0316317 -0.00365893 0.039874 0.0709019 -0.037015 0.115172 0.0166328 0.0125732 0.167707 0.0445019 -0.0796347 -0.0649506 0.15464 0.183147 -0.107584 0.065729 0.0430435 0.0583869 -0.0104009 -0.0897141 0.0496323 0.0280859 0.112366 -0.00154204 0.0849978 0.00892275 0.0267546 -0.11051 -0.053553 0.0710516 0.00385765 0.076937 0.126636 -0.0900935 -0.0369459 -0.0189683 -0.0388758 -0.00508658 -0.0438214 -0.0122468 0.0510664 0.101248 0.0152714 0.0577896 -0.0709461 -0.0794748 -0.0987321 0.0707915 0.154698 0.100462 -0.0548851 0.0682456 0.101872 0.05557 0.0223515 -0.209502 0.0982611 -0.0590829 0.0974875 0.0395002 0.140267 0.120431 0.0630914 -0.0756136 -0.115306 -0.0512232 0.0528325 -0.0720161 -0.11177 -0.00417744 0.0630605 0.0673681 -0.116139 0.0452273 -0.0103765 -0.162698 0.104012 -0.0416069 -0.0037889 
-0.0107516 0.132154 -0.124576 0.000111154 0.0605366 0.156364 0.059867 -0.222619 -0.128477 0.0694702 -0.0317833 0.0197864 0.073416 0.0420612 0.0389292 -0.0625568 -0.0702847 0.0593295 0.0805967 0.0436588 -0.0416221 -0.0227937 -0.0231915 0.011217 -0.00449794 0.0620494 -0.199779 -0.138375 0.0861034 0.164641 0.00579655 0.177042 -0.101626 -0.101166 0.0987904 0.10886 -0.0601161 0.0036669 0.0371334 -0.041215 0.0246976 -0.0305166 -0.0150305 0.0534698 -0.141058 0.160463 0.179744 0.0827131 -0.122091 -0.0868476 -0.0202514 0.0738278 0.078856 -0.0608675 0.0835244 0.0453309 -0.00941373 0.171013 0.0301991 -0.0487606 -0.0825193 0.137606 0.192058 -0.0969385 0.0738297 0.0625589 0.0697733 -0.016179 -0.0815332 0.0350706 0.0429146 0.104662 -0.00388365 0.0667459 0.0298185 0.0358199 -0.1249 -0.0607842 0.0485655 -0.00191085 0.0737063 0.117758 -0.0955855 -0.0214864 -0.0158811 -0.0324728 -0.0106937 -0.0667856 -0.0176804 0.0354032 0.0768312 0.025426 0.0563134 -0.0577559 -0.0600714 -0.105828 0.0765093 0.13073 0.107462 -0.0411504 0.0483328 0.10074 0.0625242 -0.0186235 -0.234661 0.12659 -0.0341329 0.0798802 0.0511399 0.137505 0.127078 0.0261391 -0.0779865 -0.138118 -0.0497007 0.0461164 -0.0772399 -0.102998 0.016123 0.0494644 0.0701059 -0.145592 0.0325707 -0.0150219 -0.143165 0.123917 -0.0361076 0.0177718 
-0.0085935 0.129461 -0.122385 0.0063377 0.0564447 0.161181 0.0572153 -0.224005 -0.125839 0.0631515 -0.0323655 0.0205425 0.0729583 0.0309255 0.0270988 -0.060654 -0.079541 0.0617198 0.0748237 0.0506488 -0.0280659 -0.0344977 -0.0152478 0.0257881 -0.00281783 0.0554045 -0.201644 -0.149371 0.0830805 0.165438 0.00733887 0.170932 -0.105099 -0.0946498 0.0998763 0.105128 -0.0666804 0.0109984 0.0329403 -0.0489874 0.0187132 -0.0375402 -0.0187592 0.0538055 -0.138069 0.149051 0.181743 0.0854541 -0.12455 -0.0740113 -0.0196344 0.0710667 0.0850997 -0.0592598 0.0906061 0.0415879 -0.00144428 0.170184 0.030757 -0.0631643 -0.0794272 0.141812 0.198838 -0.0988893 0.072607 0.0594337 0.0682855 -0.019915 -0.0873099 0.0378626 0.0350728 0.105833 -0.00886988 0.069914 0.0284237 0.0291581 -0.121166 -0.0601779 0.0541803 0.0116556 0.0694252 0.113291 -0.0959751 -0.0280385 -0.019659 -0.0323122 -0.014581 -0.0616171 -0.0116868 0.035448 0.081765 0.0245215 0.0590246 -0.0563498 -0.0641618 -0.106047 0.0727078 0.137633 0.107337 -0.0444168 0.0610099 0.0989364 0.0545043 -0.0149626 -0.224665 0.124119 -0.0325506 0.08177 0.0532659 0.136763 0.123784 0.037941 -0.0753346 -0.13837 -0.0467166 0.0563935 -0.0782566 -0.0978428 0.0161592 0.0570001 0.0646769 -0.14453 0.0319643 -0.0183365 -0.150935 0.129429 -0.0343379 0.0168676 
-0.00365271 0.131366 -0.1265 0.00167984 0.0586572 0.159263 0.0581178 -0.224405 -0.132764 0.0598714 -0.0329521 0.0186239 0.0783491 0.0464416 0.0296464 -0.0615607 -0.0656411 0.0575201 0.0760305 0.0490607 -0.0339253 -0.0257916 -0.0272885 0.00839311 -0.00744279 0.0598869 -0.207063 -0.134287 0.0807467 0.168661 -0.00114603 0.183452 -0.104683 -0.0951802 0.0984689 0.108999 -0.057458 0.00376997 0.0392119 -0.0515153 0.0229532 -0.0308963 -0.00707986 0.0450152 -0.132679 0.160825 0.181483 0.0845555 -0.127642 -0.0815718 -0.0231863 0.072345 0.0822208 -0.0520627 0.0870155 0.0396667 -0.0105717 0.163494 0.0296598 -0.0575098 -0.0764728 0.147263 0.189299 -0.0984756 0.0677177 0.0688529 0.0711684 -0.0131992 -0.0819135 0.0284389 0.0427325 0.0949771 -0.00400992 0.0646167 0.0284742 0.0389349 -0.118272 -0.0689769 0.052128 0.00114848 0.0769391 0.116249 -0.0956011 -0.0262407 -0.0171345 -0.0250502 -0.0138121 -0.0675426 -0.0164372 0.0414543 0.0828715 0.0197157 0.0578287 -0.0508285 -0.0667643 -0.102679 0.0777356 0.13418 0.10281 -0.0425974 0.056508 0.105501 0.0601508 -0.0124489 -0.233637 0.130168 -0.0347698 0.0872186 0.0426608 0.13744 0.124628 0.0218669 -0.082524 -0.134205 -0.0507274 0.0468076 -0.0799458 -0.10024 0.0153234 0.0473138 0.06367 -0.145539 0.0406766 -0.0167756 -0.141411 0.121828 -0.0322716 0.0125693 
0.0154426 0.120483 -0.116636 0.00208281 0.0775622 0.165731 0.078557 -0.227547 -0.130523 0.0542072 -0.0360572 0.0311721 0.0772266 0.0414075 0.0335139 -0.0709203 -0.0614926 0.0682404 0.0506338 0.0561304 -0.0378304 -0.0123213 -0.0171316 0.030786 -0.017094 0.0491049 -0.210703 -0.131382 0.075914 0.163337 -0.00311536 0.184014 -0.123942 -0.0761053 0.097259 0.102992 -0.0588356 0.0137821 0.0328613 -0.0463213 0.0316402 -0.0203122 -0.0195534 0.0428843 -0.148249 0.152732 0.166242 0.0993549 -0.114989 -0.0585582 -0.0132873 0.0707586 0.0673137 -0.0521472 0.0932906 0.0261469 -0.0106316 0.182614 0.0294871 -0.0489626 -0.0776487 0.15097 0.191801 -0.10459 0.0645568 0.0481715 0.0718818 -0.00684722 -0.0937681 0.0487385 0.0484302 0.108775 0.00564486 0.0864541 0.0085394 0.0329149 -0.114084 -0.0669305 0.0580733 -0.0067869 0.0836655 0.124742 -0.0923733 -0.0331864 -0.0133603 -0.0470803 -0.00379254 -0.0615691 -0.0215736 0.0465003 0.0949154 0.0128363 0.0649882 -0.058253 -0.0639189 -0.108123 0.0771782 0.12175 0.106098 -0.0429261 0.0602168 0.110873 0.052978 0.00500629 -0.22722 0.113664 -0.0447626 0.0797403 0.0498624 0.144116 0.1347 0.0449635 -0.0754325 -0.109994 -0.054349 0.0488103 -0.0733013 -0.100284 0.00304397 0.0560277 0.0639212 -0.132574 0.0355781 -0.00704849 -0.146959 0.113747 -0.04227 -0.00259844 
0.0131722 0.117187 -0.0949992 0.0119039 0.0868779 0.163663 0.0809406 -0.217289 -0.116612 0.0426255 -0.0407781 0.014727 0.0674605 0.0330165 0.0526191 -0.0687475 -0.0519891 0.070377 0.0437241 0.0501317 -0.0302845 -0.00950927 -0.00256511 0.0433068 -0.00432813 0.0331168 -0.224399 -0.136891 0.0917113 0.14185 0.0318914 0.182498 -0.124756 -0.0730033 0.105872 0.106092 -0.0558208 0.0274464 0.0240913 -0.0517322 0.0435281 -0.00503052 -0.0308104 0.0412443 -0.150617 0.143624 0.158035 0.103671 -0.101467 -0.0624109 -0.0288755 0.0717341 0.0771664 -0.0662633 0.0863344 0.0234763 -0.00292933 0.184497 0.0345487 -0.0592011 -0.0923652 0.153377 0.180352 -0.110107 0.0676562 0.0538321 0.0801875 -0.016497 -0.0962474 0.0618264 0.0459058 0.116191 0.00369646 0.0979687 0.00661147 0.0164252 -0.123352 -0.0583141 0.0595942 -0.00635493 0.0764849 0.135002 -0.0913801 -0.0418432 0.00701387 -0.0571876 -0.00657228 -0.0506118 -0.0337331 0.0378786 0.113885 0.0289369 0.0620355 -0.0746253 -0.0468161 -0.1122 0.0753273 0.130794 0.0894613 -0.0406447 0.0530558 0.10027 0.0580641 0.00262649 -0.227832 0.111923 -0.0337316 0.0645045 0.0892578 0.143253 0.131965 0.0564242 -0.0819121 -0.111954 -0.039712 0.0490033 -0.0708538 -0.112417 0.00486345 0.0624968 0.0659791 -0.114163 0.0236615 0.00335991 -0.153996 0.106493 -0.0358012 0.00291923 
0.0212987 0.103019 -0.118074 0.00451055 0.0834491 0.160265 0.0679082 -0.222372 -0.149438 0.0408884 -0.0542088 0.0417708 0.0815674 0.0253594 0.0163903 -0.0541208 -0.0684565 0.0757936 0.0502545 0.0771029 -0.0137003 -0.0264041 0.00450676 0.03618 -0.0188558 0.0632959 -0.203526 -0.162439 0.0592193 0.163506 -0.0182429 0.192992 -0.12135 -0.059119 0.100957 0.0871567 -0.047094 0.030396 0.0375357 -0.0667184 0.028501 -0.0296085 0.00912855 0.0493821 -0.155051 0.146138 0.197842 0.0912689 -0.127073 -0.0347525 -0.00110714 0.0355661 0.0692792 -0.0296266 0.11765 0.0122059 0.0201778 0.164905 0.0423961 -0.0806237 -0.0573159 0.146227 0.185981 -0.101765 0.069096 0.0341069 0.0561262 -0.00366454 -0.0777854 0.0415191 0.027442 0.107568 -0.00106209 0.0795177 0.00555731 0.028316 -0.113274 -0.0532042 0.0683596 0.00484178 0.0802225 0.129934 -0.0923171 -0.0363516 -0.0199845 -0.0412367 -0.00356287 -0.0420966 -0.0115702 0.0460133 0.0959351 0.0151946 0.0518205 -0.068182 -0.0801258 -0.0958043 0.0768516 0.160701 0.101114 -0.0559534 0.0633362 0.100523 0.0555521 0.0293007 -0.212223 0.0928113 -0.06117 0.104414 0.0348009 0.137435 0.117311 0.0590113 -0.0805042 -0.114993 -0.0524353 0.0525658 -0.0778709 -0.119857 -0.0097937 0.0562694 0.0639032 -0.108142 0.0537297 -0.014304 -0.159553 0.0988308 -0.0434686 -0.00481727 
