{
  "descriptor": [
    -0.01716136373579502,
    -0.005294550210237503,
    -0.022640351206064224,
    -0.13172633945941925,
    -0.11266089975833893,
    -0.019865453243255615,
    -0.030582312494516373,
    -0.05209800601005554,
    0.18186858296394348,
    -0.1436884105205536,
    0.20011690258979797,
    -0.07423464953899384,
    -0.21733738481998444,
    -0.06933529675006866,
    -0.010390779003500938,
    0.17851072549819946,
    -0.18383319675922394,
    -0.10473227500915527,
    -0.09227771311998367,
    -0.0005907088052481413,
    0.06194677576422691,
    0.06660157442092896,
    -0.030066559091210365,
    0.06715506315231323,
    -0.13168659806251526,
    -0.34560370445251465,
    -0.07664777338504791,
    -0.12161055207252502,
    -0.06213681027293205,
    -0.06689735502004623,
    0.06856752932071686,
    0.16491225361824036,
    -0.12367518246173859,
    -0.026265451684594154,
    0.04927949979901314,
    0.035836901515722275,
    -0.04688670113682747,
    -0.07235187292098999,
    0.2643807828426361,
    0.0300720427185297,
    -0.1941823810338974,
    -0.08801209926605225,
    0.04774068668484688,
    0.26822078227996826,
    0.14051614701747894,
    -0.027950698509812355,
    0.030827470123767853,
    0.0014211386442184448,
    0.1248093768954277,
    -0.3363911509513855,
    -0.029874000698328018,
    0.12779760360717773,
    0.06388042867183685,
    0.12268821150064468,
    0.060824353247880936,
    -0.11415944248437881,
    0.05636419728398323,
    0.16803041100502014,
    -0.30796077847480774,
    0.06487349420785904,
    -0.03223055973649025,
    -0.20546162128448486,
    -0.026818962767720222,
    -0.09048246592283249,
    0.24757498502731323,
    0.06856435537338257,
    -0.1516110897064209,
    -0.15736351907253265,
    0.12132804095745087,
    -0.16300369799137115,
    -0.07809057086706161,
    0.06289473176002502,
    -0.14719699323177338,
    -0.22581003606319427,
    -0.35435572266578674,
    0.007630304899066687,
    0.31209784746170044,
    0.15974700450897217,
    -0.14876233041286469,
    0.0346379280090332,
    -0.029208380728960037,
    -0.10823361575603485,
    0.021256286650896072,
    0.0971822589635849,
    0.06942513585090637,
    -0.04057268425822258,
    -0.01854216307401657,
    0.03305229917168617,
    0.19944483041763306,
    -0.11782925575971603,
    -0.004244206007570028,
    0.2670263350009918,
    -0.05347996950149536,
    -0.01901952549815178,
    -0.061865661293268204,
    0.026568030938506126,
    -0.05879899114370346,
    0.020201485604047775,
    -0.05288353189826012,
    0.0999959334731102,
    0.014332334510982037,
    -0.07893197238445282,
    0.037227120250463486,
    0.08947312086820602,
    -0.18132328987121582,
    0.1478644460439682,
    -0.06073716655373573,
    -0.08033599704504013,
    -0.05866486206650734,
    -0.06629570573568344,
    -0.14939042925834656,
    -0.0586063414812088,
    0.1952980011701584,
    -0.2619521915912628,
    0.18744471669197083,
    0.19914047420024872,
    0.06443249434232712,
    0.18812409043312073,
    -0.0017608102643862367,
    0.033457230776548386,
    -0.013293719850480556,
    -0.04532064124941826,
    -0.18149155378341675,
    -0.06834921985864639,
    0.08957310020923615,
    0.03311886638402939,
    -0.00731777073815465,
    0.00213220645673573
  ]
}