-0.0047164 0.0461951 -0.0174485 0.112246 0.129385 0.146958 0.0455309 -0.235791 -0.0139378 -0.0487148 -0.0250448 0.0737769 0.0343061 0.00225712 -0.0176309 -0.0250309 -0.0201715 0.117084 -0.0319497 0.122303 0.0947484 -0.0917627 0.0303028 0.194187 0.0597979 -0.0352475 -0.20359 -0.172649 0.0523604 0.133174 0.0858354 0.150843 -0.0795067 -0.00913912 0.119384 0.114224 -0.0539036 0.050405 -0.0520517 -0.167002 0.0628581 0.00548038 -0.00355174 -0.000591758 -0.103066 0.0523464 0.150434 0.0677529 -0.0697299 -0.0465321 -0.0327434 -0.0212178 0.123373 -0.089574 0.168913 0.062011 -0.0439819 0.172453 0.0174418 -0.116896 -0.0804318 0.127795 0.151002 -0.156337 0.123633 0.0659658 0.0196985 -0.041796 -0.158303 0.110225 0.0169401 0.0916403 -0.0482683 0.00105095 -0.0087232 0.0307335 -0.0475517 0.015811 0.0604996 -0.00289808 -0.00519936 0.15948 -0.0792519 -0.0851372 0.00783947 -0.0643325 -0.0105968 0.0345806 -0.0628398 0.0742064 0.13078 -0.00459761 0.0618374 -0.0366994 -0.0400143 -0.0627859 0.00450513 0.119303 0.0862478 -0.0516822 0.104435 0.0253961 -0.00941532 -0.00517302 -0.128135 0.109649 0.00992593 -0.0117601 0.0837255 0.0944507 0.0115671 0.0832114 -0.0582633 -0.0823725 0.0389228 0.056149 -0.134104 -0.0972849 -0.0349871 0.126803 0.0280172 -0.0171147 -0.0427502 0.0050677 -0.148955 0.194274 0.00615805 -0.0448618 
0.00120694 0.0609885 -0.0440395 0.0632649 0.10706 0.139636 -0.00647383 -0.214536 -0.076037 -0.0444157 -0.0145936 0.043897 0.0748083 0.0294507 -0.0153393 -0.00300191 -0.0088335 0.0821228 0.000103025 0.156404 0.10283 -0.099528 0.07651 0.152878 0.0395808 0.0232015 -0.171567 -0.184866 0.0817506 0.104987 0.0620494 0.126516 -0.0570503 -0.0281858 0.104773 0.121081 -0.0409285 0.132005 -0.0209412 -0.154969 0.0169735 0.0133488 -0.0122914 0.0147101 -0.12703 0.0732569 0.19965 0.0632965 -0.114804 -0.0358279 -0.0572914 -0.0163882 0.0950835 -0.0469052 0.153897 0.0299655 0.00548893 0.171047 0.027216 -0.165042 -0.0747655 0.116131 0.18874 -0.147979 0.124465 0.0667876 0.0279735 0.00106746 -0.109382 0.0824111 0.0120688 0.0841179 -0.052433 0.00743916 0.0303429 0.000653429 -0.0723116 0.0311827 0.0873658 0.0173002 -0.00947002 0.141727 -0.0804844 -0.0952322 0.0027563 -0.0580365 -0.0175483 0.0522773 -0.0243861 0.0353964 0.130134 -0.00522603 0.0668456 -0.034819 -0.0323165 -0.107737 0.0283199 0.191283 0.064992 -0.0752851 0.0604218 0.0323479 -0.00476944 0.0266033 -0.151391 0.132077 -0.0036972 0.029362 0.114006 0.0441093 0.010048 0.102613 -0.0666066 -0.0569737 0.0386225 0.0563429 -0.154272 -0.136225 -0.0398009 0.110624 0.00178408 -0.0235498 -0.0144995 0.00877456 -0.155875 0.167146 -0.000386478 -0.0175635 
0.00244774 0.0596026 -0.0797616 0.0598506 0.104021 0.127539 0.0188964 -0.18611 -0.0525449 -0.0572754 -0.0102399 0.0445916 0.0894177 0.0278219 -0.0594583 -0.00464707 -0.0154182 0.0724669 -0.035208 0.16294 0.13335 -0.147034 0.0612765 0.152688 0.0336718 -0.00780707 -0.171619 -0.181845 0.081505 0.119033 0.0624847 0.133341 -0.0648851 -0.0142797 0.072688 0.112189 -0.0572701 0.134306 -0.049226 -0.162576 0.0182363 0.00640721 -0.00374088 0.0387134 -0.101805 0.0545696 0.19222 0.0647285 -0.121931 -0.0363419 -0.0826143 -0.0298373 0.0746883 -0.0543552 0.157039 0.0432051 -0.0288044 0.191047 0.0309898 -0.172961 -0.0689649 0.110912 0.207869 -0.150534 0.114697 0.0673009 0.0135906 -0.000448129 -0.112022 0.0710018 0.00372816 0.0768931 -0.0528782 0.00513998 0.0120246 0.00576987 -0.0380369 0.041624 0.0718402 0.00353196 -0.0379286 0.114802 -0.1024 -0.104702 -0.0227382 -0.0340268 -0.0148238 0.0414733 -0.00110096 0.0271398 0.136026 -0.0423077 0.0470622 -0.0580318 -0.00501116 -0.0879477 0.016478 0.172994 0.065483 -0.0596207 0.0543694 0.0192597 -0.00689213 0.0443458 -0.159362 0.140135 -0.0300268 0.0547648 0.0914248 0.0170678 -0.000898879 0.105408 -0.087728 -0.0509213 0.0512271 0.0609425 -0.131805 -0.128289 -0.00268124 0.124661 -0.0185935 -0.0102532 -0.0190733 0.0354291 -0.166375 0.151028 -0.0207589 -0.0347607 
-0.00376863 0.0617717 -0.0653559 0.0565953 0.104076 0.115084 0.00791853 -0.190529 -0.0584333 -0.0494288 -0.01093 0.0408226 0.0904378 0.032446 -0.0388915 7.40076e-06 -0.0109014 0.0710554 -0.0232575 0.164875 0.127522 -0.135455 0.07368 0.148152 0.0383737 0.0089838 -0.16748 -0.184175 0.0889483 0.114741 0.070426 0.130337 -0.0524792 -0.0190657 0.0810284 0.113832 -0.0471582 0.15566 -0.0369104 -0.160261 0.013131 0.0118454 -0.00409543 0.0413005 -0.113093 0.0585222 0.197823 0.0639091 -0.11359 -0.0391102 -0.0770989 -0.0248302 0.0728078 -0.0523321 0.160737 0.0344708 -0.0181947 0.183328 0.0314752 -0.17749 -0.0756338 0.09222 0.198444 -0.142394 0.119926 0.0613415 0.0164258 0.00443475 -0.105351 0.0715756 0.00933141 0.0822796 -0.0546032 0.00477903 0.0184719 -0.00327001 -0.0543774 0.0453981 0.0788364 0.0154917 -0.0345589 0.119588 -0.094121 -0.0987134 -0.012238 -0.0524138 -0.0132847 0.052147 0.002187 0.0190547 0.126333 -0.0287505 0.0514622 -0.0604691 -0.0103927 -0.102917 0.0198087 0.186335 0.0606994 -0.071868 0.043121 0.0220465 -0.00123609 0.043886 -0.159903 0.133939 -0.0260562 0.0507607 0.122266 0.0152493 -0.00446862 0.109632 -0.0965631 -0.0444181 0.0536874 0.0580925 -0.131971 -0.142645 -0.0152922 0.124305 -0.0112328 -0.00020918 -0.0213888 0.0354404 -0.16567 0.144719 -0.00988427 -0.0226396 
0.0146241 0.0752874 -0.0939699 0.0542613 0.127699 0.120075 0.0149779 -0.173841 -0.051582 -0.0259336 0.0154272 0.0389497 0.100476 0.0319777 -0.0457294 0.0152793 0.03252 0.0903138 -0.0245624 0.159943 0.149725 -0.140509 0.0697182 0.155367 0.0585116 -0.0174463 -0.157763 -0.172116 0.129592 0.137676 0.0868734 0.132999 -0.0465529 -0.0238429 0.0604995 0.10109 -0.0619081 0.139954 -0.0147531 -0.151684 -0.0067253 0.0222846 -0.0162157 0.0453793 -0.10505 0.0329624 0.178968 0.068573 -0.0986317 -0.0648058 -0.0607983 0.0114841 0.0531448 -0.0813065 0.11912 0.0415765 -0.0224611 0.195138 0.0211424 -0.157196 -0.0925538 0.0638675 0.206373 -0.157991 0.106151 0.0410503 0.00647118 0.0083107 -0.120646 0.0686609 0.0168837 0.0941034 -0.0762431 -0.0145072 -0.00126021 -0.00596006 -0.0290003 0.0667765 0.0588028 0.0245641 -0.0545192 0.110227 -0.0784854 -0.0828454 0.00814066 -0.051465 -0.0177146 0.0442141 0.012221 -0.00151124 0.105683 -0.031495 0.0244132 -0.0299055 0.0239524 -0.119829 0.00963911 0.173969 0.0338221 -0.0640791 0.0444391 0.0192242 -0.00892508 0.0687414 -0.163871 0.142574 -0.0159056 0.0414167 0.159174 -0.00191382 -0.0196582 0.099278 -0.106021 -0.0195756 0.0693941 0.059437 -0.136808 -0.128543 -0.0052329 0.146193 -0.0273321 -0.00328511 -0.0421493 0.0406935 -0.162125 0.14228 -0.0230258 -0.0268589 
-0.0285685 0.0209009 -0.0897686 0.0849479 0.0707401 0.118358 0.00608282 -0.180125 0.00906915 -0.0334182 0.00303968 0.0204164 0.0742476 0.0412719 -0.0395554 -0.00621731 -0.0362093 0.0664467 0.0121999 0.126337 0.123155 -0.169242 0.057813 0.14769 0.0579909 -0.000906513 -0.162883 -0.207282 0.0710035 0.106063 0.118886 0.124791 -0.0364129 -0.0566502 0.0796227 0.139801 -0.0756662 0.118565 -0.0588792 -0.169981 0.0184971 0.00337296 -0.0485491 0.0630925 -0.093174 0.00755122 0.157097 0.068941 -0.058892 -0.0833999 -0.108092 -0.0328398 0.129069 -0.0848868 0.144591 0.0708764 -0.0224639 0.170794 0.0466631 -0.182749 -0.0876339 0.0859368 0.204504 -0.131431 0.110076 0.099301 0.0362747 -0.0125755 -0.0777037 0.0666136 -0.0039977 0.0872798 -0.0572546 -0.0273232 0.00736143 -0.0159124 -0.0601096 0.034599 0.0501675 0.0243257 -0.0442433 0.112837 -0.111215 -0.115228 -0.00448493 -0.0380712 -0.0161254 0.0443146 0.00216402 -0.0130466 0.129299 0.00588891 0.0526777 -0.0774327 -0.000329727 -0.0895009 0.0040692 0.158879 0.0714737 -0.050711 0.0800328 -0.00971463 0.0144857 -0.0394365 -0.147251 0.138755 0.00158187 -0.0118286 0.110555 0.045011 -0.018134 0.0964433 -0.0753967 -0.11183 0.0678121 0.0701713 -0.11787 -0.130786 0.00457053 0.101715 -0.00129995 -0.0369929 -0.0299444 0.0287095 -0.182453 0.167151 -0.00698012 0.0300181 
-0.0449776 0.0606293 -0.041606 0.058332 0.0494013 0.120153 0.00466683 -0.132112 -0.00201309 -0.00783492 0.0218497 -0.0185125 0.0875551 0.00893986 -0.00904716 -0.000290347 -0.0463001 0.0638771 -0.0183031 0.10855 0.137924 -0.172584 0.0518147 0.160698 0.0592889 -0.00597294 -0.165035 -0.192966 0.129229 0.0701379 0.142524 0.102829 -0.0452176 -0.0426379 0.0712602 0.126411 -0.0840963 0.132744 -0.0504485 -0.14981 0.0195258 -0.0288536 -0.0599069 0.0802696 -0.0717007 -0.0108399 0.155329 0.0790615 -0.0961114 -0.101743 -0.112833 -0.0175525 0.0921552 -0.102291 0.10814 0.0754214 -0.041841 0.17605 0.0452064 -0.198944 -0.102904 0.0685009 0.198535 -0.109344 0.0971315 0.114017 0.0411424 -0.0287965 -0.0918306 0.0618481 -0.0217379 0.0821946 -0.0628072 -0.0145515 0.0295163 -0.0608108 -0.0663352 0.0628785 0.0682898 0.0448959 -0.0511159 0.0856404 -0.0997626 -0.1172 -0.0032916 -0.0412082 -0.00840105 0.0456994 0.0169789 -0.00808842 0.133809 0.000630217 0.0377504 -0.0714457 0.0011789 -0.0908275 -0.00548517 0.162604 0.0463354 -0.0476898 0.0576858 -0.0133288 -0.00369451 -0.0145078 -0.132427 0.150673 0.00591334 0.00934099 0.165934 -0.00488627 -0.0252706 0.122067 -0.102819 -0.0962373 0.0984698 0.0614852 -0.122773 -0.132589 0.0259981 0.11511 0.000103031 -0.0453431 -0.048096 0.048958 -0.176774 0.151986 -0.00811234 0.0233918 
0.0108969 0.0683283 -0.0822762 0.0677765 0.129479 0.107656 0.00794921 -0.198185 -0.0284875 -0.0532852 0.017267 0.0547765 0.0751317 0.0312631 -0.047185 -0.00207047 0.0200161 0.0949434 -0.0118338 0.155326 0.148705 -0.0982007 0.0476175 0.181056 0.0611766 -0.0118891 -0.144277 -0.179653 0.108425 0.1641 0.0767213 0.100807 -0.0355694 -0.0358976 0.0915378 0.106578 -0.0457569 0.115679 -0.0301335 -0.143668 0.00136303 0.0465284 -0.00615865 0.0741343 -0.115611 0.060107 0.200039 0.0526265 -0.079427 -0.0601431 -0.0496608 0.00481291 0.0649017 -0.072069 0.160879 0.0478465 -0.0358496 0.196319 0.0247235 -0.155125 -0.0820687 0.051504 0.205777 -0.136752 0.103982 -0.00208913 0.0210818 -0.00838905 -0.0984441 0.079296 0.0427966 0.0882711 -0.0611292 -0.0384479 -0.000167041 0.00928507 -0.0617272 0.0823176 0.0498477 0.0245741 -0.028895 0.156742 -0.0798726 -0.0758285 0.0198382 -0.0501479 -0.0158315 0.0358238 -0.0155284 0.0122857 0.0992719 -0.0343844 0.0130605 -0.0485174 0.00640656 -0.122584 0.0039624 0.157321 0.0548282 -0.0759767 0.0398272 0.0367518 0.0177608 0.0395087 -0.191815 0.132663 -0.0200043 0.0247169 0.129315 0.0245561 0.0164963 0.0735062 -0.111206 -0.036196 0.0432916 0.0690006 -0.133321 -0.159369 -0.0360116 0.124192 -0.0117191 0.0174282 -0.0446712 0.0326563 -0.158077 0.15401 -0.00242776 -0.0189734 
0.016141 0.0506758 -0.0792482 0.0686723 0.11167 0.118078 0.0291319 -0.179522 -0.0199928 -0.0652762 0.0219582 0.0512389 0.0880306 0.0364451 -0.0634974 -0.0114657 -0.0145662 0.0753951 -0.032851 0.154625 0.166694 -0.146758 0.042661 0.174619 0.0664508 -0.0257999 -0.157119 -0.174126 0.106657 0.153003 0.0768249 0.103235 -0.0569068 -0.0287235 0.0633003 0.100864 -0.0804557 0.121122 -0.0278983 -0.15531 0.00651281 0.0195953 -0.0207087 0.0566299 -0.0961553 0.0205499 0.171015 0.0500953 -0.0856969 -0.0591676 -0.0795603 0.00152321 0.0730801 -0.0661489 0.151271 0.0475659 -0.0488732 0.21343 0.00462221 -0.164215 -0.0767219 0.0699398 0.224477 -0.131837 0.08508 0.0572369 0.0197982 -0.00573638 -0.11017 0.0624895 0.0267908 0.0906192 -0.0653767 -0.0216502 0.0057674 0.00401145 -0.0346315 0.0354322 0.0579886 0.0474793 -0.043069 0.114796 -0.0767015 -0.0946624 0.00170096 -0.039035 -0.00754324 0.0428255 0.0031074 0.00374712 0.12129 -0.0528627 0.0274771 -0.0329214 -0.00675214 -0.123128 -0.00469818 0.144586 0.0687327 -0.0601666 0.0539099 0.0162861 -0.00166551 0.0409245 -0.174335 0.156166 -0.0159613 0.0473681 0.121279 -0.0025337 0.0064837 0.0886449 -0.116273 -0.0407829 0.0686489 0.0848484 -0.132096 -0.108851 -0.0032771 0.139565 -0.0291865 -0.00992773 -0.0519785 0.0325295 -0.163982 0.167419 -0.00661133 -0.0148228 
0.0199687 0.0393238 -0.0949997 0.085882 0.125867 0.137275 -0.00679269 -0.199253 -0.0218535 -0.057005 0.0174311 0.0545871 0.0572322 0.0299307 -0.0322212 -0.00654551 0.0212786 0.0881056 0.0243824 0.143219 0.135398 -0.103187 0.0548203 0.194651 0.0862328 -0.0202865 -0.131154 -0.188891 0.0854114 0.145997 0.109164 0.0876378 -0.0441347 -0.050525 0.0879605 0.127544 -0.0708185 0.0721961 -0.0251376 -0.146178 0.00631536 0.0411604 -0.024835 0.0699595 -0.115576 0.0303574 0.183806 0.060566 -0.0554545 -0.0559567 -0.0416449 0.00167982 0.100306 -0.0887925 0.14778 0.0499714 -0.0315267 0.205317 0.0327959 -0.151046 -0.0935457 0.0709306 0.213162 -0.15881 0.0976692 0.0185057 0.0286252 -0.0165282 -0.108911 0.087648 0.0337698 0.109495 -0.0737087 -0.0423054 -0.00643413 0.00308587 -0.0535487 0.0598603 0.0449584 0.0557381 -0.0278714 0.141166 -0.0690178 -0.0887978 0.0294867 -0.0515841 -0.0227345 0.0309219 -0.024746 -0.00209622 0.102231 -0.00799238 0.0171 -0.035787 0.0186756 -0.116642 0.0107016 0.152876 0.0446541 -0.0751077 0.0519832 0.0277946 0.0134224 0.00451738 -0.184999 0.143553 -0.00440593 -0.0115378 0.117227 0.045451 0.0184057 0.0720537 -0.0783269 -0.0588627 0.0487324 0.0709587 -0.125921 -0.135972 -0.027724 0.134224 -0.0027076 -0.0170096 -0.0406503 0.0127482 -0.163204 0.166798 0.00684397 0.00437585 
-0.0196495 0.0254372 0.06937 0.116288 0.0812812 0.1409 0.0846474 -0.234238 0.0106575 -0.0693859 -0.0843737 0.0846545 0.00212128 -0.0145865 0.0186051 -0.0849771 -0.0383202 0.108756 -0.0178138 0.0475547 0.0299862 -0.0320766 -0.011195 0.236586 0.0226836 -0.0538886 -0.206734 -0.165805 -0.0377945 0.10986 0.0610644 0.141461 -0.0945916 0.0282026 0.136617 0.0552365 0.0266215 0.00237766 -0.0518632 -0.0996245 0.12278 -0.0170742 0.0359068 -0.0792426 -0.0924958 0.0426565 0.115474 0.0300995 -0.0372382 -0.0236532 0.0227947 -0.0938171 0.184733 -0.0319777 0.175957 0.0783018 -0.00456752 0.128 0.0337194 -0.0853371 -0.0315574 0.175245 0.0269874 -0.18505 0.116333 0.0664828 0.063748 -0.106972 -0.171739 0.0788586 -0.011801 0.0600562 -0.0370625 0.0417317 0.0202376 0.0711831 -0.0611378 -0.0284027 0.0840776 -0.0176165 0.00449563 0.173744 -0.0504839 -0.0432721 0.033935 -0.0605129 0.0194559 -0.0152183 -0.133253 0.0880172 0.0958516 -0.0149994 0.158074 -0.0750377 -0.099471 -0.0140047 0.00774995 0.0824324 0.123994 -0.0152761 0.124882 0.0295237 -0.0137087 0.0326499 -0.0657112 0.0096961 0.00043805 -0.0379974 -0.0740476 0.148288 0.0182508 0.0364258 0.00133942 -0.140993 -0.0459881 0.0533777 -0.119579 -0.0762836 -0.0988529 0.0758934 0.0779055 -0.0129344 -0.0652167 -0.0363317 -0.131525 0.180113 -0.0576661 -0.0578967 
-0.0496273 0.0495395 0.00196954 0.0772505 0.0573905 0.134802 -0.0120904 -0.188185 -0.0423141 -0.0232384 -0.00977437 0.0136792 0.0574224 0.00635402 -0.00341591 -0.0116911 -0.0642524 0.0852418 0.00782816 0.121544 0.0972805 -0.130208 0.0576324 0.141048 0.0335933 0.032239 -0.207389 -0.196951 0.0887633 0.0576301 0.0979764 0.126003 -0.0556633 -0.0460595 0.110554 0.141437 -0.068947 0.113441 -0.0351037 -0.154077 0.0391769 -0.0185878 -0.0495625 0.00901397 -0.0970682 0.0350969 0.177883 0.0596039 -0.113727 -0.0729578 -0.101009 -0.0203885 0.122187 -0.0657692 0.131111 0.0545635 0.00528683 0.142582 0.0205419 -0.165916 -0.078116 0.134297 0.175608 -0.114941 0.119862 0.12434 0.0496957 -0.0338383 -0.0990377 0.0784141 -0.00753859 0.0776348 -0.0395125 0.0230123 0.0423834 -0.0293708 -0.0958191 0.0163803 0.090262 0.0142911 -0.0241182 0.132419 -0.0963756 -0.102938 -0.00724015 -0.0412976 -0.0104923 0.0582028 -0.019942 0.0267064 0.14857 0.0320081 0.0854937 -0.0487228 -0.0406174 -0.0924916 0.0139514 0.179392 0.0635926 -0.0522669 0.0734338 0.00134023 -0.0114669 -0.0397483 -0.103903 0.154547 0.0356814 0.000899684 0.125217 0.055023 -0.0122554 0.100983 -0.0594313 -0.120391 0.0641907 0.0522024 -0.139319 -0.12924 -0.00581132 0.0866857 0.0140517 -0.0609807 -0.0254229 0.000781942 -0.167066 0.190274 0.0137573 0.0180477 
-0.0248772 0.0285843 0.0384115 0.123163 0.096371 0.131859 0.0378498 -0.247327 -0.00264626 -0.0642989 -0.0672099 0.0677266 0.0128675 -0.0090608 0.0251365 -0.0396147 -0.0445676 0.0868959 0.00781578 0.0892718 0.0621398 -0.0506543 0.00821952 0.199456 0.0450756 -0.0210823 -0.217327 -0.187668 -0.00814514 0.131088 0.0727168 0.145772 -0.0646075 -0.00837637 0.150914 0.1015 0.0141901 0.0140478 -0.0325122 -0.14528 0.091444 -0.0159177 0.0369102 -0.0534233 -0.0893266 0.07533 0.159021 0.0445801 -0.0461068 -0.0439876 -0.00454283 -0.0674557 0.189166 -0.0421511 0.207117 0.0614714 -0.00147355 0.104372 0.0308001 -0.116873 -0.0500781 0.150086 0.0623033 -0.155971 0.116884 0.0783773 0.0443189 -0.0675264 -0.135496 0.0552652 0.000537362 0.0698926 -0.053146 -0.00388881 0.035441 0.0678219 -0.0802943 -0.00609731 0.0824522 0.0295855 0.0327388 0.169277 -0.0627443 -0.0453807 0.0327879 -0.0427075 -0.00308506 0.0180113 -0.106431 0.0830401 0.0981615 0.0171061 0.109435 -0.048383 -0.114359 -0.036747 0.0109707 0.11973 0.109628 -0.0533829 0.131214 0.0255686 0.00292727 -0.022983 -0.10136 0.0628661 0.0102382 -0.0220145 0.00307495 0.147253 0.0100262 0.0318998 -0.0384506 -0.150175 -0.0131268 0.0670439 -0.141678 -0.0890722 -0.101806 0.0852862 0.0671097 -0.0153825 -0.0294415 -0.0304882 -0.144443 0.200219 -0.00320909 -0.0244272 
-0.0680395 0.0717072 -0.0188394 0.0816559 0.0687406 0.118624 -0.00849187 -0.19949 -0.0312605 -0.00606483 -0.012683 0.0146976 0.065784 0.00941121 -0.0222602 0.00540156 -0.0584832 0.0951777 -0.00924176 0.131636 0.106699 -0.157052 0.0409196 0.145155 0.0431192 0.00832043 -0.21362 -0.181359 0.0830301 0.0892517 0.0912005 0.134257 -0.0460361 -0.0419032 0.107672 0.145306 -0.0620608 0.0908053 -0.0493562 -0.17262 0.0330282 -0.0302562 -0.000186126 0.0220202 -0.0740543 0.0471742 0.192329 0.0731703 -0.117626 -0.072603 -0.094452 -0.0385154 0.105352 -0.0773275 0.152763 0.070023 -0.0286701 0.130905 0.0344894 -0.168049 -0.0733341 0.126741 0.165341 -0.115401 0.121485 0.120473 0.0162111 -0.0324647 -0.10924 0.071675 -0.00396675 0.0749343 -0.0456606 -0.00266062 0.038094 -0.00469419 -0.0718728 0.0457227 0.0813537 -0.0109647 -0.0234066 0.130998 -0.112263 -0.0862955 -0.0284936 -0.0173289 -0.0247608 0.0529773 -0.00354461 0.0465169 0.128139 0.0142757 0.0708691 -0.0611522 -0.0369772 -0.0684409 -0.00826399 0.178662 0.0643064 -0.0589257 0.0823148 -0.00270981 -0.00373218 -0.0445751 -0.105809 0.159692 0.0126624 0.0133654 0.108906 0.0587087 -0.0289265 0.0870415 -0.0648503 -0.111352 0.0548241 0.0467793 -0.125981 -0.116345 -0.0094181 0.0970766 0.0141147 -0.0462868 -0.0219003 0.01644 -0.184026 0.191056 0.00502848 -5.84744e-05 
-0.0213562 0.0529408 -0.0574002 0.0597845 0.111166 0.0946994 0.00496864 -0.175569 -0.0560796 -0.0270334 -0.0128149 0.026585 0.095064 0.0455035 -0.0134324 0.0132704 -0.000332002 0.0743246 -0.0141356 0.169882 0.120677 -0.154576 0.0805088 0.139184 0.0522866 -0.000759707 -0.182369 -0.177429 0.0969232 0.100689 0.0885284 0.130427 -0.0400655 -0.0317569 0.0806362 0.127901 -0.052374 0.152492 -0.0421387 -0.172949 0.00885747 0.0177807 0.000762557 0.0382088 -0.107103 0.0543481 0.189468 0.0718895 -0.0958242 -0.0519633 -0.0943255 -0.0419057 0.0734031 -0.07032 0.150547 0.0372799 -0.029742 0.17532 0.0363684 -0.170247 -0.0824482 0.0866545 0.177744 -0.136031 0.122021 0.0865426 0.00379648 0.00559242 -0.106093 0.053333 0.0139785 0.0963071 -0.0525399 -0.00590897 0.018073 -0.00469841 -0.047283 0.0512896 0.085903 0.0083359 -0.0361516 0.107359 -0.10661 -0.0964387 -0.00645493 -0.0501216 -0.022749 0.0650032 0.0168835 0.0112931 0.122157 -0.00389754 0.0514756 -0.0632806 -0.000590486 -0.0960399 0.00581048 0.190714 0.0466898 -0.071618 0.0382382 -0.00190767 0.00457381 0.0137035 -0.155588 0.149397 -0.0169361 0.0322863 0.155749 0.0159881 -0.0238225 0.10888 -0.0919123 -0.0514625 0.0630639 0.0518663 -0.122038 -0.130669 -0.0199085 0.126909 -0.0176133 0.000490071 -0.0300001 0.0509414 -0.178781 0.14463 -0.0110868 -0.0165631 
-0.00555938 0.0538605 -0.111451 0.0590625 0.113323 0.113197 -0.00635864 -0.180373 -0.0513211 -0.0215871 -0.00117265 0.0329674 0.107271 0.047227 -0.0313193 0.00881357 0.0201973 0.0732696 0.00952206 0.159381 0.132915 -0.150369 0.0753554 0.157501 0.0638157 -0.00282947 -0.164396 -0.195814 0.0918599 0.13569 0.0975523 0.128055 -0.0403652 -0.0444725 0.0587325 0.1236 -0.0589109 0.11935 -0.0282815 -0.142877 0.00159902 0.0267738 -0.00914099 0.0631043 -0.110136 0.0332547 0.198535 0.0668969 -0.0681727 -0.0697249 -0.0616373 -0.0324813 0.0842571 -0.0756209 0.132702 0.0503879 -0.00651727 0.182668 0.0691711 -0.177589 -0.0852022 0.0836427 0.181179 -0.144971 0.096183 0.0503566 0.0286161 0.00678389 -0.0800712 0.0398562 0.0150448 0.106795 -0.0612517 -0.0335952 0.014923 0.00890948 -0.0648303 0.0598545 0.0566626 0.0379666 -0.0388907 0.119689 -0.0871296 -0.0737803 0.00276001 -0.0241313 -0.0115648 0.0337832 0.00272271 -0.0306935 0.0869322 -0.00817986 0.0421055 -0.0607575 -0.00390628 -0.115945 0.00256451 0.192893 0.039238 -0.0675944 0.0462485 0.0101277 0.0276006 0.0443989 -0.183175 0.136165 -0.0372415 0.0344098 0.118911 0.0309582 -0.00980289 0.0877084 -0.0981371 -0.0615123 0.0268105 0.0724472 -0.138357 -0.142504 -0.0321929 0.119888 -0.0178173 -0.00766592 -0.038668 0.0303056 -0.194031 0.141687 -0.0499911 0.0110488 
-0.0113516 0.060705 -0.097113 0.0675363 0.107891 0.105556 0.00259368 -0.192382 -0.057298 -0.0342576 -0.0114323 0.0349793 0.0976061 0.0545112 -0.0254323 -0.00725669 0.0249843 0.064607 0.0238768 0.153966 0.118571 -0.140627 0.0720772 0.150216 0.0607535 0.000263183 -0.173898 -0.189041 0.0960109 0.137731 0.0986512 0.132282 -0.0362308 -0.0472995 0.0725667 0.118779 -0.0489376 0.129636 -0.0308466 -0.141793 0.00680173 0.0316371 -0.0081131 0.0525785 -0.117907 0.0555905 0.199146 0.0568993 -0.0654385 -0.0727082 -0.0652864 -0.017391 0.0956019 -0.0726631 0.135855 0.0491525 -0.00100656 0.181804 0.06397 -0.163575 -0.0880945 0.0888152 0.172402 -0.152164 0.110519 0.0456788 0.0394879 -0.0147631 -0.0907749 0.045694 0.0178687 0.0966883 -0.0592716 -0.0155278 0.0185633 0.0116561 -0.0647722 0.0485851 0.0588862 0.0383141 -0.0434367 0.117469 -0.0840274 -0.0694506 0.017494 -0.0441753 -0.0154119 0.0265688 -0.0119474 -0.0268826 0.0893628 -0.0022254 0.0588397 -0.0681667 -0.000493043 -0.124169 0.0210573 0.19537 0.0490606 -0.0644841 0.0360967 0.0302713 0.0307228 0.0496053 -0.187494 0.130535 -0.0201698 0.0392233 0.126947 0.0378983 -0.0074291 0.0759869 -0.105531 -0.0662162 0.019338 0.0710562 -0.125872 -0.150361 -0.0299411 0.125269 -0.0188893 -0.00615268 -0.0473477 0.0242446 -0.1842 0.14419 -0.0392817 0.00894157 
-0.0326728 0.042381 -0.0682566 0.102237 0.0912074 0.116258 -0.00120392 -0.210703 -0.0230024 -0.0399522 -0.0126186 0.0430116 0.0725075 0.0392343 -0.0205127 0.0116914 -0.015448 0.0565425 0.011973 0.140833 0.106313 -0.157166 0.0629957 0.144837 0.0678134 0.0107176 -0.194807 -0.200725 0.057269 0.109235 0.115821 0.161108 -0.0391608 -0.0403436 0.0714619 0.145737 -0.0514347 0.116078 -0.0343798 -0.147862 0.0386859 0.0124166 -0.00612953 0.0108428 -0.0931984 0.0342436 0.188489 0.044361 -0.0642022 -0.0809434 -0.0806942 -0.0448674 0.123937 -0.0696213 0.156399 0.0616823 -0.00769566 0.163156 0.0492375 -0.159569 -0.0965244 0.106299 0.162767 -0.16114 0.122902 0.110662 0.0369562 -0.0101559 -0.0956654 0.0573559 0.00754903 0.105169 -0.0541614 -0.000775529 0.0409565 0.0171168 -0.0689015 0.0258315 0.0465081 0.0246243 -0.0387178 0.129556 -0.0882335 -0.0845973 -0.0148744 -0.0191835 -0.00772255 0.039988 -0.0312234 -0.01673 0.104985 0.0045444 0.0737141 -0.061002 -0.0165688 -0.0844675 0.00864477 0.172092 0.0675127 -0.0517998 0.051327 -0.0152293 0.0119853 0.00653176 -0.148588 0.143607 -0.00782289 0.0140551 0.0974398 0.0492014 -0.0364021 0.086894 -0.0764224 -0.101368 0.0464817 0.0598493 -0.139331 -0.122544 -0.0203354 0.113223 0.0113307 -0.0138645 -0.0243454 0.0194097 -0.179123 0.178932 -0.0197062 0.0205346 
-0.0210766 0.0382873 -0.0685336 0.0715231 0.0976332 0.123009 -0.0218662 -0.173588 -0.0325555 -0.0380879 -0.000864413 0.0202647 0.0939199 0.0171746 -0.0157933 0.00516002 -0.0256676 0.0677084 -0.00497219 0.150796 0.145053 -0.166992 0.0892151 0.172901 0.0853826 -0.0187422 -0.162267 -0.210357 0.0742125 0.103813 0.129947 0.0983143 -0.0438677 -0.035254 0.0693527 0.13237 -0.0779007 0.105838 -0.0346165 -0.149271 0.0196173 -0.0103342 -0.0197996 0.074419 -0.105519 0.00812598 0.187774 0.0752309 -0.0638647 -0.0584657 -0.0674637 -0.0493462 0.0952405 -0.0816291 0.134785 0.0464442 -0.013978 0.17002 0.0647369 -0.192367 -0.0860906 0.0842193 0.173206 -0.12572 0.0962567 0.0607717 0.0258979 -0.00106235 -0.0868265 0.0568839 -0.00325437 0.113718 -0.0685278 -0.0403799 0.0255322 -0.0155905 -0.0748897 0.0595227 0.0663771 0.0852407 -0.0427658 0.0942448 -0.0769881 -0.0842966 -0.0142357 -0.0211271 -0.00389089 0.0501869 -0.00667293 -0.0256071 0.0981121 -0.00381431 0.0483979 -0.0670184 -0.0333538 -0.1074 -0.017599 0.190173 0.0368309 -0.0781524 0.0554217 -0.00439863 0.0134891 0.0179091 -0.134592 0.132069 -0.0295962 0.0416292 0.13139 0.0224509 -0.0279405 0.103817 -0.0991187 -0.0719252 0.0476207 0.0815104 -0.13715 -0.118885 -0.0221558 0.142084 -0.00267971 -0.0153927 -0.0545218 0.035871 -0.192682 0.143806 -0.0299351 0.0315961 
-0.00832293 0.0568638 -0.101029 0.0645546 0.108147 0.103411 0.00726629 -0.161419 -0.0386535 -0.0218404 0.00216198 0.0319425 0.103893 0.0269555 -0.043588 0.0117495 0.00580652 0.0724516 -0.0100164 0.164073 0.154782 -0.181464 0.070494 0.169288 0.0748324 -0.0260996 -0.15679 -0.189719 0.100768 0.139429 0.0951689 0.11317 -0.037495 -0.0318048 0.0507915 0.108835 -0.0744084 0.121536 -0.040122 -0.160454 -0.000476262 -0.00227008 0.00396431 0.078197 -0.0973006 0.0188719 0.19263 0.0681371 -0.0770855 -0.0606385 -0.0609716 -0.0287609 0.0674636 -0.0825182 0.145401 0.0508329 -0.0313876 0.17859 0.0550022 -0.182403 -0.0789856 0.0590493 0.188782 -0.13511 0.0956293 0.048423 0.00209682 -0.00557578 -0.10277 0.0478144 -0.000743443 0.105168 -0.0790389 -0.0334257 0.0112867 -0.00181989 -0.0328336 0.0763696 0.0613875 0.0505873 -0.0583343 0.0921247 -0.0862501 -0.0792677 -0.00542146 -0.0270411 -0.0170323 0.0450484 0.0252839 -0.0157122 0.0860189 -0.0247914 0.0238413 -0.0635783 -0.00162286 -0.107124 -0.00516029 0.181372 0.0425936 -0.0758662 0.0505114 0.005016 0.0150192 0.0433251 -0.165539 0.136976 -0.0380207 0.0536884 0.136665 0.00391125 -0.0274117 0.100058 -0.108245 -0.0534206 0.0553523 0.0740104 -0.114772 -0.127305 -0.0097865 0.151305 -0.0227852 -0.00142474 -0.0467555 0.0471559 -0.190435 0.138833 -0.0309367 0.000565781 
-0.0129178 0.0526142 -0.0803076 0.0731804 0.104645 0.116442 -0.00178433 -0.181448 -0.0449176 -0.0181364 -0.000441455 0.0309762 0.0977749 0.0362906 -0.0181364 0.00959994 0.0172389 0.0763205 0.0121245 0.146774 0.133566 -0.149873 0.0605911 0.161143 0.0723618 0.00421453 -0.176616 -0.197734 0.0995668 0.127696 0.112633 0.142699 -0.0439565 -0.0411906 0.0716444 0.124263 -0.062395 0.117614 -0.020066 -0.152202 0.0138231 0.0141748 -0.0120171 0.0488251 -0.0993297 0.022637 0.189685 0.0612731 -0.0746117 -0.0884881 -0.0588096 -0.0263767 0.0967339 -0.0860012 0.134963 0.0567782 -0.0140392 0.178281 0.0557035 -0.173649 -0.0903606 0.076823 0.173431 -0.149828 0.108129 0.0707189 0.0306843 -0.00847652 -0.0972904 0.04854 0.00670539 0.105788 -0.0684249 -0.026852 0.0127563 -0.0018344 -0.0616846 0.0543106 0.061628 0.0463066 -0.0437495 0.118311 -0.0799972 -0.0812679 0.00910313 -0.0433961 -0.00711875 0.0377357 -0.00116238 -0.0220374 0.0915753 0.00303345 0.0465741 -0.0505765 -0.00627512 -0.106557 0.0105782 0.18298 0.0415899 -0.0655511 0.051035 0.0078491 0.0142045 0.0329709 -0.16581 0.137181 -0.0148859 0.0217769 0.137308 0.0295915 -0.023698 0.0881339 -0.105325 -0.0759848 0.0520116 0.06339 -0.139571 -0.141895 -0.0256012 0.124165 -0.00589238 -0.0137918 -0.0387463 0.0261305 -0.181776 0.154536 -0.0286284 0.00928754 
-0.018019 0.0550844 -0.0716085 0.0911007 0.104011 0.135623 -0.0158616 -0.218262 -0.0354695 -0.0437207 -0.00611735 0.0416166 0.0760856 0.0491583 -0.0191219 0.00284617 0.0150737 0.0801094 0.011 0.131325 0.114689 -0.130602 0.0530032 0.173112 0.0744388 -0.00982882 -0.175131 -0.185305 0.0597435 0.132523 0.112873 0.146169 -0.0413281 -0.0364775 0.0844646 0.147077 -0.0527147 0.0775034 -0.0350917 -0.14794 0.0226989 0.0185358 0.00231418 0.0209822 -0.085819 0.0474018 0.193871 0.0594037 -0.0822761 -0.0789694 -0.0532536 -0.039817 0.129289 -0.0838153 0.143964 0.0738879 -0.0203095 0.174864 0.0605491 -0.162274 -0.093101 0.121266 0.158789 -0.169111 0.115023 0.0873995 0.0333939 -0.0122372 -0.115701 0.0702156 0.0132388 0.087337 -0.0618941 -0.0398175 0.0229009 0.0277103 -0.0633303 0.0310784 0.0455417 0.0253409 -0.0272398 0.138206 -0.0911543 -0.0863108 -0.00822657 -0.0204499 -0.0193719 0.0127605 -0.0430904 0.0116482 0.0979476 -0.00465986 0.0630532 -0.0455282 -0.00826721 -0.0724229 0.00115697 0.172011 0.0569857 -0.0561328 0.0662647 0.00979321 0.00847963 0.0136564 -0.161792 0.14076 -0.0189539 -0.00132579 0.0804206 0.0519311 -0.0152346 0.0711922 -0.0742988 -0.0903594 0.0292841 0.0620681 -0.152604 -0.123509 -0.0292842 0.118066 0.0108489 -0.026967 -0.0326803 0.0104077 -0.169929 0.177358 -0.023312 -0.00373188 
-0.0203198 0.0554962 -0.0712412 0.0738035 0.0690149 0.114945 -0.0126967 -0.167833 -0.0582059 -0.0159778 0.00221882 0.0121572 0.0997464 0.0254922 -0.0109975 0.00983107 -0.0026368 0.0578441 0.0166845 0.147179 0.117299 -0.169795 0.0793291 0.150719 0.0598304 0.0209813 -0.170019 -0.210948 0.0943766 0.092456 0.113315 0.146741 -0.0434637 -0.0347323 0.056896 0.127149 -0.0576166 0.145752 -0.0253777 -0.142218 0.0128478 -0.0105324 -0.0308313 0.0435542 -0.0958641 0.0231904 0.195483 0.0571487 -0.0963019 -0.0797361 -0.0743284 -0.0299605 0.10016 -0.0730528 0.122497 0.0529978 0.00467842 0.165012 0.067691 -0.186824 -0.0896145 0.0857223 0.176129 -0.146374 0.107679 0.0971576 0.0460506 -0.010586 -0.0830652 0.0487535 -0.0237162 0.0939328 -0.0667543 0.00213266 0.0383469 -0.0319207 -0.0669471 0.0563603 0.0654732 0.0520821 -0.0564851 0.100206 -0.0955652 -0.105915 -0.00408798 -0.0315101 -0.0113694 0.0349284 0.000484316 -0.0292722 0.107399 0.00702345 0.0603513 -0.0620952 -0.00955939 -0.0998835 0.0179295 0.193032 0.0518349 -0.0647075 0.0374718 -0.00313876 0.0086787 0.0392469 -0.146318 0.135944 -0.0130059 0.0370345 0.136642 0.0110772 -0.0330324 0.117175 -0.0921565 -0.0921632 0.0592639 0.0550461 -0.137337 -0.155103 0.000111642 0.114699 -0.00478929 -0.0217942 -0.0305253 0.0352356 -0.175796 0.143703 -0.0269436 0.0169308 
0.00652013 0.035641 -0.0766183 0.0577771 0.0918244 0.133598 -0.00615382 -0.152993 -0.0558162 -0.0386501 -0.00597059 0.0257685 0.112373 0.00364851 -0.0232658 0.00218846 -0.0212795 0.0529663 -0.0281722 0.165158 0.143997 -0.166886 0.093475 0.18056 0.0664119 -0.0086162 -0.156817 -0.217502 0.0729688 0.096146 0.109563 0.113225 -0.0687717 -0.00867996 0.0434029 0.110205 -0.0775279 0.138033 -0.030162 -0.133731 0.0193749 -0.0197948 -0.0298321 0.068942 -0.104561 -0.00200763 0.18535 0.0741278 -0.0790701 -0.0365763 -0.046706 -0.0497781 0.076763 -0.0653234 0.132279 0.0298167 -0.00613894 0.184243 0.0713454 -0.204408 -0.0797092 0.0838623 0.178712 -0.133621 0.0824165 0.0509588 0.0340323 0.0107448 -0.0880679 0.0451689 -0.0208069 0.113653 -0.0682711 -0.00929154 0.0227537 -0.0252834 -0.0648232 0.0545763 0.076154 0.101783 -0.0421172 0.0767967 -0.0708568 -0.101612 -0.01873 -0.030328 0.0120124 0.0490958 0.00410416 -0.0335767 0.0991453 -0.0259466 0.052232 -0.0613582 -0.0413021 -0.103555 0.0039919 0.182508 0.041106 -0.0765426 0.0479585 0.00385222 -0.000104772 0.0734783 -0.140564 0.112328 -0.0555636 0.0691274 0.120288 0.00263991 -0.0192506 0.136546 -0.10804 -0.052658 0.0448553 0.0822708 -0.14716 -0.122023 -0.0221542 0.144234 -0.0140866 -0.00769936 -0.0405994 0.0419849 -0.18543 0.121878 -0.0514424 0.0101108 
-0.0307135 0.0573155 -0.0840779 0.0675993 0.094436 0.0914641 0.0039742 -0.170427 -0.0325745 -0.0239671 -0.0128717 0.0153985 0.0885098 0.0122252 -0.0207286 0.0188216 -0.0278088 0.0487445 -0.009643 0.163353 0.119484 -0.181751 0.0824803 0.137863 0.0616499 -0.000902715 -0.162998 -0.20554 0.0817887 0.0999693 0.105395 0.125766 -0.0315209 -0.0308994 0.0705993 0.124332 -0.0505429 0.146411 -0.0519159 -0.168844 0.0150649 -0.0171941 0.00399276 0.072296 -0.0954724 0.0539707 0.200613 0.0739374 -0.0907592 -0.0551194 -0.0928039 -0.0523893 0.0817832 -0.0781436 0.156684 0.0443053 -0.0329061 0.159642 0.0549233 -0.185209 -0.0825244 0.0657395 0.181728 -0.127468 0.11926 0.0765702 0.00197045 -0.00101834 -0.0882604 0.0459963 -0.0148685 0.0956425 -0.0661334 -0.0126183 0.0307689 -0.0146093 -0.0529617 0.0745414 0.0678396 0.0387011 -0.0481135 0.0899688 -0.116143 -0.0957198 -0.0219131 -0.0298996 -0.0249894 0.0544095 0.0167008 -0.0036974 0.11135 -0.00674999 0.0338249 -0.0895561 -0.00875724 -0.0829349 0.00579502 0.183569 0.0582532 -0.0777456 0.0364575 -0.0170206 0.0138008 0.00924597 -0.154031 0.130292 -0.0340187 0.0582228 0.138241 0.0175275 -0.0289271 0.119758 -0.096309 -0.0786054 0.0652297 0.057675 -0.120415 -0.137186 -0.00268214 0.134408 -0.00325696 0.00886763 -0.0234286 0.0660328 -0.181218 0.128252 -0.0191101 -0.00195209 
-0.0187846 0.0418109 -0.0628785 0.0689667 0.089438 0.110437 0.00951796 -0.168047 -0.0361154 -0.0321806 -0.0101227 0.029241 0.0935259 0.00583529 -0.0195106 0.00698459 -0.0412741 0.0611236 -0.0285392 0.160968 0.126233 -0.170924 0.0805695 0.164688 0.0540407 -0.00200179 -0.163864 -0.214502 0.0724037 0.0998788 0.0979688 0.129103 -0.0475572 -0.0134567 0.0668978 0.121463 -0.0616143 0.141182 -0.0572567 -0.159757 0.0266132 -0.0276616 -0.0146541 0.0672024 -0.102537 0.0388195 0.191745 0.0710351 -0.0972275 -0.0462362 -0.0744426 -0.0551672 0.08358 -0.0713797 0.160082 0.0467475 -0.0292151 0.169404 0.0520851 -0.184589 -0.0806148 0.0764482 0.180543 -0.12513 0.112568 0.0727529 0.0116163 -0.00071609 -0.0965649 0.0601766 -0.0203202 0.093396 -0.0652134 -0.0105984 0.0292035 -0.0139127 -0.058655 0.0639114 0.07338 0.0508415 -0.0435764 0.0903977 -0.106299 -0.107059 -0.0288116 -0.0321949 -0.00500541 0.0520906 0.00121639 0.00817622 0.117777 -0.0190512 0.0416476 -0.0793697 -0.0344282 -0.0792065 0.000570362 0.171593 0.0724351 -0.0747157 0.0526915 -0.0103597 0.00243893 0.0232879 -0.137724 0.120935 -0.0428107 0.0569904 0.120496 0.011486 -0.0247961 0.132902 -0.0961263 -0.0828591 0.0649175 0.0681963 -0.130431 -0.134611 -0.0061377 0.141571 0.00329888 -0.0029851 -0.0318753 0.0578521 -0.175131 0.139227 -0.0211678 -0.00433493 
-0.0167194 0.0259955 -0.0933826 0.0748063 0.104678 0.107534 0.00821782 -0.172203 -0.0390123 -0.0279724 -0.0152791 0.0297484 0.0911531 0.0310635 -0.0358866 0.011516 -0.0220004 0.0724023 -0.00843621 0.1701 0.12478 -0.185098 0.0785473 0.16029 0.0575831 -0.0162066 -0.16794 -0.198773 0.0608268 0.106267 0.0873185 0.123098 -0.0498544 -0.0309333 0.0664867 0.133405 -0.0663757 0.109625 -0.0612443 -0.178368 0.0172651 -0.00634691 0.00216209 0.0548548 -0.0969509 0.0307056 0.188264 0.0827145 -0.0750538 -0.0390934 -0.0876577 -0.0677108 0.0943098 -0.0714056 0.163097 0.0478771 -0.0256668 0.166491 0.0582542 -0.181176 -0.0685695 0.101989 0.183247 -0.131405 0.103271 0.0899237 -0.00376584 0.000696874 -0.0912069 0.045853 -0.0127904 0.102627 -0.0587142 -0.02072 0.0147988 0.00440166 -0.0365216 0.0582358 0.0726337 0.0177262 -0.0346525 0.0983511 -0.117409 -0.104733 -0.025254 -0.0132279 -0.0250067 0.0590642 0.0148999 0.0028923 0.12289 -0.00318792 0.0443352 -0.0801833 -0.0152437 -0.0743337 -0.00493332 0.179123 0.0609684 -0.0696208 0.0679724 -0.0172052 0.0137888 -0.00475449 -0.143935 0.139921 -0.0380469 0.0329532 0.0994556 0.037204 -0.025078 0.113168 -0.0665563 -0.0834989 0.0480222 0.0686479 -0.112122 -0.113376 -0.0186523 0.126794 -0.0146816 -0.016055 -0.0204 0.0449001 -0.204885 0.14987 -0.0325696 -0.00291168 
-0.0149663 0.0700402 -0.0596966 0.0627218 0.102641 0.147663 -0.00666227 -0.195166 -0.0971363 -0.0133952 -0.0198495 0.03826 0.084833 0.0177268 -0.0200167 0.0160966 -0.0113325 0.0901349 0.00134191 0.154982 0.0987717 -0.131903 0.0780029 0.152445 0.0433233 0.011577 -0.179705 -0.183574 0.0881785 0.0983938 0.0662249 0.140195 -0.0686078 -0.0276699 0.0762502 0.122596 -0.0583744 0.105621 -0.0222173 -0.141855 0.0189172 -0.00807316 0.00728586 0.00978651 -0.108062 0.050406 0.213747 0.0664162 -0.126505 -0.0396339 -0.0462728 -0.0364161 0.0853999 -0.0580259 0.135325 0.0449212 0.00799028 0.173858 0.0498787 -0.16297 -0.0785568 0.135911 0.183074 -0.161815 0.119575 0.0942968 0.0138263 -0.0128727 -0.123906 0.06899 -0.00862349 0.100187 -0.0548058 0.0210582 0.0387752 0.00216517 -0.0524101 0.0394412 0.0830077 -0.000649636 -0.0168818 0.123347 -0.087271 -0.0917563 -0.0203985 -0.0254664 -0.0256788 0.0453029 -0.0119616 0.0244568 0.116681 0.000787909 0.0631596 -0.0385741 -0.0167285 -0.0814893 0.0203427 0.206646 0.053603 -0.0620118 0.0557735 0.0096916 -0.00572326 0.0365993 -0.141427 0.14603 -0.0163488 0.0349796 0.100075 0.0346528 -0.01341 0.111827 -0.0452581 -0.0661495 0.0328409 0.0484236 -0.140872 -0.111964 -0.0244286 0.116019 0.0014445 -0.0453279 -0.00794999 0.00212064 -0.183309 0.174145 -0.0321382 -0.0204422 
-0.0393857 0.0955469 -0.0353876 0.063088 0.0972853 0.126527 -0.019749 -0.201306 -0.0999277 0.0293535 -0.0111664 0.0159958 0.0787655 0.0412618 0.01277 0.0138775 0.0212212 0.126629 0.0270591 0.133146 0.0745801 -0.112351 0.0678606 0.15971 0.0465245 0.00932288 -0.186111 -0.156307 0.116141 0.104671 0.0686895 0.142795 -0.0411276 -0.0456937 0.0946497 0.134718 -0.0460058 0.085198 -0.027171 -0.1431 0.00724341 -0.00234385 0.0115907 0.0108791 -0.112955 0.0732999 0.212815 0.0799065 -0.125727 -0.067287 -0.0326733 -0.00793105 0.0867018 -0.0829498 0.121644 0.0621634 0.0109604 0.147557 0.0648168 -0.144192 -0.0893216 0.131492 0.148566 -0.14419 0.117348 0.0962864 0.0144147 -0.0290767 -0.131004 0.0864659 0.00199617 0.0847481 -0.0527904 0.0041287 0.0432177 -0.000326281 -0.0654645 0.0616046 0.0835162 -0.0357893 -0.0110857 0.147366 -0.0959696 -0.07763 0.00489931 -0.0300417 -0.0425126 0.0319905 -0.0158243 0.0470787 0.0999946 0.0321142 0.0636756 -0.0450054 -0.00391315 -0.0858579 0.00891806 0.212995 0.0450609 -0.0726811 0.0654829 0.0286895 0.0164877 0.00588074 -0.140667 0.149993 0.00200603 -0.00155371 0.138908 0.0458747 -0.0115244 0.0905204 -0.0377847 -0.0825189 0.0260105 0.0307653 -0.124379 -0.138152 -0.0269036 0.104386 0.0161916 -0.0622955 -0.0258266 0.000958503 -0.183886 0.18171 -0.0140377 -0.0125884 
0.00878771 0.0462957 -0.0819971 0.079016 0.111476 0.12736 0.0241487 -0.195 -0.0613227 -0.0388582 -0.0214824 0.0337495 0.0896959 0.0392367 -0.0234827 0.00249859 -0.0172107 0.0721395 -0.0175206 0.161407 0.110138 -0.152612 0.0758668 0.164868 0.0545546 -0.0299499 -0.183866 -0.188065 0.055469 0.126346 0.0626446 0.138451 -0.0715079 -0.0211059 0.0683534 0.122672 -0.0568028 0.104238 -0.0506879 -0.160471 0.0207966 -0.00203696 0.00803813 0.023891 -0.109614 0.0601232 0.188578 0.0774687 -0.0891861 -0.0242919 -0.0561676 -0.0450907 0.0979194 -0.0559102 0.167758 0.0348597 -0.0127342 0.176587 0.0587 -0.164115 -0.0716036 0.126744 0.170931 -0.153342 0.0971664 0.0902044 0.00856204 0.00370632 -0.111872 0.0540067 0.00391377 0.107537 -0.051305 -0.00230558 0.0231945 0.0253239 -0.0396337 0.0267528 0.0748099 0.0243938 -0.0059094 0.105362 -0.105101 -0.105663 -0.0201065 -0.0116052 -0.0283806 0.0357999 -0.0131166 0.0265234 0.122807 -0.0187442 0.0546178 -0.0683661 -0.037447 -0.0797074 0.00952678 0.175252 0.0794775 -0.0703181 0.0771193 0.00746531 0.0175041 0.023118 -0.162346 0.133402 -0.044542 0.0484931 0.087309 0.0457507 0.00273053 0.111442 -0.0646004 -0.0762693 0.0302529 0.0740628 -0.127845 -0.0974337 -0.0323876 0.130283 -0.00971674 -0.0237023 -0.01437 0.0356 -0.18596 0.159238 -0.029563 -0.018365 
0.0120004 0.0501496 -0.0917684 0.0684851 0.120632 0.121947 0.0062767 -0.204975 -0.0713837 -0.0473631 -0.020265 0.0389231 0.0919436 0.0592162 -0.0246847 0.0136854 0.00727771 0.0645543 -0.00752424 0.168374 0.109029 -0.136425 0.0849616 0.154147 0.0474787 -0.0141356 -0.166829 -0.181072 0.0558664 0.130449 0.0568303 0.139478 -0.0542719 -0.0209713 0.0681413 0.131716 -0.0377276 0.117816 -0.0446036 -0.154538 0.00766816 0.0180929 0.0164949 0.0150885 -0.108942 0.0810039 0.202076 0.071856 -0.0945687 -0.0260256 -0.0555818 -0.0449213 0.0947326 -0.047949 0.169775 0.0348716 -0.00549655 0.178709 0.0557074 -0.160074 -0.0734809 0.123236 0.172446 -0.163334 0.110782 0.0798454 0.00471933 0.0194991 -0.104876 0.0587628 0.0116731 0.0974585 -0.0552318 -0.0123906 0.0294041 0.0353174 -0.0383867 0.0337754 0.0689476 0.00810382 -0.00436084 0.116286 -0.106319 -0.101689 -0.0217614 -0.0141018 -0.032356 0.0344089 -0.0213715 0.0279339 0.117379 -0.0236286 0.0545935 -0.0587443 -0.0208602 -0.0765559 0.0146518 0.186637 0.0753198 -0.0703885 0.0636229 0.011187 0.0130036 0.0329027 -0.172758 0.134159 -0.0503011 0.0397955 0.0826653 0.0377171 -0.00272753 0.102751 -0.0607211 -0.0598491 0.0254912 0.0713472 -0.136084 -0.110044 -0.0441736 0.126068 -0.011471 -0.0108847 -0.00517805 0.0335295 -0.178744 0.156854 -0.0310621 -0.0238647 
-0.0181716 0.055943 -0.0820922 0.0507984 0.0842653 0.0974062 -0.00484905 -0.163361 -0.0643049 -0.0222918 -0.00188508 0.0139033 0.0989576 0.0289804 -0.0141314 0.014891 -0.0276342 0.0481101 0.00578236 0.169844 0.117466 -0.165955 0.0960423 0.153318 0.0465469 0.00815101 -0.140228 -0.206031 0.0882073 0.100167 0.0777643 0.0996197 -0.0323416 -0.0292002 0.060156 0.129408 -0.049797 0.152401 -0.0566319 -0.146948 -0.00339381 -0.0162483 -0.00942381 0.0735747 -0.111729 0.0696358 0.211308 0.0709883 -0.105824 -0.0374325 -0.0803478 -0.0462901 0.0677598 -0.0593488 0.160619 0.0430313 -0.0160274 0.172905 0.0599668 -0.175852 -0.0743194 0.0732547 0.191896 -0.125907 0.118061 0.0594278 0.00734907 0.00198419 -0.0777858 0.0597033 -0.0167098 0.0953311 -0.0685509 -0.00746178 0.0451781 -0.0166571 -0.052944 0.0854235 0.0774953 0.0333614 -0.039499 0.0827333 -0.11608 -0.103156 -0.02751 -0.0255708 -0.0242473 0.0457249 0.0126969 0.00215176 0.116527 -0.0147489 0.040198 -0.0856129 -0.0137914 -0.0932694 0.00753734 0.19354 0.0749802 -0.0792354 0.0335836 0.000854191 0.0118561 0.0156011 -0.158326 0.1327 -0.0452155 0.0571782 0.126614 0.00180916 -0.0161392 0.128177 -0.0797383 -0.0780122 0.0546179 0.072404 -0.111592 -0.14705 -0.0148169 0.13585 -0.0103623 -0.00771478 -0.0257179 0.0619473 -0.186537 0.137123 -0.0233961 0.00482121 
-0.012714 0.032041 -0.0751118 0.113415 0.105623 0.1526 0.0260466 -0.212474 -0.0122065 -0.0543797 -0.021093 0.0500389 0.0719167 0.0293012 -0.0346582 0.00823007 -0.0221077 0.0515497 -0.0214999 0.122971 0.11187 -0.16317 0.0462527 0.164239 0.0772261 -0.0304285 -0.206718 -0.198115 0.0353748 0.112838 0.12452 0.170759 -0.0860934 -0.024927 0.0513282 0.136794 -0.0700884 0.0679563 -0.0354754 -0.129716 0.0629711 0.00303295 -0.00514926 -0.0103264 -0.0690095 0.00900889 0.160701 0.0501785 -0.0485063 -0.0839801 -0.0587027 -0.059751 0.132422 -0.0781095 0.139164 0.0698918 -0.0182445 0.185976 0.0628232 -0.143152 -0.092343 0.145585 0.147675 -0.187145 0.112962 0.119814 0.0401883 -0.016436 -0.115296 0.0480436 3.9249e-05 0.123512 -0.048302 -0.00199796 0.0322344 0.0433696 -0.0435126 0.00849246 0.0312197 0.0391773 -0.0240241 0.108797 -0.07258 -0.0790378 -0.033317 0.00314792 0.00603146 0.0189229 -0.0709669 -0.0246309 0.102733 -0.0159413 0.0830675 -0.0484468 -0.0327966 -0.0582466 0.00694912 0.140715 0.0731598 -0.0206069 0.0720616 -0.0217384 -0.00516487 0.0357898 -0.133626 0.130926 -0.0228235 0.0272374 0.0465703 0.0558298 -0.0406338 0.0797 -0.0608836 -0.0965818 0.0316461 0.0755177 -0.160328 -0.0570044 -0.0339072 0.122433 0.00175541 -0.0266963 -0.034892 0.00811774 -0.180879 0.189032 -0.0709564 0.00235764 
0.00531732 0.0314705 -0.0916918 0.0900588 0.104727 0.117217 -0.00934025 -0.176933 -0.0338646 -0.051745 0.0151855 0.0491081 0.100389 0.0493804 -0.0317097 0.00366733 0.031907 0.0494382 0.0042172 0.156555 0.151027 -0.164089 0.0731098 0.185337 0.0935241 -0.0132121 -0.148061 -0.199122 0.0752039 0.134465 0.123522 0.123506 -0.0344603 -0.0284525 0.036063 0.120387 -0.0681314 0.128152 -0.0267038 -0.134561 0.0123896 0.0253963 -0.0221683 0.043332 -0.0947863 -0.00463853 0.180635 0.0383152 -0.0452683 -0.0857518 -0.0433896 -0.0282756 0.101926 -0.0751683 0.137462 0.0577668 -0.0206849 0.197812 0.0575836 -0.173828 -0.0988821 0.0676947 0.169754 -0.16675 0.104708 0.0656623 0.0375399 -0.00241892 -0.101124 0.043429 0.00611424 0.107873 -0.0740307 -0.0411409 0.0269283 0.0106404 -0.0420963 0.0467339 0.0435207 0.0889125 -0.0646181 0.0922011 -0.0549849 -0.0868678 0.00405499 -0.0365318 0.0074945 0.03273 -0.0224104 -0.0507529 0.0715443 -0.0280509 0.0557505 -0.0328732 -0.00847412 -0.115417 0.00456707 0.162927 0.0457718 -0.0582713 0.0354048 0.00596138 0.00699651 0.0693054 -0.164619 0.135741 -0.0269805 0.0299605 0.11708 -0.00520976 -0.0354787 0.0933355 -0.110592 -0.0505484 0.049183 0.0789327 -0.15458 -0.118922 -0.0286373 0.146557 -0.0248842 -0.000838293 -0.0644898 0.0213712 -0.159963 0.161262 -0.037256 0.0158914 
-0.0125209 0.0579002 -0.101766 0.0366679 0.0903254 0.0898758 -0.0203422 -0.14436 -0.0856652 -0.00961672 0.00408876 0.0185773 0.11564 0.025403 -0.0212411 0.0317059 -0.0041298 0.0336132 0.00901694 0.179227 0.128977 -0.177531 0.103412 0.12313 0.0522574 0.0425692 -0.131935 -0.212753 0.0993592 0.0885184 0.081323 0.119096 -0.0335748 -0.0281472 0.0263052 0.11305 -0.0561192 0.187704 -0.0225126 -0.124422 -0.00281375 -0.00166975 -0.0138255 0.070967 -0.107515 0.0432713 0.216595 0.0508205 -0.105333 -0.060839 -0.0692672 -0.0427855 0.0399591 -0.0541355 0.131833 0.0323561 0.00249511 0.175587 0.0637054 -0.184009 -0.0711462 0.0483492 0.19203 -0.123146 0.11779 0.0536433 0.0134924 0.0284551 -0.0489052 0.0355596 -0.0151629 0.110973 -0.0645304 -0.000780637 0.0453321 -0.0255772 -0.0624714 0.0893757 0.0645147 0.0486886 -0.0653566 0.0844681 -0.090225 -0.0905107 -0.0323229 -0.0305478 0.00221248 0.0596121 0.0294085 -0.0514013 0.0858468 -0.0157374 0.0363604 -0.0688875 -0.00541346 -0.112476 0.023928 0.20073 0.0481531 -0.0785382 -0.00299633 -0.0114257 0.0106073 0.0685247 -0.163796 0.126144 -0.0558152 0.0818266 0.139608 -0.0258012 -0.0279964 0.133276 -0.106456 -0.0487269 0.0588225 0.0554473 -0.142162 -0.161564 -0.01451 0.121711 -0.0226575 0.0203772 -0.0222264 0.0570375 -0.175976 0.113253 -0.0484643 0.0106298 
-0.0249143 0.0456508 -0.0587821 0.071174 0.0928622 0.0991946 -0.000486141 -0.16175 -0.0507742 0.00268347 0.00105915 0.017037 0.100371 0.0327518 0.022366 0.0111232 -0.00422988 0.0558043 0.00236772 0.156852 0.105126 -0.167807 0.0981901 0.163346 0.0697103 0.000283483 -0.165553 -0.205442 0.0869562 0.0887867 0.119158 0.125524 -0.0331368 -0.0297002 0.0510294 0.137116 -0.0616889 0.151407 -0.0499041 -0.136003 0.0190346 -0.00762801 -0.0317435 0.0562015 -0.119374 0.0413797 0.185246 0.072915 -0.069419 -0.0675917 -0.0606112 -0.0342166 0.0714609 -0.0849689 0.145646 0.0434994 -0.0189195 0.17226 0.0681968 -0.162659 -0.101517 0.0615458 0.155381 -0.133632 0.116937 0.0740797 0.0207537 0.012512 -0.0906028 0.064184 -0.00190494 0.124118 -0.0660614 -0.00762089 0.0425551 -0.0172932 -0.0676294 0.080012 0.0726519 0.051205 -0.0531567 0.086873 -0.0918734 -0.0978961 -0.0138976 -0.0415631 -0.00144236 0.052734 -0.001106 -0.0227038 0.0898407 0.00613892 0.0556706 -0.0801826 -0.0225952 -0.107106 0.00575468 0.175135 0.0586164 -0.0806007 0.0322759 -0.00651872 0.0186545 0.0196807 -0.149878 0.127167 -0.0406964 0.0347298 0.168503 0.00842185 -0.0323471 0.13319 -0.0914411 -0.0790698 0.0656189 0.0618917 -0.1237 -0.145736 -0.0205332 0.147661 0.00388309 -0.00551661 -0.0490013 0.0654438 -0.17875 0.139746 -0.0242878 0.0227958 
0.000661597 0.0419496 -0.0992406 0.0547816 0.104109 0.0842658 -0.00838274 -0.162351 -0.0768629 -0.0292684 0.00164533 0.02509 0.109606 0.0456698 -0.012615 0.008502 0.0219792 0.0371154 0.0339393 0.177534 0.129425 -0.158129 0.0883214 0.127981 0.0675145 0.028951 -0.14833 -0.207048 0.104062 0.115993 0.0904294 0.117765 -0.0302394 -0.0451812 0.0524813 0.112425 -0.0556207 0.169791 -0.0147646 -0.144127 -0.0035567 0.02208 -0.0216686 0.0661874 -0.121385 0.0546012 0.199324 0.0492512 -0.0742023 -0.0755981 -0.0742026 -0.0220663 0.0726713 -0.0652156 0.132662 0.0257816 -0.00315469 0.17984 0.0507928 -0.16777 -0.0743058 0.0502812 0.184696 -0.127905 0.115475 0.0436939 0.0281332 0.0108032 -0.0595293 0.0238385 0.00551076 0.108322 -0.066892 -0.0181789 0.0261252 -0.0128173 -0.0630475 0.0647688 0.0697711 0.0749588 -0.058495 0.086287 -0.0800857 -0.0820123 0.00944588 -0.056356 -0.00404578 0.0513026 0.0114848 -0.053568 0.08828 0.00268943 0.0429419 -0.0561291 -0.0118843 -0.1382 0.0333245 0.191451 0.046236 -0.0849943 0.0105148 0.0129899 0.0226765 0.0515486 -0.182906 0.130774 -0.0218818 0.0664149 0.159431 0.00152072 -0.0124836 0.0972258 -0.122361 -0.0548088 0.0479246 0.0678183 -0.140286 -0.157757 -0.0302503 0.126243 -0.0353824 0.0118736 -0.0434816 0.0439004 -0.167923 0.125742 -0.0326711 0.0144842 
0.0159123 0.0325752 -0.111665 0.0335057 0.0821355 0.0951586 -0.0204037 -0.121664 -0.0901891 -0.02101 0.0100797 0.0321105 0.124543 0.00502451 -0.0447814 0.0244504 -0.00865708 0.0326277 -0.00468836 0.19381 0.14807 -0.177154 0.115367 0.149637 0.0437308 0.0370266 -0.103414 -0.227559 0.0891592 0.0893372 0.0613814 0.0998229 -0.0408806 -0.0124546 0.00430553 0.0847192 -0.0683994 0.197765 -0.0261747 -0.11158 -0.0107078 -0.0109801 -0.0364002 0.0876809 -0.117175 0.0160993 0.208477 0.0463722 -0.0945554 -0.0298819 -0.0418726 -0.03892 0.0285972 -0.0359257 0.133284 0.0138333 0.0251925 0.174803 0.0704222 -0.197293 -0.0560785 0.0344743 0.198901 -0.108103 0.0922395 0.0112994 0.0187893 0.0304888 -0.0368508 0.0343682 -0.0290275 0.108857 -0.0707266 0.00595515 0.0371713 -0.0392403 -0.0572835 0.0968468 0.0664733 0.0871559 -0.0691544 0.0677374 -0.0725856 -0.0975589 -0.0270109 -0.0286939 0.0173303 0.0642425 0.0361746 -0.0682537 0.0776452 -0.0305076 0.0296218 -0.0634383 -0.0208275 -0.122748 0.0225899 0.196252 0.0498192 -0.0890909 0.00857341 -0.0013428 0.00834178 0.105618 -0.14793 0.100612 -0.0706346 0.0987101 0.12822 -0.0427536 -0.0237901 0.154895 -0.107856 -0.03471 0.0507798 0.0725675 -0.137298 -0.162223 -0.0187444 0.12977 -0.0367672 0.0267507 -0.0258805 0.0482074 -0.176943 0.100152 -0.0566736 0.0153533 
