0.101178 0.0397723 -0.0934686 -0.00427094 0.0470113 0.115085 0.102364 0.024076 -0.0882717 -0.0339948 0.0329437 0.0747597 0.1351 -0.190405 -0.0962921 -0.0105118 -0.111474 -0.0190563 -0.185724 0.235274 0.103876 -0.13585 0.0956078 0.0690661 -0.0801731 -0.0368052 -0.0953544 -0.187009 0.0339917 0.0458991 -0.052501 0.0670916 -0.0735322 0.122238 -0.0813658 -0.0617662 -0.0700024 0.180167 -0.0773061 -0.0382665 -0.00351261 -0.145707 -0.0443342 0.106467 -0.139987 -0.0550203 0.115795 0.0516157 -0.124734 0.181635 0.0231414 -0.0560974 -0.117057 0.027875 0.0786739 -0.073131 -0.031626 0.0846156 0.00249868 -0.090787 -0.0508459 -0.0156506 0.184276 -0.0587293 0.0386585 -0.12231 -0.01287 -0.0278817 -0.106077 -0.00961139 -0.0593053 0.0472288 -0.025366 0.131943 0.0041426 -0.0456796 0.0339828 0.0372312 0.0467995 0.144347 -0.0261158 -0.104227 -0.0352465 -0.0361906 -0.0478307 0.0309671 0.0476041 0.0357796 0.07645 0.0247069 0.0963041 -0.148259 -0.0846352 -0.00715586 -0.0893401 -0.0687901 0.00286875 0.0549802 0.0166943 -0.0449115 0.0198951 0.0336924 -0.0494792 0.174233 -0.0469301 0.0213167 -0.0858403 0.239991 0.0720647 -0.0680904 0.00138621 0.199582 -0.0838817 0.033221 0.013553 0.061081 -0.0365086 -0.0162216 0.0338778 0.172782 -0.0578529 0.0326338 0.0161829 0.104422 -0.0351116 -0.0132346 -0.00224303 -0.0647249 
0.0983642 0.040951 -0.0888776 -0.00197758 0.0456954 0.10711 0.100481 0.028976 -0.0740675 -0.0368986 0.0381797 0.0740944 0.141951 -0.192547 -0.0931607 -0.00276548 -0.103447 -0.0116396 -0.206296 0.233021 0.108505 -0.129729 0.0989148 0.0814031 -0.0872365 -0.0496426 -0.097201 -0.189444 0.0318754 0.047187 -0.0460974 0.0762829 -0.0614247 0.130374 -0.0910784 -0.0650148 -0.067775 0.178402 -0.0897776 -0.0208861 -0.00147167 -0.143917 -0.0472316 0.104144 -0.135166 -0.0636374 0.108358 0.0486214 -0.115464 0.180716 0.0339969 -0.0691399 -0.120743 0.0229188 0.0600056 -0.0641026 -0.0294907 0.0765086 0.0130949 -0.0803673 -0.0567697 -0.0183813 0.161224 -0.0576545 0.0301691 -0.138151 -0.0100674 -0.034662 -0.110026 -0.0161725 -0.0617054 0.0352487 -0.0244654 0.122761 0.00566805 -0.0428763 0.0305623 0.040213 0.034041 0.146936 -0.0230042 -0.106797 -0.0385758 -0.030546 -0.0486904 0.050347 0.0509064 0.0183912 0.0566641 0.0207442 0.0830655 -0.153631 -0.089777 -0.013063 -0.0907533 -0.0545041 -0.013155 0.049126 0.0118785 -0.036435 0.0205945 0.0240777 -0.0474595 0.189715 -0.0374117 0.00578356 -0.0940567 0.239419 0.0676337 -0.0734225 -0.0123903 0.195781 -0.0853191 0.0302073 0.000814968 0.0648049 -0.0404028 -0.0152813 0.0272869 0.17946 -0.0556692 0.0414623 -0.000489142 0.113716 -0.0319028 -0.0210115 -0.0204069 -0.0657558 
0.104232 0.0681416 -0.101213 -0.028172 0.0585036 0.122943 0.100006 0.0412403 -0.109179 -0.0202378 0.0362671 0.0547237 0.144359 -0.178266 -0.0738524 -0.00353482 -0.085613 -0.0243251 -0.182109 0.223986 0.101029 -0.119564 0.0849807 0.0609244 -0.0706405 -0.0435585 -0.0883052 -0.162786 0.0574917 0.0437293 -0.04796 0.0614427 -0.0710696 0.128611 -0.0916023 -0.059786 -0.0571755 0.157031 -0.0704217 -0.0279756 0.0105783 -0.148551 -0.0163106 0.119654 -0.143948 -0.0395263 0.125948 0.0579232 -0.144695 0.171937 0.028427 -0.0532293 -0.141848 0.023821 0.0633895 -0.0670986 -0.0464335 0.0893691 0.0144945 -0.093403 -0.06196 -0.0152227 0.17531 -0.0655867 0.0270192 -0.114787 -0.0175317 -0.02387 -0.103652 -0.0147415 -0.0556024 0.046725 -0.0307254 0.118027 0.0206955 -0.0416663 0.0335348 0.0583606 0.0445845 0.13436 -0.0173584 -0.0981172 -0.0230685 -0.02314 -0.0450589 0.0472075 0.0487375 0.0250102 0.0776201 0.035187 0.0934156 -0.153604 -0.106596 -0.0161386 -0.0834102 -0.0672506 0.00571631 0.0667497 -0.00348753 -0.0538822 0.00256402 0.0384038 -0.0307422 0.187372 -0.076571 0.032077 -0.107142 0.255365 0.0704899 -0.0846029 0.0111281 0.190054 -0.0966876 0.0442718 0.00812482 0.0417795 -0.0345189 -0.0291255 0.0363346 0.175789 -0.0450792 0.0269876 0.0198841 0.11915 -0.0403316 -0.0317754 -0.0119532 -0.0657472 
0.102488 0.0498325 -0.0953885 -0.0374728 0.0606198 0.127665 0.111793 0.0447004 -0.107347 -0.0333995 0.0185831 0.0593177 0.142595 -0.163805 -0.0493345 -0.0190213 -0.114563 -0.0578283 -0.173651 0.210833 0.0920917 -0.111695 0.0838018 0.0562865 -0.0656183 -0.0465521 -0.0870066 -0.163202 0.0363487 0.04986 -0.0469646 0.046997 -0.0789034 0.127594 -0.0847741 -0.0518159 -0.0574341 0.151465 -0.0747961 -0.0223367 0.0180948 -0.147894 -0.0133953 0.117417 -0.146758 -0.0289137 0.118596 0.0613265 -0.129793 0.182268 0.0200634 -0.0652225 -0.129108 0.0287268 0.089309 -0.0670126 -0.064394 0.111098 -0.000394269 -0.0869287 -0.0660194 -0.0102572 0.17461 -0.0635679 0.0304545 -0.10081 -0.0175959 -0.0139762 -0.105601 -0.0246978 -0.0499638 0.0635141 -0.0329959 0.114788 0.0330855 -0.0213 0.0318189 0.0267462 0.0597955 0.157686 -0.00201607 -0.11915 -0.0189912 -0.0201186 -0.0559281 0.0348189 0.0561061 0.0272624 0.074632 0.0418838 0.098882 -0.159415 -0.0988613 -0.015809 -0.106073 -0.0630753 0.00955014 0.0539281 0.0167634 -0.0493025 0.00534351 0.035888 -0.0327015 0.163609 -0.095274 0.0358485 -0.128376 0.256495 0.0566421 -0.0788122 0.0299244 0.187606 -0.103025 0.0349457 0.00822367 0.064954 -0.0225815 -0.0066608 0.0298901 0.189648 -0.0322926 0.0157058 0.0250723 0.12028 -0.0402038 -0.0289845 -0.00650003 -0.0582322 
0.0971552 0.0501018 -0.0932841 -0.0453004 0.0584478 0.122566 0.107157 0.0507157 -0.104588 -0.0318628 0.0172996 0.0555601 0.147544 -0.155618 -0.0465716 -0.0269607 -0.115685 -0.0621617 -0.176093 0.209139 0.0863078 -0.111685 0.0859643 0.0598937 -0.0638345 -0.0483269 -0.0799296 -0.153176 0.0389292 0.0436212 -0.0409737 0.040968 -0.0765823 0.126117 -0.0924844 -0.0520436 -0.0618575 0.151629 -0.0788657 -0.0153589 0.0204295 -0.149363 -0.0186734 0.12357 -0.148906 -0.0334024 0.11156 0.0671608 -0.122246 0.183871 0.0162967 -0.0604475 -0.128757 0.0255126 0.0824844 -0.0666954 -0.0671245 0.113476 0.00518575 -0.0925873 -0.0705501 -0.00929154 0.170539 -0.0525249 0.0162358 -0.0980044 -0.0118811 -0.0109781 -0.100807 -0.0266465 -0.0503702 0.0620802 -0.0304864 0.114887 0.0388203 -0.0240358 0.026716 0.0235046 0.0618605 0.164112 -0.00201835 -0.122983 -0.0140132 -0.018327 -0.0533643 0.0331335 0.0593262 0.0298047 0.0790039 0.0361218 0.0973571 -0.157099 -0.0932118 -0.0184016 -0.106926 -0.0690101 0.00359231 0.0552127 0.0154426 -0.0573908 0.00372068 0.0364179 -0.0277159 0.165828 -0.0992311 0.0357967 -0.135378 0.257504 0.0624764 -0.0832976 0.0350223 0.192399 -0.107533 0.0401369 0.00174626 0.0654846 -0.0214337 -0.00663613 0.0348958 0.191471 -0.0299507 0.013302 0.0158028 0.120411 -0.049613 -0.0342804 -0.0121539 -0.0513194 
0.100307 0.0528889 -0.100343 -0.0389936 0.0595687 0.118053 0.109463 0.0476945 -0.0999525 -0.0360935 0.0131573 0.0502662 0.14517 -0.169616 -0.0502175 -0.0159786 -0.109585 -0.0621527 -0.184043 0.215858 0.0823583 -0.108241 0.0855138 0.0562162 -0.074976 -0.0506271 -0.0891693 -0.163077 0.0379314 0.0397833 -0.0395423 0.0550418 -0.0794651 0.125887 -0.090442 -0.0509629 -0.0519238 0.153291 -0.0845373 -0.0126185 0.0231316 -0.146792 -0.0170019 0.121087 -0.14279 -0.0232057 0.116279 0.0696832 -0.122067 0.184046 0.0153571 -0.0714059 -0.129599 0.024523 0.076911 -0.0711477 -0.0610103 0.102318 0.0148284 -0.0871178 -0.0685471 -0.00505031 0.160331 -0.0573947 0.01902 -0.111404 -0.00775621 -0.0193549 -0.0960501 -0.0370118 -0.0539018 0.0570048 -0.0231164 0.120596 0.0340116 -0.0264369 0.0253 0.036614 0.0549503 0.156758 0.00744661 -0.116699 -0.0295849 -0.0198894 -0.0502036 0.045652 0.0525162 0.0231028 0.0654077 0.0342247 0.0985269 -0.152769 -0.0997819 -0.0287778 -0.103314 -0.0570091 0.00898503 0.0521022 0.0106355 -0.0509598 7.26123e-05 0.0288417 -0.0274661 0.172813 -0.0971441 0.024558 -0.133209 0.262923 0.0582066 -0.069174 0.0294949 0.190995 -0.104012 0.0354651 -0.00945899 0.0605971 -0.0266291 -0.0122389 0.0244457 0.181114 -0.036396 0.0271673 0.0222912 0.129855 -0.0483478 -0.0445893 -0.0287521 -0.0631228 
0.102697 0.0662703 -0.103355 -0.0331426 0.0614363 0.121395 0.0982467 0.0386095 -0.114961 -0.0186953 0.032698 0.0564024 0.144528 -0.17455 -0.0735678 -0.00341902 -0.0847973 -0.0218981 -0.183262 0.226006 0.093891 -0.114564 0.0881562 0.0584212 -0.0769645 -0.0393772 -0.0846951 -0.160338 0.0550061 0.040214 -0.051736 0.0613354 -0.0741016 0.127709 -0.092276 -0.0570364 -0.0587322 0.156714 -0.0750039 -0.0229499 0.0106438 -0.14456 -0.017165 0.123883 -0.148534 -0.0333392 0.128221 0.0616351 -0.146791 0.17531 0.0303098 -0.0594722 -0.146685 0.0229965 0.061193 -0.0679733 -0.0469929 0.094419 0.0199109 -0.089772 -0.0608239 -0.0103433 0.175678 -0.0622948 0.0301402 -0.12066 -0.0178331 -0.020385 -0.102366 -0.0107083 -0.0530703 0.0477535 -0.022585 0.119976 0.0176661 -0.0410088 0.0305312 0.0597693 0.0434272 0.125017 -0.0124708 -0.094645 -0.0280778 -0.0248 -0.0509294 0.0438922 0.0494866 0.024408 0.0748712 0.0367811 0.093888 -0.15154 -0.106016 -0.0205371 -0.0806083 -0.0631268 0.00687043 0.0671572 -0.00447457 -0.0534976 -0.00119819 0.0391929 -0.0304305 0.187075 -0.0788906 0.0293682 -0.113534 0.254367 0.0666977 -0.0817951 0.0173205 0.193382 -0.0920913 0.0478351 0.00111406 0.0386425 -0.0351138 -0.0312394 0.0327257 0.171477 -0.0458566 0.0269716 0.0209863 0.119346 -0.0423582 -0.0347619 -0.0211608 -0.070457 
0.0988705 0.0375182 -0.088229 -0.00842096 0.0546671 0.110998 0.102199 0.0312955 -0.0859019 -0.0309048 0.0385915 0.0761416 0.146918 -0.178771 -0.0924869 -0.00715513 -0.0979044 -0.00619075 -0.20264 0.232317 0.110283 -0.133144 0.0991349 0.0857253 -0.0803422 -0.0480515 -0.0966635 -0.180017 0.0400264 0.0451214 -0.0458746 0.0698467 -0.0715621 0.125986 -0.0970694 -0.0623379 -0.0814966 0.174745 -0.085427 -0.0192229 0.000748037 -0.135609 -0.0497604 0.106765 -0.141714 -0.0694728 0.107279 0.0519294 -0.115139 0.17491 0.0341107 -0.0640624 -0.127369 0.0183693 0.0586568 -0.0626235 -0.0304589 0.0948519 0.0154362 -0.0828111 -0.056047 -0.0123694 0.17007 -0.0537215 0.0264931 -0.130408 -0.012207 -0.0256638 -0.109501 -0.00966184 -0.0546486 0.0497205 -0.0212891 0.124145 0.00290575 -0.0413963 0.0297173 0.0396717 0.0381036 0.140148 -0.0274355 -0.102671 -0.0288707 -0.0314906 -0.0524394 0.0436644 0.0588518 0.0273057 0.0633032 0.0127138 0.0845363 -0.149817 -0.0840318 -0.0112011 -0.0857805 -0.0646228 -0.0128677 0.0537028 0.00809166 -0.0393672 0.0172921 0.0289886 -0.0450057 0.193016 -0.0448389 0.01536 -0.100251 0.235573 0.0746147 -0.0799577 -0.00589475 0.19894 -0.0868191 0.0394581 0.00390011 0.0651344 -0.0411181 -0.0135526 0.0271401 0.180834 -0.0599029 0.0342363 -0.00609185 0.107046 -0.0459386 -0.0142752 -0.0287636 -0.0611036 
0.099456 0.0410077 -0.0950198 -0.0410941 0.0676204 0.120874 0.112369 0.0496563 -0.0996654 -0.0405498 0.0142181 0.0574667 0.145782 -0.162775 -0.0550512 -0.0204487 -0.116737 -0.0567188 -0.185469 0.215029 0.0942253 -0.116565 0.0872627 0.0594722 -0.0697836 -0.0557181 -0.0930679 -0.160512 0.037598 0.0413872 -0.0395546 0.0459885 -0.0838075 0.124454 -0.0911105 -0.0512459 -0.0661633 0.147158 -0.082099 -0.0172608 0.0230654 -0.142191 -0.0201679 0.118624 -0.144083 -0.0348006 0.108396 0.0678151 -0.117271 0.182791 0.00775227 -0.0730464 -0.130395 0.0231544 0.0769238 -0.0685222 -0.0623102 0.114119 0.00262004 -0.0825436 -0.0626417 0.00113261 0.16882 -0.0526913 0.0200234 -0.106293 -0.0147634 -0.0156552 -0.0987823 -0.030867 -0.05006 0.0648196 -0.0255004 0.11688 0.0285792 -0.021367 0.0304729 0.0272645 0.0582244 0.155702 -0.00103787 -0.120174 -0.0232221 -0.0165718 -0.0575435 0.043905 0.0585541 0.0314202 0.0681605 0.0303488 0.105339 -0.154293 -0.0952649 -0.0218921 -0.102376 -0.0628875 -1.12931e-05 0.0526176 0.0109655 -0.0456847 0.00496825 0.0260873 -0.0332366 0.16684 -0.0893792 0.033453 -0.131425 0.259027 0.0597249 -0.0744015 0.0273314 0.187565 -0.102841 0.0391841 -0.0019262 0.0711015 -0.0228538 0.000778056 0.0274224 0.18921 -0.041048 0.0208913 0.0124812 0.122806 -0.056504 -0.0332627 -0.0292512 -0.058511 
0.09829 0.049361 -0.0909264 -0.0372007 0.0582722 0.120755 0.108675 0.0437557 -0.106634 -0.0321196 0.0161855 0.0591118 0.144491 -0.159736 -0.0515854 -0.0210463 -0.116595 -0.0606106 -0.173862 0.214783 0.0901995 -0.117483 0.0880486 0.0566895 -0.0660623 -0.0443478 -0.0882411 -0.159972 0.0369323 0.0476861 -0.0455885 0.0463278 -0.0764738 0.126158 -0.0878263 -0.0522427 -0.0603061 0.160033 -0.0753649 -0.0224867 0.0138237 -0.148323 -0.017016 0.114131 -0.145848 -0.0312285 0.115736 0.0614671 -0.124087 0.1846 0.0183082 -0.0603824 -0.12704 0.0295679 0.0902327 -0.0694515 -0.0602493 0.109131 0.00162803 -0.089962 -0.0653803 -0.0102892 0.171967 -0.0581343 0.0273942 -0.0993773 -0.015738 -0.0128281 -0.105007 -0.0250816 -0.0506968 0.063483 -0.032405 0.119865 0.0353432 -0.0233526 0.0319778 0.0237247 0.0633677 0.161666 -0.0043159 -0.122775 -0.017289 -0.0189119 -0.0529503 0.0287652 0.0553921 0.0330861 0.0806651 0.0373617 0.0965281 -0.155939 -0.0902936 -0.0145426 -0.106878 -0.0678701 0.00837277 0.0571842 0.018712 -0.0526223 0.00584116 0.0370462 -0.0337704 0.165472 -0.0923291 0.0359347 -0.127002 0.255141 0.0655783 -0.0800975 0.0273635 0.192111 -0.104666 0.038069 0.00672331 0.0672234 -0.0200002 -0.00582065 0.0309932 0.19076 -0.0353364 0.0179436 0.0213455 0.11704 -0.0451027 -0.0274575 -0.0057487 -0.0548092 
0.104108 0.0664752 -0.106416 -0.025899 0.0612187 0.118548 0.101689 0.0351284 -0.106994 -0.018222 0.0350409 0.0550722 0.145965 -0.180436 -0.0784134 0.00375119 -0.0855875 -0.0150398 -0.186238 0.225117 0.104895 -0.122361 0.088145 0.0583507 -0.0758844 -0.0462201 -0.091807 -0.171105 0.0546159 0.0507544 -0.0539461 0.072725 -0.0699266 0.128357 -0.0877484 -0.061949 -0.0543469 0.158076 -0.0703041 -0.0308182 0.00718383 -0.149301 -0.0144275 0.116016 -0.142529 -0.0336796 0.127239 0.0587412 -0.147381 0.16935 0.0295892 -0.0606921 -0.139211 0.0241951 0.0607037 -0.0665057 -0.0378643 0.0824507 0.0148558 -0.0882929 -0.0556995 -0.0141269 0.17179 -0.0656386 0.0320017 -0.119105 -0.0229848 -0.0225675 -0.102359 -0.0170354 -0.0591164 0.042686 -0.0314995 0.113074 0.0140498 -0.0396347 0.0354712 0.0601728 0.0399414 0.126191 -0.015686 -0.0946537 -0.0340003 -0.0235383 -0.0498842 0.0547888 0.0442914 0.019973 0.0721461 0.0375452 0.0934019 -0.153956 -0.109654 -0.0186045 -0.0837752 -0.0593701 0.00102884 0.0683758 -0.000259273 -0.0494116 0.00987979 0.0319075 -0.0315507 0.189989 -0.0674567 0.0247244 -0.106546 0.258188 0.0658951 -0.0795745 0.00403433 0.187636 -0.0930897 0.0396261 0.00524053 0.0437292 -0.0384582 -0.0285832 0.0333319 0.17302 -0.0466823 0.0307516 0.0205654 0.122065 -0.0408149 -0.0318373 -0.020465 -0.0720073 
0.0959504 0.0560977 -0.0907779 -0.0359971 0.0551539 0.115055 0.108344 0.0440076 -0.105185 -0.0242893 0.0185916 0.055009 0.143904 -0.164789 -0.0542871 -0.0148554 -0.113071 -0.0483823 -0.179542 0.216758 0.0876687 -0.11776 0.0947265 0.0621265 -0.0729049 -0.0510267 -0.0856036 -0.160997 0.0435618 0.0460397 -0.0502775 0.0482613 -0.0713533 0.124968 -0.0891524 -0.0572075 -0.0586927 0.163865 -0.0838059 -0.0175798 0.00876448 -0.149544 -0.0187418 0.11498 -0.147325 -0.0298259 0.118396 0.0631223 -0.12966 0.187667 0.0231384 -0.0642743 -0.130783 0.0268224 0.0807417 -0.0668703 -0.0524243 0.103239 0.00949963 -0.0875274 -0.0647758 -0.00911093 0.167513 -0.0574237 0.0281956 -0.10563 -0.018856 -0.0207485 -0.109263 -0.0213952 -0.0551049 0.0580091 -0.0293042 0.123449 0.0336333 -0.0280914 0.0327883 0.0330686 0.0601404 0.148179 -0.00291345 -0.120362 -0.0269732 -0.0215196 -0.0510891 0.0362795 0.0471692 0.0274226 0.077457 0.0399923 0.0950896 -0.154467 -0.094303 -0.0212501 -0.0982355 -0.0623231 0.00314263 0.0622448 0.0185122 -0.0496977 0.00751758 0.0331276 -0.0308008 0.169815 -0.0856674 0.0299725 -0.124382 0.253856 0.0691203 -0.0820678 0.0234246 0.197211 -0.0943173 0.0361337 0.00119459 0.0639603 -0.0194489 -0.00684668 0.0302674 0.188704 -0.0385025 0.0201212 0.016583 0.120519 -0.0468962 -0.0292743 -0.0138499 -0.0605388 
0.0965667 0.0579638 -0.0901651 -0.0365838 0.0541315 0.11964 0.104609 0.0446388 -0.103616 -0.0283129 0.0146409 0.0507863 0.145932 -0.166283 -0.0481573 -0.0149721 -0.114313 -0.0573887 -0.18068 0.21605 0.0864806 -0.116091 0.0950227 0.0533271 -0.0731227 -0.0514287 -0.0937391 -0.165009 0.0379685 0.042707 -0.0400015 0.0517048 -0.0738401 0.124956 -0.0865128 -0.0499024 -0.0552061 0.163947 -0.0806974 -0.0158527 0.00978737 -0.149805 -0.021963 0.112961 -0.144494 -0.0246363 0.117479 0.064501 -0.128098 0.188423 0.0206217 -0.0616746 -0.129647 0.0275687 0.0792754 -0.0707307 -0.0517854 0.0981561 0.011638 -0.0895797 -0.0676344 -0.00747075 0.161913 -0.0617793 0.0288558 -0.109689 -0.0123773 -0.0150544 -0.105925 -0.0232962 -0.0504698 0.0599021 -0.0301538 0.120991 0.0332891 -0.0274025 0.0268292 0.0312452 0.0600764 0.158604 -0.00197375 -0.123169 -0.0269437 -0.0176959 -0.0514965 0.0376269 0.0481765 0.0258497 0.0741705 0.0378559 0.0930008 -0.153746 -0.0922005 -0.021373 -0.104381 -0.0628211 0.00706255 0.0618621 0.0119385 -0.0491293 0.00545959 0.0349181 -0.0345181 0.169537 -0.0868188 0.0295049 -0.126573 0.256243 0.0702975 -0.0751169 0.0196098 0.193474 -0.101879 0.0358641 -7.20155e-05 0.0650232 -0.0218804 -0.0100578 0.0284455 0.189532 -0.0363243 0.0228658 0.02111 0.124292 -0.0415712 -0.0361675 -0.0109927 -0.0564599 
0.100027 0.0569374 -0.0942018 -0.0361299 0.0532594 0.118135 0.112094 0.0458766 -0.105358 -0.0283493 0.0127473 0.0505973 0.145473 -0.161724 -0.0473489 -0.025111 -0.107244 -0.059196 -0.176151 0.216296 0.0783503 -0.115287 0.0908957 0.0538479 -0.0739316 -0.0508035 -0.0914338 -0.160982 0.0355848 0.0426371 -0.0447525 0.0503648 -0.0738293 0.125992 -0.0862693 -0.0533233 -0.0510554 0.166825 -0.0847754 -0.020964 0.0132473 -0.14856 -0.020917 0.11517 -0.150085 -0.0214374 0.11482 0.0661698 -0.125361 0.189591 0.0199854 -0.0602827 -0.126125 0.0284365 0.0832292 -0.0724742 -0.0565176 0.100056 0.0138303 -0.0918063 -0.0681903 -0.00811541 0.161875 -0.0637615 0.0270163 -0.106947 -0.00985776 -0.0176074 -0.106941 -0.026723 -0.0510499 0.0558652 -0.0277758 0.124407 0.0326163 -0.0267005 0.0286613 0.0294331 0.0643903 0.156166 -0.00468736 -0.123996 -0.0267366 -0.022207 -0.044377 0.0296577 0.0482661 0.0256495 0.0777049 0.0393555 0.0947237 -0.154248 -0.0879319 -0.0271966 -0.104013 -0.0663219 0.0145917 0.0582366 0.0145837 -0.0531703 0.00461733 0.0430016 -0.0284959 0.169934 -0.0946516 0.027298 -0.127103 0.256166 0.0677952 -0.0728538 0.0292247 0.193401 -0.101828 0.0357399 -0.00283759 0.0606007 -0.0182672 -0.0148284 0.0301994 0.186151 -0.0373275 0.0204616 0.0211634 0.12539 -0.0396722 -0.0403653 -0.0104059 -0.0600354 
0.104764 0.048423 -0.0968793 -0.0341819 0.0631552 0.118537 0.1105 0.0398067 -0.0992375 -0.0467503 0.010467 0.0536117 0.14441 -0.159753 -0.0553026 -0.0158143 -0.111328 -0.059036 -0.185838 0.214807 0.0947824 -0.115425 0.0931582 0.0496702 -0.0688747 -0.0548188 -0.0970026 -0.165756 0.0318326 0.0483571 -0.0393014 0.0582912 -0.0784436 0.126396 -0.0857939 -0.0520825 -0.0572166 0.164172 -0.0774151 -0.0214013 0.012925 -0.138747 -0.0178307 0.110455 -0.141316 -0.0231742 0.112782 0.0615444 -0.121615 0.184417 0.0135563 -0.0663905 -0.121019 0.0285188 0.0806088 -0.0739054 -0.0515898 0.106373 0.00701808 -0.0895069 -0.0638161 -0.00253548 0.164539 -0.0618224 0.0253763 -0.107089 -0.0131966 -0.00973063 -0.102137 -0.0280066 -0.0462116 0.0592243 -0.0293833 0.115954 0.0269873 -0.0214537 0.0290903 0.0183798 0.0539454 0.160511 -0.000335787 -0.118763 -0.027436 -0.0212141 -0.0534499 0.0391319 0.0502364 0.0252713 0.0657032 0.0333929 0.0997343 -0.158035 -0.0947678 -0.0226045 -0.102331 -0.0586109 0.00731299 0.0592179 0.0131736 -0.0448835 0.00508957 0.031813 -0.0334717 0.176698 -0.0926386 0.0266287 -0.130581 0.259965 0.0647576 -0.0754 0.0242586 0.1877 -0.10966 0.0388847 0.00105007 0.0718863 -0.0268465 -0.00543885 0.0281633 0.188312 -0.0401221 0.0296601 0.0209729 0.122869 -0.0416611 -0.0389874 -0.0163072 -0.0615192 
0.0975616 0.0455828 -0.0978674 -0.0343188 0.0595287 0.115704 0.103932 0.0416916 -0.107354 -0.033959 0.0161739 0.0594748 0.142383 -0.164766 -0.0597351 -0.0163837 -0.112807 -0.0545199 -0.175578 0.219345 0.0909464 -0.119953 0.090291 0.0633852 -0.0675441 -0.0431857 -0.0827996 -0.165846 0.0392072 0.0444497 -0.0456631 0.0492319 -0.0779485 0.122201 -0.0925427 -0.0509306 -0.0676516 0.156345 -0.0836054 -0.0192846 0.0155316 -0.146042 -0.0233139 0.124031 -0.144937 -0.0248332 0.120367 0.0626096 -0.126424 0.179226 0.0189605 -0.0646127 -0.126537 0.0210261 0.0822274 -0.0692479 -0.0569536 0.109795 0.0126209 -0.0886195 -0.0613618 -0.00654771 0.171254 -0.0492258 0.0261344 -0.111441 -0.0150395 -0.0160447 -0.0979666 -0.0235763 -0.0536977 0.0600307 -0.028024 0.116112 0.0315455 -0.0259958 0.0271352 0.0358846 0.0555609 0.157948 -0.00483151 -0.116809 -0.0263674 -0.0247911 -0.0558078 0.0353459 0.0548723 0.0288714 0.0686015 0.0305863 0.0958279 -0.148235 -0.095829 -0.0214519 -0.101577 -0.0618082 0.00794181 0.0573094 0.0191088 -0.0556685 0.00329035 0.0322912 -0.0305468 0.170122 -0.0922298 0.0296682 -0.129749 0.259328 0.0634453 -0.0798232 0.0283972 0.194461 -0.10179 0.0330638 0.000333397 0.0659333 -0.0281305 -0.0134792 0.0303666 0.186834 -0.0413377 0.0225832 0.0154462 0.117791 -0.0512548 -0.0284589 -0.0200453 -0.0597654 
0.104973 0.0472915 -0.103756 -0.0297625 0.0645347 0.120248 0.108217 0.0410999 -0.104213 -0.0343819 0.0172173 0.0579459 0.139565 -0.169777 -0.0615063 -0.0177862 -0.108761 -0.0427181 -0.177754 0.218175 0.0921251 -0.118799 0.0969936 0.0646977 -0.0691171 -0.0581747 -0.0869515 -0.170163 0.0366544 0.0471421 -0.0456896 0.0476072 -0.0798459 0.122232 -0.0868136 -0.054117 -0.0665136 0.150827 -0.0857847 -0.0216488 0.0107068 -0.141414 -0.0259484 0.123358 -0.150176 -0.0273284 0.116417 0.0667534 -0.123917 0.187896 0.0210436 -0.0641448 -0.126647 0.0191067 0.074626 -0.0707646 -0.0485946 0.106866 0.0133084 -0.0838475 -0.0605614 -0.00153354 0.172532 -0.0573105 0.0252152 -0.120052 -0.017203 -0.0190485 -0.102926 -0.0175585 -0.0525929 0.0619613 -0.0280899 0.116854 0.0195198 -0.0279328 0.0289218 0.0353172 0.0532802 0.152843 -0.00693346 -0.115445 -0.0325555 -0.0247495 -0.0522159 0.0401819 0.0468786 0.023952 0.0666856 0.0326955 0.100111 -0.148707 -0.0989124 -0.0266646 -0.0943555 -0.0642745 0.00488235 0.059093 0.0132484 -0.0513901 0.0084852 0.0336692 -0.0290646 0.16858 -0.0868249 0.0259021 -0.123743 0.256038 0.0652952 -0.0701545 0.0283277 0.190954 -0.092377 0.0342221 -0.00252088 0.068229 -0.0217292 -0.0102191 0.0316765 0.188326 -0.0446174 0.0220965 0.0123171 0.12066 -0.0506729 -0.0332695 -0.0206074 -0.0620372 
0.0965583 0.0459802 -0.0990964 -0.0395845 0.065264 0.116057 0.104597 0.0400791 -0.106677 -0.0357474 0.0107604 0.0596896 0.141186 -0.160096 -0.0572331 -0.0188561 -0.115649 -0.0550526 -0.180062 0.215635 0.0871597 -0.115562 0.0930752 0.0567809 -0.0659013 -0.0448658 -0.0832887 -0.162253 0.0357402 0.0422381 -0.0421252 0.0478853 -0.0815462 0.121856 -0.0895207 -0.0505529 -0.0688072 0.156103 -0.0832703 -0.0170859 0.0174785 -0.140175 -0.0209039 0.127939 -0.148394 -0.0227832 0.117705 0.0665475 -0.121943 0.182069 0.0180532 -0.0665888 -0.129143 0.0194466 0.0808801 -0.0708469 -0.0589776 0.116127 0.0135303 -0.0889286 -0.062483 -0.00404832 0.171434 -0.0466691 0.0250231 -0.113011 -0.0169562 -0.00929063 -0.0970837 -0.0197305 -0.0481239 0.0659382 -0.021961 0.115991 0.0277965 -0.0246739 0.0217708 0.0301746 0.0551586 0.155282 -0.000989491 -0.114491 -0.0255283 -0.0221602 -0.0595071 0.0291974 0.0562657 0.0315455 0.0692021 0.0299831 0.0960917 -0.148353 -0.0949521 -0.0274892 -0.100055 -0.0620315 0.00797305 0.0577491 0.0159091 -0.0551357 -0.000659921 0.0330441 -0.028577 0.169374 -0.096836 0.0266855 -0.136512 0.259833 0.0652493 -0.0771074 0.0356127 0.195405 -0.104061 0.0401945 -0.00206892 0.0659601 -0.0272707 -0.0106461 0.0296859 0.186566 -0.0380049 0.0255331 0.0146583 0.118237 -0.0529892 -0.0357021 -0.0236683 -0.0600307 
0.100565 0.0433092 -0.089692 -0.000909398 0.0514563 0.104771 0.0994289 0.0251867 -0.0790155 -0.0370842 0.0343969 0.0759734 0.13712 -0.195087 -0.0936081 0.00605851 -0.0995176 -0.0126118 -0.206135 0.235382 0.107634 -0.122102 0.0962725 0.079721 -0.0852323 -0.0407173 -0.0973995 -0.188992 0.0372425 0.047522 -0.0480384 0.0842803 -0.0669205 0.127957 -0.0903478 -0.0654029 -0.0682214 0.179883 -0.0869895 -0.0200126 3.64919e-05 -0.1367 -0.0425786 0.107247 -0.132721 -0.0554253 0.116022 0.0468154 -0.11846 0.178045 0.040134 -0.0680133 -0.125358 0.020073 0.0640645 -0.0685539 -0.0293893 0.0794994 0.0176707 -0.0817477 -0.0555488 -0.0216038 0.161781 -0.0545366 0.0322749 -0.143124 -0.0117481 -0.0335204 -0.106361 -0.0149278 -0.0587268 0.0401951 -0.018557 0.126216 0.00289461 -0.0447179 0.0273756 0.0461845 0.0310713 0.143013 -0.0136556 -0.0962568 -0.0390151 -0.0328748 -0.0468318 0.0430915 0.0505517 0.0211772 0.0541165 0.0200404 0.0800054 -0.147228 -0.0986014 -0.0143304 -0.0864151 -0.0493277 -0.00381197 0.049616 0.00881678 -0.0386482 0.013116 0.0227076 -0.0456531 0.193808 -0.0482751 0.00298113 -0.0971838 0.241223 0.0715318 -0.0728846 -0.00732771 0.199759 -0.0892494 0.0330337 0.00243305 0.058186 -0.0452129 -0.0214485 0.0220666 0.173181 -0.0560788 0.0514886 0.00894376 0.111411 -0.0316654 -0.0238737 -0.0204463 -0.0719625 
0.0805998 0.043469 -0.0742562 -0.0246505 0.0588581 0.0948935 0.113881 0.0582682 -0.0833564 -0.0212389 0.0313455 0.0771961 0.14317 -0.176999 -0.0745393 -0.0206635 -0.0950014 -0.0366219 -0.19828 0.22535 0.0989064 -0.131406 0.0511307 0.0667138 -0.0666837 -0.0161132 -0.0981803 -0.153674 0.054439 0.0278107 -0.0324754 0.08369 -0.073063 0.130271 -0.106615 -0.0660596 -0.064404 0.173343 -0.0756237 -0.0303255 0.055281 -0.146061 -0.0177668 0.121919 -0.134553 -0.0694493 0.110254 0.044713 -0.114777 0.140989 0.0139945 -0.0632384 -0.144981 0.0170842 0.0808057 -0.0571799 -0.0837694 0.0958724 0.00372393 -0.101081 -0.062512 -0.0427733 0.157529 -0.033866 0.0152308 -0.096397 -0.00509656 -0.0275185 -0.0865403 -0.0377779 -0.0528692 0.0495992 -0.0132836 0.129001 0.0246784 -0.0425731 0.0211856 0.0583683 0.0480878 0.136757 -0.0342121 -0.0849607 -0.00355559 -0.0232642 -0.0377182 0.0225178 0.0906864 0.0554831 0.0889695 0.0079013 0.0805815 -0.149202 -0.0907891 -0.0235348 -0.0969854 -0.0723419 0.0107989 0.0314428 -0.00177743 -0.0603312 -0.018153 0.020699 -0.0274083 0.194999 -0.0795068 0.0286997 -0.115384 0.258469 0.0742674 -0.0961725 0.00394387 0.194972 -0.138312 0.0441614 0.0194612 0.0218985 -0.0422403 -0.0491167 0.0374503 0.16569 -0.0376123 0.0597013 0.00491557 0.124026 -0.0437071 -0.0401689 -0.0205967 -0.0595865 
0.0944525 0.0207065 -0.058045 -0.0317509 0.0764317 0.121917 0.135558 0.103826 -0.0827491 -0.0471929 0.0093447 0.0849431 0.117326 -0.18894 -0.0441072 -0.0669489 -0.0866454 -0.0336204 -0.187989 0.203496 0.092189 -0.0981147 0.0400356 0.0880261 -0.0583715 -0.0488759 -0.089686 -0.15903 0.0267831 0.00720318 -0.0265724 0.0324078 -0.0753927 0.146306 -0.0854902 -0.076039 -0.0505906 0.136211 -0.114595 -0.0413335 0.0883657 -0.123755 -0.0135357 0.147987 -0.159233 -0.0642748 0.103239 0.0331189 -0.121215 0.162593 0.00901578 -0.101753 -0.138404 0.0110062 0.0898364 -0.045647 -0.111297 0.115757 -0.00266872 -0.107348 -0.057678 -0.0303049 0.146887 -0.0505875 0.0218869 -0.113243 -0.00204345 -0.0391757 -0.0922907 -0.0229929 -0.0395004 0.0456584 -0.00621086 0.104621 0.00481013 -0.0260881 0.00821866 0.0584199 0.0661689 0.122055 -0.0607327 -0.069979 0.00223889 -0.0286037 -0.0235537 0.00358754 0.107883 0.0532424 0.0766334 0.0327567 0.101003 -0.162322 -0.104002 -0.0479705 -0.0924744 -0.0644083 0.0230867 0.00697191 -0.0250538 -0.0537605 -0.0298981 0.0312283 -0.0175136 0.163614 -0.113513 0.0169916 -0.12713 0.231544 0.0277226 -0.0851741 0.0489451 0.178295 -0.129022 0.0286734 0.0205667 0.0188074 -0.0331243 -0.0711398 0.0380574 0.16778 -0.0266456 0.0572599 -0.00797786 0.134886 -0.0186826 -0.0607691 -0.00529866 -0.0780205 
0.0888529 0.0289104 -0.086855 -0.0324716 0.0848075 0.130449 0.102063 0.0611854 -0.0667507 -0.0656163 0.0316966 0.101533 0.115338 -0.159564 -0.0821721 -0.0504097 -0.0978536 -0.0274881 -0.19247 0.207399 0.114361 -0.109633 0.0596199 0.0865678 -0.0463043 -0.0397147 -0.0661234 -0.151239 0.0275816 0.0294949 -0.0268964 0.0362306 -0.063566 0.134914 -0.104327 -0.0514148 -0.0726927 0.143262 -0.10454 -0.0294599 0.0721558 -0.11399 -0.0201797 0.141647 -0.16037 -0.0675517 0.11617 0.0268617 -0.122121 0.1586 0.000702011 -0.0672432 -0.138383 0.0193794 0.0986722 -0.0365071 -0.0939382 0.13441 -0.0167308 -0.112324 -0.0700147 -0.0243468 0.192127 -0.0494211 0.0147881 -0.103468 -0.00755365 -0.0054102 -0.0863063 0.0200087 -0.0241694 0.0530147 -0.0174439 0.0993893 0.0245878 -0.0154763 0.00229647 0.0462189 0.0329365 0.112393 -0.0661517 -0.0422288 0.00922284 -0.0287084 -0.0534215 0.0291654 0.103109 0.0559882 0.0715952 0.0256973 0.100755 -0.181224 -0.100521 -0.0374739 -0.0702005 -0.0817379 -0.000576735 0.0298237 -0.00602548 -0.0618454 -0.0244655 0.0210745 -0.0189421 0.169895 -0.111823 0.0441994 -0.138842 0.22899 0.0243398 -0.107217 0.0405193 0.181799 -0.123986 0.0460598 0.0298364 0.0335411 -0.0429254 -0.0701093 0.0625922 0.184833 -0.0151968 0.0503514 -0.00801646 0.115261 -0.0391878 -0.0270334 0.00128672 -0.0485444 
0.0941756 0.0329244 -0.104436 -0.0198377 0.0834302 0.129666 0.097955 0.0526331 -0.0616604 -0.0506208 0.0463241 0.104225 0.112726 -0.179362 -0.0860665 -0.041273 -0.104087 -0.0228529 -0.181184 0.204268 0.117204 -0.110716 0.0577012 0.0948398 -0.0294697 -0.0386544 -0.0508411 -0.160296 0.034737 0.0445926 -0.0252742 0.0373616 -0.0629384 0.130053 -0.102749 -0.0602619 -0.0765539 0.120368 -0.0870285 -0.0283861 0.0692355 -0.128641 -0.018217 0.158317 -0.162116 -0.0824993 0.118802 0.0334318 -0.106137 0.153666 0.0195307 -0.0545534 -0.137736 0.00922935 0.0911154 -0.0377085 -0.0900611 0.121887 -0.010395 -0.107613 -0.0731575 -0.0461003 0.197741 -0.0378746 0.00246545 -0.115619 -0.00772696 -0.0182188 -0.0772976 0.0142878 -0.0383795 0.0622836 -0.026314 0.0914063 0.0224275 -0.0279887 0.00178455 0.0547445 0.0207216 0.140807 -0.0544364 -0.0477317 0.018511 -0.0209613 -0.0440109 0.0350204 0.0997358 0.0482506 0.0729359 0.0148752 0.0899109 -0.167808 -0.117634 -0.0307197 -0.0806195 -0.0924968 -0.00887545 0.0290791 0.000941717 -0.0767452 -0.0181255 0.0196789 -0.00568406 0.168638 -0.102882 0.0360718 -0.127216 0.241517 0.0331328 -0.0968082 0.0383802 0.180908 -0.123865 0.0427214 0.0273132 0.0336122 -0.0395183 -0.0611926 0.0650768 0.184552 -0.00738185 0.0474718 -0.00908083 0.111315 -0.0474355 -0.0276152 0.0078666 -0.0326587 
0.102049 0.0365505 -0.106088 -0.0121714 0.0819913 0.133852 0.0958144 0.0389721 -0.0604176 -0.0566774 0.0554565 0.101147 0.110391 -0.175706 -0.0960724 -0.0316998 -0.107339 -0.0191965 -0.187991 0.206596 0.120462 -0.114807 0.070869 0.0899697 -0.0326142 -0.0451831 -0.0571043 -0.157765 0.037477 0.0444629 -0.0274139 0.0400742 -0.070216 0.126499 -0.105274 -0.0558651 -0.0860772 0.127103 -0.0805723 -0.0215859 0.0533437 -0.121657 -0.0309328 0.144454 -0.15953 -0.0832533 0.113511 0.03517 -0.105916 0.162845 0.0169255 -0.0398989 -0.142284 0.0119897 0.0809409 -0.0465597 -0.0742928 0.1253 -0.0128343 -0.0961973 -0.0739595 -0.0352369 0.209727 -0.0442871 0.00343177 -0.115686 -0.00876575 -0.0137304 -0.0834968 0.0295412 -0.0332277 0.0692543 -0.0243728 0.106713 0.0189996 -0.0359533 0.00769042 0.0450033 0.0125889 0.138923 -0.0497981 -0.0527187 0.0139998 -0.0264725 -0.0502479 0.0424778 0.0881519 0.0429493 0.0662475 0.0114343 0.0981827 -0.168168 -0.114521 -0.0257741 -0.0691471 -0.0972368 -0.0123794 0.0348138 0.00330552 -0.0676706 -0.0152955 0.0205661 -0.0129113 0.172262 -0.0901461 0.0427617 -0.116006 0.242088 0.0456437 -0.0972733 0.0318531 0.185037 -0.109743 0.0503931 0.0315419 0.0416729 -0.0347742 -0.0441363 0.0705124 0.187669 -0.0178856 0.0430177 -0.00744953 0.108121 -0.0480154 -0.0201504 0.0102124 -0.0295805 
0.105863 0.0293332 -0.114602 -0.0120754 0.0831743 0.13021 0.0816354 0.0375203 -0.0587164 -0.0728247 0.047919 0.102215 0.103529 -0.176994 -0.103793 -0.0270001 -0.10494 -0.0264436 -0.189983 0.214193 0.113266 -0.10736 0.0832394 0.086061 -0.0375028 -0.042247 -0.0444657 -0.158747 0.0267248 0.0335413 -0.0267087 0.0363619 -0.0658113 0.124511 -0.109831 -0.0514338 -0.0871643 0.133666 -0.0926136 -0.0177424 0.0466992 -0.112082 -0.0346274 0.149315 -0.158101 -0.0726514 0.11639 0.0358729 -0.10358 0.17762 0.0143479 -0.0434149 -0.137317 0.0127618 0.0813927 -0.0562953 -0.0672724 0.122963 -0.00295434 -0.101303 -0.0746999 -0.0282549 0.209623 -0.039235 0.000692978 -0.128591 -0.00689234 -0.00652272 -0.0749731 0.0337788 -0.0302875 0.0639398 -0.0174961 0.107871 0.0186783 -0.0359173 0.002949 0.0439142 0.00532581 0.140121 -0.0427654 -0.0488094 0.00533167 -0.0334298 -0.0508204 0.0425415 0.0805119 0.0449921 0.059869 0.0110663 0.0994037 -0.162645 -0.120192 -0.0290481 -0.0589509 -0.0872097 -0.00827547 0.036553 -0.000110046 -0.0726516 -0.0213608 0.016248 -0.0131005 0.169198 -0.0980813 0.0348902 -0.123225 0.237798 0.0422456 -0.0950361 0.0408423 0.194729 -0.101038 0.0539565 0.0240958 0.0413748 -0.0404849 -0.0490205 0.0696905 0.183205 -0.0229069 0.0534736 -0.000224983 0.10481 -0.0457809 -0.0280746 0.00934408 -0.0348241 
0.102687 0.0258289 -0.113219 -0.0148087 0.0857839 0.129689 0.0818267 0.0385409 -0.0577961 -0.0703568 0.054028 0.102124 0.106592 -0.172949 -0.107956 -0.0299692 -0.102659 -0.013935 -0.192149 0.212575 0.120245 -0.109995 0.0826528 0.103251 -0.0369061 -0.0485704 -0.0380414 -0.156807 0.0346783 0.034542 -0.0301227 0.024086 -0.065991 0.123349 -0.110959 -0.0522944 -0.0941448 0.125895 -0.101001 -0.017549 0.0484982 -0.108864 -0.0395525 0.155141 -0.160827 -0.0773883 0.114325 0.0392255 -0.103706 0.170865 0.0124085 -0.0487052 -0.137537 0.00633528 0.0761263 -0.0478238 -0.0685142 0.130413 -0.0018161 -0.100741 -0.070718 -0.0232891 0.213797 -0.032315 -0.00229906 -0.128138 -0.0101901 -0.00931557 -0.075813 0.0372903 -0.0341901 0.0616101 -0.0172438 0.0986899 0.0187628 -0.0339467 0.00203317 0.0516243 0.00653893 0.131358 -0.0467589 -0.0444904 0.00331026 -0.0359151 -0.054366 0.0476784 0.0834339 0.0445032 0.0543656 0.0111876 0.103264 -0.161955 -0.117326 -0.0313341 -0.0571336 -0.0900801 -0.0181934 0.0376784 0.00381355 -0.0726963 -0.0131965 0.0140615 -0.0107263 0.165891 -0.0942089 0.0365902 -0.123104 0.232908 0.0389722 -0.0992236 0.0447129 0.195038 -0.0935043 0.0525941 0.0205428 0.047592 -0.0448955 -0.0460511 0.0667935 0.184131 -0.028524 0.0461408 -0.0150701 0.103319 -0.0586864 -0.0165203 -0.00449095 -0.0356812 
0.10629 0.0302598 -0.121867 -0.0100491 0.0885069 0.11833 0.0753156 0.0387463 -0.0604552 -0.0732497 0.0469164 0.0967105 0.105187 -0.170249 -0.10812 -0.0230004 -0.089091 -0.0198658 -0.191147 0.223113 0.111741 -0.113407 0.0920459 0.0939388 -0.0352484 -0.0504453 -0.0429608 -0.15274 0.0331955 0.0286941 -0.0250654 0.0380825 -0.0630866 0.120765 -0.120826 -0.0498999 -0.0907521 0.133444 -0.100402 -0.0162044 0.0442061 -0.102781 -0.0358549 0.149277 -0.158636 -0.0689286 0.116714 0.0395189 -0.0969123 0.177837 0.0122701 -0.0418121 -0.138508 0.00654207 0.0709707 -0.0589913 -0.0599852 0.120071 0.0115367 -0.101619 -0.073594 -0.0192874 0.201139 -0.0346742 -0.010085 -0.132855 -0.00649486 -0.00749896 -0.0714281 0.0317449 -0.0309063 0.0632013 -0.0140717 0.110439 0.019243 -0.0381574 0.00493247 0.0540262 0.00109469 0.132715 -0.0459008 -0.0428826 -0.00247532 -0.0357915 -0.0444426 0.0525985 0.071593 0.0455791 0.0553054 0.00145476 0.0992579 -0.152647 -0.120024 -0.0361098 -0.0465815 -0.0880882 -0.0110439 0.0446666 -0.00695845 -0.0781033 -0.0249279 0.0099591 -0.00447055 0.17796 -0.102146 0.0344858 -0.125679 0.238282 0.0525617 -0.0960652 0.0405573 0.200179 -0.095344 0.0592397 0.0137727 0.0377027 -0.0408119 -0.0545655 0.0698388 0.182677 -0.0344795 0.0610721 -0.00902011 0.10692 -0.0599418 -0.0319124 -0.00709556 -0.0376592 
0.103649 0.0320133 -0.120262 -0.0115864 0.0866165 0.125071 0.0706308 0.0339514 -0.0602255 -0.0773546 0.0463118 0.101672 0.0994278 -0.168777 -0.107352 -0.025008 -0.0958132 -0.0274119 -0.185861 0.217271 0.11223 -0.107689 0.0885191 0.0853371 -0.0299121 -0.0376632 -0.0372301 -0.153593 0.0289715 0.0295468 -0.0234374 0.0364091 -0.0612172 0.120696 -0.116372 -0.047239 -0.0883874 0.138405 -0.0945079 -0.0169007 0.047305 -0.101661 -0.0333717 0.151946 -0.160376 -0.0671064 0.122272 0.030798 -0.100512 0.174564 0.0132605 -0.0357894 -0.13744 0.0126862 0.0820287 -0.0583767 -0.0623133 0.122902 0.00558919 -0.109725 -0.0766956 -0.0275662 0.20907 -0.035817 -0.00367756 -0.129338 -0.00371662 -0.000416164 -0.0664814 0.0410184 -0.0253271 0.0652479 -0.015056 0.108443 0.0239284 -0.0368889 -0.00379681 0.0492973 -0.00144653 0.135866 -0.0479688 -0.0351211 0.00705428 -0.0359613 -0.0476238 0.0421781 0.0781787 0.0504338 0.0577667 0.00317613 0.0964397 -0.157506 -0.120302 -0.0343384 -0.0495136 -0.0918831 -0.0050046 0.0450114 -0.00359792 -0.0805071 -0.0308699 0.014384 -0.00535217 0.174919 -0.108087 0.0367969 -0.127422 0.236658 0.0473966 -0.0999432 0.0442898 0.199338 -0.103195 0.0602977 0.0227599 0.0351754 -0.0440767 -0.0631536 0.0738018 0.18039 -0.0235307 0.0623545 -0.000182611 0.100991 -0.0505754 -0.0302428 0.00871735 -0.0303854 
0.106505 0.0358653 -0.123197 -0.00840583 0.0869994 0.121284 0.0784699 0.0349514 -0.0595434 -0.069518 0.05014 0.0983347 0.104598 -0.175501 -0.107754 -0.0201814 -0.09001 -0.0160209 -0.191793 0.218943 0.115679 -0.110723 0.0869211 0.0898958 -0.0359217 -0.0464975 -0.0446371 -0.158461 0.0339503 0.0355474 -0.0291328 0.0452374 -0.0602388 0.123253 -0.11483 -0.052818 -0.0843745 0.135046 -0.0963202 -0.0191804 0.0452576 -0.106174 -0.0314373 0.149539 -0.159001 -0.0665307 0.121723 0.0347957 -0.104404 0.171699 0.0170024 -0.0413415 -0.139339 0.00964718 0.0743345 -0.0560777 -0.0591415 0.114667 0.00824192 -0.103203 -0.0726427 -0.0272268 0.202513 -0.0381033 -0.00375693 -0.133487 -0.00767871 -0.00758816 -0.0716819 0.0333595 -0.0317549 0.0592005 -0.0174641 0.106111 0.0188209 -0.0373635 0.00184534 0.0558367 -0.00220546 0.129524 -0.0466836 -0.0376393 -0.00159026 -0.0348947 -0.0455348 0.0525317 0.0733564 0.0411252 0.0539878 0.00672541 0.0961415 -0.157893 -0.125059 -0.0368919 -0.0512289 -0.0865323 -0.010096 0.0447387 -0.00380951 -0.0763052 -0.0226397 0.0119965 -0.0037019 0.179877 -0.100844 0.0312409 -0.123973 0.241473 0.0477334 -0.0965656 0.037636 0.19602 -0.0999286 0.0544432 0.0185806 0.0357805 -0.0447154 -0.0608846 0.0697548 0.180313 -0.0278496 0.0626602 -0.00415726 0.108121 -0.0513605 -0.031813 -0.0012779 -0.0381843 
0.108947 0.0290431 -0.121901 -0.00967807 0.0923791 0.125288 0.0784763 0.033527 -0.0571243 -0.0770098 0.0499672 0.103183 0.101621 -0.173351 -0.10923 -0.0228988 -0.0930069 -0.0182197 -0.194382 0.217521 0.116728 -0.10691 0.0852037 0.0900043 -0.0344826 -0.0470207 -0.0435479 -0.156052 0.0313667 0.0340874 -0.0265573 0.0425387 -0.0656839 0.121786 -0.114328 -0.0490983 -0.0910013 0.130334 -0.0961597 -0.0179668 0.0482384 -0.101793 -0.0373344 0.149787 -0.158521 -0.065813 0.116535 0.0365705 -0.102158 0.171153 0.0122242 -0.0401302 -0.138642 0.00659136 0.0743059 -0.0570448 -0.0651687 0.124172 0.00140763 -0.0988518 -0.0733135 -0.0233882 0.20838 -0.0364718 -0.00433837 -0.133359 -0.00786602 -0.00225947 -0.0720567 0.0367692 -0.0267109 0.0628003 -0.0155602 0.103752 0.0156509 -0.0340207 0.000578145 0.0496311 -0.00330281 0.132117 -0.0449236 -0.0364146 -0.000213012 -0.0365002 -0.0499685 0.04923 0.0775537 0.043357 0.0489737 0.00692298 0.101006 -0.157935 -0.125336 -0.0320017 -0.0502317 -0.0865373 -0.010453 0.0370796 -0.00320701 -0.075561 -0.0225014 0.0109018 -0.0088484 0.174557 -0.102675 0.0346964 -0.125165 0.238228 0.0457611 -0.0955778 0.0437888 0.195319 -0.10006 0.0576722 0.0204213 0.0393225 -0.0484498 -0.0555973 0.0703865 0.182177 -0.028448 0.06069 -0.00590137 0.107004 -0.0505745 -0.0279771 -0.00147769 -0.0394586 
0.104045 0.031101 -0.125062 -0.00638613 0.0840905 0.118523 0.0752691 0.0282621 -0.0610308 -0.0602014 0.0550303 0.103761 0.10999 -0.165054 -0.117933 -0.0215109 -0.0876564 -0.00626813 -0.187267 0.222718 0.117032 -0.121755 0.0957919 0.0975532 -0.0392359 -0.0439242 -0.0405687 -0.159056 0.0334376 0.0420691 -0.0360424 0.040293 -0.0561876 0.118397 -0.117593 -0.053177 -0.0947795 0.147384 -0.0977613 -0.0208456 0.0292329 -0.104696 -0.0419672 0.143369 -0.160507 -0.0738228 0.1187 0.0348076 -0.102568 0.174372 0.0208231 -0.0338882 -0.136099 0.00950405 0.0757766 -0.052182 -0.0499714 0.121599 0.00602792 -0.101277 -0.0708654 -0.0268556 0.21192 -0.0402606 0.000840176 -0.131181 -0.014262 -0.00202603 -0.0798621 0.0408715 -0.0322288 0.0603993 -0.0208935 0.107258 0.0155703 -0.0358239 0.00899436 0.0513363 0.00242529 0.124257 -0.0563532 -0.0435868 -0.00326505 -0.0386223 -0.0509214 0.0454992 0.0710849 0.0448188 0.0657226 0.00374961 0.0907911 -0.157718 -0.110553 -0.0302953 -0.0442028 -0.0926924 -0.0142522 0.0491979 0.00373167 -0.0755586 -0.0127804 0.0170362 -0.00986807 0.17765 -0.0912652 0.034941 -0.119617 0.228774 0.0539308 -0.101206 0.0328472 0.201978 -0.087726 0.056774 0.0215018 0.0439508 -0.0408845 -0.0548003 0.0719278 0.18639 -0.0358316 0.0524094 -0.0109472 0.0989225 -0.0583404 -0.0155304 -0.00100999 -0.0355265 
0.111593 0.0364512 -0.11871 -0.00827289 0.0867915 0.127463 0.081183 0.0378022 -0.0585357 -0.0723286 0.0529672 0.0995274 0.103401 -0.175834 -0.104573 -0.0183731 -0.0873786 -0.0244513 -0.195713 0.216123 0.115357 -0.106202 0.0804222 0.0930925 -0.0341649 -0.0492862 -0.0439275 -0.151758 0.0355896 0.0357595 -0.0267466 0.0457958 -0.0640999 0.127677 -0.119081 -0.0526062 -0.0859277 0.12887 -0.0939603 -0.0155923 0.0451559 -0.108724 -0.0309014 0.14354 -0.149708 -0.0684428 0.116347 0.0352719 -0.107386 0.173122 0.0200159 -0.0397573 -0.140578 0.00708565 0.0721193 -0.0547177 -0.0711567 0.122063 0.00238785 -0.0962078 -0.0762462 -0.0252074 0.203318 -0.0445007 -0.0052959 -0.126928 -0.00838207 -0.00854212 -0.0821599 0.0317179 -0.0321301 0.0588591 -0.0211052 0.106636 0.0209118 -0.0360819 0.0116137 0.0494746 -0.00191273 0.136153 -0.0419887 -0.0452453 0.00214469 -0.0369954 -0.0455544 0.0505927 0.074263 0.0360175 0.0507255 0.0125371 0.0972825 -0.163566 -0.128406 -0.0241648 -0.0505399 -0.0788977 -0.00807858 0.0341352 -0.00453374 -0.0709583 -0.0224213 0.012418 -0.0123462 0.180295 -0.104276 0.0367874 -0.123925 0.238132 0.0445452 -0.101833 0.0396216 0.196096 -0.0995918 0.0575089 0.0232874 0.0359429 -0.0461187 -0.0491531 0.0717649 0.186214 -0.0277126 0.0577167 -0.00231469 0.108894 -0.0431328 -0.0281277 0.00287361 -0.0442734 
0.104523 0.0333296 -0.123767 -0.0120161 0.0905835 0.120317 0.0804714 0.0271111 -0.0681192 -0.0596765 0.0479497 0.098661 0.111212 -0.164407 -0.114819 -0.014576 -0.0889113 -0.00556128 -0.189296 0.220868 0.122412 -0.120135 0.0934452 0.0921078 -0.0388644 -0.0430726 -0.0464945 -0.159344 0.0389893 0.0445601 -0.0383565 0.0445398 -0.0625695 0.11945 -0.110292 -0.0553631 -0.0905177 0.146616 -0.0918287 -0.0276572 0.0308338 -0.103838 -0.0302137 0.143785 -0.157828 -0.0683106 0.123592 0.0381965 -0.109469 0.169467 0.0190988 -0.0442007 -0.136742 0.0100015 0.0790068 -0.0536309 -0.0512931 0.125231 0.00529003 -0.105305 -0.0653919 -0.0235679 0.211941 -0.0405219 0.00596434 -0.125145 -0.0212117 -0.000619211 -0.07921 0.0360251 -0.0336636 0.0629114 -0.0199635 0.103981 0.012321 -0.0340755 0.0123918 0.0532581 0.00619555 0.116631 -0.0470476 -0.0403668 -0.00597783 -0.0379235 -0.0532633 0.0423926 0.0696264 0.0484019 0.0664581 0.00914388 0.0965252 -0.157986 -0.116477 -0.0317975 -0.0463015 -0.0851077 -0.0122346 0.054972 0.00231287 -0.0706393 -0.0111399 0.0141895 -0.011309 0.178918 -0.0957783 0.034514 -0.123619 0.232016 0.0530057 -0.10098 0.0349502 0.201189 -0.0917285 0.058315 0.0240305 0.0437461 -0.0453255 -0.0504698 0.0635698 0.181436 -0.0363129 0.0553204 -0.00349266 0.0992835 -0.0608049 -0.0170712 -0.00697796 -0.044823 
0.105782 0.0312316 -0.119998 -0.0104328 0.086498 0.121263 0.0764579 0.0299565 -0.0663132 -0.062877 0.0524 0.0960399 0.110825 -0.169292 -0.116236 -0.0135027 -0.0938037 -0.00608899 -0.188107 0.221914 0.126202 -0.121688 0.0954319 0.0932151 -0.0395685 -0.0458063 -0.0477004 -0.16094 0.0413424 0.0423207 -0.0357657 0.0404006 -0.0634409 0.118365 -0.110653 -0.0532022 -0.0943218 0.143012 -0.0894497 -0.0256697 0.0273381 -0.107323 -0.0356174 0.142242 -0.154406 -0.0734231 0.120719 0.0389505 -0.107931 0.173384 0.0142647 -0.0385726 -0.13701 0.0110706 0.0748289 -0.0561191 -0.0469562 0.120302 0.00049691 -0.101748 -0.0651678 -0.022201 0.214134 -0.0380649 0.00249973 -0.127244 -0.0186784 -0.00526633 -0.0775407 0.0369386 -0.0364396 0.0628091 -0.0236673 0.108163 0.0124461 -0.0408975 0.0140427 0.0534042 0.00606844 0.124609 -0.0466061 -0.0453785 -0.00619808 -0.0378048 -0.0528011 0.0490695 0.066413 0.0478033 0.0657048 0.00814946 0.101649 -0.154682 -0.117517 -0.0270116 -0.0457167 -0.0883106 -0.0165491 0.0554001 0.000899964 -0.0699645 -0.00991377 0.012525 -0.0146663 0.175367 -0.0864681 0.0383696 -0.115061 0.232866 0.0591901 -0.0999463 0.0286111 0.200124 -0.0896216 0.0564313 0.0260947 0.0476511 -0.0384312 -0.0473084 0.0677554 0.183716 -0.0384573 0.0524721 -0.00441573 0.0991076 -0.0631001 -0.0154983 -0.00152025 -0.0389563 
0.111284 0.0381071 -0.120585 -0.00338958 0.0845854 0.120395 0.0876069 0.0237153 -0.0643668 -0.0624924 0.0472327 0.0967183 0.107811 -0.175167 -0.112216 -0.0137191 -0.092002 -0.00657369 -0.190119 0.219751 0.123331 -0.117441 0.0939246 0.0912683 -0.0434669 -0.0499607 -0.0527818 -0.168685 0.0378673 0.0533665 -0.0439751 0.0513602 -0.0597961 0.122795 -0.100465 -0.0619373 -0.083051 0.15153 -0.0938629 -0.0333097 0.0221406 -0.110292 -0.0322116 0.136994 -0.153931 -0.0582858 0.122439 0.0369049 -0.115149 0.174414 0.0233919 -0.0393522 -0.12826 0.0107762 0.08111 -0.0569629 -0.046431 0.11394 0.000172228 -0.0994515 -0.0632964 -0.0274079 0.208163 -0.0477815 0.013079 -0.130703 -0.021214 -0.00878477 -0.0888397 0.034338 -0.0393014 0.054327 -0.027618 0.104742 0.00822252 -0.0350963 0.0176418 0.0479493 0.00838855 0.126156 -0.0432395 -0.0496841 -0.0150011 -0.0418208 -0.0460332 0.0399014 0.0599019 0.0379299 0.0614838 0.0214851 0.098149 -0.159797 -0.120743 -0.0281014 -0.0523485 -0.079661 -0.0079675 0.0501902 0.0105304 -0.0666824 -0.00151962 0.0185703 -0.0162397 0.176957 -0.0911864 0.0264787 -0.112976 0.234992 0.0565106 -0.0945145 0.0323895 0.199157 -0.0910026 0.04831 0.0272281 0.0492946 -0.0433953 -0.0472987 0.0642425 0.185008 -0.0368513 0.0564245 5.32738e-05 0.103508 -0.0457902 -0.0175666 0.00639923 -0.0531948 
0.109629 0.030717 -0.125842 -0.00405537 0.0893971 0.114116 0.0848472 0.0200725 -0.0780341 -0.0514794 0.0414422 0.10124 0.11306 -0.167408 -0.111727 -0.00758169 -0.0856213 -0.00851764 -0.177571 0.226681 0.12209 -0.124639 0.0954032 0.0844247 -0.0386275 -0.032108 -0.0539052 -0.169862 0.0404887 0.0555225 -0.0464734 0.0634416 -0.0619156 0.116733 -0.103587 -0.0616682 -0.0864413 0.159663 -0.0801198 -0.0414724 0.0191566 -0.109729 -0.0285694 0.135991 -0.156211 -0.058522 0.127366 0.0367173 -0.109852 0.16533 0.0289602 -0.0364236 -0.127069 0.0120804 0.0883842 -0.0640152 -0.0412734 0.114473 0.00369934 -0.104786 -0.0594489 -0.0338844 0.207576 -0.0420525 0.0152338 -0.125617 -0.0249027 -0.000154204 -0.0806525 0.026688 -0.0386321 0.0632337 -0.028613 0.104729 0.0070598 -0.0343824 0.0195686 0.0487107 0.0121156 0.129736 -0.0434425 -0.0481634 -0.0092197 -0.0395452 -0.0431118 0.0269679 0.0640672 0.0512908 0.0723605 0.00925978 0.0896444 -0.147939 -0.118537 -0.0215126 -0.056168 -0.0838431 0.000183994 0.0581401 0.0102219 -0.0742686 -0.00239269 0.0191891 -0.0149702 0.183145 -0.093944 0.0277254 -0.116584 0.235965 0.0664899 -0.0962749 0.0280507 0.203508 -0.0978853 0.0509584 0.0307674 0.0451996 -0.0459088 -0.0527429 0.0584761 0.181571 -0.0400126 0.0584667 0.00819225 0.0947017 -0.0520949 -0.0150683 0.00557462 -0.0493442 
0.106584 0.0402112 -0.117678 -0.00727505 0.0845056 0.120677 0.0855462 0.0217426 -0.0685232 -0.0555992 0.0456158 0.0960287 0.11262 -0.172269 -0.105494 -0.00953136 -0.0940028 -0.0128845 -0.184847 0.220025 0.127014 -0.117648 0.0860471 0.0860771 -0.0365131 -0.0380415 -0.0568383 -0.167993 0.0443975 0.0588359 -0.0372773 0.0586893 -0.0612145 0.120319 -0.0968722 -0.0580458 -0.0812229 0.153923 -0.0796553 -0.0386115 0.023439 -0.115688 -0.0254628 0.139415 -0.150463 -0.0586706 0.127244 0.0380442 -0.11512 0.163173 0.0244722 -0.0333719 -0.127584 0.0116245 0.0898222 -0.0588429 -0.0527814 0.112986 -0.00249823 -0.109456 -0.0656819 -0.0364729 0.207664 -0.0442651 0.0121457 -0.122869 -0.0195825 -0.00384368 -0.0846021 0.0265934 -0.0362405 0.0588944 -0.0321239 0.0999324 0.0123511 -0.0362621 0.0151652 0.0491468 0.0135261 0.136992 -0.0381366 -0.0474753 -0.00655297 -0.0367105 -0.0429056 0.0314615 0.0645507 0.0457915 0.0697798 0.0190127 0.0926354 -0.157394 -0.121579 -0.0192612 -0.0630169 -0.083329 -0.00488342 0.053799 0.00977613 -0.0730814 -0.0013898 0.0202254 -0.0173748 0.17887 -0.0968923 0.0320142 -0.115402 0.237428 0.0654804 -0.0961324 0.0278635 0.198098 -0.10837 0.0509407 0.0333834 0.0465904 -0.0474138 -0.052571 0.0602699 0.184372 -0.0302731 0.0566589 0.00788541 0.100676 -0.0472724 -0.0163965 0.0139498 -0.0472829 
0.105464 0.0349295 -0.107861 0.00112246 0.074445 0.109277 0.0743594 0.020998 -0.0794958 -0.0572918 0.0394591 0.094002 0.114364 -0.186343 -0.117005 0.0157691 -0.0868437 -0.00962832 -0.200059 0.232549 0.121951 -0.118506 0.097244 0.0699168 -0.0553063 -0.0226274 -0.0670895 -0.174803 0.0334305 0.0381288 -0.0409039 0.0811536 -0.0663323 0.124098 -0.104211 -0.0611744 -0.0830845 0.172376 -0.07573 -0.0266929 0.013502 -0.112777 -0.0309162 0.125909 -0.136687 -0.0632173 0.12629 0.0302242 -0.115953 0.169452 0.0432837 -0.0496482 -0.13807 0.0166201 0.0744279 -0.0738201 -0.033582 0.0938145 0.0136346 -0.0987808 -0.0551724 -0.035584 0.186421 -0.0408741 0.0269885 -0.143547 -0.0228747 -0.00592979 -0.0829818 0.0191519 -0.0397606 0.0550136 -0.0142023 0.115184 0.000126708 -0.0476715 0.0177807 0.0549422 0.0022937 0.134797 -0.028696 -0.0590536 -0.012917 -0.0391107 -0.0559099 0.0341339 0.0645028 0.0454382 0.0581879 0.00493445 0.0745002 -0.148116 -0.122029 -0.013997 -0.0611454 -0.0594147 0.00493345 0.0526427 -0.0089989 -0.0560541 -0.0121024 0.0180109 -0.0366585 0.200187 -0.0666027 0.0130978 -0.107454 0.241715 0.0696501 -0.0953402 0.00409331 0.205564 -0.0996886 0.0587543 0.0253987 0.0352379 -0.0572181 -0.0420847 0.042991 0.167937 -0.0491889 0.0746776 0.0183234 0.09491 -0.0254423 -0.0274828 -7.20918e-05 -0.0601935 
