{
  "descriptor": [
    -0.14389677345752716,
    0.06406435370445251,
    0.03696063533425331,
    -0.06321674585342407,
    -0.09477499127388,
    -0.02614680677652359,
    0.012255193665623665,
    -0.07798023521900177,
    0.04064980894327164,
    -0.05836476385593414,
    0.20188580453395844,
    -0.019857145845890045,
    -0.24705585837364197,
    -0.0875430628657341,
    -0.048545196652412415,
    0.09048712253570557,
    -0.13899101316928864,
    -0.13001932203769684,
    -0.1584760546684265,
    -0.15109466016292572,
    -0.021587759256362915,
    0.0644637942314148,
    -0.07460865378379822,
    0.04555198550224304,
    -0.10446953773498535,
    -0.2665728032588959,
    -0.010336884297430515,
    -0.1072196215391159,
    0.06398503482341766,
    -0.11023104935884476,
    0.052075378596782684,
    0.06927623599767685,
    -0.0755491852760315,
    0.019426804035902023,
    0.0200875885784626,
    0.08426082879304886,
    -0.13997970521450043,
    -0.08376872539520264,
    0.2417622059583664,
    0.060029178857803345,
    -0.08027523010969162,
    -0.05591180920600891,
    0.0656437948346138,
    0.3401179015636444,
    0.19605447351932526,
    0.02606169693171978,
    0.066203773021698,
    -0.02716812863945961,
    0.13341845571994781,
    -0.24669992923736572,
    -0.0007635783404111862,
    0.19865721464157104,
    0.07808040082454681,
    0.1318943351507187,
    0.12835919857025146,
    -0.2158898264169693,
    0.08485627174377441,
    0.06941293925046921,
    -0.16182072460651398,
    0.10982461273670197,
    0.031735859811306,
    -0.1355302333831787,
    -0.06912199407815933,
    -0.061086662113666534,
    0.1787603348493576,
    0.037031058222055435,
    -0.09966958314180374,
    -0.14850924909114838,
    0.1292051374912262,
    -0.23630651831626892,
    -0.1011352613568306,
    0.12103573232889175,
    -0.07892337441444397,
    -0.14446169137954712,
    -0.19094416499137878,
    0.037051860243082047,
    0.38205796480178833,
    0.2560678720474243,
    -0.1654193103313446,
    -0.012437529861927032,
    -0.0036214329302310944,
    -0.08533541858196259,
    0.18249726295471191,
    0.0890820324420929,
    -0.10351090133190155,
    -0.06647475808858871,
    -0.13165678083896637,
    -0.051669444888830185,
    0.14205144345760345,
    0.05565902963280678,
    -0.03941163420677185,
    0.18245813250541687,
    0.05413713678717613,
    -0.029412128031253815,
    0.04983953386545181,
    -0.04639004170894623,
    -0.1624690294265747,
    0.026411592960357666,
    0.010164391249418259,
    -0.05979215353727341,
    0.06729573011398315,
    -0.16362661123275757,
    0.06199527904391289,
    0.03748319298028946,
    -0.08311814069747925,
    0.22895468771457672,
    -0.04845514893531799,
    0.0836402103304863,
    -0.03057532012462616,
    -0.03252860903739929,
    -0.08561624586582184,
    0.033380717039108276,
    0.17791250348091125,
    -0.22134549915790558,
    0.1462530493736267,
    0.17683692276477814,
    0.018261831253767014,
    0.1342248171567917,
    0.12547311186790466,
    0.10033250600099564,
    -0.06151477247476578,
    0.018065661191940308,
    -0.13759374618530273,
    -0.08069702982902527,
    -0.04787181317806244,
    -0.04199908301234245,
    0.07041699439287186,
    -0.004797185771167278
  ]
}