{
  "descriptor": [
    -0.09456196427345276,
    0.03496568650007248,
    0.11438674479722977,
    -0.0566495843231678,
    -0.10993704944849014,
    0.014376964420080185,
    -0.07760762423276901,
    -0.08083432167768478,
    0.1460655778646469,
    -0.15976546704769135,
    0.16128891706466675,
    -0.052304912358522415,
    -0.20777539908885956,
    0.08675239235162735,
    -0.09076083451509476,
    0.16902673244476318,
    -0.1399393081665039,
    -0.16707061231136322,
    -0.03470412641763687,
    -0.041811976581811905,
    -0.030767539516091347,
    0.06072928011417389,
    0.00752571877092123,
    0.1176491305232048,
    -0.1393229216337204,
    -0.3509507179260254,
    -0.09036841243505478,
    -0.05104159936308861,
    0.033470988273620605,
    -0.09574149549007416,
    -0.08811481297016144,
    0.06353301554918289,
    -0.12421444803476334,
    0.05972032994031906,
    0.053075578063726425,
    0.11336558312177658,
    -0.020595185458660126,
    -0.12262257933616638,
    0.2371005415916443,
    0.10797780007123947,
    -0.2521596848964691,
    0.008005250245332718,
    0.07937660813331604,
    0.26677027344703674,
    0.17887403070926666,
    0.008173352107405663,
    0.025698222219944,
    -0.08865447342395782,
    0.16540628671646118,
    -0.288340300321579,
    0.01839425042271614,
    0.18299412727355957,
    0.024291301146149635,
    0.05214960500597954,
    0.0892660915851593,
    -0.14500169456005096,
    0.0011223810724914074,
    0.11311071366071701,
    -0.11574891954660416,
    0.05363623425364494,
    0.03849687799811363,
    -0.035181351006031036,
    0.023519670590758324,
    -0.07786662876605988,
    0.19418862462043762,
    0.12614990770816803,
    -0.11363095790147781,
    -0.11073245853185654,
    0.20699161291122437,
    -0.17591620981693268,
    -0.08804449439048767,
    0.044694725424051285,
    -0.09125966578722,
    -0.16113398969173431,
    -0.22689621150493622,
    0.013985863886773586,
    0.3964363932609558,
    0.19240568578243256,
    -0.10967569053173065,
    0.11251028627157211,
    -0.006841753143817186,
    -0.050739873200654984,
    0.020547980442643166,
    0.1603095978498459,
    -0.12901674211025238,
    0.08076772093772888,
    -0.03012089990079403,
    0.032157931476831436,
    0.23256823420524597,
    0.07399166375398636,
    0.04448458179831505,
    0.21707642078399658,
    -0.013273194432258606,
    0.07083088904619217,
    0.08767925947904587,
    0.06686678528785706,
    -0.1651029735803604,
    -0.061176445335149765,
    -0.18674704432487488,
    -0.05224666744470596,
    -0.005024210084229708,
    -0.022288493812084198,
    0.05102529749274254,
    0.1473626345396042,
    -0.23564407229423523,
    0.16915972530841827,
    -0.0721333771944046,
    -0.08770359307527542,
    -0.0038042133674025536,
    0.08305761218070984,
    -0.0473848432302475,
    0.018000980839133263,
    0.12543416023254395,
    -0.2249707579612732,
    0.09413189440965652,
    0.1356770396232605,
    0.06876526772975922,
    0.12145565450191498,
    0.13204634189605713,
    0.03452640026807785,
    0.0012925482587888837,
    -0.02485179342329502,
    -0.13968460261821747,
    -0.09219656884670258,
    0.04454099386930466,
    -0.07990214973688126,
    0.04053448513150215,
    0.020343631505966187
  ]
}