0.0214628 0.0329643 -0.0868567 -0.0177353 0.0306953 0.229829 -0.0118844 -0.0111334 -0.0439263 -0.00920877 0.0764499 0.0880645 0.0755998 -0.14469 -0.0540377 -0.0483932 -0.141638 0.0371561 -0.0809143 0.141169 0.107212 -0.100354 0.0930318 0.151726 -0.0193721 0.0148817 -0.00936471 -0.228384 0.0256867 -0.00531911 0.0603444 -0.0504447 -0.060581 0.060596 -0.0180305 0.0788491 -0.0909274 0.103996 -0.0767506 -0.00610687 0.0561023 -0.0943792 -0.110775 0.15863 -0.18333 -0.118979 0.159101 0.0302449 -0.137796 0.0876754 -0.0101753 -0.056148 -0.089076 0.00660096 0.091625 0.0447427 -0.0418632 0.18064 -0.0161877 -0.150248 -0.120158 -0.00499505 0.299327 -0.126261 0.109257 -0.0777038 0.0316012 -0.00790903 -0.0781945 0.149289 -0.0179368 0.107227 -0.0373599 0.0567757 0.0461378 -0.072511 -0.0803709 0.10141 0.0216583 0.060511 -0.116602 0.0299582 0.00463406 -0.0600996 -0.11459 0.0190643 0.0997671 0.0525594 0.0477934 0.00152516 0.0996416 -0.142802 -0.0187002 -0.0481046 -0.0189239 -0.124633 -0.0213832 0.085633 0.00735513 -0.0313097 -0.0130506 0.0184627 -0.0529411 0.0452349 -0.0520296 0.102405 -0.0665793 0.0643758 -0.00579998 -0.0652322 -0.00243336 0.172273 -0.013909 -0.0049139 0.0721491 0.0525147 -0.0612063 -0.120486 0.0691179 0.155115 0.0491671 -0.0720452 0.000517055 0.0486231 -0.0776328 0.0879935 0.0125165 0.0592435 
0.0172629 0.0435839 -0.0763314 0.00173163 0.0252192 0.248476 -0.0118442 -0.0268483 -0.0283398 -0.0190502 0.0793072 0.0893254 0.0532113 -0.155704 -0.0442196 -0.0602991 -0.143126 0.0384768 -0.0689028 0.121784 0.093501 -0.092601 0.0872208 0.148272 -0.00453525 0.00635369 -0.0116731 -0.225164 0.0201769 -0.00958105 0.0824073 -0.0406349 -0.0619928 0.0626609 -0.00303159 0.0821633 -0.0787043 0.0894092 -0.0646675 -0.00959698 0.0711054 -0.099071 -0.11309 0.140592 -0.185398 -0.129296 0.149339 0.0218077 -0.133673 0.0841191 -0.0139171 -0.0410305 -0.0693426 0.000801799 0.0811391 0.0557584 -0.0438514 0.176963 -0.0336621 -0.140034 -0.136039 -0.000871196 0.303397 -0.155741 0.120681 -0.0577807 0.043092 -0.0269247 -0.101944 0.169282 -0.0226397 0.103819 -0.0457098 0.0665563 0.0490581 -0.0795842 -0.0763404 0.083375 0.0123119 0.0607867 -0.129529 0.0358817 0.0132477 -0.061605 -0.104345 0.0129606 0.090692 0.0421493 0.0328301 0.0103405 0.111003 -0.144689 -0.0108471 -0.0402532 -0.00773587 -0.126589 -0.0191738 0.0774283 0.00843678 -0.0209706 -0.019146 0.0178866 -0.0634211 0.040511 -0.0398067 0.108852 -0.0380031 0.0490872 -0.0125466 -0.0522791 -0.00664649 0.164568 -0.00168069 -0.00953624 0.08362 0.0378757 -0.0567172 -0.114479 0.0921289 0.160507 0.0690562 -0.0840364 -0.000546135 0.0414043 -0.0550415 0.0938235 0.0349419 0.0604424 
0.00699018 0.0385219 -0.0701658 -0.00555319 0.00840606 0.221959 -0.0315927 1.63412e-05 -0.0244035 -0.00701634 0.081998 0.0707582 0.0584794 -0.156954 -0.0406984 -0.0564272 -0.15122 0.0227096 -0.0592401 0.121726 0.099525 -0.116475 0.113946 0.143954 9.75191e-05 0.0100682 0.00825081 -0.237054 0.0200282 -0.0281078 0.0853112 -0.0748468 -0.0335655 0.0558609 -0.0143036 0.0710916 -0.0799304 0.125372 -0.0702893 -0.00294378 0.0543391 -0.102489 -0.129005 0.144918 -0.182079 -0.132496 0.146502 0.0103152 -0.128519 0.0847783 -0.0203172 -0.0355447 -0.0649328 0.00910218 0.0783724 0.0509014 -0.0156964 0.15525 -0.021296 -0.164235 -0.132224 -0.0232094 0.283684 -0.134035 0.113292 -0.0581672 0.0406615 -0.00937615 -0.0747346 0.154825 -0.0295328 0.098482 -0.0554602 0.051708 0.064958 -0.0840376 -0.0893375 0.0951492 0.0200991 0.0863184 -0.154574 0.0160472 0.0139186 -0.0585012 -0.100334 0.0187989 0.0896071 0.0565466 0.053643 -0.0157168 0.0904744 -0.134501 -0.00218327 -0.0474682 -0.0127738 -0.142162 -0.0244165 0.0892279 0.00668668 -0.0338358 -0.0208061 0.00722515 -0.0531406 0.0344689 -0.0272611 0.0975231 -0.0369069 0.050642 0.00905928 -0.0773588 -0.019623 0.177305 -0.000284988 -0.0159473 0.0936568 0.0526392 -0.0652976 -0.123076 0.0902916 0.158178 0.0576299 -0.0724037 -0.0136842 0.043072 -0.0549818 0.0882147 0.0403826 0.0824855 
0.0114333 0.0162193 -0.0633276 0.00406545 0.0331544 0.222432 -0.0130502 -0.0131573 -0.0207573 -0.0302821 0.064112 0.0712873 0.0499441 -0.156676 -0.0281302 -0.0622966 -0.145196 0.0171459 -0.0643236 0.1197 0.10132 -0.120657 0.117857 0.108433 0.0107352 0.0119523 -0.0288271 -0.24761 0.020354 -0.042417 0.123191 -0.0228194 -0.0530071 0.0573063 0.00363495 0.0751159 -0.0795752 0.140836 -0.0425629 -0.0250987 0.0858008 -0.0885535 -0.145245 0.123741 -0.187322 -0.123158 0.122984 0.0111601 -0.114005 0.0580132 -0.0570601 -0.0295536 -0.0445861 -0.00112944 0.0585868 0.0366482 -0.00943965 0.164395 -0.0475115 -0.145943 -0.134677 -0.0099379 0.274568 -0.144044 0.131278 -0.0419473 0.0493804 -0.00234792 -0.0715814 0.153646 -0.0265217 0.106829 -0.0572919 0.0641497 0.042474 -0.0953766 -0.0921715 0.0713782 0.0137829 0.0973154 -0.166432 0.0200446 0.010952 -0.0633122 -0.0891545 -0.00247602 0.0971646 0.069108 0.0245773 -0.0339467 0.126519 -0.116041 0.00386601 -0.044615 -0.00906443 -0.142147 -0.0110612 0.087616 -0.00365424 -0.0210298 -0.0321347 -0.0101826 -0.0686149 0.0545422 -0.0128681 0.0954527 -0.0185928 0.0677548 0.0420957 -0.0636667 -0.0358195 0.175932 -0.03067 -0.00933257 0.113747 0.0426855 -0.0770461 -0.132147 0.106455 0.165385 0.0623888 -0.0515161 -0.0184459 0.0538883 -0.0468072 0.0659424 0.0359694 0.0735255 
0.00538166 0.00510234 -0.0538548 0.007092 0.0257529 0.216868 -0.0161999 -0.00769921 -0.00893547 -0.0355066 0.0642585 0.0724813 0.051689 -0.14661 -0.024444 -0.0723715 -0.145743 0.00774625 -0.0672568 0.1229 0.0961402 -0.127208 0.124221 0.118916 0.00840881 0.00251076 -0.029411 -0.243053 0.00916175 -0.0514822 0.132131 -0.0380687 -0.0450609 0.0580581 -0.00409475 0.0819318 -0.082033 0.147751 -0.0593821 -0.0189794 0.0867066 -0.0854429 -0.157457 0.116329 -0.187258 -0.134704 0.111179 0.0114456 -0.0968457 0.0647296 -0.0632884 -0.0367021 -0.0365473 -0.000976859 0.0606444 0.0402103 -0.0117206 0.165152 -0.0428291 -0.148474 -0.139313 -0.00504512 0.2639 -0.145191 0.127342 -0.0376445 0.0579141 -0.000664534 -0.0736412 0.151262 -0.022758 0.105341 -0.0531449 0.0655016 0.0478102 -0.0907044 -0.0927448 0.0647577 0.0192673 0.102785 -0.173854 0.0105374 0.0116582 -0.0655745 -0.0869078 -0.00274291 0.100931 0.0715054 0.0232811 -0.0410155 0.121815 -0.115997 0.0244773 -0.0488913 -0.0111986 -0.146702 -0.0175791 0.0793468 -0.00197044 -0.0181336 -0.029996 -0.0118955 -0.068781 0.0450352 -0.00827475 0.0953274 -0.0189191 0.0523373 0.0393501 -0.0634087 -0.0401959 0.178951 -0.0236095 -0.00996767 0.106711 0.0514572 -0.0735541 -0.124298 0.0994615 0.167488 0.0553715 -0.0539774 -0.0327122 0.0555946 -0.0508443 0.0716274 0.029891 0.0821353 
-0.00106 0.00813714 -0.0565999 0.00910241 0.0211614 0.202581 -0.0256052 -0.00608801 -0.0219858 -0.0308099 0.0568209 0.0640346 0.045255 -0.147539 -0.0205257 -0.0612402 -0.150792 0.00296921 -0.0497748 0.129848 0.0899875 -0.133002 0.133298 0.105332 0.0117406 0.0195681 -0.0264899 -0.252986 0.012716 -0.0579028 0.126913 -0.0324273 -0.0397336 0.0504004 -0.00384602 0.0842599 -0.0817486 0.159994 -0.0538796 -0.0201623 0.0780109 -0.0848352 -0.153067 0.117763 -0.184533 -0.116016 0.127903 0.00333781 -0.106719 0.0628884 -0.0674924 -0.032745 -0.0328251 0.00178808 0.0648485 0.0345604 0.00223254 0.158278 -0.0334609 -0.151685 -0.134146 -0.00803375 0.263224 -0.138849 0.133488 -0.0352236 0.0536016 -0.0013438 -0.062016 0.148832 -0.0281105 0.109274 -0.0543926 0.072479 0.0545065 -0.0995461 -0.0960064 0.0721146 0.018692 0.101064 -0.174999 0.011976 0.000771859 -0.0691583 -0.0869623 -0.00204925 0.0899766 0.0762173 0.0294726 -0.0495763 0.121755 -0.100766 0.0192583 -0.0545214 -0.00486713 -0.140776 -0.00601777 0.0959024 0.00242532 -0.0244444 -0.0429976 -0.0179725 -0.064479 0.0431077 -0.0135412 0.0975754 -0.0181483 0.0587353 0.0519492 -0.0675587 -0.0418066 0.185091 -0.0241423 -0.0205014 0.111729 0.0455871 -0.0704194 -0.138974 0.10436 0.159914 0.0554353 -0.0449003 -0.0203583 0.0529468 -0.0538635 0.0674361 0.036949 0.0841901 
0.00911976 -0.00140707 -0.060624 0.0158478 0.0325241 0.218584 -0.0108256 -0.014015 -0.0160043 -0.0422993 0.0599869 0.0778288 0.0515517 -0.153502 -0.0348277 -0.0592903 -0.158822 0.0147706 -0.0717831 0.133384 0.107573 -0.133174 0.120684 0.119327 0.00879908 0.00350492 -0.0404457 -0.252267 0.0020533 -0.0388521 0.118234 -0.0278587 -0.0542007 0.0620248 -0.00251495 0.0836171 -0.087932 0.132102 -0.0603489 -0.0289686 0.0846073 -0.0891448 -0.137815 0.120989 -0.182008 -0.132622 0.127413 0.00929803 -0.103452 0.072871 -0.0588475 -0.0561674 -0.0399995 0.00291268 0.0754813 0.0390904 -0.0166902 0.165348 -0.0386632 -0.146673 -0.127405 0.00161909 0.269965 -0.141744 0.129643 -0.0397583 0.0453107 -0.00735467 -0.0739018 0.147383 -0.0264127 0.112107 -0.0492886 0.0659293 0.0403293 -0.0865251 -0.0828657 0.0651318 0.0168717 0.0968274 -0.159227 0.0119771 0.00161084 -0.0683461 -0.0989165 0.00987084 0.0959379 0.0707195 0.0236298 -0.032938 0.128478 -0.11881 0.0101869 -0.0528437 -0.0171867 -0.128875 -0.0210809 0.0851128 0.0038863 -0.0138315 -0.0282791 -0.0164609 -0.0671616 0.0426493 -0.00993691 0.0991689 -0.0272285 0.0643726 0.0251506 -0.0574333 -0.0426099 0.176011 -0.0240246 -0.0187005 0.106553 0.0543224 -0.0641209 -0.117897 0.0964716 0.16705 0.0537581 -0.0489853 -0.0185342 0.0552862 -0.0585409 0.0749339 0.0306078 0.0751686 
0.0108095 0.0203349 -0.079932 0.00451234 0.0301045 0.225731 -0.0248579 -0.0245941 -0.0281709 -0.0119514 0.0752287 0.0828043 0.0648263 -0.137057 -0.0388686 -0.0416351 -0.151323 0.0366118 -0.0632888 0.127339 0.107181 -0.12228 0.127625 0.127663 0.00510107 0.0102899 -0.01784 -0.248488 0.00845403 -0.0146607 0.0898763 -0.034474 -0.0414257 0.0493123 -0.0103341 0.0813329 -0.0897215 0.128893 -0.0553336 -0.0107464 0.05893 -0.0874385 -0.126322 0.126352 -0.19339 -0.133454 0.146082 0.00699468 -0.116193 0.0744374 -0.0230961 -0.0524645 -0.056099 0.0114975 0.0777624 0.0480256 -0.00319641 0.167852 -0.0267275 -0.147735 -0.131841 -0.0102103 0.284541 -0.148221 0.128542 -0.0467506 0.032694 0.00714422 -0.0779429 0.155986 -0.0165327 0.120042 -0.0518219 0.0489575 0.0502887 -0.0734229 -0.0906261 0.0711075 0.00806674 0.0772009 -0.146994 0.0222456 0.00688209 -0.0589789 -0.114886 0.0234012 0.092493 0.0575062 0.0361516 -0.0277163 0.095804 -0.131896 -0.000122933 -0.0473568 -0.014852 -0.135796 -0.0296448 0.0997587 0.00960686 -0.0199836 -0.0178289 -0.00847623 -0.0562627 0.0422946 -0.0198388 0.101929 -0.0421298 0.0541232 0.0131152 -0.0694459 -0.0382672 0.17181 -0.00200217 -0.0160145 0.0957032 0.0571261 -0.0704517 -0.112167 0.0835192 0.164192 0.0606627 -0.0701896 -0.00990602 0.0420465 -0.0633436 0.0928301 0.0264966 0.0866086 
0.00832702 0.043828 -0.0833131 -0.0170486 0.0234368 0.234912 -0.0317211 -0.0191382 -0.0383203 -0.0218282 0.0712504 0.0761778 0.0589996 -0.151065 -0.0463597 -0.0563783 -0.146118 0.030329 -0.0601021 0.126079 0.0947867 -0.0904893 0.106886 0.124246 -0.0135075 0.0241763 0.00151502 -0.232107 0.0273623 -0.0225466 0.0848788 -0.0512096 -0.04394 0.054157 -0.00152057 0.0821979 -0.0713105 0.114037 -0.0632295 -0.00478197 0.0635847 -0.0929035 -0.117783 0.154052 -0.193185 -0.110298 0.160545 0.0212961 -0.137996 0.0813554 -0.0302877 -0.0385317 -0.0688655 0.0111628 0.0759076 0.0467478 -0.0174095 0.166086 -0.0271118 -0.154991 -0.132663 -0.00506791 0.300233 -0.137072 0.122209 -0.0710848 0.0445136 -0.0127589 -0.0723988 0.165661 -0.0235628 0.0942983 -0.0447015 0.060872 0.0575777 -0.0855621 -0.0974684 0.0953129 0.012505 0.0617997 -0.132372 0.0369187 0.00828522 -0.0547214 -0.10469 0.0153668 0.0886548 0.0537078 0.0369969 -0.00262876 0.112214 -0.136171 -0.0122965 -0.0512545 -0.00337187 -0.135141 -0.0174603 0.103378 0.00268314 -0.0302862 -0.0288689 0.0160356 -0.0547 0.0447734 -0.0399984 0.101398 -0.0450757 0.061311 0.00180849 -0.0614684 -0.00812701 0.168168 -0.0110384 -0.00612932 0.0780496 0.0415313 -0.0628937 -0.13805 0.0906362 0.151014 0.0671308 -0.0723142 0.00277818 0.0405872 -0.0631389 0.0779739 0.0283802 0.0719933 
0.0213827 0.0338261 -0.0831085 0.0114906 0.0440037 0.250934 -0.00926314 -0.0409809 -0.0294871 -0.0298653 0.0676802 0.0874646 0.0628747 -0.150759 -0.0415789 -0.055938 -0.134587 0.0404974 -0.0763478 0.131188 0.103866 -0.106265 0.109339 0.139023 0.00527189 -0.0124601 -0.0395739 -0.238316 0.0164322 -0.00469078 0.107936 -0.0142977 -0.0647251 0.0624926 -0.000559188 0.0834638 -0.0814272 0.0966924 -0.0511248 -0.0177206 0.0757051 -0.0910354 -0.118863 0.120113 -0.189476 -0.134445 0.142927 0.0248802 -0.115611 0.0797772 -0.0258399 -0.0476209 -0.0478736 -0.00344961 0.0629096 0.0493532 -0.0239305 0.17764 -0.0327604 -0.137478 -0.139661 0.0173929 0.286097 -0.173079 0.122538 -0.050034 0.0479161 -0.0204383 -0.107015 0.154981 -0.023034 0.113671 -0.0517658 0.0663187 0.0380017 -0.0752531 -0.0760764 0.0635314 0.00921186 0.0796411 -0.134638 0.0282566 0.00647916 -0.0584134 -0.0979531 0.0203499 0.083696 0.0415669 0.0150428 -0.00993802 0.119044 -0.137262 -0.000374561 -0.0388611 -0.00839459 -0.129517 -0.0275828 0.0908092 -0.00162455 -0.0117891 -0.0149506 0.00280737 -0.0664561 0.061846 -0.029454 0.107333 -0.0326668 0.0594809 0.00218869 -0.0410451 -0.0287494 0.164189 -0.0104314 -0.00442389 0.0781021 0.0459802 -0.0696024 -0.104719 0.090211 0.17305 0.0609651 -0.0747812 -0.0122128 0.0463196 -0.0651003 0.0852759 0.0136971 0.0602635 
0.0219139 0.0491596 -0.0887305 -0.00969506 0.0315701 0.234179 -0.0162066 -0.0154468 -0.0350402 -0.0136833 0.0785073 0.086417 0.0650954 -0.166071 -0.059641 -0.042332 -0.135601 0.0415765 -0.0822144 0.136755 0.10857 -0.102097 0.100605 0.142167 -0.0131491 0.00784867 -0.00633779 -0.231136 0.0270363 -0.00532043 0.0688047 -0.046193 -0.0457075 0.0675834 -0.0102438 0.0652929 -0.073808 0.10816 -0.0672422 -0.0136948 0.0569062 -0.101706 -0.0994849 0.151261 -0.184646 -0.123844 0.16102 0.0218441 -0.141444 0.0933623 -0.00584069 -0.0500445 -0.0830882 0.00816187 0.0839979 0.0455045 -0.0290952 0.162273 -0.024683 -0.154257 -0.127465 -0.0138677 0.296516 -0.141666 0.116113 -0.0781327 0.0248095 -0.0161049 -0.0927561 0.153376 -0.027401 0.0948156 -0.050783 0.056867 0.0489955 -0.0768714 -0.0733743 0.100903 0.0140356 0.0634319 -0.128791 0.0285012 0.0099451 -0.0525363 -0.103815 0.0230238 0.0864588 0.0511046 0.0476366 0.00812493 0.0968349 -0.15078 -0.0281358 -0.0447504 -0.00872693 -0.123066 -0.0235061 0.0947805 -0.00263229 -0.0285675 -0.015186 0.0149615 -0.0566077 0.0577262 -0.0379197 0.0970712 -0.0512682 0.0692541 -0.00266962 -0.0677812 -0.0150557 0.169388 -0.00872488 0.00227251 0.0795143 0.0433945 -0.0636865 -0.118536 0.0821818 0.163497 0.0565278 -0.065833 0.0027187 0.0467968 -0.0583762 0.0793459 0.0278017 0.0556716 
0.0145846 0.0299165 -0.0735087 -0.0143113 0.0181645 0.226664 -0.0259402 -0.00403836 -0.0301419 -0.0156199 0.0750603 0.0749355 0.0665174 -0.160009 -0.0496966 -0.0454042 -0.158919 0.0198418 -0.0727055 0.136384 0.112066 -0.108071 0.100921 0.144035 -0.0129902 0.0203765 -0.00440839 -0.241773 0.0200205 -0.0216139 0.0748602 -0.0659166 -0.0480714 0.0621459 -0.00874213 0.0782579 -0.0823264 0.119672 -0.0740341 -0.0163593 0.0574374 -0.106283 -0.115834 0.155197 -0.174448 -0.11873 0.153793 0.026624 -0.13651 0.0874809 -0.022499 -0.0514688 -0.0722871 0.0112984 0.0976505 0.0413529 -0.030351 0.156882 -0.018765 -0.167408 -0.120471 -0.0163012 0.289355 -0.118376 0.110053 -0.0713458 0.0341494 -0.00497706 -0.0637566 0.147542 -0.0285467 0.0964435 -0.0493151 0.0483138 0.0572145 -0.0784991 -0.0877417 0.104723 0.0283845 0.0878549 -0.124543 0.0205341 0.00826963 -0.0588798 -0.106083 0.0180156 0.0972324 0.0646839 0.0531137 0.00206272 0.104108 -0.135073 -0.0155156 -0.0462876 -0.0304326 -0.128707 -0.0212874 0.0891491 0.00934977 -0.0392667 -0.00654219 0.0105736 -0.0546127 0.0299438 -0.0366986 0.0939149 -0.0541678 0.0634987 0.00477033 -0.0665937 -0.0108719 0.174936 -0.0160457 -0.0167971 0.0894567 0.0587573 -0.0693436 -0.123144 0.0694523 0.153334 0.055298 -0.0642873 0.0025497 0.0487479 -0.0691956 0.0844679 0.0344272 0.0714613 
0.0140142 0.0228071 -0.0674208 -0.0251637 0.010626 0.222492 -0.0154534 0.00609578 -0.0392193 -0.0133731 0.0715922 0.0842805 0.0742512 -0.158342 -0.0581537 -0.0487295 -0.160091 0.0218776 -0.0812575 0.13657 0.112643 -0.10555 0.0898899 0.146624 -0.0313419 0.0354869 -0.00337306 -0.237897 0.0225764 -0.0209053 0.0575916 -0.059887 -0.0511451 0.0639387 -0.0183791 0.0675067 -0.0877835 0.129225 -0.079082 -0.00694731 0.0562399 -0.105699 -0.119574 0.154095 -0.169659 -0.12287 0.154307 0.0169563 -0.14669 0.0835416 -0.0193936 -0.060873 -0.0769675 0.0177971 0.0966644 0.0450793 -0.0339568 0.169094 -0.0258745 -0.164078 -0.112138 -0.0141359 0.292822 -0.111758 0.113017 -0.0690064 0.0343258 -0.00749791 -0.0690445 0.136379 -0.0321231 0.0863568 -0.0425298 0.0573259 0.0566636 -0.0742182 -0.0840711 0.096387 0.0342911 0.0729853 -0.125536 0.0190823 0.00779897 -0.0622372 -0.114496 0.0114149 0.108257 0.0613746 0.0570638 0.00203263 0.0989478 -0.143346 -0.0108231 -0.0394425 -0.0310493 -0.117228 -0.0153503 0.0818291 0.0149909 -0.0278554 -0.00805194 0.0132283 -0.0631485 0.0422775 -0.038733 0.0930167 -0.0612336 0.0612688 -0.0105559 -0.0815453 -0.00653805 0.178249 -0.0174641 -0.0195826 0.0879177 0.0613582 -0.0704782 -0.123623 0.0692151 0.147961 0.0492896 -0.0702291 0.00460298 0.0397356 -0.064964 0.0930844 0.0220432 0.0596739 
0.0241798 0.0222907 -0.0743596 -0.00479325 0.0335148 0.250859 -0.00242782 -0.0225967 -0.0152331 -0.0460093 0.0714259 0.0828868 0.0744857 -0.15412 -0.05795 -0.0433929 -0.156959 0.0260878 -0.112595 0.130141 0.131573 -0.0939916 0.0740776 0.147038 -0.0152303 0.00108533 -0.0425277 -0.232958 0.0200685 0.00089358 0.09371 -0.0134682 -0.0750793 0.0767134 -0.00855204 0.0892721 -0.0857435 0.0891579 -0.065888 -0.0156064 0.0820989 -0.0985784 -0.109291 0.139145 -0.158544 -0.133936 0.146064 0.033897 -0.129397 0.0713751 -0.0348851 -0.0625109 -0.0607174 0.0054199 0.0884322 0.0491043 -0.0499104 0.175153 -0.035175 -0.15826 -0.128716 0.0164415 0.288717 -0.134779 0.0957163 -0.0499158 0.0510614 -0.010192 -0.0806123 0.136512 -0.0224973 0.0952058 -0.0432185 0.054944 0.0440826 -0.0715078 -0.0812696 0.0733668 0.0135413 0.0827608 -0.0985518 0.0373879 0.00686093 -0.0674724 -0.114103 0.0409319 0.104927 0.0476182 0.0178048 0.00978628 0.131439 -0.153203 -0.0213304 -0.0345068 -0.0368704 -0.102133 -0.0332318 0.0734465 0.00616584 -0.0147606 0.00281015 -0.000394052 -0.0663938 0.0550492 -0.0439486 0.105246 -0.0639306 0.0718731 -0.016885 -0.050857 -0.0135834 0.163991 -0.0429431 -0.0147308 0.0827237 0.0604034 -0.0793482 -0.108697 0.0757687 0.159366 0.0639273 -0.0656206 0.00671121 0.054985 -0.0792215 0.0855292 0.0123687 0.0533348 
0.026374 0.0319819 -0.0697927 -0.00149454 0.0379078 0.247921 0.00428116 -0.0231324 -0.00424707 -0.0462284 0.0752908 0.088323 0.0744708 -0.172489 -0.0621077 -0.0421453 -0.158597 0.0354975 -0.130445 0.136983 0.136407 -0.0873503 0.0661811 0.153202 -0.021611 -0.0107225 -0.0495961 -0.230699 0.0155255 0.0100965 0.0876398 -0.0154644 -0.0722708 0.0888379 -0.00328945 0.081876 -0.0738779 0.0796054 -0.0714592 -0.0157236 0.0850723 -0.107588 -0.0945667 0.144935 -0.1583 -0.140588 0.148754 0.0375977 -0.129067 0.0859389 -0.0232568 -0.0725508 -0.0779161 0.00833738 0.0943686 0.0483107 -0.0632275 0.159864 -0.0356447 -0.154381 -0.125239 0.00670204 0.27933 -0.134906 0.094706 -0.0721026 0.0475387 -0.0209358 -0.0881344 0.134359 -0.0232024 0.0897225 -0.0404009 0.053358 0.0366132 -0.0712853 -0.0755883 0.0863488 0.0124415 0.0810828 -0.0902066 0.0406655 0.00684898 -0.0565509 -0.110319 0.0483136 0.103452 0.0441901 0.0203144 0.024374 0.12499 -0.164955 -0.0328405 -0.038349 -0.0466925 -0.0984758 -0.04263 0.0655548 -0.000557111 -0.0153807 0.00565103 0.0017702 -0.0664282 0.0583768 -0.0358729 0.0977743 -0.0643225 0.0808642 -0.0235752 -0.039706 -0.0183531 0.155894 -0.046615 -0.00779804 0.0733264 0.0552963 -0.0717165 -0.106646 0.065354 0.160744 0.0657189 -0.0505774 0.00596606 0.0669503 -0.0716047 0.0732476 0.0150385 0.0468589 
0.0208029 0.0199757 -0.0557942 -0.00939187 0.0295269 0.25143 0.000982782 -0.00968408 -0.0117453 -0.0378357 0.0716477 0.074714 0.081505 -0.146291 -0.0401174 -0.0545123 -0.169544 0.0158993 -0.114476 0.128719 0.128227 -0.103019 0.0762382 0.15367 -0.0105931 -0.0150051 -0.0499771 -0.223332 0.0142926 -0.00846967 0.0963843 -0.0408335 -0.0772262 0.0743438 -0.0115306 0.095083 -0.091052 0.0866381 -0.075646 -0.0127768 0.0867343 -0.105692 -0.113657 0.130496 -0.162447 -0.142449 0.133098 0.0391548 -0.121424 0.0780855 -0.0382674 -0.0670031 -0.063385 0.00883978 0.0914393 0.0512712 -0.0639167 0.173639 -0.0331468 -0.158985 -0.130198 0.0187259 0.275447 -0.133665 0.0911375 -0.0365961 0.0537938 -0.00497464 -0.0850592 0.129123 -0.0144578 0.104992 -0.0417601 0.0474988 0.0528081 -0.0568877 -0.0819488 0.0656976 0.0315196 0.0935618 -0.103413 0.0198084 0.0136042 -0.0581867 -0.115794 0.0436366 0.109923 0.0531448 0.0276665 0.0115687 0.126897 -0.156791 -0.00521599 -0.0344133 -0.0549099 -0.117908 -0.0411206 0.0627489 0.00766615 -0.017862 0.00948962 0.00102697 -0.0638969 0.0366467 -0.0413002 0.114839 -0.0644071 0.0658364 -0.0162568 -0.0517963 -0.0121972 0.161399 -0.0374606 -0.0131061 0.0820967 0.070028 -0.0767478 -0.088715 0.0633777 0.163735 0.0597864 -0.0780484 -0.00480674 0.0598243 -0.0770113 0.0943044 0.0143756 0.0638625 
0.0151221 0.0201013 -0.0622649 0.0026338 0.0246757 0.233607 -0.00161963 -0.0198963 -0.00767734 -0.0464303 0.0706259 0.0844884 0.0711872 -0.173912 -0.063099 -0.0509019 -0.165096 0.028483 -0.113035 0.143903 0.128385 -0.102273 0.0822946 0.141423 -0.0245895 0.0041506 -0.0497546 -0.239862 0.0177939 -0.00770122 0.0966699 -0.0150189 -0.0646711 0.0803448 -0.00211546 0.0770573 -0.0749792 0.110943 -0.0650321 -0.0198287 0.0858193 -0.110496 -0.115706 0.13925 -0.167268 -0.145949 0.141503 0.0295239 -0.115831 0.0839195 -0.0362725 -0.0573422 -0.0677349 0.0158344 0.0897782 0.0382173 -0.0397619 0.149012 -0.0405203 -0.156743 -0.124357 -0.000615752 0.27404 -0.125345 0.100929 -0.0727745 0.0574068 -0.0282963 -0.0784739 0.132799 -0.0295775 0.0862226 -0.042464 0.0726826 0.0413997 -0.0879796 -0.0818504 0.0828443 0.0184841 0.0968966 -0.109452 0.0291105 0.0103054 -0.0571456 -0.0959859 0.0327399 0.104341 0.0592628 0.025645 0.00030317 0.126912 -0.149047 -0.0109229 -0.0423043 -0.0463865 -0.119289 -0.0327333 0.0786069 0.00127725 -0.0176858 -0.00293713 0.00517237 -0.0668008 0.0660296 -0.0136943 0.0944947 -0.0439098 0.0849327 0.00386298 -0.0428667 -0.0341077 0.164618 -0.0509595 -0.0105547 0.077405 0.0557268 -0.0611428 -0.119589 0.0775373 0.162098 0.0590499 -0.0480896 -0.00384742 0.0578817 -0.0722023 0.0708017 0.023227 0.0628491 
0.0195386 0.0643924 -0.106943 -0.0234336 0.021215 0.227103 -0.00617613 -0.0149719 -0.0551331 0.00203357 0.0739465 0.0750857 0.089116 -0.131103 -0.0602339 -0.0672074 -0.120885 0.0429606 -0.0771429 0.142713 0.0956982 -0.0979967 0.0883611 0.153923 -0.0245824 -0.00087725 -0.00995423 -0.214463 0.0377395 0.0175085 0.0538926 -0.0472624 -0.0545517 0.0579233 -0.0220577 0.0727475 -0.0838173 0.104446 -0.0906663 -0.000201819 0.0395264 -0.100101 -0.109372 0.17067 -0.187084 -0.0987442 0.168446 0.0433755 -0.144602 0.0881068 0.00277757 -0.0256063 -0.0859867 -0.000298729 0.0853597 0.0497054 -0.0382208 0.176511 0.0061423 -0.158653 -0.127193 0.00288181 0.296124 -0.131217 0.0947974 -0.0899674 0.0419551 -0.0164287 -0.0896156 0.145048 -0.0180123 0.0898705 -0.0406919 0.0575095 0.0492375 -0.0702407 -0.0780877 0.103007 0.020192 0.0591104 -0.118024 0.0243881 -0.00308106 -0.0567869 -0.102965 0.0208007 0.0845151 0.0291219 0.0550243 0.00625213 0.0881337 -0.149343 -0.0104035 -0.0615762 -0.015435 -0.132168 -0.0141038 0.0987932 0.0100104 -0.0388063 -0.00736351 0.0514833 -0.0382242 0.0654003 -0.0782276 0.100596 -0.0769708 0.0755958 -0.00250778 -0.0577848 0.0128273 0.165938 -0.0287833 -0.00407483 0.0465262 0.0528548 -0.0508352 -0.134411 0.0791811 0.160261 0.0424551 -0.082316 -0.00878349 0.0509941 -0.0816563 0.0810152 0.00640884 0.0539466 
0.0139368 0.0366147 -0.0630699 -0.00949987 0.0212496 0.245781 -0.0151668 -0.0135872 -0.0123572 -0.0293494 0.0774533 0.062159 0.0708936 -0.15306 -0.0421316 -0.0602556 -0.15979 0.0233558 -0.0929762 0.125444 0.1173 -0.0956847 0.0825553 0.153831 -0.00709596 -0.00512101 -0.0328825 -0.222172 0.0357937 -0.0166718 0.109606 -0.0450708 -0.0696246 0.068292 -0.00649519 0.0950496 -0.0845454 0.0870182 -0.0701943 -0.0102855 0.0800228 -0.110011 -0.124781 0.148534 -0.167191 -0.135715 0.1382 0.0504265 -0.118393 0.0731127 -0.0387231 -0.0317541 -0.062832 -0.00160875 0.0798871 0.0482516 -0.0422211 0.160314 -0.0216996 -0.166542 -0.137125 0.0106911 0.280722 -0.12145 0.0812394 -0.0525948 0.0643755 -0.0192213 -0.0706353 0.149267 -0.026649 0.0969072 -0.0478542 0.0608172 0.0553106 -0.0902856 -0.0920214 0.0907954 0.0232564 0.0963372 -0.108489 0.0323415 0.0145386 -0.0607766 -0.0923717 0.0341105 0.0984821 0.0554076 0.0305849 0.00469613 0.131888 -0.134077 -0.00676141 -0.0458561 -0.0383519 -0.134682 -0.0355136 0.0835712 0.00233376 -0.033454 0.00347693 0.0131402 -0.0529069 0.0394144 -0.0393462 0.109579 -0.0500885 0.0661722 0.0144743 -0.0439345 -0.0106322 0.166282 -0.0418885 -0.0143235 0.0789774 0.0580281 -0.0612481 -0.118635 0.0805636 0.160542 0.0668734 -0.0755746 -0.00755938 0.0560979 -0.0908592 0.0808383 0.0256292 0.0788982 
0.0355073 0.0500857 -0.0775956 -0.010598 0.0173086 0.232491 0.0106055 -0.00940338 -0.0221522 -0.0440465 0.08173 0.0863097 0.0872924 -0.189715 -0.0733326 -0.0438872 -0.142599 0.0226651 -0.138901 0.148052 0.132437 -0.078036 0.0644576 0.153802 -0.0438444 -0.0044025 -0.0396472 -0.234241 0.0261276 0.0207314 0.0622656 -0.0107105 -0.0604451 0.100558 -0.0186791 0.0520481 -0.058854 0.107668 -0.0731784 -0.000172732 0.0703816 -0.120358 -0.0958346 0.152575 -0.152225 -0.123202 0.158851 0.0291166 -0.150516 0.0965381 -0.00352891 -0.0540117 -0.0874092 0.0197376 0.0867033 0.0358252 -0.0517879 0.142608 -0.0249128 -0.158716 -0.121942 -0.00563567 0.2696 -0.126144 0.081139 -0.0994249 0.0549176 -0.0318827 -0.0865551 0.108891 -0.0369843 0.0576055 -0.0446177 0.0673389 0.0487725 -0.0782462 -0.0736704 0.0934405 0.0136665 0.102963 -0.0887214 0.0250844 0.00580538 -0.0564996 -0.0972027 0.0520723 0.0998776 0.0240547 0.0215572 0.0234903 0.108239 -0.17778 -0.0412801 -0.0337766 -0.055806 -0.097978 -0.0288563 0.0677457 0.00114514 -0.0249476 0.000903995 0.0226416 -0.0620259 0.102439 -0.0454122 0.0760953 -0.0695467 0.114763 -0.0201222 -0.0578694 -0.00950724 0.162229 -0.0638069 -0.0052146 0.0556232 0.0548135 -0.0786803 -0.122193 0.0676379 0.159586 0.0520993 -0.0409009 0.00524938 0.0702269 -0.0532354 0.0558969 0.0123354 0.0293216 
0.0152132 0.0428623 -0.0646597 -0.0151548 0.0111575 0.23278 -0.0115461 0.00132747 -0.0267098 -0.031228 0.0798226 0.0618761 0.0816595 -0.162088 -0.0493189 -0.0386127 -0.143494 0.0101268 -0.107507 0.135107 0.129661 -0.0921306 0.0730315 0.14797 -0.0208788 0.0159412 -0.0303122 -0.232779 0.0490067 -0.0115461 0.0961857 -0.0147308 -0.0648287 0.0792606 -0.022296 0.0798346 -0.0725999 0.120133 -0.0597448 0.00195552 0.0721189 -0.109895 -0.121362 0.145026 -0.143961 -0.125487 0.154745 0.0287949 -0.146574 0.0580029 -0.0311709 -0.0377531 -0.073535 0.0064766 0.0743788 0.0456776 -0.0438206 0.159765 -0.0239635 -0.16927 -0.13304 -0.00360621 0.273084 -0.124653 0.087308 -0.0588502 0.0685246 -0.0209031 -0.065692 0.120924 -0.0376048 0.0807892 -0.0514831 0.0675284 0.0653911 -0.0989008 -0.0854542 0.104417 0.0173732 0.101835 -0.105537 0.0295077 0.00852074 -0.0716855 -0.0951356 0.0398184 0.102485 0.0451696 0.0255845 -0.00461363 0.122462 -0.146362 -0.0239955 -0.0295321 -0.0366496 -0.108171 -0.0199753 0.0801749 -0.00018181 -0.02638 -0.0160617 0.00552528 -0.0661974 0.083432 -0.0462838 0.10017 -0.0592206 0.0867594 0.016461 -0.0755731 -0.0214642 0.178729 -0.0644858 -0.0125415 0.0852295 0.0502061 -0.0855167 -0.139951 0.081601 0.152733 0.0570811 -0.0509759 0.00274266 0.0644152 -0.0716585 0.0705983 0.0132869 0.0498438 
0.0239695 0.0570593 -0.0720393 -0.0107805 0.00286698 0.243733 -0.00122608 -0.0017927 -0.0202319 -0.0258813 0.0891694 0.0664899 0.0888041 -0.178567 -0.0636636 -0.043137 -0.150639 0.02004 -0.12929 0.135428 0.124817 -0.0889853 0.0665071 0.153501 -0.0338615 -0.00518924 -0.0377076 -0.221272 0.0387334 0.00175907 0.0790224 -0.018719 -0.0687036 0.0914699 -0.0257717 0.0669458 -0.0706926 0.102976 -0.071872 0.00579414 0.0678809 -0.128171 -0.111029 0.144073 -0.147234 -0.143279 0.148102 0.0396118 -0.146727 0.086578 -0.0108255 -0.0385093 -0.0830884 0.0129805 0.0721358 0.043582 -0.0488886 0.142939 -0.0185814 -0.167319 -0.133815 0.00081566 0.275761 -0.129898 0.0730182 -0.0674201 0.0642177 -0.0285566 -0.0853828 0.117873 -0.0408264 0.0700761 -0.0454248 0.0740127 0.0593759 -0.091088 -0.0742287 0.0911047 0.0151364 0.0996701 -0.0927235 0.0173705 0.0116657 -0.0637431 -0.0996371 0.0560043 0.0968589 0.029572 0.034454 0.0157691 0.113872 -0.167391 -0.0277073 -0.0317633 -0.0486065 -0.105986 -0.0306034 0.0711749 0.000619921 -0.0241955 0.00543227 0.0188816 -0.0647259 0.0861073 -0.0382384 0.0932414 -0.061964 0.0955089 -0.0102801 -0.0609776 -0.0161256 0.173482 -0.0514384 -0.00871619 0.0675823 0.0504326 -0.0722269 -0.113135 0.0812791 0.155291 0.053809 -0.0644766 0.00771163 0.0663106 -0.0645981 0.0682697 0.0145182 0.0473252 
0.0204793 0.0232811 -0.0494852 -0.00749511 0.0146801 0.233502 -0.00226886 0.00542057 -0.0112453 -0.0455487 0.0780142 0.0711973 0.078242 -0.180824 -0.053798 -0.0471935 -0.157581 0.0111831 -0.127884 0.13923 0.13343 -0.0929529 0.0718543 0.137747 -0.0312038 0.0120951 -0.0464078 -0.239121 0.0261518 -0.0232236 0.0978712 -0.0173576 -0.0680341 0.090477 -0.0149137 0.0735617 -0.068703 0.125357 -0.0646335 -0.00731594 0.0896571 -0.112118 -0.127766 0.136194 -0.152112 -0.141428 0.135932 0.0243196 -0.13075 0.0714025 -0.0363506 -0.0493998 -0.077084 0.020478 0.0804331 0.035874 -0.0432868 0.142869 -0.0375516 -0.166105 -0.126753 -0.00894976 0.262249 -0.121763 0.0929113 -0.0695069 0.0708311 -0.0166638 -0.0630472 0.118064 -0.0316802 0.0774944 -0.0411425 0.0703284 0.0531268 -0.0919145 -0.0893349 0.0950353 0.0205695 0.108075 -0.109708 0.0254645 0.0188473 -0.063291 -0.0948082 0.0390433 0.117223 0.0586129 0.0232857 -0.00264824 0.126399 -0.156001 -0.0171681 -0.0334576 -0.0562288 -0.113046 -0.0232363 0.0627462 -0.00476963 -0.0194554 -0.0097916 0.00451824 -0.0714447 0.0805625 -0.0191437 0.0883026 -0.0514016 0.0925982 0.00458583 -0.0632397 -0.0295222 0.171695 -0.0656255 -0.00879475 0.0883582 0.0512862 -0.0859245 -0.130172 0.0722835 0.148999 0.0560424 -0.0386901 0.00320447 0.0679289 -0.0532148 0.0626012 0.0191608 0.0525731 
0.0125255 0.0200411 -0.0455355 -0.0129012 0.00663244 0.238333 -0.0131799 0.0100401 -0.00649413 -0.0355519 0.0809001 0.0650657 0.072504 -0.163783 -0.0457007 -0.0561242 -0.17279 0.00604659 -0.11275 0.132759 0.116251 -0.0943363 0.0737301 0.143029 -0.0255975 0.0106536 -0.0337682 -0.222625 0.0283603 -0.0413212 0.103141 -0.0445 -0.072249 0.0744215 -0.0197507 0.0885328 -0.0841148 0.113879 -0.0721116 0.00110229 0.0875213 -0.109608 -0.140578 0.138095 -0.157637 -0.152555 0.125696 0.0349849 -0.11819 0.0776781 -0.0469783 -0.0426679 -0.0740336 0.0155227 0.0784166 0.0394327 -0.0497944 0.154987 -0.0341751 -0.168451 -0.135478 0.000193451 0.275285 -0.113144 0.0799972 -0.049398 0.0753226 -0.0148273 -0.0602068 0.129762 -0.0242046 0.0912646 -0.0324799 0.0771428 0.0629041 -0.0961203 -0.0937194 0.0866792 0.0279512 0.102063 -0.106568 0.0226588 0.0208332 -0.0661241 -0.0949677 0.0362362 0.113024 0.0665953 0.0363248 -0.00652773 0.13119 -0.144199 -0.00274792 -0.0353843 -0.0481438 -0.128057 -0.0278225 0.0611492 -0.00136527 -0.0248283 -0.00683567 0.00193403 -0.0655754 0.0464317 -0.0257629 0.10684 -0.0485863 0.0680201 0.0069757 -0.0605475 -0.0167221 0.176875 -0.0447402 -0.0104961 0.0879591 0.0521257 -0.0703997 -0.115682 0.0780151 0.144686 0.0582085 -0.0646084 0.000843073 0.0590989 -0.0704376 0.0767816 0.0231921 0.0740809 
0.012724 0.0188895 -0.040916 -0.00462152 0.0067092 0.220802 -0.0156068 0.0180706 -0.0121301 -0.0421579 0.0808086 0.0561023 0.0712788 -0.169846 -0.0465864 -0.0492663 -0.149477 -0.00393801 -0.102727 0.133692 0.130181 -0.112812 0.0827105 0.128822 -0.011926 0.0197041 -0.0347754 -0.231541 0.0399476 -0.0469814 0.116176 -0.0291627 -0.0580946 0.0793296 -0.0227242 0.0735009 -0.0716483 0.144531 -0.0515847 -0.0118174 0.0933924 -0.108524 -0.140048 0.122941 -0.152112 -0.148702 0.122531 0.0164037 -0.117828 0.0549247 -0.0545097 -0.0229914 -0.0639412 0.0207802 0.0731622 0.0318365 -0.0228924 0.137066 -0.0411254 -0.174619 -0.133611 -0.0168179 0.256412 -0.116792 0.0890255 -0.0435874 0.0726624 -0.012199 -0.0487992 0.118719 -0.0362186 0.0810928 -0.0541354 0.0759329 0.071887 -0.104028 -0.0876226 0.0985286 0.0226882 0.122206 -0.136009 0.0147234 0.0351062 -0.0629555 -0.0787514 0.0327642 0.115591 0.0786081 0.031654 -0.0282231 0.127942 -0.136117 -0.00359822 -0.0304065 -0.0446404 -0.13637 -0.0160078 0.0757655 -0.00886604 -0.0278799 -0.0191441 -0.00185159 -0.0665234 0.0800695 -0.00902454 0.0975733 -0.0322082 0.0879629 0.0371598 -0.082917 -0.0418771 0.176464 -0.0669456 -0.00663777 0.106835 0.0482512 -0.0839976 -0.134174 0.0864467 0.153092 0.0511939 -0.0413649 -0.0072186 0.0585512 -0.0581403 0.0671159 0.0327588 0.0757622 
0.0286439 0.028883 -0.0606503 -0.0102796 0.0117438 0.216 -0.00322356 0.0137887 -0.0232894 -0.0519479 0.07383 0.0623813 0.0757725 -0.194231 -0.0631055 -0.0486231 -0.152372 0.0040849 -0.11653 0.154605 0.132929 -0.0932222 0.079816 0.128686 -0.0320948 0.0145539 -0.0338783 -0.24198 0.0345301 -0.0227687 0.0851084 -0.0300063 -0.0584138 0.0900175 -0.0100405 0.0513897 -0.0586687 0.138796 -0.0650631 -0.0225027 0.0812124 -0.117284 -0.117808 0.15519 -0.158726 -0.12593 0.145248 0.0278288 -0.134678 0.0871574 -0.0396832 -0.0391811 -0.0737983 0.0259693 0.0853849 0.0150855 -0.0291959 0.124514 -0.0327729 -0.182227 -0.117108 -0.0190847 0.262248 -0.100401 0.0811136 -0.085047 0.0637143 -0.0274957 -0.0499116 0.101298 -0.042916 0.0628691 -0.0435871 0.0757195 0.0537858 -0.106073 -0.0891612 0.103216 0.0276192 0.128051 -0.105313 0.0188266 0.0149025 -0.0633559 -0.0722404 0.0348304 0.102825 0.0671228 0.036577 -0.00426959 0.132209 -0.14527 -0.0329762 -0.0405387 -0.0576248 -0.124216 -0.0142324 0.0820897 -0.00994964 -0.0399942 -0.00979713 0.0146303 -0.054796 0.0867679 -0.0274265 0.0785715 -0.0438599 0.11836 0.0256008 -0.0611212 -0.0169172 0.174568 -0.0779546 -0.00614469 0.0786247 0.0486702 -0.0784622 -0.141918 0.074442 0.14764 0.043898 -0.0237961 0.00592077 0.0696939 -0.0568112 0.0431909 0.033195 0.051683 
0.022416 0.0372894 -0.0837095 -0.0160644 0.00551345 0.215114 -0.0125582 0.0018527 -0.0368727 -0.0214526 0.0825526 0.0677714 0.0898178 -0.15814 -0.0692582 -0.0538926 -0.142002 0.0194574 -0.0950298 0.150835 0.12395 -0.106463 0.081317 0.151713 -0.030415 0.0157951 -0.0186882 -0.236599 0.0372587 -0.00137551 0.0675692 -0.0329208 -0.0560715 0.0724115 -0.0295334 0.0664983 -0.0826819 0.1267 -0.0777212 -0.00651134 0.058277 -0.117426 -0.128064 0.162039 -0.162283 -0.116648 0.155493 0.0357911 -0.140819 0.0743814 -0.0220718 -0.0251541 -0.0741635 0.0127734 0.0848969 0.036818 -0.0262234 0.144229 -0.00636804 -0.175758 -0.117101 -0.00833733 0.277895 -0.101115 0.0733241 -0.081669 0.0617581 -0.0162825 -0.0518348 0.118019 -0.0378114 0.0709969 -0.047347 0.0614457 0.059282 -0.0901122 -0.0886479 0.106412 0.0215999 0.106192 -0.114817 0.0233493 0.00491444 -0.0674723 -0.0939645 0.0393229 0.101843 0.0483185 0.0452616 -0.00954091 0.110478 -0.139947 -0.0173487 -0.0450575 -0.0481818 -0.128903 -0.0187991 0.0877609 0.0119771 -0.048203 0.00166727 0.0263697 -0.0445386 0.0776554 -0.0496191 0.0892112 -0.0650287 0.098468 0.0105783 -0.0692848 -0.0057905 0.17653 -0.0592744 -0.0202419 0.0659684 0.0591867 -0.0742028 -0.147435 0.077122 0.148972 0.0399352 -0.0559726 -0.00558161 0.0580972 -0.0809029 0.0711716 0.0153128 0.0609387 
0.0231277 0.0350963 -0.0605333 -0.0166234 0.00495187 0.230346 -0.00700076 0.0198493 -0.0267939 -0.0142992 0.0902032 0.0703428 0.0897224 -0.176552 -0.0567099 -0.0482996 -0.150659 0.0232054 -0.114287 0.146425 0.129643 -0.102746 0.0741354 0.161245 -0.0319908 0.00208621 -0.0272241 -0.230981 0.0348375 -0.0112435 0.0719864 -0.0445038 -0.0579726 0.0852957 -0.0304976 0.0652114 -0.0833513 0.111536 -0.0791576 -0.00365808 0.0650766 -0.127009 -0.125302 0.147228 -0.153728 -0.145097 0.141956 0.0336661 -0.143214 0.0840768 -0.0128083 -0.0433745 -0.0842471 0.0124082 0.0789909 0.0434183 -0.044584 0.139111 -0.0190352 -0.168862 -0.123105 -0.0116555 0.268929 -0.111603 0.0764828 -0.0724845 0.055897 -0.0193574 -0.0732455 0.113998 -0.0362 0.0742402 -0.0495001 0.0580572 0.0576007 -0.0835547 -0.0782687 0.102192 0.0295896 0.106858 -0.114314 0.0093169 0.0156247 -0.0589255 -0.0985936 0.0470038 0.108793 0.04905 0.0488274 0.00518476 0.105156 -0.15428 -0.0200227 -0.0279474 -0.056687 -0.1203 -0.0316319 0.0678216 -0.00249997 -0.0345909 0.0104474 0.0175774 -0.0628238 0.0662523 -0.0288108 0.0946541 -0.057045 0.0836384 0.000771295 -0.073869 -0.0193261 0.173535 -0.045888 -0.0152481 0.0770366 0.060258 -0.0754883 -0.118779 0.0702349 0.157291 0.0440827 -0.0666361 -0.00574314 0.0618717 -0.064227 0.0793958 0.0214929 0.0571961 
0.0142645 0.0492577 -0.0631161 -0.00879115 0.00876219 0.229012 -0.0177281 -0.00345704 -0.0308632 -0.0368814 0.0819204 0.0697001 0.0706979 -0.176045 -0.0494088 -0.0414596 -0.130088 0.0181918 -0.0901611 0.134797 0.128923 -0.0725047 0.0701768 0.143647 -0.0243143 0.0281098 -0.0210199 -0.243816 0.0466713 -0.0030468 0.0914515 -0.0135238 -0.0478837 0.0818382 -0.00320369 0.0708793 -0.0498293 0.127523 -0.0538681 -0.00364042 0.0746598 -0.10792 -0.113342 0.15166 -0.156476 -0.114289 0.165917 0.0128231 -0.153038 0.0565595 -0.016804 -0.0290553 -0.0712331 0.0155064 0.083626 0.0449865 -0.032132 0.141263 -0.031169 -0.167641 -0.133775 -0.0245298 0.27103 -0.133029 0.10411 -0.0874504 0.0702863 -0.035743 -0.064763 0.129104 -0.0386615 0.0665875 -0.0595472 0.0629038 0.0638413 -0.100919 -0.0923779 0.118012 0.0120926 0.104196 -0.112684 0.043885 0.0205952 -0.0608896 -0.0809921 0.0283798 0.10375 0.0424976 0.0189664 0.000503966 0.112812 -0.148 -0.0345025 -0.031188 -0.0358609 -0.111854 -0.00911224 0.0879625 -0.00523768 -0.0327865 -0.023566 0.0224484 -0.0628941 0.0919072 -0.0421016 0.0870047 -0.0447118 0.0879029 0.0151731 -0.070605 -0.0255217 0.16224 -0.0719641 -0.0154928 0.0833291 0.0415816 -0.0812518 -0.167892 0.0774215 0.151186 0.0666888 -0.040053 0.00734636 0.0580147 -0.0485451 0.0661918 0.0347542 0.0499573 
0.0269372 0.0435358 -0.0832152 -0.00983309 0.0251804 0.236039 -0.00315595 -0.0134133 -0.0141062 -0.0398224 0.0820215 0.072609 0.0840085 -0.172071 -0.0661426 -0.0462275 -0.140814 0.0273261 -0.121629 0.144014 0.134556 -0.0830715 0.0713185 0.15615 -0.0299163 -0.00179219 -0.0350166 -0.235534 0.0367199 0.0108068 0.0829064 -0.0170674 -0.0609612 0.0840663 -0.0113281 0.0723311 -0.0650406 0.105991 -0.0737172 -0.00879502 0.0742592 -0.109456 -0.112656 0.156088 -0.158251 -0.122994 0.154642 0.0414722 -0.137815 0.0743591 -0.0243983 -0.0396404 -0.0719657 0.00878859 0.085644 0.0414774 -0.0433412 0.146125 -0.0220465 -0.170415 -0.129678 -0.00210553 0.277235 -0.123316 0.0774219 -0.085086 0.0644323 -0.0198531 -0.0676175 0.119713 -0.0328431 0.0704445 -0.0468602 0.055192 0.0504173 -0.0843457 -0.0883498 0.104691 0.0125389 0.0981284 -0.0940914 0.0425714 0.00383809 -0.0633419 -0.0904513 0.0519762 0.0992556 0.0401197 0.0235572 0.0113335 0.123951 -0.157931 -0.0337454 -0.0417421 -0.0472603 -0.113635 -0.0309102 0.0763084 0.00225446 -0.0346591 0.00685759 0.0158985 -0.0521886 0.0793352 -0.0507334 0.0877742 -0.0644068 0.0944189 -0.00136732 -0.0475009 -0.00861452 0.1654 -0.0627987 -0.0113309 0.0642675 0.0567154 -0.0858952 -0.136888 0.0697627 0.150833 0.0563085 -0.0466345 0.00228931 0.0689222 -0.0753867 0.065109 0.00927475 0.0458019 
0.00666218 0.0488701 -0.0776839 -0.0192606 0.0105343 0.232908 -0.0169518 -0.0036253 -0.0177847 -0.0143325 0.0883424 0.0657009 0.0808024 -0.160561 -0.0543301 -0.0504545 -0.146225 0.0220039 -0.0941418 0.132743 0.117974 -0.0914995 0.078081 0.142797 -0.0255068 0.0151268 -0.018941 -0.227671 0.0472354 -0.00812448 0.092602 -0.0358816 -0.0503298 0.0667413 -0.0147716 0.0819632 -0.0719813 0.11757 -0.0665337 0.0044968 0.0676094 -0.109932 -0.128677 0.152855 -0.164403 -0.131177 0.148236 0.0337485 -0.133321 0.0635729 -0.0315334 -0.0229276 -0.0771999 0.00803925 0.0743515 0.0507619 -0.0361263 0.15068 -0.0293505 -0.164201 -0.140804 -0.0149091 0.287271 -0.125183 0.0906166 -0.072645 0.0655022 -0.0168921 -0.0648962 0.132893 -0.0276473 0.0817474 -0.051692 0.063081 0.0641174 -0.0905711 -0.0934507 0.108114 0.0138255 0.0858067 -0.117267 0.032091 0.0150964 -0.053889 -0.0962866 0.0376171 0.102006 0.049304 0.0416822 -0.00576684 0.111092 -0.147409 -0.0157238 -0.0379362 -0.0283238 -0.132082 -0.026939 0.0816864 0.00109947 -0.0320023 -0.00835792 0.0168458 -0.0581961 0.0630123 -0.0407273 0.102321 -0.0502771 0.0729444 0.0138181 -0.0621936 -0.0199432 0.167388 -0.0482483 -0.0101304 0.0773563 0.0530186 -0.0716655 -0.139175 0.0833191 0.152565 0.0606133 -0.0668857 -0.00208713 0.0593918 -0.0753064 0.0789194 0.0186402 0.069673 
0.00364863 0.0428372 -0.0637821 -0.0221391 -0.0117939 0.211799 -0.0223624 0.0297314 -0.0438647 0.0195727 0.0892072 0.0511009 0.0750672 -0.144405 -0.041793 -0.0555625 -0.133727 0.0275071 -0.0510308 0.123033 0.112702 -0.120711 0.0844633 0.164077 -0.0101627 0.0232664 0.0126372 -0.233799 0.0488034 -0.0217286 0.0721597 -0.074303 -0.0385556 0.0575982 -0.0290022 0.0677407 -0.0860329 0.128079 -0.0786484 -0.00202548 0.0409835 -0.12057 -0.135043 0.159198 -0.151027 -0.123064 0.152521 0.0175099 -0.154291 0.0538001 -0.0129654 -0.0214077 -0.07225 0.000700781 0.0777033 0.0652542 -0.0235632 0.153362 0.000616926 -0.175877 -0.116891 -0.0282355 0.276803 -0.113055 0.0977043 -0.0580831 0.046964 -0.0194789 -0.0565587 0.142702 -0.0455699 0.0794708 -0.0652163 0.0438174 0.0692075 -0.0974351 -0.0769043 0.132098 0.0315996 0.0796598 -0.156413 0.0131774 0.00857254 -0.0707532 -0.0952795 0.0130965 0.0995695 0.0511615 0.0694124 -0.0136309 0.0894306 -0.124976 -0.00177443 -0.043865 -0.0195549 -0.127236 -0.011273 0.0907512 0.016205 -0.0383167 -0.00844981 0.027936 -0.0523389 0.0438864 -0.0385105 0.0967253 -0.0499244 0.0470246 0.0186641 -0.101373 -0.0180227 0.177613 -0.025168 -0.0381106 0.0982458 0.0556015 -0.0616509 -0.15222 0.0862685 0.147431 0.0441596 -0.0799877 -0.0176478 0.0464619 -0.070299 0.0967083 0.0326158 0.0703069 
0.0159716 0.0539336 -0.0722467 -0.0292776 -0.000535774 0.229492 -0.0286145 0.00644573 -0.0363451 -0.0230591 0.0866887 0.0579145 0.0837706 -0.180651 -0.0621566 -0.0358094 -0.145694 0.0131197 -0.102787 0.137852 0.126016 -0.073553 0.0701414 0.134674 -0.0385812 0.0383573 -0.010529 -0.236753 0.0483568 -0.0147686 0.0743717 -0.0359103 -0.0547051 0.0765948 -0.0144001 0.0670087 -0.0609021 0.129072 -0.0578994 0.0075647 0.0657232 -0.117144 -0.118266 0.16169 -0.151977 -0.115916 0.164214 0.0309361 -0.158066 0.0646805 -0.0175528 -0.0258464 -0.0826528 0.0243117 0.0780228 0.0323232 -0.0255228 0.12893 -0.018698 -0.186203 -0.125627 -0.0212395 0.277245 -0.103864 0.0794286 -0.0882195 0.070052 -0.011996 -0.0385285 0.113048 -0.0365187 0.0644685 -0.0445395 0.0583559 0.0725732 -0.0985849 -0.106886 0.122286 0.0174175 0.107805 -0.0930824 0.0387588 0.0209038 -0.0579782 -0.0935602 0.0454649 0.108177 0.0533252 0.0398023 0.000154957 0.107427 -0.14699 -0.0345118 -0.0297421 -0.0537642 -0.12029 -0.0128142 0.0869182 -0.00500032 -0.0472879 -0.00805682 0.022538 -0.0556889 0.083643 -0.0444762 0.083878 -0.0606465 0.100535 0.00658975 -0.0692071 -0.0063227 0.173287 -0.0656206 -0.0106097 0.0707825 0.0466622 -0.100617 -0.15266 0.0639716 0.127998 0.0557314 -0.047841 0.0195733 0.0550665 -0.0622717 0.0634527 0.0181618 0.0554275 
0.0173317 0.0449066 -0.0713619 -0.0285224 0.0110869 0.2348 -0.0168589 0.0100317 -0.0345101 -0.0281041 0.0845892 0.0643844 0.083501 -0.175742 -0.0558016 -0.0437972 -0.143948 0.018591 -0.10793 0.133442 0.127163 -0.0764212 0.0712265 0.133865 -0.0337773 0.0244307 -0.0165925 -0.233972 0.0440406 -0.0157223 0.0786897 -0.0323262 -0.0568066 0.0797553 -0.0169131 0.0694264 -0.0658139 0.116803 -0.0648024 0.00581126 0.0770654 -0.112899 -0.118872 0.161333 -0.162316 -0.119355 0.157211 0.028082 -0.156362 0.0624426 -0.0252062 -0.0376701 -0.0848949 0.0176371 0.0722339 0.0388667 -0.0353554 0.141871 -0.0258748 -0.173917 -0.127442 -0.0135532 0.277083 -0.110501 0.0869157 -0.0812528 0.0654809 -0.0109434 -0.0491855 0.120086 -0.0315583 0.0702543 -0.0434979 0.0547109 0.0650958 -0.0906915 -0.104182 0.112545 0.0138736 0.0945229 -0.104795 0.037597 0.0191196 -0.0584611 -0.100668 0.047608 0.113067 0.049783 0.0300456 0.00211777 0.11549 -0.152778 -0.0365898 -0.0351336 -0.0481591 -0.117709 -0.0196187 0.0807264 -0.00749186 -0.0371211 -0.0122645 0.016522 -0.0553875 0.0801376 -0.0449002 0.0885477 -0.0630029 0.0981192 -0.00170892 -0.0712258 -0.00811419 0.167547 -0.0628094 -0.0110515 0.0742242 0.0458962 -0.0952805 -0.148145 0.0726531 0.138227 0.0581459 -0.0524501 0.00928715 0.061662 -0.0593954 0.0631646 0.0139562 0.0530857 
0.00219947 0.086163 -0.0757508 -0.0394843 -0.00394416 0.229255 -0.00997603 -0.00232571 -0.064012 0.0169208 0.0876596 0.0669888 0.0769117 -0.142813 -0.0385912 -0.0645536 -0.114373 0.0357598 -0.051334 0.102322 0.0985952 -0.0659863 0.0580416 0.141042 -0.0278085 0.0409411 0.00800308 -0.217488 0.0716369 0.00991384 0.0585379 -0.0360741 -0.0410248 0.0564816 -0.011718 0.0623518 -0.0584698 0.117023 -0.0567895 0.0226449 0.0547215 -0.111443 -0.1126 0.169063 -0.17408 -0.0857233 0.177519 0.00935919 -0.18158 0.0318881 0.0086178 -0.00131829 -0.090098 0.00619291 0.0687276 0.0684461 -0.0337233 0.165859 -0.0212408 -0.151381 -0.130094 -0.0293457 0.288217 -0.130574 0.116726 -0.0857245 0.0631351 -0.0315646 -0.0721479 0.153976 -0.0278739 0.0682565 -0.0581975 0.0551034 0.0734055 -0.0852609 -0.0979462 0.12646 0.0137183 0.0516752 -0.134243 0.0487533 0.0208338 -0.048259 -0.0933612 0.00557619 0.106035 0.0184369 0.0377878 0.00791131 0.0813611 -0.149438 -0.0203237 -0.0393305 -0.0148504 -0.130123 0.00546389 0.0926271 0.0124383 -0.0328949 -0.0293535 0.0556174 -0.0505891 0.0860931 -0.0719242 0.0934374 -0.0567399 0.0757054 0.00259469 -0.0918001 0.00508276 0.151561 -0.0539194 -0.0207377 0.0732372 0.0341122 -0.0723707 -0.180403 0.0896161 0.14523 0.0714521 -0.0835838 -0.0063878 0.0415364 -0.0457495 0.0854929 0.0237998 0.052374 
-0.00269816 0.0512718 -0.0584852 -0.0158636 0.00716605 0.240513 -0.021464 -0.0189396 -0.0228471 -0.0296594 0.0805201 0.0697241 0.0528389 -0.15861 -0.0442045 -0.0453183 -0.150017 0.0275789 -0.06725 0.0995077 0.117672 -0.0693766 0.0720793 0.139984 -0.0136232 0.0359958 -0.00290314 -0.234338 0.0552294 -0.00730664 0.0984195 -0.0239574 -0.0487041 0.0623116 0.00756579 0.081248 -0.0610843 0.10696 -0.0466266 0.00540948 0.0734978 -0.10428 -0.118913 0.150669 -0.157366 -0.113515 0.161908 0.00986803 -0.154276 0.0403071 -0.0304236 -0.0249073 -0.0576948 0.00450771 0.0723663 0.0675588 -0.0278129 0.168355 -0.0464633 -0.152914 -0.136133 -0.013697 0.295233 -0.135125 0.119441 -0.0603721 0.0638937 -0.0365367 -0.0718124 0.16523 -0.0410629 0.0757724 -0.0610894 0.0610769 0.0665206 -0.102436 -0.0948242 0.106138 0.00536679 0.0677455 -0.11852 0.0552661 0.0158306 -0.0636281 -0.0963899 0.014817 0.0981849 0.0406689 0.0120552 0.00697709 0.123752 -0.139276 -0.0250133 -0.0312117 -0.00933325 -0.107152 -0.0167565 0.0944073 0.0145197 -0.015863 -0.0252141 0.0112434 -0.0698549 0.0630463 -0.0355652 0.0994705 -0.0374306 0.0566447 0.00528814 -0.0744921 -0.0195513 0.162505 -0.0433496 -0.0252064 0.0976925 0.0444093 -0.070939 -0.154598 0.0991045 0.149893 0.0848662 -0.0669103 0.00380092 0.0389845 -0.0587025 0.0902589 0.0342587 0.0606786 
0.00839707 0.0467281 -0.081596 -0.0326864 0.0152235 0.223777 -0.0227751 -0.00377618 -0.0425091 -0.0280612 0.0767484 0.0730624 0.0715539 -0.157438 -0.0666258 -0.0429909 -0.142567 0.0164735 -0.0767377 0.134529 0.119866 -0.0790927 0.0763656 0.127932 -0.0322122 0.0461271 0.000867884 -0.230848 0.056459 -0.0101707 0.0688893 -0.0441974 -0.0495865 0.0589279 -0.00859256 0.071961 -0.0701083 0.126725 -0.0617367 0.000897815 0.0603378 -0.0949569 -0.114748 0.167817 -0.164761 -0.100461 0.170172 0.0198792 -0.157345 0.0587685 -0.0355235 -0.0291795 -0.0801243 0.0135382 0.0834652 0.0434613 -0.0308402 0.165418 -0.0350054 -0.165838 -0.122656 -0.0168022 0.304968 -0.110747 0.105917 -0.0826739 0.0512866 -0.0164619 -0.0512711 0.135845 -0.0295127 0.0749108 -0.0450799 0.0601891 0.0642062 -0.0889087 -0.0971718 0.116747 0.0167199 0.0714678 -0.111139 0.0452753 0.0127016 -0.0567875 -0.100633 0.019655 0.101881 0.0589643 0.0404633 -0.00201165 0.115895 -0.140606 -0.0320968 -0.0341501 -0.0159006 -0.121818 -0.00735653 0.0974552 0.00475446 -0.036194 -0.0248265 0.0207441 -0.0589748 0.0645554 -0.0603641 0.0993107 -0.0540051 0.0812857 0.0078963 -0.0764114 0.00118264 0.166991 -0.0498227 -0.00764763 0.0796537 0.0501887 -0.0809313 -0.153752 0.0761742 0.139191 0.0536746 -0.0555655 0.0105061 0.0436769 -0.0720143 0.0818312 0.0200337 0.0543194 
-0.00390846 0.0770915 -0.0507934 -0.0117554 0.0220024 0.227061 -0.00694076 -0.0329653 -0.0310537 -0.0253615 0.0703548 0.0418794 0.0484817 -0.15242 -0.0160623 -0.0607857 -0.135181 0.0260082 -0.0555851 0.0861323 0.107124 -0.0810298 0.0911565 0.113723 0.0133222 0.0217611 -0.0214249 -0.226801 0.0813349 -0.01278 0.122863 -0.0141758 -0.0456004 0.0555669 0.0306974 0.0649883 -0.0434479 0.128473 -0.0257399 -0.0200549 0.0881415 -0.103959 -0.11352 0.14808 -0.180611 -0.0865247 0.154152 0.0237437 -0.14784 0.0185045 -0.048407 0.00409849 -0.0409401 -0.00692036 0.0563878 0.0533419 -0.00908123 0.158758 -0.0459375 -0.159873 -0.144956 -0.0152277 0.275987 -0.132926 0.131296 -0.0345895 0.0630327 -0.0406434 -0.075307 0.165478 -0.0456043 0.0783149 -0.0682952 0.0659351 0.0738692 -0.115964 -0.104995 0.0969415 0.0126255 0.0828119 -0.133567 0.0490306 0.0166737 -0.054671 -0.0636908 -0.00971609 0.0825436 0.047732 0.00439007 -0.00205783 0.139034 -0.118868 -0.0155365 -0.0548118 -0.00970497 -0.141926 -0.00564972 0.124542 0.00983261 -0.0279549 -0.0313287 0.0203988 -0.046509 0.076762 -0.0361172 0.0943454 -0.0127113 0.090043 0.0675719 -0.0726776 -0.0171267 0.161762 -0.0683714 -0.0144999 0.10394 0.033341 -0.0777978 -0.158234 0.112807 0.1628 0.0846562 -0.0562361 -0.0189315 0.0496025 -0.0545976 0.0672769 0.0433739 0.065252 
