{
  "descriptor": [
    -0.08451879769563675,
    0.06318913400173187,
    0.12986592948436737,
    -0.05914654955267906,
    -0.1612282246351242,
    0.0423220619559288,
    -0.04937595874071121,
    -0.016864025965332985,
    0.14007537066936493,
    -0.11559329181909561,
    0.1867111623287201,
    -0.033035919070243835,
    -0.2297549694776535,
    0.06625575572252274,
    -0.036125678569078445,
    0.11660796403884888,
    -0.115458644926548,
    -0.1668129563331604,
    -0.05215887725353241,
    -0.05923749879002571,
    0.015933064743876457,
    0.1064237430691719,
    -0.008148031309247017,
    0.06685052812099457,
    -0.13910305500030518,
    -0.3766188323497772,
    -0.085772804915905,
    -0.1025448590517044,
    0.03288641571998596,
    -0.13678747415542603,
    -0.07321164011955261,
    0.07165493071079254,
    -0.10909470915794373,
    0.026724301278591156,
    0.051003456115722656,
    0.05247999727725983,
    -0.04196546971797943,
    -0.1172199696302414,
    0.2595354914665222,
    0.08787437528371811,
    -0.2314118891954422,
    -0.0045523615553975105,
    0.0730714499950409,
    0.2657320499420166,
    0.1365642547607422,
    -0.01843143440783024,
    0.017637593671679497,
    -0.023861566558480263,
    0.11770414561033249,
    -0.2792963683605194,
    0.041768498718738556,
    0.22412744164466858,
    0.027424486353993416,
    0.09617237001657486,
    0.1068384051322937,
    -0.1179366186261177,
    -0.005221615079790354,
    0.08630085736513138,
    -0.10954741388559341,
    0.0689290389418602,
    0.03934388980269432,
    -0.0897761657834053,
    -0.01572895050048828,
    -0.08675878494977951,
    0.1676940619945526,
    0.08872199803590775,
    -0.10548477619886398,
    -0.10596936196088791,
    0.11260028183460236,
    -0.15202020108699799,
    -0.11030358821153641,
    0.07074951380491257,
    -0.1357508897781372,
    -0.1295737326145172,
    -0.21077369153499603,
    0.06315278261899948,
    0.4175417423248291,
    0.13710346817970276,
    -0.15318962931632996,
    0.05333337187767029,
    -0.013996471650898457,
    -0.07033112645149231,
    0.03863700479269028,
    0.12321513891220093,
    -0.1117379441857338,
    0.041967034339904785,
    -0.032192662358284,
    0.06191764399409294,
    0.21791520714759827,
    0.03060285933315754,
    0.03164757415652275,
    0.21612176299095154,
    0.002032279036939144,
    0.08031849563121796,
    0.09907649457454681,
    0.092153400182724,
    -0.08413746953010559,
    -0.09748508781194687,
    -0.12401766330003738,
    0.02081373520195484,
    0.019898999482393265,
    -0.11100315302610397,
    -0.029512405395507812,
    0.12313483655452728,
    -0.2305978685617447,
    0.11374811828136444,
    -0.03527931869029999,
    -0.09596510976552963,
    -0.02245292253792286,
    0.05207870900630951,
    -0.07982032746076584,
    -0.015479895286262035,
    0.14228592813014984,
    -0.23321202397346497,
    0.11350686848163605,
    0.1701706349849701,
    0.016502026468515396,
    0.12217911332845688,
    0.08542224764823914,
    0.02756691351532936,
    -0.02649187296628952,
    -0.048462606966495514,
    -0.11545778065919876,
    -0.11679819226264954,
    0.06335175037384033,
    -0.004523676820099354,
    -0.032164886593818665,
    -0.012166175991296768
  ]
}