-0.0204928 0.0846178 -0.0883195 -0.0011734 0.0628802 0.130517 0.125391 -0.147615 -0.150348 0.137532 -0.0231143 0.0482212 0.0911205 -0.00218917 0.0575894 -0.0800561 -0.0720888 0.075242 0.10219 0.0432014 -0.00542643 -0.0705099 -0.0279082 0.0358011 -0.014471 0.0855107 -0.202672 -0.204237 0.103084 0.156271 -0.0160768 0.132603 -0.100238 -0.0885928 0.123069 0.0528476 -0.0511654 0.0637571 0.0394978 -0.078541 0.040076 -0.0474849 -0.043875 0.0819111 -0.189293 0.121779 0.1582 0.0543804 -0.122692 -0.12876 -0.0083317 0.0470371 0.0463004 -0.0639282 0.120041 0.0552483 -4.39918e-05 0.17912 -0.0103881 -0.034253 -0.0611552 0.0462331 0.190794 -0.0998482 0.15649 0.0265108 0.0384906 -0.0193663 -0.0705329 0.00566341 0.0366605 0.137 -0.0344931 0.0379865 0.00015982 0.0415578 -0.12448 0.00785386 0.102761 0.00733388 -0.0148753 0.0652419 -0.0580358 0.00232618 -0.0232792 -0.0976305 0.0562937 -0.0192565 0.0325878 -0.00434912 0.0495528 0.0240181 0.063355 -0.0748915 -0.0949284 -0.157288 0.103674 0.0966838 0.107775 -0.0381508 0.0515469 0.112676 0.0493962 -0.0245551 -0.187745 0.0898206 -0.00370577 0.083391 0.0854439 0.102714 0.0850516 0.0257235 -0.0948802 -0.154368 0.0225249 0.0620297 -0.0752841 -0.13055 -0.0126112 0.0637692 0.0473838 -0.148472 -0.00984354 0.00072618 -0.120079 0.147167 -0.0360881 0.023084 
-0.00647191 0.0874264 -0.0993085 -0.00505369 0.0598916 0.132419 0.132192 -0.12868 -0.157061 0.136601 -0.0332635 0.0390046 0.11252 -0.000637422 0.045279 -0.0793444 -0.0660453 0.0730004 0.0800136 0.05784 0.00770497 -0.0910424 -0.0176352 0.0455822 -0.0154779 0.0699742 -0.207411 -0.201798 0.110347 0.158013 -0.0221899 0.157233 -0.110932 -0.0709706 0.0990085 0.0359294 -0.0537133 0.0824214 0.0329684 -0.087804 0.0375523 -0.0578735 -0.038026 0.0795921 -0.186232 0.101788 0.158699 0.0657124 -0.126332 -0.112646 -0.00410835 0.0473827 0.048508 -0.0579433 0.116136 0.0444846 0.0100326 0.175719 0.0101103 -0.0722119 -0.0584392 0.0553206 0.185769 -0.0989904 0.126988 0.0456844 0.0420237 -0.015034 -0.0746858 -0.00735017 0.0144399 0.13203 -0.0352902 0.0518434 -0.000209528 0.0332924 -0.109199 -0.00243558 0.110955 0.0191852 -0.0138939 0.0603993 -0.0619405 -0.0140855 -0.00830249 -0.0914128 0.0512986 -0.0123358 0.053779 -0.00588032 0.0589657 0.0162046 0.0589227 -0.0795457 -0.0983719 -0.156791 0.103677 0.115701 0.104571 -0.0480094 0.0647595 0.107982 0.0564037 0.0136578 -0.1971 0.0833335 -0.0240749 0.101935 0.0908202 0.0872712 0.0851528 0.0556623 -0.107924 -0.146058 0.0191249 0.0615692 -0.0759466 -0.131882 -0.00406982 0.0688298 0.0379922 -0.139635 -0.00262014 0.00560383 -0.135359 0.128392 -0.0470254 0.0129203 
-0.0202984 0.0790858 -0.089603 -0.00199994 0.0667603 0.129719 0.124541 -0.149011 -0.157886 0.138943 -0.0279169 0.0456828 0.0975057 0.0108662 0.0637524 -0.0679676 -0.0715419 0.0680205 0.10175 0.0402882 -0.00221816 -0.0800116 -0.0224166 0.0267665 -0.00564019 0.087693 -0.209468 -0.202431 0.0995349 0.154642 -0.0156756 0.141262 -0.104446 -0.0895811 0.112695 0.0560371 -0.059689 0.0663676 0.0468118 -0.0801101 0.0360573 -0.0432413 -0.0377582 0.070153 -0.179049 0.123483 0.156027 0.0516513 -0.123755 -0.137338 -0.00995754 0.0387384 0.0506108 -0.0669215 0.117131 0.0527586 0.00152303 0.186111 -0.00804835 -0.0343246 -0.0584415 0.0543605 0.185292 -0.0980585 0.155801 0.050089 0.0307984 -0.00116642 -0.0676524 -0.00434724 0.0381028 0.148578 -0.0346669 0.0337013 0.00453487 0.049189 -0.121287 -0.00766787 0.102942 0.0109428 -0.00880443 0.0587979 -0.0592875 -0.00254566 -0.0332783 -0.0947233 0.0577887 -0.0164901 0.0317183 -0.0103941 0.0477479 0.0276755 0.0645998 -0.0652321 -0.0971781 -0.146272 0.10179 0.0981894 0.107853 -0.0342684 0.0508896 0.0997026 0.0473367 -0.0229504 -0.193134 0.0956922 -0.0128903 0.0858734 0.087068 0.0934693 0.0842173 0.0298969 -0.0942597 -0.154847 0.0300181 0.0670746 -0.0869633 -0.113498 -0.0164369 0.0638991 0.0423233 -0.147866 -0.00613487 -0.000775965 -0.123429 0.152466 -0.0436885 0.0197995 
-0.0262607 0.0755686 -0.0901985 -0.00383745 0.0613275 0.127197 0.123595 -0.139031 -0.154333 0.136465 -0.0312131 0.0402411 0.0988163 0.01534 0.0647304 -0.0762352 -0.0641864 0.068376 0.103668 0.0459332 -0.0106475 -0.0770759 -0.0204191 0.0288796 -0.0197206 0.0860033 -0.211351 -0.204387 0.10074 0.143672 -0.010757 0.140738 -0.0981026 -0.0922486 0.116748 0.0632483 -0.0485442 0.0768609 0.0288753 -0.0775128 0.0396875 -0.0339346 -0.0458717 0.0724425 -0.186255 0.123183 0.159325 0.0535027 -0.118823 -0.131907 -0.0223767 0.032446 0.0515028 -0.0630241 0.116353 0.0544587 0.00398778 0.180242 0.000509014 -0.0411972 -0.0643561 0.0588074 0.180687 -0.103965 0.155533 0.0443279 0.0434661 -0.0106813 -0.0637402 -0.00437694 0.0383008 0.138875 -0.028567 0.0421211 0.00460605 0.0456868 -0.128274 0.00196842 0.105285 -0.00496691 -0.0138153 0.0660707 -0.0682727 -0.00584307 -0.0236387 -0.0908019 0.0553819 -0.0158842 0.0308648 -0.0140438 0.0549497 0.0305722 0.0708274 -0.0837129 -0.0864918 -0.149933 0.106257 0.10493 0.101477 -0.0320909 0.0443247 0.101587 0.0535059 -0.0259962 -0.197746 0.0949093 -0.0114692 0.0753358 0.0854473 0.100279 0.0790626 0.0292649 -0.0907932 -0.16123 0.0199002 0.0627755 -0.0760395 -0.135433 -0.0171305 0.0578178 0.0408164 -0.147157 -0.00576873 0.00560955 -0.129247 0.143816 -0.0471169 0.023696 
-0.0148418 0.1123 -0.104353 -0.0131354 0.0570409 0.132696 0.118135 -0.151588 -0.151883 0.146489 -0.0272408 0.0267911 0.110613 0.0115531 0.0663662 -0.0591082 -0.0400621 0.0529293 0.0919292 0.0396913 -0.0168725 -0.0558795 -0.0434141 0.0427493 -0.0198257 0.0742377 -0.210016 -0.184352 0.117749 0.173489 -0.0161419 0.157968 -0.105576 -0.0844057 0.108277 0.0597551 -0.0400329 0.0542478 0.0470426 -0.0636664 0.0208171 -0.0492515 -0.0372142 0.0567367 -0.1474 0.155332 0.157037 0.0751923 -0.13413 -0.140651 0.00132536 0.0638802 0.0606399 -0.0803621 0.0993233 0.0577062 -0.00723931 0.174487 0.00878137 -0.0331847 -0.0660587 0.068246 0.166348 -0.110754 0.125285 0.0424509 0.04635 0.00169092 -0.0769238 -0.0245185 0.0347578 0.121226 -0.0463077 0.028469 0.0145963 0.0594544 -0.115009 0.00228156 0.105627 0.0185077 0.0182158 0.0627927 -0.0691592 -0.00331355 -0.0145794 -0.0772237 0.0395861 -0.0459136 0.0203635 0.00918364 0.039509 0.0221637 0.0652506 -0.0453178 -0.0957762 -0.13287 0.109448 0.0843269 0.104743 -0.0456309 0.0703795 0.114265 0.042299 -0.00390884 -0.215895 0.0919563 -0.0227579 0.0781887 0.0783347 0.108676 0.0981059 0.0220428 -0.0994916 -0.153641 0.00214947 0.0682629 -0.107007 -0.116213 -0.0258466 0.0616529 0.0396151 -0.150396 0.000185697 0.0091577 -0.125961 0.148017 -0.0631729 -0.00598907 
-0.0233895 0.0784217 -0.0933015 -0.00540647 0.070238 0.131959 0.128366 -0.141199 -0.150251 0.139928 -0.0342601 0.0384326 0.10095 0.00680396 0.0729213 -0.075233 -0.0671189 0.0685865 0.0955561 0.038348 -0.00726445 -0.0736239 -0.0354152 0.0252707 -0.00840697 0.0789825 -0.220947 -0.202474 0.092584 0.154034 -0.00913144 0.145364 -0.106239 -0.0864141 0.119608 0.0617055 -0.049535 0.0502002 0.0377626 -0.0850712 0.0494271 -0.0450385 -0.0316328 0.0759894 -0.177076 0.129049 0.154685 0.0611665 -0.120658 -0.140719 -0.0149406 0.0252449 0.0545584 -0.0710807 0.11534 0.0560822 -0.0135074 0.176197 0.000846389 -0.038483 -0.0590329 0.0590472 0.170167 -0.0978871 0.149173 0.0475531 0.036209 -0.00256693 -0.062697 -0.0165783 0.0418138 0.141251 -0.0305232 0.0212115 0.000220035 0.0569108 -0.128509 -0.00324958 0.103588 0.0064173 -0.0039062 0.0656204 -0.0649609 0.00178358 -0.0284595 -0.0831462 0.0601258 -0.0219369 0.0276693 -0.00437118 0.0502052 0.0277769 0.0607468 -0.0767763 -0.106988 -0.140043 0.100761 0.0908757 0.0995466 -0.0353132 0.0546039 0.100556 0.0575272 -0.0322066 -0.201816 0.0919944 -0.0206656 0.0860134 0.0726428 0.110668 0.0876793 0.0183074 -0.102993 -0.163625 0.0181213 0.0606719 -0.0897643 -0.122488 -0.0223567 0.0559986 0.0479412 -0.146195 -0.00306637 0.0109147 -0.121917 0.140857 -0.0499155 0.0152661 
-0.0225977 0.109642 -0.111957 -0.00780364 0.0455343 0.130339 0.121728 -0.150749 -0.133575 0.146518 -0.0241701 0.0293185 0.111613 0.0168893 0.0629373 -0.0674976 -0.0489903 0.0490934 0.088138 0.0364536 -0.0211663 -0.0694865 -0.0352681 0.0555987 -0.0207278 0.0690829 -0.199912 -0.192053 0.116813 0.171448 -0.00316202 0.160676 -0.101331 -0.0887153 0.091169 0.0622824 -0.0490189 0.067665 0.0280775 -0.046561 0.0215793 -0.0493934 -0.0551678 0.069061 -0.152851 0.13656 0.152537 0.0685457 -0.117873 -0.141311 0.0032467 0.0624466 0.0602168 -0.0855482 0.0984145 0.0666301 -0.0079416 0.18924 0.0230982 -0.0390127 -0.0785289 0.0610249 0.172214 -0.114286 0.123746 0.0394187 0.0618332 -0.0106541 -0.0793526 -0.015436 0.0288976 0.127739 -0.0416636 0.0420073 0.0188579 0.0478777 -0.117871 0.00444488 0.0921376 0.0188712 0.00877846 0.0600086 -0.0771947 -0.0107049 -0.0137036 -0.0812627 0.0428128 -0.0542763 0.0203318 -0.00729254 0.0305719 0.01749 0.0722148 -0.0646889 -0.082297 -0.133959 0.103759 0.0814239 0.117479 -0.0354481 0.0597234 0.10683 0.0461123 0.00511975 -0.221387 0.087607 -0.0308524 0.0709701 0.0799998 0.102124 0.0927127 0.0393113 -0.0957681 -0.158196 -0.00158903 0.0727208 -0.0945733 -0.123494 -0.0131497 0.0660452 0.0431397 -0.148623 -0.0120293 0.0122446 -0.134703 0.145794 -0.0761468 0.00581899 
-0.0225188 0.0747879 -0.103558 0.00303509 0.0607363 0.13781 0.134397 -0.13663 -0.126199 0.129482 -0.030841 0.0381985 0.0993243 -2.67919e-05 0.0641385 -0.0927169 -0.0767634 0.0604585 0.0885916 0.0419453 -0.0086224 -0.0880215 -0.032268 0.0465821 -0.00516088 0.059792 -0.212021 -0.209202 0.0870262 0.152165 0.00719095 0.135511 -0.106611 -0.0861734 0.108548 0.0606174 -0.0572637 0.0527771 0.0175501 -0.0788318 0.0551491 -0.0513485 -0.047947 0.0899405 -0.182388 0.108314 0.145335 0.0636394 -0.101956 -0.128777 -0.0208068 0.0262399 0.0648251 -0.0761953 0.11561 0.0616419 -0.0221505 0.186804 0.0103561 -0.0545525 -0.0709028 0.058287 0.179488 -0.104837 0.137695 0.0456243 0.0533038 -0.0200409 -0.0707411 -0.0133974 0.0325798 0.142062 -0.0308443 0.0324087 0.00497193 0.0465956 -0.127169 -0.00420327 0.0996546 0.022971 -0.0144583 0.0584136 -0.0684173 -0.00772093 -0.017964 -0.0825463 0.0583207 -0.0264876 0.0333606 -0.013622 0.0519014 0.0193079 0.0692914 -0.0922012 -0.10104 -0.148827 0.0935783 0.0849964 0.107219 -0.034971 0.0560666 0.0982279 0.0627869 -0.0289892 -0.206865 0.0906812 -0.0219429 0.0822092 0.0683436 0.112588 0.0922427 0.0342412 -0.100823 -0.167566 0.0105318 0.0681732 -0.0799992 -0.121201 -0.00738607 0.0660195 0.048042 -0.147881 -0.0157262 0.0165475 -0.131015 0.137908 -0.0568478 0.0248804 
-0.0227162 0.073545 -0.11353 -0.00299981 0.0648997 0.129904 0.134071 -0.137271 -0.129169 0.135163 -0.0303022 0.0472907 0.105103 0.0129298 0.0561392 -0.0818085 -0.0640354 0.0616735 0.0925788 0.0479196 -0.00768347 -0.0872496 -0.0248724 0.0434067 -0.014826 0.070713 -0.203097 -0.207961 0.0969328 0.158936 -0.00190943 0.143757 -0.0974783 -0.0909493 0.100714 0.0600582 -0.0554585 0.0713769 0.0156969 -0.0730868 0.0421444 -0.0377261 -0.0501236 0.0880459 -0.18426 0.111671 0.149393 0.0559171 -0.102441 -0.133397 -0.0183888 0.027687 0.054943 -0.0759681 0.116263 0.0641748 -0.0151864 0.1956 0.00632526 -0.0458805 -0.0719457 0.0490986 0.187889 -0.109609 0.147341 0.0376189 0.0468244 -0.0131212 -0.0701395 -0.0109378 0.0368163 0.143239 -0.0329296 0.0334358 0.00101582 0.0523014 -0.119244 0.00208536 0.0952654 0.0034994 -0.0178469 0.0630735 -0.0717968 -0.00609045 -0.0199243 -0.0900414 0.0578477 -0.023766 0.0370715 -0.0191633 0.0440376 0.0162619 0.0659877 -0.0875662 -0.0825471 -0.146275 0.0981998 0.0895566 0.109408 -0.0283646 0.0493542 0.0942744 0.0576242 -0.0200815 -0.214522 0.0900347 -0.0256739 0.0720272 0.0741456 0.101624 0.0841629 0.0356504 -0.0969324 -0.159282 0.0134217 0.0692354 -0.0780982 -0.128297 -0.0120898 0.0672139 0.0412628 -0.14246 -0.0139278 0.0141201 -0.133044 0.142176 -0.0638944 0.0205592 
-0.0375545 0.0725779 -0.0996386 0.00763387 0.0573825 0.128717 0.121756 -0.139996 -0.116515 0.126322 -0.0288549 0.040281 0.100015 0.0158068 0.0588536 -0.084965 -0.0694191 0.0599848 0.0939598 0.0475779 -0.00304916 -0.0949784 -0.0206839 0.0511758 -0.00780206 0.0644102 -0.211278 -0.210167 0.0976541 0.149049 0.0178014 0.134077 -0.0898416 -0.0980132 0.104056 0.0723805 -0.0579416 0.0749827 0.00623809 -0.0720394 0.0461758 -0.0318271 -0.0578756 0.082873 -0.180871 0.0992649 0.150952 0.0517477 -0.0916514 -0.138229 -0.0303437 0.0269711 0.0665024 -0.0780353 0.116457 0.0692122 -0.0115183 0.189693 0.0119277 -0.0566508 -0.0798488 0.0572993 0.180895 -0.109005 0.146595 0.0467143 0.0585585 -0.0223278 -0.0695045 -0.00753371 0.038631 0.142845 -0.0287762 0.0335074 0.0123446 0.0481517 -0.131217 0.0020783 0.0941229 0.00960057 -0.0227481 0.0680415 -0.070265 -0.00600958 -0.0145798 -0.0835203 0.0558942 -0.0177484 0.029165 -0.0272013 0.0454558 0.0238317 0.0776737 -0.0918485 -0.0827231 -0.153949 0.0894429 0.0958078 0.104202 -0.026113 0.0477667 0.0891467 0.0590041 -0.0305616 -0.208747 0.0991091 -0.014776 0.0607267 0.0840059 0.104198 0.0760389 0.0344804 -0.0954653 -0.165714 0.0116459 0.0734814 -0.0799282 -0.129339 -0.0131632 0.0669593 0.0399057 -0.141853 -0.0251393 0.00946816 -0.139385 0.152579 -0.059882 0.0352987 
-0.0301448 0.0867112 -0.110196 0.00630581 0.0540569 0.134695 0.124349 -0.145909 -0.112266 0.121878 -0.0178652 0.0359143 0.0956382 0.0144235 0.0513731 -0.0808649 -0.0704802 0.0557756 0.0867229 0.0412698 -0.00548703 -0.0871419 -0.0251149 0.0584363 -0.00849524 0.0583273 -0.200329 -0.203081 0.108528 0.15142 0.0194792 0.133504 -0.0993228 -0.0971516 0.094057 0.0780771 -0.0652199 0.0657771 0.00482413 -0.0552694 0.0420819 -0.0338875 -0.0631012 0.0922546 -0.172293 0.106498 0.151904 0.0568938 -0.0975868 -0.13661 -0.0271486 0.0408048 0.0537481 -0.0852648 0.111042 0.0735324 -0.0210142 0.207431 0.0168229 -0.0462447 -0.0867944 0.0587183 0.195844 -0.112552 0.138636 0.0378933 0.0637608 -0.0264579 -0.0715045 0.00875271 0.0385424 0.145067 -0.0271843 0.0446551 0.0146105 0.0375623 -0.12505 0.0122032 0.0782491 0.00322411 -0.0131317 0.069426 -0.0780019 -0.0161402 -0.0227749 -0.0767063 0.0501607 -0.0343537 0.018546 -0.0243026 0.0530139 0.015153 0.06634 -0.0957151 -0.0651758 -0.1443 0.0887546 0.0872542 0.111605 -0.0209622 0.0399893 0.091358 0.0567763 -0.0225803 -0.219403 0.104013 -0.0225513 0.0639895 0.0819295 0.0978109 0.0860641 0.0413732 -0.0917328 -0.160674 0.011528 0.0745564 -0.0718452 -0.127913 0.000445078 0.0702727 0.0429217 -0.142732 -0.0223396 0.0174943 -0.144128 0.149416 -0.0655676 0.0304135 
-0.0326276 0.0637378 -0.0762704 -0.00384821 0.0586015 0.13795 0.124763 -0.122274 -0.144645 0.111299 -0.0308668 0.0502779 0.0914649 0.00110992 0.0551992 -0.0910226 -0.0989012 0.0637995 0.084611 0.050071 0.00972437 -0.092241 -0.000729264 0.0276518 -0.0125701 0.0815629 -0.203145 -0.215261 0.0964699 0.120193 0.00553607 0.127251 -0.102715 -0.0773168 0.103975 0.0655293 -0.0664227 0.0947784 0.014015 -0.0707596 0.0621651 -0.0418699 -0.0545248 0.0884767 -0.20505 0.0857893 0.160465 0.0361095 -0.119846 -0.112519 -0.0394226 0.0191156 0.029403 -0.0497313 0.125318 0.057337 0.000464591 0.198473 -0.0114549 -0.0561811 -0.0703004 0.0506647 0.205491 -0.104601 0.169505 0.0390876 0.0449963 -0.0233613 -0.0657805 0.0324802 0.031338 0.153192 -0.0226884 0.0670808 0.00802112 0.0234145 -0.129846 0.00199412 0.0931112 -0.00712779 -0.045405 0.0649075 -0.0585719 -0.01297 -0.0409112 -0.0962457 0.0720565 0.00333961 0.0373134 -0.0248399 0.0749628 0.0107954 0.0649018 -0.105758 -0.0752638 -0.155639 0.0948811 0.116148 0.101006 -0.0179405 0.0171511 0.0886571 0.0461397 -0.0152859 -0.184386 0.0996311 -0.0178874 0.089856 0.0862418 0.0708641 0.0632626 0.0532107 -0.100458 -0.152192 0.0420867 0.0599712 -0.0505729 -0.145028 0.0148669 0.0780827 0.0533269 -0.133852 -0.0108846 0.0124167 -0.128761 0.132918 -0.0312124 0.0413118 
-0.0192575 0.0749476 -0.0888913 -0.0164598 0.0551071 0.15516 0.126687 -0.113336 -0.147543 0.0886485 -0.0299337 0.0426029 0.0859555 -0.00108845 0.0611605 -0.102791 -0.104723 0.0434929 0.0785096 0.0431726 -0.00559583 -0.0692582 -0.00223515 -0.0134624 -0.0180209 0.0863917 -0.198566 -0.201373 0.0956982 0.104683 0.0126345 0.143292 -0.108794 -0.0676611 0.101226 0.0680325 -0.0558965 0.0989831 0.0255382 -0.0582594 0.0771903 -0.0393493 -0.0584248 0.0863798 -0.214174 0.0895809 0.156884 0.0304118 -0.129866 -0.0963856 -0.0646068 0.0343204 0.0221599 -0.0325562 0.101201 0.0495719 -0.00519645 0.19884 -0.0296985 -0.0563195 -0.0836154 0.0565827 0.223871 -0.116087 0.16124 0.0501388 0.0640276 -0.0238247 -0.0610845 0.0428289 0.0316903 0.139851 -0.0147354 0.0933503 0.0102558 0.0110207 -0.131573 -0.0293847 0.0761543 -0.0120101 -0.0458545 0.0683134 -0.0576075 -0.0180046 -0.0361423 -0.0891646 0.0689719 -0.00878909 0.0326902 -0.0190103 0.104613 -0.00907332 0.0521924 -0.106387 -0.057911 -0.157898 0.104346 0.119306 0.0908768 -0.011921 -0.010433 0.0884511 0.0459958 0.00148189 -0.197644 0.110278 -0.0149407 0.10933 0.0751541 0.0657324 0.0721707 0.0499775 -0.116497 -0.136132 0.0425441 0.0404777 -0.0368002 -0.156021 0.0533613 0.07301 0.0722238 -0.133784 0.0120026 0.023138 -0.104039 0.0972097 -0.0104342 0.0442942 
-0.0403352 0.11565 -0.0677482 0.00437966 0.0267477 0.172074 0.143852 -0.134184 -0.0893705 0.103755 -0.0181011 0.0191497 0.0610341 -0.0248582 0.0658059 -0.111358 -0.127803 0.0407618 0.0602921 -0.012588 -0.0158511 -0.0720094 -0.0601727 0.0327728 0.00442957 0.0413527 -0.222024 -0.181254 0.106185 0.122645 0.0454534 0.123212 -0.133833 -0.0829968 0.10946 0.0716126 -0.0820616 0.0276812 0.0260797 -0.0456286 0.0779794 -0.0683128 -0.0735299 0.078016 -0.151617 0.0872684 0.118054 0.0491349 -0.121173 -0.136355 -0.0558794 0.0643932 0.060454 -0.086284 0.081227 0.0813895 -0.0503622 0.210653 -0.0260276 -0.041045 -0.0967211 0.0819972 0.20681 -0.113894 0.127549 0.0833207 0.0812776 -0.0487108 -0.0974239 0.0276098 0.0342871 0.1396 -0.0211456 0.076811 0.0209616 0.019464 -0.129554 -0.0441572 0.076204 0.0168719 -0.0175319 0.0569484 -0.0617843 -0.0162697 -0.0343936 -0.0764579 0.0553164 -0.0492491 0.0149028 0.0019557 0.0832771 -0.00651572 0.0714149 -0.0820504 -0.0728986 -0.132668 0.0836066 0.0487852 0.10676 0.00383231 0.0327887 0.0867628 0.0252599 -0.033512 -0.196011 0.124439 0.00200098 0.0772887 0.0599869 0.0986079 0.105983 0.0383702 -0.102297 -0.161797 0.0348355 0.0608176 -0.0661746 -0.0898093 0.0584883 0.0659953 0.0728584 -0.171123 -0.0176907 0.0144364 -0.103849 0.14304 -0.0337439 0.0251225 
-0.0275237 0.11427 -0.0478132 -0.0101309 0.0208703 0.177909 0.158621 -0.107488 -0.0887673 0.0862117 -0.0213948 0.00654975 0.0739113 -0.0329718 0.0861026 -0.131929 -0.1286 0.0194477 0.0307472 -0.0172216 -0.0157059 -0.056694 -0.0735118 0.0357801 -0.0014956 0.0306846 -0.229745 -0.176234 0.0968961 0.106943 0.0505064 0.12016 -0.146991 -0.0564328 0.111374 0.0624394 -0.0628859 0.035305 0.0214882 -0.0455097 0.100569 -0.0779639 -0.0766627 0.0780081 -0.150344 0.0957252 0.10509 0.0570825 -0.131341 -0.129483 -0.06696 0.0532098 0.059712 -0.0765811 0.0760263 0.072515 -0.071722 0.20686 -0.0271267 -0.0545692 -0.0968323 0.0850665 0.184438 -0.111829 0.11135 0.0922554 0.100045 -0.0381247 -0.0921232 0.00499233 0.0314589 0.120918 -0.018719 0.0750929 0.0308365 0.0196373 -0.140469 -0.0528433 0.0924999 0.0406732 -0.0148601 0.0471455 -0.0568715 -0.0273179 -0.0283489 -0.0729093 0.0726843 -0.0572262 0.00643794 0.0131836 0.101862 -0.0248145 0.0760681 -0.088619 -0.102965 -0.132617 0.0868979 0.0274903 0.10248 -0.00418062 0.0305674 0.0928101 0.0268227 -0.0163774 -0.202879 0.112213 -0.0127093 0.102299 0.0471828 0.0918012 0.12111 0.0416163 -0.129792 -0.157397 0.0323594 0.0576567 -0.0849191 -0.0983228 0.0559343 0.0640678 0.0776866 -0.161144 -0.0202019 0.0404305 -0.0836727 0.11452 -0.0375844 0.0105306 
0.00492491 0.0990756 -0.0673443 -0.0322539 0.0456332 0.19374 0.120529 -0.112056 -0.165076 0.0865892 -0.0156498 0.0333541 0.0736077 -0.0421631 0.0885852 -0.103602 -0.113697 0.0378336 0.0776076 0.0132206 -0.0103228 -0.0204145 -0.0197149 0.00883528 -0.012596 0.0857358 -0.180784 -0.203626 0.100919 0.10434 0.0135899 0.116988 -0.135908 -0.0472826 0.114329 0.0594218 -0.0533911 0.0529685 0.0601203 -0.0303094 0.077855 -0.0669502 -0.0669914 0.0845179 -0.197719 0.110509 0.154111 0.0356441 -0.164049 -0.088846 -0.0330978 0.0519077 0.0221102 -0.0379549 0.0758249 0.0491686 -0.00979267 0.204665 -0.0428372 -0.0364559 -0.0831648 0.065176 0.223715 -0.125234 0.147265 0.0318849 0.0768397 -0.0243293 -0.0727417 0.0506726 0.0240936 0.136099 -0.0375075 0.085182 0.0190649 0.00104994 -0.141897 -0.0293287 0.0826053 0.0316418 -0.0223403 0.0601055 -0.0395043 -0.0183667 -0.042738 -0.0864883 0.0734958 -0.0437547 0.00489514 0.00626225 0.108744 -0.0179956 0.0428683 -0.0687437 -0.0816276 -0.144907 0.107068 0.0914415 0.0904293 -0.0181444 -0.00497403 0.105912 0.018054 0.0152333 -0.188153 0.102933 -0.0124324 0.117914 0.0505295 0.0693483 0.102612 0.0461367 -0.113607 -0.135154 0.043664 0.049749 -0.0653422 -0.140956 0.0511622 0.0781791 0.0924833 -0.154859 0.0161935 0.0212767 -0.0774092 0.0973193 -0.00605803 0.0257973 
-0.0395753 0.121195 -0.0566389 -0.0101093 0.00896259 0.170224 0.155698 -0.101489 -0.109868 0.112367 -0.0224186 0.00731542 0.0691034 -0.0374009 0.0865713 -0.122603 -0.127252 0.018641 0.0603372 -0.0230634 -0.032822 -0.0630143 -0.0735161 0.0120125 -0.00842511 0.0500577 -0.223051 -0.181504 0.101955 0.102776 0.0360717 0.121938 -0.141549 -0.0729441 0.110118 0.0591298 -0.065248 0.0326527 0.0294897 -0.0351734 0.0896679 -0.0843565 -0.0765639 0.0764296 -0.150475 0.109488 0.115544 0.0432297 -0.144694 -0.142244 -0.05686 0.0602649 0.0511033 -0.0781528 0.0673484 0.0765574 -0.0584513 0.198045 -0.0256928 -0.0341399 -0.0919252 0.0766074 0.185947 -0.114323 0.131385 0.086742 0.0928808 -0.0447376 -0.0859793 0.00287981 0.0295775 0.127839 -0.0202162 0.0809334 0.0325502 0.0207978 -0.137317 -0.0402671 0.088254 0.0280567 -0.0244953 0.0349597 -0.0603928 -0.0186563 -0.0370476 -0.0741678 0.0692144 -0.0615308 0.0126405 0.00151187 0.0839108 -0.0112734 0.0721527 -0.0866622 -0.0918862 -0.127899 0.105135 0.030785 0.101737 0.00176987 0.0174522 0.09538 0.0249616 -0.0231635 -0.197592 0.112688 -0.00270808 0.104056 0.0459137 0.0899993 0.110806 0.0326626 -0.115576 -0.171199 0.0354611 0.0486304 -0.0763955 -0.101015 0.0640152 0.0545571 0.0734052 -0.174648 -0.0128108 0.0320032 -0.0739776 0.119088 -0.0383416 0.0130353 
-0.0111964 0.118153 -0.0585564 -0.0194515 0.0247352 0.207391 0.129594 -0.126689 -0.118339 0.0745855 -0.0221961 0.0130883 0.056672 -0.0335628 0.0940344 -0.113271 -0.124446 0.0248712 0.0610213 -0.0258971 -0.0238143 -0.0192475 -0.052782 0.0176533 -0.00185912 0.0582223 -0.203377 -0.175197 0.0969723 0.102535 0.0457891 0.130528 -0.146897 -0.0508382 0.118424 0.0728323 -0.0545945 0.0219869 0.0512118 -0.0326983 0.0893103 -0.0736078 -0.0636501 0.0715306 -0.159378 0.0989965 0.126751 0.0508203 -0.151394 -0.103973 -0.051136 0.0573422 0.0541182 -0.0594326 0.0688577 0.0674767 -0.0454217 0.211 -0.0380657 -0.0461142 -0.0985222 0.095058 0.211612 -0.132632 0.12363 0.0840946 0.0946324 -0.0408234 -0.094512 0.0499774 0.0216031 0.123161 -0.0307224 0.0934291 0.0268195 -0.00271339 -0.135133 -0.0645535 0.0769348 0.0244794 0.00134175 0.0658911 -0.0506552 -0.0336191 -0.0336567 -0.0820455 0.0581322 -0.0661228 -0.00558579 0.0297393 0.120183 -0.0237736 0.0557216 -0.0709113 -0.073258 -0.116177 0.0961019 0.0618208 0.0934124 0.00121066 0.0130936 0.0972984 0.0140526 -0.00950042 -0.199569 0.116883 -0.00906381 0.0888078 0.0350938 0.0873298 0.119908 0.0432039 -0.109909 -0.147938 0.041345 0.0443291 -0.0610962 -0.112161 0.0734511 0.0674212 0.106641 -0.170907 0.0171481 0.0206757 -0.0777775 0.103877 -0.00550494 0.0182694 
-0.0053873 0.113986 -0.0722704 -0.0269366 0.0427138 0.193224 0.130282 -0.124223 -0.148075 0.0972982 -0.0170451 0.0266827 0.0679952 -0.0365142 0.0911832 -0.101651 -0.11291 0.0348868 0.074671 -0.00603013 -0.0242896 -0.0234491 -0.0383289 0.000973966 -0.0067927 0.0747021 -0.194661 -0.188239 0.10505 0.111301 0.023263 0.129271 -0.141337 -0.0588898 0.115167 0.0644816 -0.0605484 0.0320014 0.061421 -0.0274523 0.0783586 -0.0698366 -0.0651294 0.0762627 -0.1788 0.119085 0.13886 0.0421577 -0.158806 -0.109003 -0.0364486 0.0642797 0.0311204 -0.058742 0.063427 0.0591669 -0.0272166 0.208688 -0.0426768 -0.0193176 -0.0898807 0.0745475 0.217558 -0.12801 0.142962 0.0501386 0.0757627 -0.0266818 -0.0846217 0.0453466 0.0297783 0.137652 -0.0358197 0.0820717 0.0180845 0.0100723 -0.136002 -0.0427249 0.0744617 0.023902 -0.0122693 0.0564839 -0.0475846 -0.0144733 -0.0442062 -0.0838007 0.0647961 -0.0578521 -0.00179263 0.011866 0.10141 -0.0124268 0.0464436 -0.0642617 -0.0739982 -0.131802 0.105544 0.0721634 0.0944777 -0.00861812 0.00339716 0.101388 0.0162844 0.00128723 -0.195116 0.110531 -0.00793677 0.108967 0.0491503 0.0816 0.107819 0.0361183 -0.109379 -0.14165 0.041085 0.0466632 -0.0683324 -0.118068 0.0595566 0.0747564 0.0933089 -0.167374 0.0118232 0.0218155 -0.0747103 0.106222 -0.015452 0.0181966 
-0.0128887 0.116075 -0.0587862 -0.0288422 0.0300136 0.195628 0.129155 -0.107249 -0.134208 0.0744479 -0.0180363 0.0138745 0.0723645 -0.0360513 0.0965164 -0.114167 -0.115173 0.0164489 0.0561667 -0.0137468 -0.0154844 -0.0239946 -0.0523201 0.0127729 -0.00149981 0.0667728 -0.194834 -0.183969 0.102006 0.0990635 0.0455696 0.124145 -0.141382 -0.0462547 0.110539 0.0707279 -0.0541909 0.0360516 0.0433178 -0.0260025 0.0985048 -0.0722331 -0.062703 0.0890201 -0.168612 0.112554 0.139808 0.0414467 -0.161018 -0.118009 -0.0486759 0.0496158 0.0370127 -0.0604164 0.0649588 0.0691822 -0.0524344 0.212858 -0.0295847 -0.0454964 -0.0987748 0.0747206 0.203782 -0.122479 0.13398 0.0625842 0.0957623 -0.0346928 -0.0795371 0.0374603 0.0253993 0.120591 -0.0305013 0.076438 0.0338198 0.00426371 -0.147052 -0.0384496 0.0734075 0.036755 -0.0169119 0.0565317 -0.0453742 -0.0279075 -0.0415765 -0.0772873 0.0773586 -0.0623657 -0.0109499 0.0128644 0.110494 -0.0272238 0.0453944 -0.0801832 -0.0840823 -0.123456 0.103129 0.0626283 0.0885147 -0.00774857 -0.00805315 0.10274 0.0238281 0.00969067 -0.207224 0.109422 -0.0214728 0.117421 0.0415501 0.0661665 0.112557 0.0384045 -0.136924 -0.144709 0.0411359 0.0430633 -0.0763137 -0.133689 0.0683072 0.0731719 0.0993306 -0.156402 0.00482802 0.0355028 -0.0674846 0.0927736 -0.0164889 0.0179372 
0.0082925 0.0889802 -0.0672683 -0.0428334 0.047847 0.199306 0.116426 -0.0885028 -0.179191 0.0761651 -0.0184467 0.0305834 0.0729793 -0.0425711 0.0917948 -0.0959468 -0.107351 0.0246765 0.0778181 0.0127846 -0.00693831 -0.0213038 -0.0143875 0.00622984 -0.0111716 0.0979035 -0.165746 -0.204565 0.10378 0.0812195 0.0178757 0.112003 -0.142837 -0.0417758 0.0962992 0.0606221 -0.0622561 0.0603142 0.0545727 -0.0202159 0.0822664 -0.0554541 -0.0694704 0.090211 -0.19252 0.106711 0.160294 0.0246463 -0.17626 -0.0911489 -0.0424365 0.0321055 0.0132151 -0.0394587 0.0626792 0.0514277 -0.0149162 0.224217 -0.038283 -0.044456 -0.0816448 0.0678651 0.230585 -0.126771 0.149713 0.0429083 0.0780639 -0.0191136 -0.0625573 0.0476933 0.0172991 0.140345 -0.0333538 0.0908733 0.0218836 -0.00831193 -0.138551 -0.0247534 0.0804165 0.024616 -0.0313359 0.0607354 -0.0425574 -0.0352072 -0.0481861 -0.0909738 0.0821061 -0.0391021 0.00435219 -0.00548083 0.119515 -0.0175025 0.0305688 -0.0682229 -0.0622635 -0.128417 0.116106 0.0950653 0.0799889 -0.0106135 -0.0313328 0.0901066 0.0129958 0.0245071 -0.202131 0.105543 -0.0235593 0.116883 0.0440534 0.0435528 0.107134 0.0600843 -0.113783 -0.130798 0.0562928 0.0418676 -0.072308 -0.1516 0.0584195 0.0742301 0.0878393 -0.14686 0.0237199 0.0265367 -0.0751424 0.0878137 -0.0158986 0.0150522 
-0.00126675 0.0867287 -0.0643798 -0.0439679 0.0401368 0.171231 0.109297 -0.0894301 -0.185079 0.0840315 -0.017639 0.0327982 0.0795017 -0.0415298 0.0878601 -0.0863571 -0.106557 0.0145171 0.0897262 0.02674 -0.00533194 -0.031669 -0.00481778 -0.00829055 -0.0182459 0.120858 -0.164968 -0.221082 0.107131 0.0802881 0.00992148 0.113129 -0.125037 -0.0466355 0.0964433 0.0553378 -0.051285 0.0989866 0.0653288 -0.0157831 0.0729131 -0.0547738 -0.0755941 0.0817991 -0.191838 0.119845 0.168327 0.00827095 -0.175303 -0.102526 -0.0478115 0.0353201 0.0118936 -0.0275521 0.0673234 0.046132 0.00742228 0.210076 -0.0445487 -0.0398649 -0.072328 0.0465386 0.224247 -0.118469 0.163715 0.0299879 0.0770268 -0.00862504 -0.0411489 0.0318905 0.0163972 0.136516 -0.039978 0.0924007 0.0338449 -0.0062554 -0.14687 -0.0108866 0.0818824 0.033535 -0.0481222 0.0551879 -0.0412573 -0.0251082 -0.0507197 -0.0935201 0.0901425 -0.028603 0.00743625 -0.0281809 0.104967 -0.0113951 0.0441918 -0.0673082 -0.0685502 -0.141307 0.12242 0.103136 0.0882247 -0.0162364 -0.0417479 0.0853439 0.00947297 0.0375118 -0.188945 0.0947838 -0.0156425 0.130184 0.0592128 0.0343798 0.0884674 0.0573226 -0.123066 -0.133394 0.0581795 0.0476657 -0.084398 -0.166378 0.0463611 0.0698734 0.0775816 -0.126139 0.0169641 0.029528 -0.0750193 0.0887319 -0.019678 0.0228047 
-0.00770885 0.113231 -0.0492294 -0.0315143 0.0243248 0.191818 0.11141 -0.0944518 -0.158328 0.0684534 -0.0185489 0.00709971 0.0656225 -0.0443163 0.102206 -0.101935 -0.106473 0.0132861 0.0718638 -0.00188239 -0.0191001 -0.0187274 -0.0283375 -0.0102569 -0.00964879 0.0907019 -0.186051 -0.194398 0.110675 0.0701738 0.0421381 0.133435 -0.132628 -0.0439414 0.1064 0.0674594 -0.0474166 0.0674524 0.0551059 -0.0195018 0.0932893 -0.0668927 -0.0759082 0.074847 -0.175421 0.120924 0.153363 0.0238583 -0.181755 -0.113107 -0.0603144 0.0545542 0.0341981 -0.043742 0.0453129 0.0546457 -0.0191125 0.19608 -0.0375815 -0.048504 -0.0934973 0.0746406 0.207182 -0.126693 0.144623 0.0648867 0.102925 -0.0330042 -0.0654069 0.0419692 0.0135973 0.113271 -0.0323528 0.0984074 0.0398392 -0.0180797 -0.151504 -0.033786 0.0716809 0.0348697 -0.0336161 0.0625067 -0.0496427 -0.0390042 -0.0334283 -0.0804963 0.0745053 -0.0533183 -0.013968 -0.000405923 0.126792 -0.014845 0.0413562 -0.0710126 -0.0687158 -0.126075 0.119507 0.0883976 0.0785889 -0.00838115 -0.0316299 0.0918913 0.013086 0.0261606 -0.195251 0.10869 -0.00435465 0.124279 0.0594803 0.0481004 0.0986972 0.049785 -0.133549 -0.143978 0.0536678 0.0277316 -0.0832159 -0.159612 0.0794836 0.0661023 0.0955441 -0.143395 0.0175807 0.0345557 -0.0538254 0.0791507 -0.00227346 0.0163901 
-0.000318008 0.108735 -0.0497735 -0.0266141 0.028303 0.186523 0.1122 -0.100966 -0.159038 0.0601022 -0.0197878 0.00973614 0.063516 -0.0468659 0.103952 -0.100478 -0.105889 0.00837499 0.0760781 0.00111096 -0.0145907 -0.0186298 -0.0245248 -0.00395028 -0.00186597 0.0924436 -0.179892 -0.201852 0.104248 0.0772693 0.0404341 0.13118 -0.130321 -0.0387203 0.109804 0.0622344 -0.0413357 0.0696901 0.058837 -0.0273236 0.0919846 -0.0702249 -0.06767 0.0805505 -0.175691 0.126989 0.158272 0.0223565 -0.178919 -0.108216 -0.0548878 0.0489794 0.0392404 -0.0418475 0.0569342 0.052412 -0.0205663 0.197458 -0.0355601 -0.0517899 -0.0889599 0.0654608 0.206478 -0.126145 0.146037 0.0605636 0.0995028 -0.0337734 -0.0629086 0.0414926 0.00690963 0.112932 -0.0378821 0.0924987 0.0393846 -0.0204333 -0.147957 -0.0316483 0.0738128 0.0477327 -0.0312771 0.0608879 -0.050992 -0.044214 -0.0314148 -0.08865 0.0724586 -0.0538404 -0.0154885 0.00247715 0.127716 -0.0148911 0.0383624 -0.074213 -0.0746278 -0.123553 0.121133 0.0892321 0.0876153 -0.0155037 -0.0326809 0.0922615 0.0163769 0.0276505 -0.197331 0.100046 -0.00748194 0.130748 0.0590129 0.0470354 0.102192 0.0530216 -0.138337 -0.144698 0.0568714 0.0306549 -0.0834596 -0.163006 0.0741635 0.0700766 0.0976294 -0.132413 0.0173133 0.0387951 -0.0528218 0.074836 0.00275888 0.0140087 
-0.00956262 0.101885 -0.0685484 -0.042353 0.0322159 0.158087 0.119324 -0.103648 -0.17569 0.0947219 -0.0230176 0.0243468 0.0721755 -0.0344702 0.0958042 -0.0879814 -0.100138 0.00685668 0.0985016 0.0147596 -0.0330853 -0.0222044 -0.0144947 -0.02047 -0.0287711 0.115207 -0.175906 -0.21227 0.111375 0.087477 0.00865443 0.122732 -0.12134 -0.0618363 0.108536 0.0572505 -0.041682 0.0941726 0.0634627 -0.00897113 0.0650117 -0.0536394 -0.0830581 0.0678828 -0.180536 0.156975 0.15692 0.0135513 -0.172168 -0.11528 -0.0556273 0.0551109 0.0286473 -0.0402671 0.0559671 0.0479958 0.0073193 0.201639 -0.0459396 -0.0133581 -0.0764505 0.0563106 0.209185 -0.122541 0.164739 0.0315266 0.0832069 -0.0102759 -0.0473852 0.0207372 0.0225251 0.12672 -0.0408134 0.0942461 0.036481 0.00623682 -0.148849 -0.0192304 0.080661 0.0276816 -0.0351618 0.0469574 -0.0583993 -0.0196103 -0.0449204 -0.0924964 0.0735322 -0.0496465 -0.0084628 -0.0219956 0.0991418 -0.000435065 0.0562419 -0.0664397 -0.0630342 -0.134287 0.130916 0.0873754 0.0993055 -0.0126254 -0.0327361 0.0897232 0.00783005 0.0243671 -0.194734 0.0918936 -0.00303045 0.123525 0.0613292 0.0559904 0.0949501 0.0419496 -0.114044 -0.148262 0.0445568 0.0511412 -0.0875489 -0.156573 0.0469792 0.0638506 0.0743925 -0.13622 0.0102695 0.0341121 -0.0688221 0.092932 -0.0305885 0.0130669 
-0.00672012 0.0946016 -0.055435 -0.0366572 0.0334375 0.165728 0.116051 -0.0976948 -0.177503 0.0826558 -0.0240001 0.0242551 0.0788103 -0.0372011 0.0996647 -0.0900983 -0.107453 0.00190701 0.0870513 0.017433 -0.0165534 -0.0312516 -0.0158412 -0.0142481 -0.0166639 0.11165 -0.186069 -0.215968 0.101399 0.0818898 0.0156126 0.117139 -0.12933 -0.0528831 0.107045 0.0586159 -0.0475517 0.092335 0.0651724 -0.0201905 0.0753506 -0.0569097 -0.0756841 0.0669479 -0.178543 0.141072 0.158029 0.0107258 -0.174311 -0.115346 -0.0548107 0.0390223 0.0306185 -0.0361204 0.0634765 0.0446168 -0.00270618 0.203447 -0.0426975 -0.0317664 -0.0751292 0.0602776 0.203465 -0.11913 0.160765 0.0468876 0.0847625 -0.00579208 -0.0469993 0.0117771 0.0224441 0.132537 -0.038018 0.0842131 0.0414611 0.00769519 -0.153332 -0.0284493 0.0891369 0.0494452 -0.0351931 0.0418309 -0.04724 -0.0238238 -0.048935 -0.0890847 0.0841509 -0.0399527 -0.00776523 -0.0221391 0.10223 -0.00476981 0.0582944 -0.061827 -0.0856117 -0.136381 0.126155 0.0881919 0.0912643 -0.0152307 -0.0311786 0.088282 0.00907155 0.0255618 -0.193485 0.0967568 -0.00787827 0.133754 0.0587964 0.0491638 0.0948106 0.0450989 -0.125638 -0.146027 0.0511629 0.0534613 -0.101747 -0.147401 0.0403361 0.065127 0.0728609 -0.133829 0.00774694 0.0327436 -0.0655495 0.0953812 -0.0265173 0.0160558 
0.00315653 0.102103 -0.0599977 -0.0390308 0.0473301 0.195313 0.0869261 -0.104883 -0.18203 0.0685048 -0.00987274 0.0340232 0.0611942 -0.0587648 0.0859578 -0.0757264 -0.10613 0.0368505 0.0862624 0.0313653 0.00137844 -0.0153929 0.0195794 0.0370489 -0.0108115 0.0949851 -0.135578 -0.217746 0.119585 0.082456 0.021427 0.0988463 -0.116504 -0.0330984 0.0975724 0.0620091 -0.0571987 0.0728225 0.0497045 -0.0108023 0.0595911 -0.0671869 -0.0716378 0.0942678 -0.195716 0.113441 0.185218 0.0256065 -0.188564 -0.0677875 -0.028798 0.0405597 0.0152069 -0.041422 0.0637733 0.054274 0.0110262 0.214473 -0.03659 -0.0441224 -0.0887445 0.063156 0.242364 -0.134726 0.160861 0.013237 0.0680191 -0.0381451 -0.0805416 0.0808176 -0.00358782 0.130506 -0.0536225 0.0983466 0.0348583 -0.0272996 -0.131933 0.00370757 0.0761131 0.0318409 -0.0371336 0.064534 -0.0495054 -0.0376276 -0.0450646 -0.091243 0.0600641 -0.0377384 -0.00845874 0.0052245 0.120474 -0.0131752 0.0236775 -0.0584642 -0.0448849 -0.122955 0.103037 0.126632 0.0856901 -0.0225595 -0.0296494 0.0849756 -0.00413787 0.0374557 -0.179802 0.100274 -0.0146079 0.107841 0.0661275 0.0303011 0.089159 0.0800612 -0.0958472 -0.123182 0.0544172 0.0494486 -0.0672061 -0.162487 0.0605773 0.102304 0.0907237 -0.136652 0.0138543 0.0206545 -0.0884004 0.0983912 -0.00455069 0.0154552 
0.0147132 0.0693161 -0.084916 -0.025362 0.0564077 0.140337 0.10602 -0.108433 -0.187451 0.0843063 -0.0201047 0.0553478 0.0624304 -0.041965 0.0645433 -0.0793918 -0.080323 0.0369278 0.110644 0.0627436 -0.0181065 -0.037805 0.0325817 0.0252586 -0.029042 0.125094 -0.130369 -0.230917 0.106843 0.0873358 -0.0129977 0.116061 -0.105996 -0.0474297 0.0925344 0.0402759 -0.0389754 0.126145 0.0456633 -0.0258249 0.0484966 -0.0409467 -0.0801268 0.0948778 -0.21572 0.127052 0.181553 0.0166378 -0.147306 -0.0608801 -0.0264804 0.0448573 0.00681644 -0.0271841 0.0939738 0.0285677 0.040521 0.202747 -0.0244728 -0.0371585 -0.0602107 0.0285952 0.233819 -0.118163 0.165164 -0.0212378 0.0642138 -0.0261292 -0.0411442 0.0626665 -0.00335085 0.137754 -0.0400792 0.121103 0.0126005 -0.0297547 -0.123385 0.0304546 0.0807895 0.0123483 -0.0522811 0.0732361 -0.0604129 -0.0408146 -0.0199915 -0.124667 0.0625116 -0.0143227 0.017925 -0.0329182 0.104451 0.0102014 0.038781 -0.0910374 -0.0338469 -0.150337 0.131752 0.126893 0.105811 -0.0380162 -0.0393019 0.0889247 0.0203749 0.0467614 -0.180562 0.067848 -0.010693 0.112758 0.0838467 0.0462495 0.083596 0.0876992 -0.0894738 -0.122586 0.0442079 0.0432187 -0.0471559 -0.200287 0.0351343 0.0795039 0.0655135 -0.0932261 0.017235 0.0290679 -0.103029 0.0773849 -0.0183973 0.0178929 
0.0127714 0.0716163 -0.0821938 -0.044448 0.0472574 0.144339 0.097628 -0.102083 -0.206175 0.0935568 -0.0211852 0.0574923 0.0698795 -0.0385147 0.0641239 -0.0760958 -0.0809607 0.0368967 0.118258 0.0530987 -0.0210426 -0.0161733 0.0212846 0.0202432 -0.0426383 0.146 -0.118466 -0.227317 0.111627 0.0906175 -0.0307442 0.115149 -0.111577 -0.0486872 0.0888781 0.0361164 -0.0376848 0.119831 0.0578463 -0.00485977 0.0433342 -0.0419863 -0.0798092 0.0952064 -0.208187 0.131614 0.187686 0.0104861 -0.161896 -0.0692511 -0.0110061 0.0418301 -0.000776696 -0.0189364 0.0840061 0.0316949 0.0490345 0.203185 -0.0231751 -0.0319444 -0.0494285 0.0301796 0.22956 -0.108102 0.161591 -0.031418 0.0703688 -0.021055 -0.027589 0.0562906 -0.00400359 0.130808 -0.0378479 0.117316 0.0152706 -0.0268161 -0.13325 0.0311979 0.0809404 0.00933505 -0.0398508 0.0784234 -0.0518924 -0.0338728 -0.0277844 -0.12413 0.0744036 -0.0233818 0.0141728 -0.0334314 0.0931857 0.00944762 0.0377305 -0.0778363 -0.0411279 -0.141943 0.135045 0.126494 0.104127 -0.0353043 -0.0413113 0.0976516 0.0151349 0.058209 -0.182133 0.0596287 -0.0194545 0.112866 0.0630789 0.0409547 0.0903459 0.0802406 -0.0924881 -0.122418 0.0337867 0.0443834 -0.0557215 -0.205781 0.0249108 0.063048 0.0679869 -0.10111 0.0247253 0.0163964 -0.0995623 0.0773396 -0.0310815 0.0157074 
0.0420452 0.0561396 -0.0940734 -0.0403833 0.0912022 0.164222 0.0942532 -0.0938642 -0.19393 0.0586577 -0.0293385 0.0779872 0.0809262 -0.0745323 0.0343953 -0.0674311 -0.0992685 0.0652945 0.0425799 0.105724 0.0324698 -0.0513765 0.0762853 0.0826044 -0.0262329 0.0740478 -0.110913 -0.241675 0.0914595 0.0976119 -0.0308305 0.0951699 -0.112234 0.000923116 0.0659527 0.0128225 -0.0585693 0.117507 0.017126 -0.0407843 0.0421693 -0.0634559 -0.0602463 0.116889 -0.230489 0.0902722 0.192791 0.0465117 -0.159405 0.0114831 0.00791009 0.0067817 -0.0130466 -0.0214588 0.107993 0.00596223 0.0483275 0.206998 -0.011464 -0.0764273 -0.0487895 0.048501 0.240255 -0.103686 0.137038 -0.0574772 0.0176265 -0.00717078 -0.0740619 0.0723411 -0.0226849 0.137209 -0.0475754 0.102678 0.000793865 -0.0231283 -0.103562 0.033352 0.0951495 0.0394278 -0.0449426 0.0621585 -0.0518406 -0.0422878 -0.0381514 -0.0992129 0.0635828 0.011084 0.0268584 -0.00108189 0.109458 -0.0290913 0.00760217 -0.0784468 -0.059538 -0.134725 0.0852448 0.152994 0.0889134 -0.0564471 0.00154825 0.077755 0.00874041 0.0933452 -0.158616 0.0506773 -0.0642558 0.141543 0.0684453 0.0212325 0.089176 0.134379 -0.0794579 -0.0815846 0.0278106 0.0680889 -0.0606299 -0.166175 0.0258804 0.12966 0.0557524 -0.0769254 0.0075389 0.0243345 -0.129661 0.0699662 -0.0377182 -0.00696231 
0.0386857 0.057748 -0.0936268 -0.0393346 0.0899992 0.1725 0.0952894 -0.0972455 -0.182924 0.047134 -0.027222 0.0743292 0.0785701 -0.0727296 0.0270349 -0.0718727 -0.106156 0.068199 0.0366643 0.101029 0.0359768 -0.0494314 0.068395 0.0858145 -0.0270752 0.0682994 -0.113198 -0.233776 0.0952244 0.0957385 -0.0238356 0.0906607 -0.115794 -0.000420635 0.0713717 0.0190482 -0.0608415 0.107255 0.0105974 -0.0472726 0.0488515 -0.0624726 -0.0546141 0.12237 -0.228228 0.0801246 0.192368 0.0534699 -0.159672 0.0127614 -0.00574804 0.00213042 -0.00835707 -0.0228632 0.109189 0.0126051 0.0355012 0.213863 -0.01358 -0.0847872 -0.0544884 0.0590064 0.252221 -0.103567 0.131613 -0.0432071 0.0206962 -0.0180541 -0.0784203 0.0786414 -0.0233384 0.131837 -0.0414764 0.10596 0.000825261 -0.0279369 -0.101952 0.0272296 0.0930697 0.0282917 -0.0372555 0.0701987 -0.0550417 -0.0481744 -0.0372182 -0.0945487 0.0597241 0.0126042 0.0265724 0.00944875 0.126455 -0.032483 0.00489716 -0.0836676 -0.0527296 -0.131839 0.0786891 0.156022 0.0880961 -0.052848 0.00452114 0.0762806 0.0123773 0.0807764 -0.163202 0.0607837 -0.0606571 0.135546 0.0630178 0.0242018 0.0950201 0.13296 -0.0785688 -0.0818798 0.0288171 0.0664801 -0.0536979 -0.161152 0.0333031 0.126669 0.0579083 -0.0845987 0.00993158 0.0231977 -0.138034 0.0735566 -0.0338427 -0.00587068 
0.0223284 0.0857086 -0.078549 -0.0293282 0.0628803 0.199918 0.111428 -0.089829 -0.173847 0.0796217 -0.0254153 0.045203 0.0726021 -0.0772176 0.0625534 -0.0893719 -0.10465 0.0648522 0.0398798 0.058737 0.00273334 -0.0553824 0.0497712 0.0601014 -0.022489 0.0596137 -0.14358 -0.221806 0.0919223 0.0724092 0.00406336 0.12631 -0.124325 0.0010205 0.0783041 0.0341518 -0.0519055 0.0945159 0.0181616 -0.0483683 0.070902 -0.0923164 -0.0642859 0.0948047 -0.220421 0.076977 0.170067 0.0596434 -0.177955 -0.0141266 -0.0105951 0.0271037 0.000882481 -0.0316954 0.0869435 0.0310985 0.019183 0.198449 -0.0141331 -0.0818717 -0.0773402 0.0696366 0.235689 -0.139426 0.144368 0.0103542 0.03843 -0.0270138 -0.102137 0.0946525 -0.0270575 0.126363 -0.0479288 0.122996 0.00778492 -0.0381424 -0.10034 0.010249 0.092776 0.0107737 -0.0562855 0.0597019 -0.058797 -0.0539815 -0.0356351 -0.0943228 0.0548094 -0.0121576 0.0301242 0.0266154 0.130195 -0.0349363 0.024422 -0.0902161 -0.0482979 -0.125472 0.0960359 0.136494 0.0841288 -0.0367673 0.00464851 0.0852174 0.00595829 0.0673502 -0.148912 0.0719101 -0.0425693 0.12331 0.0641824 0.032672 0.0795492 0.129303 -0.0725318 -0.105022 0.0532885 0.031417 -0.043317 -0.165445 0.0759981 0.121325 0.0909482 -0.120249 0.025034 0.0352003 -0.100755 0.0665216 -0.00983298 -0.00566645 
0.0356269 0.0738361 -0.0735433 -0.0329888 0.0742776 0.202904 0.114829 -0.0848131 -0.15891 0.0337929 -0.0385409 0.0512495 0.0772493 -0.109936 0.0429242 -0.0942761 -0.135245 0.0582253 -0.0148919 0.0864227 0.025769 -0.0538262 0.0477967 0.0837245 -0.0311745 0.0321151 -0.146295 -0.230057 0.0612043 0.0724742 -0.00480743 0.109293 -0.135716 0.0380444 0.0751862 0.0206904 -0.0394049 0.0808397 -0.00400319 -0.0611925 0.0949484 -0.112197 -0.0359766 0.110466 -0.218292 0.0649211 0.177821 0.0766506 -0.180405 0.0304167 -0.0142386 -0.0241554 -0.00205042 -0.0139131 0.109642 0.014252 -0.00175138 0.186656 -0.00774277 -0.111264 -0.0620007 0.0849226 0.224804 -0.119818 0.116463 -0.00327035 0.0297981 -0.02964 -0.10035 0.0696934 -0.0414186 0.107158 -0.0324614 0.116916 0.0115731 -0.0328391 -0.100111 0.00963971 0.10309 0.0352359 -0.0311894 0.0588382 -0.0614273 -0.0574261 -0.045268 -0.0626573 0.0606163 -0.000600274 0.0184483 0.0543263 0.150456 -0.0648464 0.0118499 -0.102351 -0.0926556 -0.108626 0.0673974 0.130015 0.0836082 -0.0478924 0.0209934 0.0736867 0.0110075 0.0807471 -0.139686 0.0536536 -0.072754 0.163435 0.0212957 0.0422243 0.0984314 0.140983 -0.0843951 -0.0916469 0.023073 0.0418343 -0.0579206 -0.146889 0.0542683 0.124846 0.0882465 -0.0896946 0.0250339 0.0500796 -0.108781 0.0449343 -0.028345 -0.0269344 
0.016465 0.0844693 -0.0516763 -0.0218503 0.0665264 0.196723 0.124687 -0.116749 -0.148574 0.0568178 -0.0415008 0.054231 0.0715494 -0.0836061 0.0576717 -0.112628 -0.147259 0.0654629 0.0110309 0.0602172 0.00895639 -0.0495888 0.0223332 0.0822668 -0.0185726 0.0364874 -0.167763 -0.214635 0.0620885 0.0963486 -0.00459266 0.107999 -0.136685 0.010639 0.0979457 0.0302678 -0.043141 0.0606984 0.0131017 -0.0650362 0.095743 -0.106735 -0.031199 0.0935039 -0.219777 0.0743538 0.166707 0.0729434 -0.16376 0.00222534 -0.00996319 -0.00135925 0.0217256 -0.0206799 0.12652 0.0303605 -0.00623635 0.189913 -0.0162714 -0.0948261 -0.0646272 0.0873575 0.21368 -0.113332 0.117696 0.0213226 0.0396806 -0.0345293 -0.108062 0.0710193 -0.021134 0.121601 -0.0326531 0.111299 0.0181465 -0.0107867 -0.114532 -0.0130276 0.112435 0.0314223 -0.020005 0.0690045 -0.050123 -0.0370409 -0.0384679 -0.0785538 0.0600685 -0.00697405 0.0217784 0.0553636 0.132617 -0.0464349 0.0432682 -0.0982753 -0.111478 -0.125619 0.0648132 0.119509 0.107488 -0.046793 0.0354854 0.0898441 0.0223445 0.0456192 -0.149585 0.0643162 -0.0587394 0.142432 0.0269539 0.0696089 0.109354 0.116207 -0.0858044 -0.110858 0.0201519 0.0504712 -0.0531031 -0.132789 0.0434787 0.113775 0.103178 -0.117166 0.0117927 0.0278681 -0.117303 0.0772908 -0.0185369 -0.00491825 
0.00556514 0.092041 -0.0704551 -0.0269382 0.0489473 0.201097 0.119006 -0.106277 -0.154735 0.0767621 -0.0344047 0.0334176 0.0754108 -0.0600532 0.0635588 -0.107855 -0.131963 0.0572006 0.0408808 0.0353699 -0.000815718 -0.0586514 0.0254245 0.0420494 -0.0181345 0.0544935 -0.171489 -0.214126 0.0798012 0.0815103 0.012086 0.119063 -0.134382 -0.0206529 0.0965564 0.0439151 -0.0573132 0.0773273 0.0209731 -0.0540807 0.0801951 -0.0901715 -0.0561568 0.0942637 -0.213469 0.0783726 0.159285 0.0614883 -0.168135 -0.0330934 -0.0297837 0.0222477 0.0231855 -0.0311109 0.0925034 0.0392367 0.00489335 0.19961 -0.0135728 -0.0876743 -0.0770728 0.0857598 0.227845 -0.125478 0.135069 0.0393362 0.0539181 -0.0264648 -0.0922607 0.0771137 -0.0104518 0.129983 -0.0316447 0.111289 0.0137211 -0.0211543 -0.122416 -0.0225857 0.0967697 0.0152495 -0.037659 0.0607831 -0.0591109 -0.0445494 -0.0428726 -0.0852497 0.0569374 -0.019523 0.0305011 0.0261239 0.129156 -0.0310187 0.0452393 -0.103135 -0.0731611 -0.13181 0.0876258 0.128124 0.0931761 -0.027569 0.016644 0.0909207 0.0229873 0.0329433 -0.162789 0.081358 -0.0414195 0.124883 0.047884 0.0589926 0.0981033 0.106653 -0.0851537 -0.124744 0.0405236 0.0427075 -0.0490602 -0.144169 0.0686763 0.0989159 0.0958263 -0.139338 0.0191882 0.0266428 -0.106785 0.0769292 -0.0141317 0.0126939 
0.0155391 0.0834787 -0.0567673 -0.0262016 0.0560817 0.201308 0.123036 -0.105584 -0.155579 0.0629516 -0.0342282 0.042525 0.0723036 -0.074272 0.0585943 -0.112198 -0.144788 0.0581893 0.0281556 0.0446195 0.0104817 -0.0554617 0.0218387 0.0547481 -0.0157654 0.0520021 -0.16879 -0.216279 0.072063 0.0835544 0.00163482 0.104964 -0.140943 -0.00710492 0.0974255 0.0352142 -0.057379 0.0700504 0.0219809 -0.0625668 0.0866181 -0.0971168 -0.047569 0.0969495 -0.216076 0.0740973 0.160555 0.061609 -0.170298 -0.0176947 -0.0240345 0.0130955 0.0185573 -0.0236875 0.107639 0.03226 -0.0019612 0.199179 -0.0210603 -0.0916006 -0.0662213 0.0834883 0.228674 -0.114217 0.127779 0.0320847 0.0468961 -0.0273245 -0.0924765 0.0757246 -0.0135155 0.129676 -0.0300876 0.109459 0.0130475 -0.0196359 -0.11966 -0.0208836 0.105361 0.0285186 -0.0320219 0.0620175 -0.0507602 -0.0443308 -0.044083 -0.0857294 0.0629246 -0.00855159 0.0306539 0.0378816 0.136308 -0.0378619 0.0410881 -0.0976444 -0.0943484 -0.133124 0.080097 0.121222 0.099612 -0.0354546 0.0224502 0.0918664 0.0212563 0.0338524 -0.156228 0.0769143 -0.0463132 0.137608 0.0393356 0.0575567 0.107629 0.110952 -0.0890803 -0.118419 0.0417885 0.0477586 -0.0525094 -0.136914 0.0591576 0.103037 0.0949019 -0.129753 0.0179706 0.025741 -0.105574 0.0778086 -0.00899534 0.00603847 
0.0397644 0.071912 -0.0574189 -0.0184748 0.0750257 0.211003 0.152722 -0.106351 -0.139035 0.0327624 -0.0486728 0.0445747 0.0787574 -0.0852084 0.0634414 -0.121646 -0.143556 0.0622217 -0.016436 0.0551027 0.0160024 -0.0493279 0.0159185 0.0892266 -0.0200158 -0.00442298 -0.184556 -0.212825 0.0360787 0.0982584 -0.00477086 0.110719 -0.157164 0.032658 0.0987238 0.0234298 -0.0378036 0.0369719 0.000712837 -0.0771741 0.103861 -0.110706 -0.0171733 0.0869257 -0.211448 0.0711053 0.144918 0.0896249 -0.156661 0.0233011 -0.0133676 -0.0290247 0.0296366 -0.0191141 0.123823 0.0226453 -0.0239644 0.191435 -0.00930503 -0.0934948 -0.0560586 0.110142 0.195997 -0.126651 0.101675 0.0292287 0.0361133 -0.0326044 -0.119241 0.0547084 -0.0247151 0.116323 -0.0295421 0.102969 0.00222414 -0.0011335 -0.0961362 -0.0333581 0.118034 0.0389608 -0.00782506 0.0493952 -0.0602925 -0.0489746 -0.0439719 -0.0587078 0.0580094 -0.0231974 0.00799984 0.0741653 0.150567 -0.0639469 0.0379069 -0.104669 -0.127066 -0.103548 0.0543681 0.101939 0.102648 -0.0376261 0.0561257 0.0881017 0.0227909 0.0505821 -0.147603 0.0518206 -0.0740052 0.152937 -0.00243851 0.0818667 0.118821 0.113422 -0.0830761 -0.111918 0.00915763 0.0598849 -0.0524495 -0.102624 0.037963 0.118242 0.0960182 -0.115752 0.0129435 0.0495022 -0.110837 0.0590472 -0.0328423 -0.027942 
0.0297585 0.0741467 -0.0661635 -0.042259 0.0816708 0.184996 0.107063 -0.0860723 -0.18019 0.0553198 -0.0453975 0.0547067 0.0819316 -0.0961648 0.0512066 -0.0896844 -0.131077 0.0579421 0.00559332 0.0919193 0.021329 -0.0581665 0.0525426 0.0586382 -0.0279324 0.0594211 -0.156749 -0.230089 0.0692843 0.0726949 -0.0129463 0.114017 -0.132636 0.0232918 0.0801708 0.0201432 -0.0441311 0.100452 0.0202524 -0.0610434 0.0838352 -0.0975004 -0.0388164 0.0999385 -0.220689 0.0826923 0.182311 0.0663681 -0.177286 0.0161384 -0.0133931 -0.00843052 -0.00636949 -0.0109414 0.110144 0.00611377 0.0166739 0.183734 -0.0155749 -0.10458 -0.052799 0.0761731 0.218179 -0.107631 0.124251 -0.00660078 0.0269713 -0.00672274 -0.0833574 0.0609571 -0.0262505 0.121143 -0.0349674 0.113018 0.0100026 -0.0235852 -0.112511 0.006942 0.114121 0.0396433 -0.037078 0.0617862 -0.0515905 -0.0400463 -0.0423402 -0.0815549 0.0682825 0.0160945 0.0365501 0.0328556 0.134397 -0.0452599 0.026285 -0.0925202 -0.0951304 -0.125164 0.0812503 0.142918 0.0801366 -0.0552853 0.0102924 0.0768188 0.011544 0.0826819 -0.144652 0.0574196 -0.0706082 0.166498 0.0453514 0.040572 0.0955003 0.1332 -0.0969656 -0.0864668 0.0308437 0.0437576 -0.0675733 -0.156398 0.0415224 0.116937 0.0838002 -0.0850542 0.0259939 0.0404604 -0.110931 0.0471437 -0.0258724 -0.016274 
