0.0741604 0.0563179 -0.145982 -0.0372188 0.155865 0.208752 0.0933672 -0.109172 -0.184121 -0.0176768 -0.0479535 0.114886 0.120133 -0.0399411 -0.0489524 -0.0398033 -0.0228489 0.0587982 -0.0566643 0.129555 0.0797856 -0.0337912 0.0126832 0.0699621 -0.0265736 0.0280591 -0.144924 -0.169773 0.0429791 0.132871 -0.0285425 0.156787 -0.152806 0.0366972 0.016036 0.0304688 -0.0724612 0.0358711 0.00168958 -0.0546697 0.0804733 -0.0203217 0.0355853 0.092045 -0.171346 0.065159 0.189836 0.0475572 -0.155231 0.00486458 0.0426068 -0.0563377 -0.0333015 -0.021326 0.108753 0.00461266 -0.0380633 0.240889 0.0153443 -0.0808021 -0.0491414 0.120912 0.211206 -0.141118 0.10886 -0.0518067 -0.00575718 0.0245507 -0.114012 0.0286124 0.025471 0.119075 -0.00759149 0.037139 -0.0318145 0.0786915 -0.0478597 -0.0158872 0.0473993 0.0169631 0.0067895 0.0580808 -0.0108457 -0.0183577 -0.0843841 -0.0375227 0.087458 -0.00815893 -0.022415 0.0271226 0.0741874 -0.101452 -0.0240774 -0.0224235 -0.0622485 -0.0563081 0.0710352 0.116559 0.0178966 -0.017304 0.0155932 0.0930368 -0.00571274 0.168693 -0.202212 0.0737861 -0.136808 0.165495 -0.0499978 0.0164997 0.0936074 0.0799338 -0.109772 0.0019242 -0.0245823 0.0452949 -0.126157 -0.0792915 -0.0134085 0.132815 0.0148366 -0.0593264 0.0305847 -0.00539796 -0.100704 0.0728854 -0.110615 -0.0802794 
0.0572874 0.0584161 -0.143802 -0.0558277 0.163633 0.190591 0.0698984 -0.0909282 -0.224299 0.0136333 -0.0605785 0.089573 0.120483 -0.0229052 -0.0170746 -0.0253258 -0.00675203 0.0417738 -0.0129851 0.145746 0.0630894 -0.0408971 0.0491808 0.018475 -0.0217969 0.0672356 -0.153169 -0.172074 0.0780124 0.0912517 -0.0179138 0.159259 -0.138825 0.018775 0.0173756 0.04677 -0.0668353 0.0887548 0.020739 -0.0606601 0.0701868 -0.00102423 0.0182307 0.076411 -0.187097 0.0894979 0.199734 0.0527524 -0.155875 -0.0130841 0.00993885 -0.0308137 -0.0444577 -0.0212308 0.091442 -0.0134275 -0.00135582 0.229089 0.00971213 -0.0854084 -0.0546406 0.11539 0.211434 -0.13442 0.136357 -0.036586 -0.00849372 0.0487388 -0.0786083 0.0332442 0.0256019 0.140373 -0.0101534 0.061589 -0.0178489 0.0588729 -0.0654398 0.00267204 0.0625565 -0.0015243 -0.011554 0.0648243 -0.00837562 -0.0130318 -0.0670347 -0.0629798 0.0840636 0.0384804 0.00246284 -0.00553289 0.0897441 -0.0579918 -0.0125191 -0.022884 -0.0384587 -0.0897921 0.097144 0.155907 0.00155814 -0.0291198 -0.0108177 0.0838153 0.000571086 0.158093 -0.206116 0.088962 -0.119967 0.158961 0.0163217 0.00655772 0.0801043 0.0933855 -0.113633 0.0102783 -0.00112003 0.0306769 -0.12419 -0.114667 -0.0114255 0.12317 0.00552605 -0.047219 0.0425813 -0.0019517 -0.113712 0.0646917 -0.102337 -0.0601878 
0.0497808 0.0700104 -0.106411 -0.0680492 0.135433 0.170313 0.0522828 -0.0634808 -0.237606 -0.0123962 -0.075932 0.0678028 0.0991746 -0.0428177 -0.0143213 -0.0286181 -0.0171976 0.00193342 -0.00234384 0.160075 0.0471758 -0.031226 0.0605693 -0.00159979 -0.0367584 0.100166 -0.132142 -0.162219 0.095002 0.0397086 -0.0168398 0.137815 -0.133923 0.0386411 0.0162013 0.0361167 -0.0393566 0.149072 0.0203435 -0.0584792 0.0714689 -0.00850181 0.0150515 0.0657815 -0.181155 0.100845 0.20575 0.0483749 -0.166134 0.0145295 -0.00727408 -0.0164825 -0.0517177 0.00290848 0.099414 -0.0345064 0.014881 0.211981 0.00352673 -0.112189 -0.0482701 0.102528 0.208035 -0.124443 0.13914 -0.0333938 0.00634697 0.0270938 -0.0648339 0.035103 -0.00210934 0.117706 -0.0045836 0.115161 0.00899002 0.0128699 -0.062022 0.0240687 0.0885991 0.0105095 -0.0146954 0.0603411 0.0030828 -0.0251982 -0.0381447 -0.100308 0.0788152 0.0765624 0.0235913 -0.00367952 0.113353 -0.0500365 0.00206661 -0.0307042 -0.0297432 -0.0978741 0.131702 0.168075 -0.00180579 -0.0431826 -0.0470553 0.0911251 -0.0154975 0.176109 -0.194385 0.0764465 -0.103938 0.167439 0.0436559 -0.0137721 0.0884821 0.124853 -0.128629 0.0323606 0.0104654 0.0107007 -0.106795 -0.144958 -0.00520076 0.109668 -0.00179886 -0.0152606 0.0599036 -0.000482033 -0.0996659 0.0362718 -0.0816572 -0.0683047 
0.0576486 0.0544282 -0.138642 -0.0515497 0.166456 0.166135 0.0682084 -0.0932993 -0.22196 0.0059504 -0.0710076 0.0999459 0.116855 -0.0311454 -0.0278886 -0.0118944 -0.00266853 0.0395695 -0.0264892 0.165872 0.0649242 -0.0396744 0.0507802 0.038536 -0.0258925 0.0670839 -0.139624 -0.172614 0.0665588 0.0992659 -0.0316703 0.150925 -0.13665 0.0245051 0.0124555 0.036354 -0.0651963 0.100127 0.00497841 -0.063103 0.0545404 0.00207171 0.032995 0.0852659 -0.172151 0.09731 0.208375 0.0520486 -0.15115 0.00578497 0.0332021 -0.0516876 -0.0503336 -0.0242949 0.111712 -0.023982 -0.0124751 0.227967 0.0249815 -0.0914255 -0.0390304 0.102583 0.197741 -0.122115 0.133349 -0.0622904 -0.0198843 0.0466705 -0.0841507 0.0200225 0.0243063 0.139165 0.000126779 0.0549869 -0.0243441 0.0627496 -0.0535768 0.019599 0.0699582 0.00739632 0.00463353 0.0629003 -0.0188769 -0.0175109 -0.066661 -0.0737558 0.0758743 0.0455724 0.00868834 -8.12477e-05 0.0659455 -0.0580002 -0.018924 -0.0231319 -0.0445786 -0.0676714 0.0996524 0.144343 0.00472083 -0.0400395 -0.0114296 0.0782402 -0.00513165 0.167769 -0.213358 0.0704255 -0.13942 0.15803 0.0130187 0.0038822 0.0857626 0.110827 -0.112139 0.0193367 -0.0148737 0.0334204 -0.133019 -0.106827 -0.0372376 0.119808 -0.0100758 -0.0180768 0.0452287 -0.000125363 -0.112834 0.0609566 -0.114788 -0.0878495 
0.0243133 0.0806473 -0.114059 0.00622139 0.0902098 0.216032 0.0693817 -0.170014 -0.149624 0.0146011 -0.0402124 0.092539 0.102034 -0.0266625 -0.0303654 -0.041762 -0.0706308 0.0632012 -0.0111974 0.0857801 0.0543435 -0.0782245 0.00876078 0.124047 0.00520297 0.0405482 -0.158853 -0.193729 0.0353964 0.140099 0.00335629 0.16134 -0.147422 0.00555007 0.0395739 0.0626946 -0.082149 0.0264274 0.00439766 -0.0516802 0.0631377 -0.057944 0.0162885 0.0628863 -0.130872 0.0515694 0.204823 0.0474268 -0.165242 -0.0334014 0.0369312 -0.0609043 0.0438589 -0.0442053 0.122729 0.0566732 -0.0293152 0.245449 0.0379784 -0.10768 -0.0545471 0.148062 0.214374 -0.155441 0.117259 0.0395982 0.0233669 -0.00959934 -0.133814 0.0472426 -0.0125673 0.124856 -0.0274164 0.0518887 0.0104546 0.0543779 -0.0617216 -0.0340278 0.0607707 0.0176638 0.00863411 0.078694 -0.0482558 -0.052623 -0.0941636 -0.0343127 0.053113 -0.0344112 -0.0239526 0.0310835 0.0742011 -0.0682877 0.0416545 -0.0289611 -0.0689189 -0.0368153 0.055278 0.125713 0.0796817 -0.00864717 0.0455302 0.0671443 -0.0125403 0.106439 -0.179016 0.091262 -0.106184 0.107502 -0.0577195 0.0360071 0.0829886 0.10032 -0.0615037 -0.0726116 -0.015872 0.0601193 -0.132765 -0.0724723 0.000294237 0.11519 0.0446075 -0.104419 0.015846 -0.0282065 -0.135262 0.138843 -0.100461 -0.052029 
0.066257 0.0383752 -0.133318 -0.0271977 0.155201 0.196165 0.0936337 -0.114054 -0.179714 -0.0197726 -0.0541417 0.123278 0.12048 -0.0426275 -0.0474583 -0.026605 -0.035341 0.0606143 -0.0498123 0.143569 0.0965958 -0.0516042 0.0278834 0.0842434 -0.0255575 0.0255412 -0.154064 -0.193945 0.0339159 0.142224 -0.02882 0.143321 -0.143732 0.0327805 0.0287992 0.033462 -0.0801959 0.0515626 0.000136525 -0.065444 0.0593051 -0.0172163 0.0308469 0.0818277 -0.162497 0.0653068 0.191997 0.0407468 -0.149559 0.00658495 0.0388591 -0.0774583 -0.0184043 -0.0240603 0.123921 0.00381051 -0.0307816 0.241853 0.00398077 -0.0777986 -0.0391074 0.117206 0.206859 -0.142384 0.127057 -0.0548932 -0.0203329 0.0273609 -0.12074 0.0183518 0.0259911 0.128848 -0.0182059 0.0228624 -0.0346211 0.0879864 -0.0427389 -0.0169122 0.0646194 0.0316278 0.00149463 0.0457318 -0.0230766 -0.0183721 -0.0937754 -0.0424719 0.0819153 0.00372599 -0.019909 0.0222891 0.0659071 -0.0918479 -0.0135947 -0.00821854 -0.0731224 -0.0506866 0.0598808 0.117128 0.0262426 -0.0124753 0.0284246 0.0762776 -0.0216233 0.15422 -0.188445 0.0746923 -0.130958 0.14994 -0.0407757 0.016967 0.0762359 0.0846083 -0.0998221 -0.0122804 -0.0164826 0.0737361 -0.136196 -0.061442 -0.0343414 0.143336 -0.000172712 -0.0543521 0.0207959 -0.00786849 -0.105953 0.0968087 -0.110954 -0.0866084 
0.0312552 0.0778224 -0.129878 -0.00866278 0.140974 0.221441 0.0720809 -0.159945 -0.149433 -0.000778095 -0.0355429 0.112178 0.0985511 -0.0341359 -0.0192443 -0.0328629 -0.0509413 0.0819338 -0.0236195 0.0940697 0.0708265 -0.0486858 0.0129314 0.103176 0.0079004 0.0132009 -0.155598 -0.188795 0.0281284 0.15049 0.010754 0.152852 -0.125092 0.0137262 0.0438779 0.0707426 -0.0743822 -0.0112224 0.00477134 -0.0485898 0.0850439 -0.0356716 0.0415212 0.0735668 -0.161338 0.0647875 0.205083 0.0390907 -0.15584 -0.0293641 0.0327958 -0.0739629 0.0175983 -0.0452158 0.11447 0.0606882 -0.0418856 0.243865 0.0128708 -0.0658237 -0.0743949 0.137771 0.211106 -0.170149 0.135217 0.0007873 -0.00725548 0.000870203 -0.140975 0.0561741 0.0221812 0.128594 -0.0334574 0.0131549 0.00139816 0.0915194 -0.0631808 -0.0261356 0.0350831 -0.00141907 -0.00334279 0.0798543 -0.0292627 -0.0117535 -0.109256 -0.00257188 0.0671305 -0.0374507 -0.0513104 0.0434697 0.070737 -0.0910244 -0.00212732 -0.023419 -0.0588106 -0.0375373 0.0293767 0.123777 0.0459295 -0.00530208 0.0310924 0.0588349 -0.00314969 0.107214 -0.181961 0.104386 -0.112526 0.115536 -0.0662736 0.0354134 0.0706562 0.0593934 -0.0702189 -0.0517676 -0.0184579 0.0560167 -0.129924 -0.065737 0.000738575 0.141578 0.0615707 -0.0962565 0.00860923 -0.0144808 -0.118027 0.130771 -0.0938598 -0.0515446 
0.00611694 0.0993769 -0.153707 -0.0276254 0.127656 0.203686 0.0401946 -0.170452 -0.156769 0.0139643 -0.0292983 0.0961012 0.111068 0.0200791 -0.00350481 -0.0285975 -0.0453407 0.041425 0.0180355 0.0885224 0.0606464 -0.0552206 0.0230778 0.062815 0.0205705 0.0352533 -0.140268 -0.170429 0.036165 0.159413 0.017931 0.131819 -0.0969951 -0.0191552 0.0372903 0.105688 -0.0726297 0.0066882 0.0126558 -0.0352655 0.0539552 -0.0183792 0.0393677 0.0815258 -0.159653 0.0981963 0.215506 0.0359371 -0.151431 -0.0525467 0.0139407 -0.0477085 0.0100817 -0.0431986 0.116195 0.0689612 -0.0546428 0.253909 0.00926698 -0.0579949 -0.0881164 0.119756 0.221528 -0.168626 0.151344 0.00860237 -0.0047329 0.0321569 -0.116955 0.0527481 0.0481511 0.139579 -0.0395444 -0.0100562 0.0247316 0.108159 -0.0737147 -0.0283101 0.0291405 0.00213772 -0.00708381 0.061675 -0.0287352 0.00414551 -0.125752 -0.00828323 0.0605734 -0.0419068 -0.035719 0.0233326 0.0437581 -0.0898162 0.00998069 -0.020572 -0.0402603 -0.0624011 0.0359418 0.13331 0.0466515 -0.0106063 0.00317829 0.0694392 0.00552289 0.0800095 -0.21435 0.133009 -0.118523 0.111095 -0.0481255 0.0237809 0.0722187 0.0387626 -0.0834343 -0.0440944 -0.0159294 0.061912 -0.125293 -0.0723313 0.00611478 0.144183 0.0567919 -0.105725 0.00968355 -0.00838157 -0.114288 0.139185 -0.0838965 -0.0187201 
0.024783 0.0771943 -0.150369 -0.0271804 0.133952 0.198845 0.0427067 -0.162148 -0.159489 -0.00597277 -0.0290734 0.103259 0.11285 0.0130066 -0.0214524 -0.0234181 -0.0461838 0.0516293 -0.00653273 0.107665 0.0772145 -0.0526817 0.0293404 0.0843032 0.0106827 0.0283574 -0.130779 -0.176954 0.0258886 0.159253 0.000241923 0.120462 -0.104738 -0.00505378 0.0346839 0.0948703 -0.0823999 0.0141344 -0.00535439 -0.0432284 0.0433254 -0.0101392 0.0400616 0.0934494 -0.153916 0.0924171 0.217499 0.0390308 -0.156196 -0.0244823 0.0211338 -0.0678196 0.00394971 -0.0382856 0.128453 0.0544693 -0.0570377 0.260034 0.0183008 -0.0719476 -0.0714552 0.122692 0.225334 -0.153572 0.137978 -0.0112219 -0.0157937 0.0366262 -0.116869 0.0508696 0.0457777 0.132988 -0.0294061 -0.015653 0.00699802 0.101709 -0.0660303 -0.0250728 0.035447 0.00618223 0.00580863 0.0627768 -0.0415312 -0.0167729 -0.130757 -0.00948799 0.058487 -0.0354256 -0.0344808 0.0338066 0.0525546 -0.0953913 -0.0045606 -0.0231086 -0.0447683 -0.0447246 0.0314776 0.130473 0.0483576 -0.0169414 0.0109156 0.0665516 0.00143483 0.0874825 -0.216719 0.121079 -0.134904 0.11334 -0.0552313 0.0163003 0.082882 0.0579241 -0.0788091 -0.0374106 -0.0172415 0.0726293 -0.128022 -0.0702746 -0.00820258 0.142301 0.039532 -0.0893336 0.0146228 -0.00548385 -0.119798 0.13114 -0.0850855 -0.0398637 
0.0180573 0.0884616 -0.157418 -0.0427613 0.134541 0.192412 0.0427378 -0.163177 -0.16777 0.0139558 -0.0269249 0.0977671 0.121339 0.0323529 -0.0075949 -0.0366044 -0.0436043 0.0437835 0.0156476 0.0991575 0.0656132 -0.0504627 0.0244261 0.0625063 0.0160058 0.0386868 -0.128272 -0.165808 0.0360521 0.167053 -0.00199704 0.109955 -0.0955006 -0.0196559 0.0360408 0.0941836 -0.0761222 0.0144833 0.0113116 -0.0380172 0.0421864 -0.0106433 0.0415657 0.0978559 -0.168391 0.102364 0.214545 0.0392258 -0.14791 -0.0411135 0.0158723 -0.0510967 -0.00155992 -0.0343205 0.122598 0.0566572 -0.0558242 0.259475 0.0111688 -0.0632586 -0.0748428 0.110906 0.224065 -0.146198 0.137672 -0.00721539 -0.0104254 0.0448523 -0.102652 0.041698 0.0568906 0.139572 -0.0315586 -0.022032 0.0188135 0.109827 -0.0771165 -0.0280122 0.0390489 0.00646398 0.00164932 0.0608993 -0.0276359 0.00490499 -0.124975 -0.0155443 0.0643336 -0.0333378 -0.0209004 0.0220897 0.0404793 -0.0911781 0.00650658 -0.0252233 -0.0495717 -0.0742265 0.0342407 0.135059 0.0479805 -0.0225055 0.00389659 0.0784684 0.0177662 0.0795889 -0.226869 0.12663 -0.131398 0.119503 -0.0461917 0.0182946 0.0914662 0.0401719 -0.0886898 -0.0339558 -0.0244487 0.0728748 -0.124861 -0.0731972 -0.0101489 0.138176 0.0450877 -0.101856 0.00645855 -0.00670833 -0.12033 0.129374 -0.0878932 -0.0191676 
0.0523057 0.0724195 -0.123812 -0.0415513 0.164171 0.22229 0.089448 -0.128399 -0.191143 0.00290929 -0.0510702 0.108024 0.107647 -0.0257955 -0.0110467 -0.0349323 -0.0260305 0.0694203 -0.0321495 0.0985332 0.0633017 -0.0179197 0.0214608 0.0644535 -0.016421 0.0295724 -0.152451 -0.164954 0.048258 0.128235 -0.0127636 0.149073 -0.142166 0.0280513 0.0379087 0.0512547 -0.0616796 0.0175807 0.017203 -0.0448543 0.0880967 -0.0119921 0.0447212 0.0712344 -0.18167 0.0790868 0.193282 0.0487585 -0.160321 -0.0155079 0.0368588 -0.062253 -0.0206592 -0.0293062 0.105587 0.0287422 -0.0273133 0.252312 0.000813264 -0.0592703 -0.0668031 0.136705 0.207393 -0.160519 0.138746 -0.0199139 -0.016571 0.0281282 -0.12798 0.0542697 0.0346466 0.133803 -0.0170627 0.0325225 -0.0156938 0.0934206 -0.0586411 -0.0237855 0.0504911 -0.0205198 0.0059084 0.0735289 -0.00608693 -0.00226795 -0.100264 -0.0370668 0.0853402 -0.010488 -0.0428642 0.0418511 0.0816133 -0.090513 -0.00827454 -0.0157456 -0.0534592 -0.0501527 0.0577058 0.129706 0.0218067 -0.00272219 0.0147819 0.0844821 -0.00681189 0.141047 -0.192493 0.089153 -0.125673 0.131904 -0.0461043 0.0211859 0.088637 0.0667878 -0.0826656 -0.00653436 -0.0145761 0.0472291 -0.1258 -0.0698561 -0.017976 0.137015 0.0443557 -0.0836528 0.0237064 -0.0141099 -0.107106 0.100068 -0.105229 -0.0686662 
0.0530998 0.0522915 -0.146309 -0.0392943 0.132265 0.202334 0.0759866 -0.114725 -0.176327 -0.0275227 -0.0470947 0.118475 0.117396 -0.0432881 -0.0697927 -0.0342036 -0.0535495 0.0578168 -0.054048 0.130173 0.0895818 -0.0480087 0.0350514 0.0767044 -0.0394691 0.0347694 -0.123755 -0.190981 0.0299755 0.130257 -0.0348502 0.131118 -0.136457 0.0301069 0.0190005 0.0345131 -0.077722 0.0550221 -0.0128137 -0.0443664 0.0589942 -0.0243922 0.0246946 0.105529 -0.169965 0.0638817 0.20728 0.0373992 -0.166922 0.0173749 0.0333499 -0.0751584 -0.029477 -0.0113065 0.118747 0.0130837 -0.0202356 0.242763 0.0149882 -0.0930184 -0.039592 0.120902 0.22906 -0.129633 0.121787 -0.0622444 -0.0123317 0.0258607 -0.103567 0.0441973 0.0167139 0.112377 -0.0101296 0.0344928 -0.0213422 0.0709115 -0.0569181 -0.00911216 0.0470018 0.010964 -0.00321479 0.0551318 -0.0277374 -0.0260227 -0.11241 -0.0273445 0.0814865 -0.0053401 -0.0203238 0.0222884 0.0732291 -0.109018 -0.0177374 -0.0305931 -0.0589013 -0.0472972 0.054589 0.132165 0.0303455 -0.0110035 0.0153015 0.0803134 -0.0163847 0.15905 -0.182268 0.0699154 -0.143892 0.158253 -0.0655367 0.00550702 0.0857827 0.0930925 -0.0929412 -0.00797271 -0.0284763 0.0647587 -0.12273 -0.0831239 -0.00777083 0.132218 0.0106196 -0.0578013 0.0278681 -0.0120069 -0.111757 0.0854293 -0.113979 -0.0717359 
0.0605501 0.0622755 -0.143816 -0.0388195 0.148206 0.210286 0.0872642 -0.127217 -0.180769 -0.0166083 -0.0443089 0.1197 0.116933 -0.0268813 -0.0556589 -0.0340286 -0.035193 0.0600741 -0.0424216 0.11487 0.0874678 -0.0406674 0.0286669 0.0745137 -0.0243422 0.0269403 -0.132177 -0.174886 0.0439258 0.145958 -0.0316463 0.137037 -0.138887 0.0271845 0.0248739 0.0332642 -0.0733766 0.0428734 0.0101434 -0.0485711 0.0585959 -0.0157804 0.0350721 0.0827642 -0.171418 0.066632 0.194486 0.0398505 -0.159628 0.00202963 0.0392682 -0.0561163 -0.0206725 -0.0173352 0.115768 0.01698 -0.017574 0.253401 -0.000574229 -0.0758819 -0.047601 0.125076 0.226405 -0.147214 0.125547 -0.0425006 -0.0196409 0.0315569 -0.121288 0.0493507 0.0256931 0.121851 -0.0230451 0.0310344 -0.0218374 0.0863164 -0.0438772 -0.0245871 0.0493106 0.00468152 -0.00171173 0.0565447 -0.0115124 -0.0139724 -0.102107 -0.0390911 0.0782092 -0.0084291 -0.0260427 0.0290256 0.0723517 -0.107276 -0.0102237 -0.0122622 -0.0528266 -0.057082 0.0547913 0.131148 0.0311801 -0.00522733 0.0246305 0.0878287 -0.017992 0.159909 -0.187262 0.0794096 -0.131223 0.146296 -0.0528417 0.00659541 0.0863677 0.0780276 -0.087026 0.00171544 -0.0184384 0.0678111 -0.124372 -0.062135 -0.0121562 0.142989 0.0162676 -0.0721361 0.0206536 -0.0217529 -0.111044 0.100745 -0.108924 -0.0716404 
0.0587316 0.0562809 -0.162627 -0.0469783 0.15611 0.186785 0.0669546 -0.123011 -0.20609 0.00601956 -0.0567894 0.111147 0.120419 -0.01374 -0.0455959 -0.03131 -0.0168304 0.0554196 -0.0107417 0.135033 0.0681724 -0.0458336 0.0391231 0.0527429 -0.0193739 0.0552697 -0.12724 -0.17823 0.0427014 0.133751 -0.0422385 0.136173 -0.13207 0.00489129 0.023581 0.0368288 -0.074919 0.0587552 0.0130834 -0.0597054 0.0489883 -0.00474179 0.0304869 0.0926468 -0.178622 0.0972122 0.205847 0.0453254 -0.156236 -0.00650273 0.0382466 -0.0494808 -0.0205279 -0.0219264 0.11322 -0.00063223 -0.00690928 0.24044 0.0201103 -0.0852411 -0.0341916 0.115699 0.217294 -0.126267 0.126823 -0.0512418 -0.0214051 0.0528863 -0.0894329 0.0277095 0.0326104 0.131784 -0.0131403 0.0195544 -0.0227681 0.0889024 -0.0622381 -0.00802806 0.0589629 0.010231 -0.0026668 0.0632589 -0.0187977 -0.00976419 -0.0880435 -0.0514434 0.0747083 0.01027 -0.00521454 0.00534966 0.0538267 -0.0739618 -0.00734166 -0.0210479 -0.0528913 -0.074125 0.0789997 0.144379 0.0258754 -0.033707 0.0155797 0.0910697 0.00465646 0.148356 -0.20827 0.0771653 -0.136408 0.150766 -0.0343544 0.0158276 0.100541 0.0795475 -0.0912131 -0.00362449 -0.027861 0.0555003 -0.140512 -0.088405 -0.0261466 0.121993 0.0029744 -0.0618574 0.0297196 -0.023787 -0.11471 0.0887728 -0.11496 -0.0658642 
0.0838585 0.0221088 -0.139986 -0.0520817 0.164781 0.169014 0.0759829 -0.0818527 -0.194364 -0.0374751 -0.0738225 0.116586 0.108027 -0.0454046 -0.0572791 -0.0102854 -0.0184893 0.0245665 -0.0603839 0.172352 0.0783859 -0.0277836 0.0528486 0.0449621 -0.0385311 0.0685476 -0.116883 -0.177075 0.0398338 0.0891118 -0.0441403 0.143696 -0.145688 0.0493526 0.00264314 0.0151973 -0.0609737 0.118751 -0.000850453 -0.0656556 0.0575394 0.00797549 0.0305938 0.0876969 -0.165775 0.0702265 0.189271 0.0449446 -0.133672 0.0413474 0.0370073 -0.070142 -0.0493453 0.00057638 0.13236 -0.0436762 -0.0106717 0.233171 0.015905 -0.108829 -0.0263294 0.0913851 0.207566 -0.111471 0.112536 -0.0759318 -0.0204036 0.0577091 -0.0693519 0.0193042 0.0190281 0.127973 0.00806131 0.06157 -0.0333337 0.0555089 -0.0440574 0.0038155 0.065359 0.0238279 0.0207539 0.0640542 -0.00789108 -0.034707 -0.0653876 -0.0809565 0.0895346 0.0618478 0.00864538 0.00263224 0.0785174 -0.0842452 -0.0322269 -0.0200633 -0.0530438 -0.0527293 0.0957799 0.122934 0.0117143 -0.0357973 -0.00898734 0.0675651 -0.0193722 0.187063 -0.203253 0.0445685 -0.155373 0.160829 -0.0157408 -0.00717167 0.101846 0.130929 -0.111418 0.0390261 -0.00960233 0.0439986 -0.13422 -0.0932941 -0.0428899 0.112534 -0.0160444 0.0100124 0.061918 -0.00518113 -0.100052 0.0422238 -0.111931 -0.0988755 
0.057429 0.0898328 -0.136107 -0.0747178 0.156049 0.189001 0.0882945 -0.0953522 -0.222415 0.0303059 -0.0479229 0.0786677 0.128991 0.014246 0.0046777 -0.0547026 0.00753074 0.0337426 -0.00369752 0.115111 0.0415234 -0.00953475 0.0145592 0.00586321 -0.0240801 0.0649813 -0.14469 -0.130845 0.0988379 0.113058 -0.0300343 0.154875 -0.137473 0.0111028 0.0257008 0.0475098 -0.0456261 0.0767572 0.0327585 -0.0487605 0.0761073 -0.00317522 0.0191661 0.0764863 -0.200784 0.11376 0.181735 0.0606384 -0.158096 -0.0406226 0.0125787 0.0127274 -0.0526614 -0.0154656 0.0908205 0.000116768 -0.0239314 0.237233 -0.00629582 -0.0687786 -0.0652049 0.101862 0.209579 -0.133572 0.126577 -0.0206524 0.0099954 0.0529641 -0.0816167 0.0379539 0.044687 0.128788 -0.00869193 0.0531285 -0.0042925 0.0724062 -0.0684124 -0.00397269 0.0671273 -0.0147157 0.000112163 0.0691009 0.00755475 8.92926e-06 -0.0504865 -0.0786784 0.0902892 0.0200409 0.00171289 0.0177126 0.0859108 -0.0737846 -0.00110909 -0.0199921 -0.0484822 -0.118443 0.103147 0.134295 0.0159954 -0.0341174 -0.0073829 0.120895 0.0146103 0.151134 -0.229344 0.096095 -0.116933 0.155825 0.0186986 0.00400794 0.106088 0.0670025 -0.133892 0.02056 -0.00777968 0.0216048 -0.115949 -0.118725 -0.00617087 0.115499 0.0232814 -0.0730922 0.0324634 0.0032777 -0.0921225 0.0664548 -0.0926195 -0.0531885 
0.076658 0.0617169 -0.141819 -0.0457507 0.160765 0.224357 0.110287 -0.116885 -0.192774 0.00527296 -0.0394917 0.102199 0.118547 -0.00475931 -0.011021 -0.0463899 -0.0279336 0.0582247 -0.0287452 0.0887085 0.0709572 -0.0254524 0.0093044 0.0525264 -0.0124851 0.0241603 -0.154761 -0.155609 0.0527295 0.140169 -0.0249989 0.156153 -0.166014 0.0276293 0.0247724 0.048927 -0.0774266 0.00727964 0.0302946 -0.0466816 0.0825025 -0.0161195 0.0313361 0.0770618 -0.181652 0.0732021 0.168251 0.0551876 -0.151715 -0.0172143 0.0310599 -0.0383689 -0.0346221 -0.0230833 0.09902 0.0189111 -0.0357053 0.263223 -0.00603249 -0.0477658 -0.0551615 0.128645 0.220031 -0.153013 0.115482 -0.0158373 -0.0102495 0.0402074 -0.11247 0.0536218 0.0387186 0.145187 -0.0172425 0.0362064 -0.0346655 0.0844874 -0.043522 -0.0392052 0.0472638 -0.00657758 0.00957789 0.0563959 -0.00615408 -0.0103991 -0.0985738 -0.0410598 0.0901472 -0.021768 -0.0281757 0.0339839 0.0917821 -0.0946418 -0.0163219 -0.0191409 -0.0558787 -0.0676219 0.0623236 0.111687 0.0301587 -0.0015583 0.0204466 0.0957805 0.000302028 0.13789 -0.202599 0.0930986 -0.129385 0.145322 -0.0454715 0.0196433 0.098763 0.0597623 -0.097074 -0.00651029 -0.00119771 0.0521713 -0.100144 -0.0631184 -0.00291228 0.135699 0.0358597 -0.0934422 0.030987 -8.05964e-05 -0.106276 0.0870077 -0.0968507 -0.0590292 
0.0797805 0.0374765 -0.135737 -0.0556309 0.167621 0.173279 0.0930981 -0.0785551 -0.195258 0.00401938 -0.0592207 0.105841 0.124634 -0.032011 -0.0349569 -0.0181279 -0.00611595 0.0395577 -0.0598083 0.165893 0.0724576 -0.0280126 0.0441548 0.0498929 -0.0393167 0.0610696 -0.136404 -0.167869 0.0738669 0.0950094 -0.0366176 0.161077 -0.154422 0.0413788 0.0012603 0.0243976 -0.0670005 0.115415 0.000956837 -0.0580067 0.0611643 0.0023949 0.00410877 0.0833908 -0.180112 0.068465 0.173861 0.0648071 -0.129235 0.0100034 0.0380906 -0.0354068 -0.0649344 -0.0167337 0.114254 -0.0361035 -0.015592 0.235233 0.0153125 -0.09152 -0.0428186 0.0850431 0.204453 -0.116821 0.112682 -0.0697878 -0.00999854 0.0594841 -0.0752409 0.0274383 0.0257762 0.142299 0.00452342 0.0654376 -0.0354673 0.0499426 -0.0495863 0.0204286 0.0690829 0.0129516 0.0166545 0.0645135 -0.00505068 -0.0280422 -0.0513726 -0.0855386 0.0969791 0.0565362 0.00934957 -0.000877134 0.0782565 -0.0728195 -0.0243471 -0.0206667 -0.0557433 -0.0819229 0.0949277 0.117273 0.0156986 -0.0388991 0.00510733 0.0784892 -0.0124311 0.183306 -0.20523 0.0543879 -0.145383 0.155259 0.0201178 -0.000271191 0.0900138 0.127795 -0.119121 0.0341573 -0.00227215 0.0393628 -0.130275 -0.102129 -0.0403975 0.118801 -0.0108927 -0.0109202 0.0445101 0.0112081 -0.108299 0.0519831 -0.120564 -0.0869407 
0.0564503 0.0519809 -0.158998 -0.0518126 0.143316 0.202416 0.0761618 -0.121756 -0.16378 -0.0122355 -0.0512443 0.120742 0.122385 -0.0372396 -0.0482893 -0.0520228 -0.0391438 0.0633839 -0.0435782 0.120769 0.0693894 -0.0297546 0.0146994 0.0936852 -0.0338653 0.027779 -0.1133 -0.18591 0.011465 0.148666 -0.0317555 0.122783 -0.124679 0.0257687 0.0364327 0.0396203 -0.0599895 0.0179986 -0.0165321 -0.0545558 0.0669499 -0.0308922 0.041176 0.115716 -0.171864 0.0838296 0.201003 0.0548359 -0.158924 0.0134506 0.0410338 -0.0930512 -0.00739043 -0.0239076 0.123183 0.025577 -0.0459186 0.238332 0.021295 -0.0875132 -0.0395929 0.117387 0.212383 -0.130325 0.111052 -0.0656459 -0.0149162 0.0326888 -0.109076 0.0217049 0.0219899 0.101764 -0.0181044 -0.00792185 -0.0233161 0.0981332 -0.0637216 -0.00953216 0.0541765 0.0148372 0.00796028 0.0634711 -0.0345491 -0.0105497 -0.104558 -0.0277477 0.0807077 -0.0224834 -0.0199207 0.0435648 0.0573055 -0.106467 -0.0171587 -0.033818 -0.0715908 -0.0406863 0.0479632 0.11232 0.0336009 -0.0286886 0.0322135 0.0832508 0.000385036 0.130468 -0.20085 0.0619223 -0.15687 0.142065 -0.0953904 0.0312354 0.11123 0.0700212 -0.087794 -0.0247153 -0.050469 0.06388 -0.134541 -0.0842913 -0.0253689 0.131082 0.0290048 -0.0714046 0.0217909 -0.00451116 -0.111794 0.0795567 -0.121274 -0.078803 
0.0578685 0.0316653 -0.139679 -0.0159531 0.14703 0.20165 0.067316 -0.130745 -0.147405 -0.034754 -0.0425928 0.12915 0.109715 -0.0577135 -0.0579778 -0.0312243 -0.0581053 0.0841501 -0.0556558 0.13146 0.101396 -0.0461473 0.0325589 0.128694 -0.0147329 0.00784406 -0.12278 -0.211742 0.0059432 0.153707 -0.0219948 0.126324 -0.123822 0.0299462 0.0359462 0.0396444 -0.0808814 0.0121483 -0.0213907 -0.0603864 0.0678338 -0.0302019 0.0328767 0.106892 -0.167302 0.0554146 0.206159 0.0424477 -0.149919 0.0175553 0.0504644 -0.104109 0.00920606 -0.0310011 0.131824 0.0268804 -0.0265476 0.230226 0.0262343 -0.0932651 -0.0402958 0.121245 0.205562 -0.126398 0.105543 -0.0645664 -0.0213291 0.0156044 -0.1137 0.0351483 0.0106562 0.110538 -0.0259736 -0.00993978 -0.0239683 0.0884481 -0.0637804 -0.00829431 0.0467817 0.0387112 0.0062908 0.0697189 -0.0338439 -0.0217953 -0.103359 -0.00578314 0.0766816 -0.013923 -0.0426282 0.0352613 0.0653541 -0.0970397 -0.0272744 -0.0293517 -0.0824611 -0.0329459 0.0217271 0.121785 0.0410166 -0.028484 0.0460641 0.0587052 -0.00368695 0.129612 -0.174487 0.0610674 -0.143168 0.137913 -0.0793034 0.0283888 0.0862644 0.0823182 -0.0806567 -0.0396864 -0.0376723 0.0820485 -0.140736 -0.0731858 -0.029581 0.143193 0.0280809 -0.0576747 0.00746246 -0.013639 -0.123169 0.10173 -0.109728 -0.0672653 
0.0743152 0.0367046 -0.150107 -0.02867 0.164877 0.181367 0.0656916 -0.111498 -0.189629 -0.00585137 -0.0606503 0.123296 0.116177 -0.063527 -0.0452946 -0.0134723 -0.0117628 0.0828679 -0.0395309 0.151756 0.089807 -0.03704 0.0474475 0.09745 -0.0202298 0.0349487 -0.121197 -0.211591 0.0214803 0.141917 -0.0384869 0.146529 -0.1201 0.0317221 0.0340672 0.0141899 -0.0626923 0.0515486 -0.000624859 -0.0745946 0.0518389 -0.0187316 0.0440901 0.106061 -0.175709 0.0783871 0.212328 0.044179 -0.154544 0.0201986 0.0757503 -0.0908908 -0.00811876 -0.0282944 0.123442 -0.0039887 -0.00211793 0.210946 0.0400054 -0.0997018 -0.0278438 0.0956417 0.185444 -0.124464 0.117252 -0.0919125 -0.0356852 0.0340712 -0.102628 0.0144302 0.0104851 0.113437 -0.0225326 -0.0048572 -0.0426969 0.0818293 -0.0587686 0.0131238 0.0586162 0.0404827 0.00436305 0.0680022 -0.0277117 -0.0150941 -0.0738715 -0.0432405 0.0729759 0.00664598 -0.0176 0.0221554 0.0410349 -0.0753134 -0.0408093 -0.0246073 -0.0716621 -0.0388405 0.0623511 0.13748 0.0140304 -0.0446521 0.0337711 0.0743492 0.00129881 0.163676 -0.1868 0.037508 -0.145611 0.148502 -0.0390567 0.0217511 0.0876995 0.0926785 -0.0910117 -0.0165754 -0.0340298 0.056913 -0.152927 -0.0992773 -0.0494204 0.132148 0.0113205 -0.0305119 0.0259635 -0.0149277 -0.103985 0.068989 -0.109767 -0.0890762 
0.0579688 0.0515538 -0.164174 -0.0294345 0.154644 0.174982 0.0577137 -0.124045 -0.189239 0.0207509 -0.0480228 0.11735 0.124008 -0.0591386 -0.0465038 -0.0165857 -0.0132678 0.0852951 -0.0203203 0.151819 0.0846674 -0.0565059 0.0466313 0.0902821 -0.0149256 0.0492427 -0.122322 -0.215721 0.0405503 0.145473 -0.0308432 0.153824 -0.112812 0.0168255 0.0350662 0.0221585 -0.063034 0.0576036 0.0123611 -0.0766952 0.050605 -0.0327361 0.0316113 0.112131 -0.183057 0.0782323 0.219264 0.0516683 -0.154484 -0.00348081 0.0626929 -0.0671107 -0.00956232 -0.0363764 0.11343 0.00541062 0.00221082 0.204524 0.0378318 -0.101067 -0.0352091 0.0861757 0.198707 -0.119096 0.120363 -0.0813065 -0.0257328 0.0328052 -0.0917996 0.0153888 0.00263363 0.115459 -0.0313401 -0.000592499 -0.0308156 0.0702131 -0.0690319 0.0280915 0.0587048 0.0383652 -0.0128739 0.0725358 -0.0296337 -0.00965422 -0.0735529 -0.0429163 0.0713175 0.00854807 -0.00533446 0.00625118 0.0412245 -0.0632108 -0.0274609 -0.0279656 -0.0711599 -0.0668384 0.061647 0.149224 0.0189253 -0.0562809 0.0348066 0.0757128 0.00808573 0.156659 -0.179193 0.0487781 -0.130963 0.155333 -0.0193577 0.0265689 0.0767507 0.0899934 -0.0964165 -0.0222646 -0.0337702 0.0508054 -0.152677 -0.115902 -0.0351253 0.130164 0.0139394 -0.0417095 0.0161356 -0.0124571 -0.11991 0.0757366 -0.11288 -0.0678354 
0.0279542 0.0558362 -0.141976 -0.0129887 0.147844 0.200358 0.0569689 -0.150094 -0.147353 0.0005315 -0.029815 0.126589 0.100401 -0.0583059 -0.0462948 -0.0297314 -0.0678054 0.0988243 -0.0260832 0.125531 0.0906766 -0.0594043 0.0326801 0.108266 -0.00224705 0.0277131 -0.134165 -0.216 0.031282 0.148377 -0.00182975 0.131133 -0.112959 0.00450551 0.0485499 0.0603902 -0.0864844 0.00959894 -0.00418984 -0.0577779 0.076296 -0.0343718 0.0208829 0.11498 -0.186373 0.0582757 0.218557 0.0408266 -0.150635 -0.0158902 0.0296461 -0.0762866 -0.00197419 -0.0442711 0.118109 0.0441083 -0.0234461 0.226184 0.014778 -0.0807767 -0.0583766 0.10636 0.227327 -0.127349 0.131232 -0.0538218 -0.0163145 0.00730818 -0.105195 0.057841 0.0201115 0.128644 -0.0276143 3.40026e-05 -0.0123776 0.0749072 -0.0885466 0.00998053 0.0361268 0.0144629 -0.0173817 0.0914135 -0.0330435 -0.00578118 -0.107298 -0.00550409 0.0776474 -0.00667441 -0.0346427 0.0208337 0.0657191 -0.0764025 -0.0209901 -0.0393968 -0.0671276 -0.0660536 0.0200894 0.138237 0.0411706 -0.0325722 0.0301856 0.0528984 0.00583024 0.104264 -0.168476 0.0858029 -0.114083 0.135787 -0.0447549 0.0381989 0.0687346 0.0715576 -0.0816859 -0.0477994 -0.0252121 0.0640682 -0.134838 -0.097311 -0.00595802 0.139219 0.0465342 -0.0710567 -0.0022105 -0.0112666 -0.134649 0.115726 -0.0965145 -0.0349112 
0.0198591 0.0644451 -0.149015 -0.0450704 0.13183 0.197476 0.0566281 -0.13667 -0.154612 0.0221297 -0.0341582 0.1242 0.116987 -0.0477518 -0.0420616 -0.0611907 -0.0549562 0.083948 -0.00423361 0.127237 0.0665894 -0.0512155 0.0202743 0.120586 -0.0261341 0.0440214 -0.110933 -0.200344 0.0438438 0.151308 -0.011805 0.104204 -0.101661 0.00432949 0.0542427 0.0573739 -0.0595706 0.0160056 -0.0128277 -0.0599188 0.0683289 -0.0488661 0.0184611 0.129422 -0.194851 0.0650883 0.215668 0.060675 -0.151461 -0.00824332 0.0226913 -0.0739832 -0.000318982 -0.0402248 0.124473 0.0542785 -0.0401303 0.230405 0.00913126 -0.088736 -0.056619 0.101568 0.234956 -0.126941 0.128495 -0.0603868 -0.0048382 -0.00121522 -0.111201 0.0392022 0.00380089 0.105296 -0.0350339 -0.000337899 -0.00509073 0.0773209 -0.080659 0.0247854 0.0661171 0.00635221 -0.0200879 0.08201 -0.0329886 0.00465408 -0.087564 -0.035817 0.0772862 -0.00425242 -0.00329299 0.035446 0.0648621 -0.0818609 0.0037898 -0.037625 -0.0644545 -0.0819191 0.0294909 0.132641 0.0434016 -0.0431504 0.0386418 0.0794028 0.00254824 0.0946738 -0.17905 0.0825022 -0.116489 0.118147 -0.0587768 0.0437648 0.0906151 0.0689458 -0.0775127 -0.043338 -0.0476611 0.063222 -0.118715 -0.11474 -0.0138663 0.138426 0.0430565 -0.0923477 -0.00911909 -0.00998369 -0.145221 0.112003 -0.109836 -0.0417829 
0.0552536 0.0398748 -0.142389 -0.0260307 0.170499 0.166235 0.0523251 -0.120493 -0.206291 0.0275159 -0.0553893 0.114572 0.12169 -0.0374253 -0.0181817 -0.00588936 0.0196657 0.0980785 -0.00832866 0.15333 0.0791771 -0.0430253 0.0590154 0.1038 -0.0104618 0.0505523 -0.132096 -0.210993 0.0517511 0.134768 -0.0171521 0.159226 -0.110802 0.0117717 0.0365419 0.0339857 -0.0674151 0.0637714 0.00661746 -0.0697957 0.0408489 0.00182274 0.0231091 0.100327 -0.178941 0.0865557 0.218052 0.0522899 -0.146228 -0.0159523 0.069385 -0.0728238 -0.00988949 -0.0544654 0.103422 0.00417586 0.00675001 0.21912 0.050471 -0.087615 -0.0399844 0.0966119 0.177597 -0.12735 0.132945 -0.0826053 -0.0261863 0.0337303 -0.100646 0.0238737 0.0154423 0.128187 -0.025138 0.000112361 -0.0439339 0.0689834 -0.0718503 0.0335627 0.0640947 0.0214245 -0.0109397 0.0844098 -0.0374765 -0.0202154 -0.062069 -0.0630647 0.0688052 0.00957197 -0.020797 -0.000421554 0.0379253 -0.0350341 -0.0222313 -0.023829 -0.048433 -0.0557861 0.0691706 0.154215 0.007176 -0.0505507 0.0234998 0.0709242 0.00673059 0.154381 -0.190188 0.050536 -0.128126 0.121349 0.012932 0.0229366 0.068158 0.0946299 -0.0882664 -0.0223441 -0.0269539 0.0491325 -0.154823 -0.128232 -0.0535727 0.130336 0.00639532 -0.0333307 0.00462761 -0.0121714 -0.126728 0.082369 -0.119539 -0.0782445 
0.0358126 0.0787688 -0.156346 -0.0432409 0.137439 0.191074 0.0829799 -0.13012 -0.169833 0.0173341 -0.0394559 0.103564 0.127282 -0.0305257 -0.0343635 -0.0750271 -0.0283804 0.0637464 -0.0187234 0.141263 0.044953 -0.0545259 0.0152236 0.0687283 -0.0387075 0.039635 -0.152109 -0.179253 0.0581115 0.130986 -0.0104049 0.15031 -0.115409 0.0114311 0.0436279 0.0565475 -0.0475402 0.0499347 -0.0117404 -0.0696921 0.0861408 -0.0400043 0.0111274 0.103578 -0.202415 0.0909123 0.199324 0.0716646 -0.151636 -0.0164484 -0.00528142 -0.0390722 -0.0113403 -0.0327552 0.10637 0.0270477 -0.041394 0.218217 0.0103352 -0.0826635 -0.0679815 0.120097 0.222969 -0.138345 0.124347 -0.0381866 0.0171944 0.00563591 -0.109355 0.0235749 0.0158597 0.0974108 -0.0157209 0.0395312 -0.00453246 0.0716229 -0.0754801 0.00677949 0.0662083 -0.00317293 -0.0222517 0.0692111 -0.0391584 -0.00489601 -0.0655531 -0.0379779 0.0744935 -0.00434405 -0.00413669 0.0281489 0.0905905 -0.0816563 0.0136715 -0.0463488 -0.0620825 -0.101908 0.0627816 0.132005 0.0334205 -0.038012 0.0276012 0.0990573 0.0140068 0.122118 -0.196654 0.0923407 -0.107142 0.151819 -0.0273411 0.0488299 0.0899281 0.0696885 -0.10585 -0.0271302 -0.0476086 0.0376997 -0.116774 -0.121314 0.0050172 0.129576 0.0264938 -0.0859926 0.00499193 0.00936791 -0.125062 0.0833654 -0.10798 -0.0522081 
0.0811256 0.0400645 -0.148416 -0.0298385 0.168254 0.193549 0.0993479 -0.107691 -0.169028 0.000118982 -0.0387665 0.126606 0.132836 -0.0508792 -0.0490935 -0.0308568 -0.00506173 0.0812205 -0.0677564 0.152103 0.0899706 -0.0364335 0.0110025 0.10412 -0.0343319 0.0154234 -0.14349 -0.183046 0.0410784 0.152024 -0.0348867 0.152897 -0.141681 0.0378969 0.0250736 0.0243346 -0.0703848 0.0338391 -0.00895769 -0.0687337 0.0652857 -0.0170515 0.0257179 0.0980427 -0.171659 0.0576389 0.181001 0.0624963 -0.141021 0.00533796 0.0595747 -0.0735247 -0.0324061 -0.0371701 0.113927 0.00241664 -0.0499573 0.229128 0.0177713 -0.0753213 -0.0448893 0.101651 0.199365 -0.136483 0.104143 -0.0783895 -0.0162786 0.0266853 -0.122816 0.00441154 0.0275016 0.115221 -0.0111943 0.00509528 -0.0513714 0.0873988 -0.0418716 0.00673511 0.0605948 0.0272413 0.0117694 0.0558101 -0.0253677 -0.0174533 -0.0737909 -0.0410173 0.0852098 -0.00469384 -0.0168542 0.0326774 0.0564538 -0.0930038 -0.0304234 -0.00853072 -0.0768327 -0.0561633 0.0556381 0.097166 0.0148969 -0.0290015 0.043907 0.084196 -0.00929187 0.157302 -0.19576 0.0618145 -0.136629 0.145812 -0.0372471 0.03326 0.0861827 0.0807693 -0.101689 0.000571974 -0.0334943 0.0578201 -0.145509 -0.0728651 -0.0468943 0.134496 -0.00244217 -0.0521665 0.0151611 0.00616428 -0.102023 0.0813418 -0.125149 -0.0979157 
0.0822285 0.0800515 -0.142179 -0.0507265 0.12318 0.220208 0.0757418 -0.123367 -0.164155 -0.0121203 -0.0233738 0.0995766 0.12127 -0.0639209 -0.0272431 -0.062331 -0.0388509 0.0666651 -0.0427716 0.122086 0.0643971 -0.00104451 0.00108393 0.131469 -0.0316797 0.00979341 -0.110785 -0.175193 0.0426866 0.157633 -0.0257687 0.1108 -0.134785 0.0440355 0.0518796 0.0327925 -0.0407569 -0.00454334 0.00717226 -0.0492649 0.0623081 -0.060352 0.0301526 0.117664 -0.172227 0.069614 0.195765 0.0838824 -0.167066 0.0392588 0.0469883 -0.0536819 -0.00432264 -0.0207212 0.109951 0.0180652 -0.0480094 0.221476 0.0159674 -0.0958043 -0.059293 0.118705 0.221565 -0.138109 0.0617172 -0.0591248 0.0141224 -0.0039463 -0.129809 0.0186042 -0.0034103 0.0805859 -0.0356741 0.0183525 -0.0076457 0.0532758 -0.0606821 -0.00757206 0.0764711 0.0594129 0.0354625 0.0649387 -0.0258571 -0.0238572 -0.0631482 -0.0226933 0.0571833 -0.0453868 -0.0176538 0.0737501 0.089855 -0.105324 -0.020738 -0.0203726 -0.0872707 -0.066284 0.0402892 0.112937 0.0328622 -0.0557583 0.0515355 0.103771 0.00121314 0.133355 -0.199453 0.0692789 -0.129016 0.146128 -0.0661177 0.0461306 0.133065 0.0757833 -0.0925005 -0.02108 -0.0579091 0.0634642 -0.11637 -0.0896964 -0.017957 0.13578 0.0460329 -0.0957783 0.0235067 0.0071462 -0.12085 0.0691513 -0.0885722 -0.0719544 
0.109283 0.084772 -0.126768 -0.0429191 0.151785 0.233501 0.0809044 -0.0918419 -0.196594 0.0150148 -0.0202473 0.0819597 0.135074 -0.0752438 0.00903456 -0.0172997 0.000995355 0.081287 -0.0643892 0.126967 0.0867052 0.00662697 0.0201342 0.103012 -0.0158522 -0.00235922 -0.143022 -0.179305 0.0616612 0.142216 -0.0212681 0.144048 -0.143891 0.0619474 0.0339265 0.0205302 -0.0446595 0.0103983 0.0324939 -0.0455697 0.0625467 -0.0472839 0.0393277 0.0899941 -0.175527 0.0542758 0.190006 0.0723087 -0.171988 0.0295647 0.0894165 -0.04689 -0.0410642 -0.0175122 0.0836081 -0.00563495 -0.0214139 0.199452 0.0341502 -0.0898375 -0.0714836 0.0985738 0.182646 -0.162647 0.0736732 -0.0652357 0.00113836 0.0199745 -0.131989 0.0170244 0.0155123 0.113111 -0.0359738 0.0119027 -0.0214466 0.0555897 -0.058002 0.00382962 0.0661656 0.0659044 0.038429 0.0561812 0.00323596 -0.0138409 -0.0565671 -0.0113519 0.0715983 -0.0365999 -0.0234854 0.058695 0.0673593 -0.102393 -0.0521301 -0.00271654 -0.0930819 -0.0615407 0.0547441 0.122921 -0.00705193 -0.045056 0.039698 0.100551 0.00139583 0.17398 -0.194243 0.0604715 -0.130333 0.159827 -0.017084 0.0235036 0.0926563 0.0794121 -0.101342 0.00128182 -0.0234622 0.04701 -0.138767 -0.0787966 -0.0411522 0.140001 0.0418146 -0.0772262 0.0404344 0.0164997 -0.0863966 0.0508468 -0.0833824 -0.0749714 
0.099317 0.0562539 -0.116188 -0.0587506 0.136811 0.196831 0.0967179 -0.0564242 -0.194957 -0.0100192 -0.0608501 0.104375 0.125777 -0.101223 -0.0225023 -0.0222736 -0.0165625 0.0511785 -0.0801275 0.141218 0.0863433 0.00750785 0.0147198 0.0990916 -0.0540492 0.018698 -0.128177 -0.193609 0.0385927 0.13499 -0.0451137 0.131076 -0.13969 0.0692781 0.0269697 -0.0120773 -0.04464 0.0561849 -0.00554896 -0.040922 0.0487939 -0.0430512 0.0393303 0.108139 -0.150826 0.0722275 0.187739 0.0493517 -0.17285 0.0559992 0.0979193 -0.0821779 -0.0420403 -0.0138806 0.110126 -0.0209213 -0.0261856 0.203387 0.0337748 -0.0941911 -0.0339487 0.0845458 0.16334 -0.130416 0.0853299 -0.122104 -0.013485 0.0117881 -0.125258 -0.0125285 0.00438287 0.0881646 -0.0240438 0.0180689 -0.0405857 0.0673928 -0.0473508 0.00717252 0.0814497 0.0768596 0.0358684 0.0320174 -0.00917571 -0.0124961 -0.056486 -0.0525989 0.084128 -0.019047 -0.00943904 0.051017 0.0397006 -0.105138 -0.0578371 -0.00961771 -0.0930021 -0.0181065 0.0787227 0.0973515 -0.00588756 -0.0299108 0.0288774 0.101568 -0.0204562 0.192576 -0.201644 0.0141751 -0.158493 0.166972 -0.0437827 0.010382 0.108299 0.0969771 -0.119535 -0.00345656 -0.0374073 0.0654415 -0.132085 -0.085057 -0.057879 0.136787 0.0130755 -0.0361817 0.0436601 0.00776131 -0.0686252 0.0298305 -0.10374 -0.116887 
0.103939 0.0502311 -0.135291 -0.0513007 0.163651 0.200166 0.101802 -0.0734633 -0.195706 0.00942507 -0.0474951 0.104719 0.130406 -0.0786014 -0.0129993 -0.0325032 -0.000497118 0.0681575 -0.0587112 0.144496 0.0867272 -0.00697706 0.019247 0.098935 -0.0310021 0.00795107 -0.138174 -0.188196 0.0526613 0.143146 -0.0358354 0.124407 -0.1472 0.0494206 0.0373189 0.00189708 -0.0585303 0.035477 0.00924272 -0.0636737 0.0532311 -0.0279281 0.027362 0.109282 -0.177287 0.0693678 0.176293 0.0682598 -0.15297 0.0333656 0.0814429 -0.0615818 -0.0408011 -0.030331 0.10055 -0.021886 -0.0331359 0.2138 0.0229627 -0.0825207 -0.0400998 0.085821 0.180311 -0.133413 0.0881071 -0.1074 -0.0162961 0.027114 -0.119211 -0.00669237 0.0227977 0.115939 -0.0258319 0.00350961 -0.0523932 0.0719232 -0.0504162 0.00928589 0.0845 0.0711128 0.0238296 0.039334 -0.00517196 -0.00817738 -0.0487163 -0.0566276 0.0831864 -0.00693862 -0.00537445 0.0374695 0.0522504 -0.0863019 -0.0491644 -0.00749242 -0.0896919 -0.063492 0.072789 0.101248 -0.00828985 -0.0444901 0.0392785 0.103845 -0.0055143 0.166187 -0.206547 0.0385984 -0.137836 0.159771 -0.0149228 0.0322708 0.112323 0.0817734 -0.113213 0.00402762 -0.0304974 0.0640705 -0.138708 -0.0776948 -0.0595886 0.141016 0.00296849 -0.0523698 0.0249325 0.0123593 -0.0873845 0.0458519 -0.107453 -0.0981105 
0.085465 0.0420721 -0.100703 -0.0477323 0.147336 0.168165 0.070147 -0.050571 -0.177059 -0.039527 -0.0718355 0.110315 0.102304 -0.103496 -0.0472948 0.000617802 -0.0325928 0.0404162 -0.109588 0.176258 0.0981369 -0.0095766 0.0566187 0.0683934 -0.0538605 0.0353522 -0.118864 -0.201764 0.0200042 0.0940143 -0.0494209 0.130794 -0.120137 0.0840358 0.0088825 -0.00671772 -0.0462715 0.131241 -0.0336647 -0.0488008 0.0460117 -0.0221291 0.0345104 0.097885 -0.150384 0.0679519 0.197339 0.029893 -0.164641 0.0800507 0.0846469 -0.0933624 -0.0655169 0.005539 0.13494 -0.0401343 -0.0120913 0.189987 0.0337469 -0.120244 -0.0246556 0.0651647 0.167086 -0.112952 0.117189 -0.135497 -0.0305878 0.0342616 -0.102286 0.0217879 0.00969763 0.0966422 0.0023553 0.0382583 -0.0368621 0.0528645 -0.0472333 0.0237619 0.0636359 0.0524807 0.0185059 0.0504884 -0.0153584 -0.0246816 -0.0714596 -0.0639049 0.0865157 0.0415049 0.00345815 0.0389632 0.0444651 -0.114707 -0.0631678 -0.0224379 -0.0797438 -0.00963826 0.0815056 0.103696 -0.00572697 -0.026012 -0.000301564 0.0740841 -0.0379234 0.201702 -0.180183 0.00624961 -0.172235 0.166535 -0.0220522 -0.0208512 0.0857967 0.138996 -0.123979 0.0292987 -0.0148963 0.0487998 -0.140082 -0.0994296 -0.0569639 0.128792 -0.00268256 0.0336132 0.057974 0.0122854 -0.0445336 0.0181621 -0.085709 -0.123004 
0.106454 0.0336983 -0.11934 -0.0488141 0.142255 0.162183 0.0935635 -0.0441767 -0.182151 0.000126631 -0.0456903 0.111143 0.132842 -0.102591 -0.0383535 0.00680869 -0.0309073 0.0604737 -0.11392 0.169058 0.10361 -0.0157605 0.037981 0.104941 -0.0553529 0.00852891 -0.113686 -0.196254 0.0246655 0.140791 -0.0810253 0.118477 -0.131498 0.0764882 -0.00149153 -0.0207245 -0.0680339 0.0792185 -0.0243681 -0.0387091 0.0172678 -0.0388308 0.0393842 0.111875 -0.141513 0.0489094 0.182711 0.0490276 -0.160054 0.0859233 0.116259 -0.104702 -0.0712668 -0.0042393 0.124561 -0.0368967 -0.0259061 0.190699 0.0426402 -0.0957854 -0.014367 0.057263 0.162415 -0.0968058 0.0729296 -0.138119 -0.0415351 0.0363442 -0.112987 -0.0220159 0.00972901 0.105295 -0.00857701 0.00809616 -0.0506433 0.0678822 -0.0291578 0.0144816 0.0721002 0.0698859 0.0505544 0.0260168 -0.0260638 -0.0197822 -0.0785649 -0.0318261 0.0756884 0.00440878 0.0182269 0.0488194 0.0218712 -0.11262 -0.0837688 -0.0018824 -0.0997068 -0.000532519 0.0500305 0.0795783 0.00340732 -0.0316833 0.0348491 0.0707034 -0.0258869 0.187382 -0.189683 0.0048475 -0.182172 0.165352 -0.0331547 -0.00831281 0.0988274 0.128823 -0.102144 0.0107554 -0.0320033 0.0779183 -0.130109 -0.0577187 -0.0785318 0.129229 -0.012225 -0.00603152 0.0546595 0.0214782 -0.068567 0.0317469 -0.106251 -0.126684 
0.0912432 0.037438 -0.124527 -0.0370639 0.169494 0.164061 0.0735537 -0.0857618 -0.15528 -0.00962432 -0.04512 0.112637 0.120917 -0.0905616 -0.0342966 0.00786205 -0.048707 0.0778165 -0.112059 0.169392 0.111755 -0.0268563 0.0545269 0.101987 -0.0309389 0.00156256 -0.1265 -0.208851 0.0120772 0.144647 -0.0528723 0.118101 -0.121743 0.0630139 0.0210862 0.00947995 -0.0672283 0.0705538 -0.0234698 -0.0519272 0.0344237 -0.0213482 0.0412854 0.118509 -0.157951 0.0602169 0.196243 0.0584565 -0.146698 0.0710376 0.0915211 -0.107908 -0.0646986 -0.0125063 0.13943 -0.024794 -0.0278 0.193418 0.0405815 -0.101002 -0.0217485 0.0585655 0.172681 -0.0958449 0.0905095 -0.134099 -0.0469666 0.0560883 -0.0933722 0.0146513 0.0290654 0.125121 -0.00502923 -0.00795764 -0.0494593 0.0727641 -0.0593283 0.0257711 0.0562144 0.0497165 0.0405705 0.0658837 -0.0343854 -0.010979 -0.0932868 -0.0195381 0.0778799 0.0167448 0.00399786 0.0454624 0.0335688 -0.108747 -0.073493 -0.0286974 -0.0961865 -0.0212589 0.0254361 0.0966651 0.0123847 -0.0422737 0.031157 0.0535773 -0.00866494 0.156123 -0.185248 0.0197729 -0.182914 0.160308 -0.0216044 0.0128951 0.0927501 0.119288 -0.106526 0.0111531 -0.0278252 0.0768283 -0.140491 -0.0759636 -0.0746378 0.129827 0.0122832 0.01346 0.0433748 0.0314346 -0.087496 0.0378628 -0.098104 -0.0980442 
0.0969632 0.0470507 -0.122841 -0.0506476 0.155808 0.163717 0.0848671 -0.0504565 -0.169603 -0.00951461 -0.0573384 0.105974 0.120106 -0.104493 -0.0380083 0.0122157 -0.0273796 0.0505005 -0.117635 0.16756 0.096723 -0.0130493 0.0365723 0.0899609 -0.0460984 0.0094626 -0.114295 -0.191142 0.0175203 0.127693 -0.0668399 0.116305 -0.123933 0.073836 0.00564922 -0.0128621 -0.0511079 0.0788879 -0.0300527 -0.0464561 0.0367292 -0.030293 0.0609335 0.115699 -0.140941 0.0657416 0.191965 0.0489605 -0.161024 0.0820647 0.107263 -0.112134 -0.0705621 -0.00603625 0.136585 -0.0338246 -0.0352615 0.185329 0.0498391 -0.109171 -0.0196298 0.0550824 0.156264 -0.101662 0.0832227 -0.134441 -0.0456482 0.0462293 -0.101389 -0.0147615 0.0199235 0.106331 -0.00125421 -0.00157697 -0.0412671 0.080869 -0.0407175 0.0293362 0.0639317 0.0529464 0.0495683 0.0475172 -0.0226753 -0.0090914 -0.0769634 -0.0289276 0.0759324 0.0168207 0.0154479 0.0552172 0.0175223 -0.118124 -0.0884005 -0.0183969 -0.0937339 0.00262146 0.0579728 0.0831807 -0.00504377 -0.0383981 0.0228617 0.0637907 -0.0156184 0.179048 -0.203678 0.00656693 -0.190069 0.1666 -0.0419053 -0.00441762 0.10513 0.12438 -0.107093 0.0187429 -0.0334467 0.0600716 -0.146913 -0.069587 -0.0804838 0.119299 0.000144589 0.0141325 0.063868 0.0271691 -0.0613507 0.02105 -0.103206 -0.126245 
0.0875817 0.0514104 -0.134596 -0.0456496 0.167778 0.168069 0.0661843 -0.0778545 -0.163017 -0.0023469 -0.0326774 0.113347 0.12172 -0.0758767 -0.0352891 -0.000212669 -0.0285653 0.074505 -0.105315 0.162428 0.105338 -0.0266272 0.0401674 0.112286 -0.0156476 0.00207228 -0.102802 -0.18554 0.0248036 0.1413 -0.048412 0.105583 -0.119316 0.0591708 0.00368593 0.0134791 -0.0748577 0.0529177 -0.0249104 -0.0434015 0.0419408 -0.0210812 0.0480494 0.132029 -0.15971 0.0569677 0.201003 0.0578115 -0.154174 0.059458 0.0940702 -0.0927746 -0.0734738 -0.0235273 0.130536 -0.0127482 -0.0473381 0.207854 0.0485483 -0.108368 -0.0353821 0.0567339 0.18065 -0.0950293 0.0723254 -0.118199 -0.0400674 0.0575349 -0.0952532 0.0190367 0.0363456 0.126935 -0.00508407 -0.016613 -0.0360612 0.0757459 -0.0596358 0.0330402 0.0516959 0.0459721 0.0294897 0.0715958 -0.0226633 -0.0144888 -0.091897 -0.016207 0.0800431 0.0119951 0.0133474 0.0422582 0.0251008 -0.113632 -0.0760457 -0.0271178 -0.082533 -0.0322707 0.028833 0.0945042 0.00398514 -0.0589187 0.0162221 0.0581299 0.00327669 0.161028 -0.208392 0.0369328 -0.19147 0.160259 -0.0291801 -0.00512714 0.106892 0.119561 -0.11155 0.0227458 -0.0300658 0.0591274 -0.147648 -0.083474 -0.0581354 0.131672 0.0138678 0.00147706 0.0352532 0.0308668 -0.0920578 0.0386505 -0.0990076 -0.0953153 
0.10314 0.0587963 -0.132363 -0.0504191 0.170173 0.170147 0.0724659 -0.0710414 -0.178706 0.0145198 -0.0329254 0.0999939 0.130611 -0.0745865 -0.0290443 0.00590549 -0.00873855 0.0814737 -0.101332 0.160338 0.106007 -0.0118623 0.0421687 0.101593 -0.0245508 0.00247692 -0.110127 -0.183253 0.0370961 0.14637 -0.0613735 0.116129 -0.12281 0.0591591 0.0118435 -0.00155523 -0.0656801 0.0619543 -0.0129263 -0.0474853 0.0261945 -0.0206097 0.0448434 0.123258 -0.161247 0.0655831 0.192797 0.0641355 -0.157737 0.057811 0.112525 -0.0747895 -0.0743738 -0.0177803 0.121169 -0.0282871 -0.0241734 0.19124 0.054333 -0.108377 -0.0268103 0.053263 0.167495 -0.0976293 0.0706835 -0.129247 -0.0390007 0.0637929 -0.0927305 0.0125376 0.0358201 0.123165 -0.00824249 -0.021167 -0.0466004 0.0727357 -0.0559089 0.0362203 0.0588844 0.0501999 0.0426796 0.0686241 -0.0174779 -0.0103984 -0.0716255 -0.0262189 0.074893 0.0117241 0.017297 0.0473144 0.0201466 -0.105208 -0.0825303 -0.0175501 -0.091017 -0.0371906 0.0410692 0.101575 -0.00287814 -0.0589757 0.035743 0.0777006 0.00284582 0.172058 -0.205608 0.023331 -0.183917 0.158892 -0.0109519 8.33129e-05 0.106724 0.116601 -0.111827 0.0255735 -0.0291721 0.0616563 -0.15197 -0.0832672 -0.075211 0.123566 0.00611106 -0.00234567 0.0459631 0.0247509 -0.0802279 0.0334281 -0.09842 -0.0998116 
0.0682618 0.0301308 -0.138529 -0.0376095 0.167072 0.180447 0.0616147 -0.105663 -0.174432 -0.0175202 -0.0473685 0.128319 0.117941 -0.0563315 -0.0417538 -0.0184954 -0.035634 0.0785751 -0.0567828 0.157186 0.107882 -0.046044 0.04956 0.10787 -0.0128121 0.0150721 -0.111629 -0.204683 0.0136303 0.148085 -0.0376998 0.108879 -0.109258 0.042816 0.0264806 0.0282821 -0.0745858 0.0418274 -0.0151708 -0.0682174 0.0499169 -0.0214493 0.0483982 0.116194 -0.17671 0.0651354 0.210858 0.0444102 -0.15393 0.0344843 0.0622374 -0.106083 -0.0256289 -0.0235576 0.137832 0.00518623 -0.0289557 0.221287 0.0220132 -0.0997592 -0.0313679 0.0882365 0.197389 -0.113324 0.111835 -0.0882084 -0.0446881 0.0449889 -0.103981 0.0252211 0.0258722 0.119331 -0.0257933 -0.0229727 -0.0298586 0.0918744 -0.0573801 0.00941245 0.0615053 0.038745 -0.00154031 0.0654883 -0.025112 -0.0117458 -0.100593 -0.0261508 0.0807413 0.0152171 -0.00763119 0.0361687 0.0460854 -0.0995895 -0.0432271 -0.0199486 -0.0809381 -0.0405511 0.0282981 0.124358 0.0170048 -0.0434787 0.0295162 0.0613444 -0.00508301 0.14216 -0.186523 0.0558845 -0.161526 0.146109 -0.0487386 0.00609226 0.0891451 0.0929023 -0.0967443 -0.00437669 -0.0277459 0.0750458 -0.146108 -0.0826699 -0.0460223 0.146338 0.0156321 -0.0327888 0.0162291 0.000274797 -0.107254 0.0782769 -0.10014 -0.080327 
