{
  "descriptor": [
    -0.06502673029899597,
    0.10737551003694534,
    0.1133463978767395,
    -0.04769743233919144,
    -0.16548268496990204,
    0.05438059940934181,
    -0.055500078946352005,
    -0.04444136843085289,
    0.15502020716667175,
    -0.13972166180610657,
    0.1723397672176361,
    -0.03428168222308159,
    -0.23412485420703888,
    0.08974457532167435,
    -0.043881285935640335,
    0.18252137303352356,
    -0.22876019775867462,
    -0.17386968433856964,
    -0.05050430819392204,
    -0.04026411473751068,
    -0.025607099756598473,
    0.11823529005050659,
    -0.00906547624617815,
    0.06302013248205185,
    -0.1902417689561844,
    -0.41382452845573425,
    -0.06513421982526779,
    -0.05426912382245064,
    0.050826866179704666,
    -0.06980690360069275,
    -0.08292214572429657,
    0.11228523403406143,
    -0.09916647523641586,
    0.05704691633582115,
    0.10884720087051392,
    0.06534212827682495,
    -0.060837700963020325,
    -0.14980235695838928,
    0.21244680881500244,
    0.09069650620222092,
    -0.26384249329566956,
    -0.00620909733697772,
    0.09061717987060547,
    0.27867093682289124,
    0.21546298265457153,
    -0.03229428827762604,
    0.037993788719177246,
    -0.06676407158374786,
    0.17003874480724335,
    -0.2881055176258087,
    0.027424639090895653,
    0.22172293066978455,
    0.014900526031851768,
    0.08591695129871368,
    0.09599757939577103,
    -0.10188083350658417,
    -0.030092084780335426,
    0.11918066442012787,
    -0.10093511641025543,
    0.005502683110535145,
    0.07919901609420776,
    -0.08140360563993454,
    0.017421282827854156,
    -0.0992656797170639,
    0.14801175892353058,
    0.05132846534252167,
    -0.11934423446655273,
    -0.12721605598926544,
    0.1789509803056717,
    -0.15954139828681946,
    -0.1136811301112175,
    0.02052266150712967,
    -0.13325700163841248,
    -0.16605494916439056,
    -0.24324358999729156,
    0.04136158153414726,
    0.3710847496986389,
    0.18046462535858154,
    -0.11142398416996002,
    0.07653781026601791,
    0.03670379891991615,
    -0.046668920665979385,
    0.023133566603064537,
    0.1863526850938797,
    -0.09992872923612595,
    0.003223240841180086,
    -0.03913092985749245,
    0.052476752549409866,
    0.26447027921676636,
    0.01644798368215561,
    0.02100534737110138,
    0.22603240609169006,
    -0.005746733862906694,
    0.009686737321317196,
    0.09316251426935196,
    0.07137775421142578,
    -0.15107937157154083,
    -0.08437997102737427,
    -0.1838385909795761,
    -0.03295188024640083,
    0.004713277332484722,
    -0.035687901079654694,
    -0.033224452286958694,
    0.1890190839767456,
    -0.19678495824337006,
    0.16689515113830566,
    -0.06747303903102875,
    -0.08124896883964539,
    0.0029320602770894766,
    -0.0007321392185986042,
    -0.0682767853140831,
    -0.02890768088400364,
    0.12779709696769714,
    -0.1814400851726532,
    0.08315334469079971,
    0.14183078706264496,
    0.07045697420835495,
    0.13203741610050201,
    0.09578950703144073,
    0.008939707651734352,
    -0.008925105445086956,
    -0.029575824737548828,
    -0.14247678220272064,
    -0.13255228102207184,
    0.08824300765991211,
    -0.04899369552731514,
    -0.014201324433088303,
    -0.03755837678909302
  ]
}