0.0911925 -0.0378048 -0.0915359 0.0462833 0.101025 0.0645434 0.0687813 0.0665721 0.0173195 -0.0565149 0.0619354 0.138553 0.101428 -0.180266 -0.141769 -0.0071506 -0.00354429 0.0727095 -0.238064 0.212242 0.152063 -0.129562 0.0521122 0.195671 -0.0376357 -0.0652286 -0.0306048 -0.190954 0.0136316 0.0321196 -0.00487333 0.107463 -0.0235292 0.121858 -0.143161 -0.0663451 -0.114326 0.119923 -0.15528 -0.0406175 0.0733243 -0.0726447 -0.0895103 0.136411 -0.106126 -0.10487 0.0675105 0.0119332 -0.0705377 0.0708726 0.0515191 -0.073898 -0.0836728 -0.0647237 0.0437345 -0.00457073 -0.0560888 0.0780258 0.0478247 -0.0922443 -0.0535998 -0.0548249 0.1111 -0.010567 -0.0282675 -0.159485 -0.0208943 -0.00220968 -0.0647346 0.00778928 -0.0437384 0.00503675 -0.0201505 0.00617458 -0.0371501 -0.0143303 -0.000441332 0.113392 -0.0368896 0.10131 -0.114661 0.0114141 -0.0286914 -0.067969 -0.0284396 0.0683517 0.118916 0.0404159 -0.00306419 -0.0318389 0.0274283 -0.117659 -0.123601 -0.0242986 -0.034583 -0.0161358 -0.0379842 -0.0328561 -0.0177524 -0.0735313 0.0306833 -0.0418444 -0.0177591 0.197364 -0.0522105 -0.0351611 -0.122933 0.153851 0.0368392 -0.112083 -0.0175813 0.192154 -0.105555 0.0100331 0.0326934 0.0267866 -0.132433 -0.110991 0.0447727 0.164384 -0.0540889 0.114496 -0.0833537 0.112735 -0.0349533 -0.00992528 -0.0652786 -0.0775449 
0.0821607 -0.028355 -0.0996318 0.0318412 0.101931 0.0654868 0.0521084 0.0574622 0.00675722 -0.0611872 0.0647828 0.127612 0.107632 -0.174467 -0.15685 0.00660358 -0.0211907 0.0698337 -0.232514 0.216604 0.173879 -0.145009 0.0563291 0.182812 -0.0287471 -0.0593631 -0.0270186 -0.184957 0.0275195 0.0407374 -0.00603029 0.0887446 -0.0310737 0.113046 -0.138093 -0.0612576 -0.126648 0.119619 -0.137123 -0.0474945 0.0607137 -0.0769547 -0.0757222 0.144742 -0.090888 -0.102923 0.0824304 0.0199255 -0.0843119 0.0682162 0.0328535 -0.0686429 -0.08913 -0.0597269 0.0439074 -0.00804225 -0.0546221 0.0851984 0.0409566 -0.108289 -0.0402542 -0.0462539 0.136746 0.00390148 -0.0293796 -0.151282 -0.032357 0.00575776 -0.0545296 0.00485622 -0.0466349 0.0115892 -0.0249145 0.000623703 -0.0346415 -0.0201837 0.00181781 0.117295 -0.032406 0.105697 -0.108791 0.00987821 -0.0286209 -0.0621259 -0.0473713 0.0746545 0.109181 0.0500216 0.0138074 -0.0360163 0.0378652 -0.120482 -0.122271 -0.018901 -0.0325878 -0.0258504 -0.0444671 -0.00858544 -0.0166613 -0.0795267 0.0307772 -0.0443289 -0.0236021 0.194154 -0.0493076 -0.0166289 -0.121647 0.170613 0.0417833 -0.119149 -0.0206559 0.186734 -0.11361 0.0231421 0.0349239 0.0367359 -0.133954 -0.09691 0.0469194 0.161769 -0.0658904 0.11136 -0.0799462 0.103393 -0.0604499 -0.000577283 -0.0696866 -0.0721282 
0.0876166 -0.0303221 -0.0945082 0.0210896 0.111189 0.0864832 0.0493575 0.0583662 -0.00176078 -0.062308 0.0667237 0.121423 0.108964 -0.167457 -0.148342 0.00606604 -0.0364705 0.0720487 -0.232821 0.215937 0.183928 -0.143307 0.068532 0.181871 -0.0246321 -0.0672103 -0.0329759 -0.185354 0.0327058 0.0349611 -0.00143445 0.0673284 -0.04567 0.111638 -0.130993 -0.048879 -0.137733 0.115579 -0.130453 -0.0476945 0.0543328 -0.070899 -0.0834472 0.143827 -0.098536 -0.111377 0.0803062 0.0306597 -0.0859564 0.083227 0.0237952 -0.0689707 -0.0984591 -0.0568079 0.0453753 -0.0108922 -0.0512015 0.10162 0.0319959 -0.11225 -0.0416298 -0.0355329 0.15777 -0.000258745 -0.0241267 -0.146048 -0.0359374 0.0171006 -0.0546409 0.0242528 -0.0365231 0.0328354 -0.0242494 0.00352019 -0.0393108 -0.025035 -0.000496498 0.110999 -0.0228215 0.10416 -0.101782 0.00831367 -0.0231639 -0.061169 -0.0560851 0.0732707 0.109791 0.0611208 0.0219807 -0.0304651 0.0578764 -0.123249 -0.119995 -0.0152986 -0.0301861 -0.0384003 -0.0528895 0.00281966 -0.0216233 -0.0730711 0.0344979 -0.0412316 -0.0323958 0.177708 -0.0470948 0.00035563 -0.121284 0.159975 0.0505513 -0.117344 -0.0163939 0.191847 -0.10561 0.0342372 0.0457822 0.0506652 -0.125359 -0.0827847 0.0432171 0.16753 -0.0665218 0.0989119 -0.074242 0.10123 -0.0741614 0.00819955 -0.0611429 -0.0602048 
0.120089 -0.0460813 -0.105918 0.0512696 0.111591 0.0918081 0.0760761 0.0516392 -0.000267616 -0.0638866 0.0793252 0.135318 0.107779 -0.165798 -0.123857 -0.0248346 -0.0127323 0.06901 -0.22366 0.218111 0.155025 -0.122651 0.0663298 0.202031 -0.0225852 -0.079615 -0.0384809 -0.196136 0.00734852 0.0436195 -0.00905578 0.0764266 -0.0457414 0.12307 -0.13132 -0.0493189 -0.125283 0.106537 -0.142933 -0.0449755 0.0656682 -0.0621125 -0.10281 0.141077 -0.131505 -0.108989 0.0645806 0.0299079 -0.0602108 0.0978497 0.0443837 -0.0628588 -0.0904814 -0.0557212 0.0544346 -0.0154625 -0.0572107 0.104586 0.0412756 -0.0865602 -0.0570798 -0.041808 0.14462 -0.0234936 -0.0337345 -0.154739 -0.0101864 0.00851893 -0.0650237 0.0231949 -0.0327954 0.0375771 -0.0172692 0.018 -0.0451827 -0.0234234 -0.00503624 0.0909349 -0.0237001 0.122402 -0.104963 0.00114773 -0.0252199 -0.0801278 -0.0324715 0.0655266 0.116355 0.0324301 -0.000356139 -0.0313561 0.0598823 -0.123068 -0.111291 -0.0262494 -0.0441548 -0.05298 -0.0447711 -0.0286528 -0.00880775 -0.0787308 0.0319054 -0.016777 -0.00668257 0.175113 -0.0634957 -0.0148876 -0.116571 0.155507 0.0466568 -0.0939542 0.00467405 0.191309 -0.0966093 0.0176785 0.0335439 0.0491811 -0.108913 -0.0985129 0.0412009 0.171738 -0.0548339 0.0895568 -0.0824252 0.119952 -0.0548489 -0.0036188 -0.0471358 -0.0544102 
0.10707 -0.0288777 -0.104054 0.0391378 0.111863 0.0905483 0.0653794 0.0427854 -0.0212164 -0.0494795 0.0861135 0.128887 0.120061 -0.144591 -0.137538 -0.00142951 -0.0124035 0.0752918 -0.223978 0.219509 0.172805 -0.151471 0.0783393 0.177386 -0.0182784 -0.0716054 -0.044345 -0.179809 0.0293953 0.0471515 -0.0174468 0.0844589 -0.0437715 0.119255 -0.140178 -0.0514072 -0.134912 0.129048 -0.116211 -0.0508132 0.045406 -0.0673862 -0.0879856 0.121271 -0.121909 -0.117142 0.0710943 0.0243208 -0.0801186 0.0903969 0.0404024 -0.0527885 -0.108018 -0.0455768 0.0462444 -0.0166753 -0.0440969 0.108307 0.0285852 -0.0900459 -0.0503846 -0.0403045 0.161339 -0.0258882 -0.0174549 -0.129496 -0.0361912 0.0243405 -0.0749187 0.0335122 -0.0315571 0.0441009 -0.0276249 0.0218469 -0.0367248 -0.0256814 0.0136266 0.088103 -0.0238401 0.104304 -0.116427 -0.0101393 -0.0140943 -0.0696282 -0.054428 0.0672298 0.108519 0.0451044 0.0224134 -0.0346493 0.0550248 -0.135463 -0.105339 -0.0111885 -0.032133 -0.0605333 -0.0486192 0.00316758 -0.0139676 -0.0692358 0.0324717 -0.0200736 -0.0234948 0.192776 -0.0429383 0.00779271 -0.112578 0.167397 0.06284 -0.124191 -0.0232762 0.191043 -0.0946727 0.0409769 0.0533496 0.0469933 -0.10725 -0.0755301 0.0523929 0.181701 -0.0681387 0.0810613 -0.0774809 0.105827 -0.0602303 0.0122513 -0.0456221 -0.0492697 
0.0979579 -0.0287692 -0.0950791 0.0244092 0.112712 0.0945696 0.0582002 0.0438123 -0.0260691 -0.0404897 0.080514 0.119347 0.117847 -0.139538 -0.128223 0.00679832 -0.0306345 0.0745867 -0.217769 0.210383 0.18065 -0.153258 0.084744 0.176936 -0.0129038 -0.0566743 -0.0419396 -0.185291 0.0389635 0.0374383 -0.00803676 0.0715198 -0.0522126 0.112342 -0.128865 -0.0418048 -0.142117 0.138281 -0.111574 -0.0526441 0.0422569 -0.0645548 -0.0915023 0.131763 -0.117029 -0.114073 0.0782409 0.0296076 -0.0870882 0.0828502 0.030653 -0.0565849 -0.112077 -0.0480364 0.0538227 -0.0137732 -0.0394172 0.121772 0.0297993 -0.105051 -0.0458436 -0.0418045 0.173175 -0.0146032 -0.00851889 -0.121961 -0.0434697 0.0377908 -0.061623 0.048681 -0.0321227 0.0585439 -0.0289595 0.0189012 -0.0343021 -0.0359788 0.000679235 0.0990196 -0.0146172 0.0968532 -0.112404 -0.00100914 -0.0156333 -0.074394 -0.0660047 0.0526094 0.112236 0.0600303 0.0317951 -0.0364509 0.0647118 -0.124568 -0.103489 -0.0193088 -0.0291827 -0.0589811 -0.048304 0.0182387 -0.00925878 -0.0702144 0.0306498 -0.0275731 -0.0276924 0.17748 -0.0460473 0.0108164 -0.119761 0.158774 0.0754323 -0.12996 -0.0211669 0.2047 -0.0952989 0.0380593 0.0697578 0.0540775 -0.108868 -0.0839056 0.0480761 0.17872 -0.0584444 0.0821866 -0.0694257 0.104878 -0.0790969 0.0173161 -0.0443852 -0.0410996 
0.0919158 -0.0314752 -0.0848105 0.0304883 0.116285 0.0862067 0.0577234 0.0429566 -0.0211212 -0.037743 0.0889152 0.128202 0.123423 -0.132074 -0.131847 0.0139679 -0.0299682 0.0824203 -0.222125 0.210133 0.195192 -0.162934 0.0800551 0.175499 -0.00556536 -0.066082 -0.0483782 -0.177692 0.0388555 0.0539805 -0.00958127 0.0754025 -0.0437262 0.113042 -0.133247 -0.0443318 -0.14946 0.128384 -0.100004 -0.0518341 0.0375252 -0.0653922 -0.0818425 0.118461 -0.110535 -0.131355 0.0722986 0.0183197 -0.0796938 0.0766774 0.0359053 -0.0575432 -0.115998 -0.0473799 0.0480896 -0.00777122 -0.0451742 0.1171 0.014607 -0.0898285 -0.0444158 -0.049027 0.164687 -0.0137394 -0.00771386 -0.118177 -0.052935 0.0361289 -0.0721667 0.0429811 -0.025093 0.0602774 -0.0363388 0.00546696 -0.0372576 -0.0248151 0.0140908 0.0897464 -0.0200025 0.100987 -0.117656 -0.0108763 -0.00509296 -0.0580491 -0.0715968 0.0636715 0.114285 0.0582422 0.0329887 -0.0388785 0.049229 -0.133124 -0.105447 0.000554964 -0.0352103 -0.059972 -0.0646847 0.0147583 -0.0134794 -0.0613887 0.0333172 -0.0337093 -0.0345568 0.182301 -0.0293398 0.0211684 -0.113116 0.159557 0.0770174 -0.139331 -0.044384 0.187631 -0.100551 0.0453148 0.0740088 0.0596955 -0.104311 -0.0620476 0.0481693 0.189886 -0.0634028 0.0789758 -0.0823868 0.0980386 -0.0723251 0.0285669 -0.0396707 -0.03523 
0.0945533 -0.0206923 -0.0974506 0.0298435 0.112033 0.0862736 0.0598796 0.0360774 -0.0179511 -0.0417924 0.0868557 0.131423 0.12075 -0.14213 -0.137579 0.00729477 -0.0296421 0.0779142 -0.227028 0.212376 0.179811 -0.150799 0.0789468 0.177576 -0.0155221 -0.0654771 -0.0393994 -0.178951 0.0361942 0.0552888 -0.0179491 0.0791176 -0.0407297 0.11333 -0.134834 -0.049255 -0.140028 0.129338 -0.113206 -0.0441406 0.0422566 -0.0695544 -0.0838825 0.127536 -0.118626 -0.114619 0.0780379 0.0229701 -0.085109 0.0830775 0.0405587 -0.0542885 -0.113919 -0.0474825 0.0502655 -0.00961101 -0.0461551 0.113686 0.0243142 -0.0908444 -0.0497155 -0.0478011 0.166736 -0.0148336 -0.0116088 -0.130216 -0.045237 0.0297152 -0.0734714 0.039368 -0.0293596 0.0481559 -0.029498 0.012341 -0.0308847 -0.0212946 0.00497284 0.0913914 -0.0250231 0.100661 -0.109771 -0.00580352 -0.0117542 -0.0599999 -0.066679 0.0666342 0.111336 0.0465124 0.0230878 -0.031518 0.0472906 -0.136522 -0.107987 -0.0101303 -0.0358033 -0.0595154 -0.0580804 0.00976375 -0.00505232 -0.0695299 0.033274 -0.0274256 -0.0252297 0.186794 -0.0423728 0.00992895 -0.117291 0.169631 0.0654657 -0.129953 -0.0265002 0.191126 -0.0976926 0.0406936 0.0560994 0.0541339 -0.112391 -0.0704401 0.0493309 0.184191 -0.0596458 0.0804929 -0.0809745 0.102255 -0.0683369 0.0222884 -0.0470054 -0.0427633 
0.122375 -0.0197389 -0.0884332 0.0293083 0.119918 0.10634 0.0831587 0.0419049 -0.0224586 -0.041985 0.089891 0.11588 0.123394 -0.130572 -0.0974916 -0.00474737 -0.0106551 0.0649724 -0.225262 0.200535 0.17917 -0.128813 0.0658248 0.181643 -0.0029124 -0.0696 -0.0614245 -0.181661 0.0435062 0.0580523 -0.0007432 0.0852275 -0.0628599 0.126771 -0.118088 -0.0435429 -0.128838 0.137501 -0.0975129 -0.0533408 0.0475304 -0.055402 -0.0908467 0.123542 -0.119794 -0.109298 0.0636764 0.0331998 -0.0826094 0.0749255 0.0377269 -0.0442894 -0.113216 -0.052238 0.0562978 -0.0150347 -0.0644722 0.135023 0.0209545 -0.0963888 -0.0606535 -0.0506799 0.166165 -0.0400403 -0.0137377 -0.115135 -0.0276687 0.0429447 -0.0786355 0.0376232 -0.0185343 0.0639145 -0.0345054 0.0146446 -0.0400038 -0.0342219 0.00211582 0.0794852 -0.00783101 0.117858 -0.0997922 -0.00560797 -0.00803983 -0.0821334 -0.0470237 0.0363321 0.118061 0.0378676 0.023119 -0.02532 0.0683942 -0.139026 -0.105974 -0.0102925 -0.0424176 -0.0650255 -0.0403071 -0.00607698 -0.0108636 -0.066489 0.0300859 -0.0109038 -0.0250296 0.184812 -0.0756359 0.0107576 -0.12045 0.158047 0.0850796 -0.124677 -0.00467724 0.195205 -0.11811 0.0416124 0.0780781 0.0560049 -0.113968 -0.0834957 0.038561 0.182748 -0.0477997 0.0787362 -0.0692331 0.12405 -0.0566439 0.00592502 -0.0305424 -0.0506141 
0.130319 -0.0413949 -0.10554 0.0487582 0.128731 0.102173 0.0978829 0.0387377 -0.0165326 -0.0509334 0.0804939 0.129949 0.117181 -0.15358 -0.098177 -0.0166203 -0.0149951 0.0774213 -0.220895 0.211222 0.166798 -0.12159 0.0687921 0.189025 -0.0139342 -0.0888809 -0.0671456 -0.204525 0.015156 0.0665639 -0.0118462 0.0967571 -0.0606812 0.129203 -0.111531 -0.0470822 -0.117158 0.105513 -0.119311 -0.0552458 0.0627318 -0.0581767 -0.0881761 0.129956 -0.140812 -0.106348 0.0663436 0.037028 -0.0611355 0.0925251 0.0461479 -0.0726905 -0.100476 -0.0525766 0.0597739 -0.0167725 -0.0596048 0.119566 0.0283277 -0.0739508 -0.0554658 -0.0422118 0.149436 -0.0431786 -0.0158988 -0.141621 -0.02218 0.0142528 -0.0783924 0.0244501 -0.0295573 0.0609008 -0.024401 0.0181233 -0.0578517 -0.0254908 0.0027719 0.0774381 -0.015447 0.118003 -0.091401 -0.00408742 -0.0273737 -0.0780853 -0.0375495 0.0575337 0.112212 0.0240473 -0.000519028 -0.021971 0.0743161 -0.129836 -0.115242 -0.026859 -0.0542301 -0.0569034 -0.0496574 -0.0190861 -0.00441809 -0.0633054 0.0352279 -0.0153644 -0.00790378 0.176014 -0.0665462 -0.00734734 -0.116176 0.164291 0.0590455 -0.0856815 -0.00228902 0.182907 -0.10285 0.0180392 0.0471403 0.056603 -0.0942609 -0.086332 0.0310239 0.181214 -0.0442933 0.0826488 -0.075147 0.13229 -0.0584793 -0.00473046 -0.0454963 -0.0560014 
0.137418 -0.0251776 -0.112011 0.0327947 0.124217 0.114056 0.10068 0.0517527 -0.014917 -0.0610585 0.0791263 0.127887 0.11289 -0.156405 -0.102574 -0.0208234 -0.0130107 0.0473033 -0.224504 0.205042 0.157526 -0.109851 0.0541516 0.173439 -0.0146373 -0.0788825 -0.0561102 -0.187524 0.0240935 0.057456 -0.00898965 0.0905778 -0.0651314 0.13056 -0.12245 -0.0529797 -0.111272 0.111772 -0.113079 -0.047025 0.0689337 -0.0608767 -0.0816451 0.132609 -0.131952 -0.0999767 0.0653194 0.0320757 -0.0742015 0.0956849 0.03826 -0.0556749 -0.105698 -0.0485297 0.0595753 -0.0196966 -0.076615 0.129776 0.021528 -0.082301 -0.0663949 -0.046483 0.164622 -0.0519763 -0.0245854 -0.133107 -0.0152416 0.0203473 -0.0778024 0.0188043 -0.0237119 0.0551601 -0.0266366 0.0278354 -0.0446621 -0.0226135 0.00363604 0.0703078 -0.016498 0.125135 -0.089562 -0.00667057 -0.0119553 -0.0753986 -0.0313917 0.0493698 0.117178 0.0250774 0.00992132 -0.0177578 0.0740536 -0.14424 -0.123771 -0.0176375 -0.0415708 -0.0578595 -0.0290654 -0.0270635 -0.0121629 -0.066654 0.0196902 -0.00942043 -0.013207 0.184712 -0.0949377 0.000523359 -0.122358 0.171745 0.0523424 -0.0998373 0.0188807 0.18445 -0.113485 0.0296844 0.054906 0.0461994 -0.104549 -0.0860898 0.0429282 0.177889 -0.0403177 0.0823284 -0.0599485 0.132326 -0.0452074 -0.0150498 -0.0349122 -0.0604319 
0.1239 -0.0298355 -0.123071 0.0394001 0.136019 0.0931682 0.0978848 0.0481988 -0.0304924 -0.0364818 0.0676494 0.120977 0.123695 -0.154672 -0.0976494 -0.00577617 0.00379195 0.0731503 -0.214882 0.212324 0.157931 -0.126161 0.0600707 0.189092 -0.0125852 -0.0911987 -0.0699086 -0.199057 0.0263996 0.0675011 -0.00947202 0.102747 -0.0655115 0.118639 -0.125174 -0.048007 -0.122057 0.0841444 -0.125822 -0.0469914 0.0659941 -0.0557076 -0.0708029 0.141753 -0.12963 -0.0874967 0.0787594 0.0415968 -0.0676181 0.0775562 0.0538349 -0.0829115 -0.103103 -0.0698121 0.0451048 -0.0121635 -0.0662052 0.122586 0.0553131 -0.0710249 -0.0519633 -0.0291285 0.131684 -0.037951 -0.0239333 -0.14812 -0.0269087 0.00780751 -0.0733503 -0.00119118 -0.030594 0.0630199 -0.021537 0.00889709 -0.0566437 -0.0119905 0.00427853 0.0964329 -0.0184404 0.109493 -0.0834887 -0.00433282 -0.036556 -0.0665574 -0.0373304 0.0723553 0.107502 0.0141 -0.00546883 -0.0320093 0.0557997 -0.114662 -0.127503 -0.0343491 -0.0461399 -0.0405215 -0.0410265 -0.0143125 -0.0171238 -0.0648042 0.0252849 -0.0209513 0.00324432 0.187285 -0.0919941 -0.00974376 -0.133044 0.175072 0.0524486 -0.081871 0.00344959 0.175786 -0.105608 0.0131908 0.0264202 0.0475425 -0.105916 -0.0875122 0.0214614 0.172979 -0.0543429 0.0828819 -0.0772079 0.132337 -0.0740918 -0.0116695 -0.0823747 -0.070052 
0.129698 -0.0170538 -0.110433 0.0385142 0.123916 0.116614 0.100478 0.0426868 -0.00580043 -0.0457139 0.0888783 0.123709 0.116239 -0.171827 -0.102523 -0.00997409 -0.0292181 0.0675783 -0.228208 0.197326 0.169196 -0.115085 0.0534063 0.175101 -0.0120856 -0.0897136 -0.0712153 -0.202128 0.0297525 0.0722181 -0.00238503 0.0998146 -0.0708854 0.125517 -0.113527 -0.0557611 -0.114399 0.0945409 -0.0937676 -0.0371775 0.0669113 -0.070251 -0.0833907 0.129032 -0.127368 -0.117693 0.0653301 0.0361154 -0.0666405 0.0859847 0.0441 -0.0523526 -0.110166 -0.0501353 0.0423632 -0.0138045 -0.0634202 0.116915 0.0167254 -0.0705877 -0.063805 -0.0511147 0.160306 -0.0495215 -0.0286914 -0.143054 -0.0133365 0.0100173 -0.0748335 0.017163 -0.0295298 0.0661539 -0.0309242 0.0261988 -0.0523299 -0.0328706 -0.000291697 0.0740811 -0.0248021 0.133354 -0.0822216 -0.00415792 -0.0132055 -0.0609118 -0.0350262 0.0716093 0.114315 0.0163528 0.00504819 -0.0287608 0.0675601 -0.13979 -0.12665 -0.0143968 -0.0528723 -0.0640935 -0.0496279 -0.023018 -0.0127166 -0.057268 0.0283346 -0.0202783 -0.0132937 0.189171 -0.0663265 -0.000817655 -0.109812 0.180839 0.0570669 -0.0848048 -0.00324486 0.173494 -0.114389 0.023405 0.0495987 0.0533111 -0.101588 -0.0745381 0.0398659 0.177434 -0.0349925 0.0793491 -0.0666492 0.132401 -0.0546491 -0.0124976 -0.0460998 -0.0477014 
0.126921 0.0107329 -0.106292 0.0246587 0.114363 0.0976324 0.0953952 0.0505561 -0.000275421 -0.0487156 0.0740533 0.106809 0.107531 -0.200699 -0.0964845 -0.0134576 -0.0533556 0.0277524 -0.242627 0.209569 0.138659 -0.0868801 0.0419996 0.128836 -0.0253289 -0.0758847 -0.0781053 -0.183224 0.036095 0.0568616 -0.00400888 0.0911455 -0.0779359 0.117275 -0.105703 -0.0624338 -0.106336 0.109308 -0.0984576 -0.0238182 0.0651476 -0.0738625 -0.0823139 0.151276 -0.123702 -0.0901429 0.0645617 0.0501774 -0.0562894 0.107822 0.0375562 -0.0310233 -0.130333 -0.0472732 0.0399232 -0.0505721 -0.0864956 0.0876337 0.0231874 -0.0816217 -0.0673538 -0.072176 0.150662 -0.0102079 -0.0458949 -0.173853 0.00827571 0.00659941 -0.0503948 -0.0146 -0.011014 0.0662101 0.00302776 0.0514137 -0.0516283 -0.0440164 -0.0295273 0.0641672 -0.0198016 0.164575 -0.0383978 -0.00956851 -0.0145757 -0.0415333 -0.0117806 0.0511293 0.104578 0.0296905 0.0236345 -0.0250054 0.056161 -0.1257 -0.144087 -0.0180102 -0.0726663 -0.0777531 -0.0245743 -0.0432364 -0.0210038 -0.0794126 0.00411689 -0.00859166 -0.00210384 0.178939 -0.100776 -0.0135457 -0.108443 0.216312 0.0844021 -0.0578487 0.0328355 0.178203 -0.148172 0.0423067 0.0246307 0.0384936 -0.106589 -0.0724451 0.0273842 0.147325 -0.0432797 0.10847 -0.0423042 0.145817 -0.0321748 -0.0539254 -0.0315416 -0.055587 
0.133397 -0.031027 -0.104927 0.0462085 0.115508 0.116247 0.103631 0.0327197 -0.014883 -0.039223 0.100338 0.119089 0.128577 -0.145094 -0.101237 -0.0055677 -0.0171222 0.0805408 -0.221521 0.195042 0.178247 -0.128588 0.0634149 0.18867 -0.0130572 -0.0896707 -0.0775503 -0.204174 0.0341452 0.0757338 -0.00627278 0.111063 -0.0719818 0.127739 -0.116289 -0.0493691 -0.120427 0.108934 -0.0841456 -0.0406145 0.0529022 -0.0680696 -0.0957924 0.109321 -0.125634 -0.127578 0.0569005 0.0352395 -0.0677151 0.0755002 0.0410709 -0.0521026 -0.102469 -0.0436664 0.0382554 -0.00921177 -0.0457635 0.127438 0.01481 -0.0635391 -0.0610446 -0.0395282 0.16309 -0.0606682 -0.0234679 -0.119413 -0.0150904 0.0156657 -0.0823275 0.0258404 -0.0371955 0.0660433 -0.0410585 0.0318337 -0.0501482 -0.0414645 0.0155996 0.0662713 -0.0204357 0.124848 -0.0902854 -0.0130378 -0.0194135 -0.0818514 -0.0445405 0.0732839 0.110975 0.0103544 -0.000260121 -0.0339778 0.0809254 -0.138773 -0.106714 -0.0106622 -0.0483719 -0.0625778 -0.0571457 -0.0112181 -0.00128804 -0.0468047 0.0418186 -0.0198713 -0.0201791 0.196761 -0.0454617 0.00635723 -0.104019 0.167206 0.0643081 -0.0986307 -0.0225895 0.179995 -0.0994283 0.0186641 0.0602585 0.0643876 -0.091295 -0.0703848 0.0436766 0.183473 -0.0429172 0.0622626 -0.0742263 0.127718 -0.0671561 0.00618947 -0.0523684 -0.0440977 
0.140802 -0.0346908 -0.115396 0.0414802 0.124534 0.12301 0.121534 0.0434079 -0.0150475 -0.0550416 0.0799469 0.115619 0.117406 -0.164174 -0.0849308 -0.0256154 -0.0321349 0.0619268 -0.207116 0.187611 0.175658 -0.118225 0.0504292 0.182613 -0.00373893 -0.0986761 -0.0779201 -0.218046 0.0224623 0.0795211 -0.00679107 0.0976014 -0.0796896 0.130257 -0.0982948 -0.0539903 -0.106913 0.0803223 -0.0944565 -0.0552469 0.0777183 -0.0753274 -0.0791097 0.133673 -0.135209 -0.101449 0.0642411 0.0409903 -0.0675379 0.0769858 0.0305514 -0.069661 -0.0905174 -0.049426 0.0531323 -0.0102028 -0.0627978 0.127831 0.0156759 -0.0673988 -0.0514031 -0.037537 0.159427 -0.0567136 -0.0246021 -0.131202 -0.0123385 0.00179211 -0.0701084 0.00895984 -0.0438586 0.0666733 -0.0411937 0.016707 -0.0572835 -0.0282297 0.00370663 0.0670378 -0.0116173 0.139214 -0.0840347 -0.0143457 -0.0240175 -0.0739047 -0.034955 0.0692887 0.113424 0.00401823 -0.00895708 -0.0221303 0.0947704 -0.136374 -0.12172 -0.0298146 -0.0665007 -0.0626138 -0.0478796 -0.0217322 0.00796745 -0.0553607 0.0385991 -0.01577 -0.00240753 0.176798 -0.0742517 -0.00677765 -0.109674 0.187336 0.0405472 -0.0749531 0.00713737 0.161593 -0.115267 -0.00342745 0.0505839 0.0688106 -0.089358 -0.079297 0.0346533 0.180364 -0.0305737 0.06606 -0.0730134 0.141918 -0.0667239 -0.0113633 -0.0514193 -0.0507799 
0.137235 -0.0207032 -0.121746 0.0450274 0.122412 0.131478 0.120644 0.0381091 -0.0236962 -0.0307791 0.0938247 0.10695 0.130157 -0.150561 -0.0759831 -0.0243344 -0.0106494 0.08191 -0.199682 0.18052 0.174179 -0.126134 0.0510346 0.194124 0.0023136 -0.110624 -0.0867554 -0.215222 0.0309109 0.0882435 0.00406863 0.103494 -0.0799241 0.129827 -0.100799 -0.0444905 -0.106351 0.069609 -0.0863253 -0.0484478 0.0724478 -0.0760127 -0.0803874 0.128284 -0.137444 -0.11095 0.066075 0.0464493 -0.0722903 0.0648235 0.0414527 -0.0663509 -0.0971434 -0.055593 0.0360886 0.00296231 -0.0605256 0.131531 0.0273123 -0.061807 -0.0585331 -0.0292053 0.154385 -0.07717 -0.0215541 -0.122045 -0.00990435 0.000543096 -0.0836412 0.0154071 -0.0425359 0.0728102 -0.0480688 0.0136907 -0.0559622 -0.0337585 0.00935036 0.0775038 -0.0139328 0.126862 -0.0959478 -0.0138751 -0.025423 -0.0748868 -0.039537 0.0814546 0.108939 -0.0144984 -0.0100032 -0.0266674 0.086913 -0.137354 -0.111006 -0.033375 -0.0581273 -0.0673432 -0.0560338 -0.0127222 -0.00251604 -0.0472188 0.038815 -0.00853642 0.000549586 0.186038 -0.0671954 0.00349689 -0.107971 0.178043 0.0436441 -0.0750734 -0.00934386 0.154417 -0.105538 -0.00379255 0.0468765 0.0626567 -0.0844869 -0.0825782 0.0391958 0.18533 -0.0286424 0.0475579 -0.083314 0.145588 -0.0747748 -0.00612556 -0.0628944 -0.0451972 
0.154431 -0.0369228 -0.115059 0.0357379 0.123519 0.139057 0.128549 0.0555755 -0.0414917 -0.0343799 0.0796537 0.105301 0.136648 -0.162613 -0.0623779 -0.0274074 -0.00551073 0.0701068 -0.207981 0.187157 0.156643 -0.100019 0.0490036 0.195487 -0.023845 -0.110337 -0.0960478 -0.218147 0.0180752 0.0721214 -0.00502849 0.0960684 -0.100895 0.132518 -0.103182 -0.0476187 -0.106941 0.0606176 -0.0972913 -0.0292765 0.0707059 -0.0656563 -0.092335 0.127608 -0.137426 -0.103818 0.0575243 0.0557174 -0.068995 0.0877112 0.0533481 -0.0905728 -0.101471 -0.0534579 0.0244758 -0.0130087 -0.0627538 0.136361 0.0407899 -0.0480741 -0.0552247 -0.0111238 0.13845 -0.0764844 -0.0283954 -0.145276 0.00217531 -0.00431302 -0.0838733 -0.0095289 -0.0357343 0.0736895 -0.028352 0.0239742 -0.0700969 -0.0285271 0.0049552 0.0645884 -0.00105665 0.138311 -0.06759 -0.0297565 -0.0323596 -0.0757253 -0.0366186 0.0772068 0.113655 -0.0225591 -0.0222817 -0.0257627 0.0866599 -0.126953 -0.113134 -0.028855 -0.0689873 -0.0502996 -0.0425797 -0.0298932 -0.0188387 -0.0364024 0.038387 0.000362586 -0.00659859 0.183054 -0.0781471 -0.0106677 -0.116906 0.171364 0.0324416 -0.0564269 0.0114177 0.155569 -0.0961492 -0.00338798 0.0229003 0.0688199 -0.0866879 -0.0686648 0.00864884 0.17189 -0.0430253 0.0407487 -0.0744083 0.145882 -0.066086 -0.0201514 -0.0853724 -0.0629984 
0.131506 -0.0117653 -0.107584 0.0313686 0.111508 0.11764 0.104622 0.0389089 -0.0367668 -0.0304782 0.0953289 0.105283 0.138725 -0.147559 -0.101883 -0.00312482 -0.0146429 0.0715895 -0.225254 0.202313 0.165738 -0.131347 0.0589643 0.179046 -0.0194778 -0.0881301 -0.0821653 -0.184701 0.0505639 0.0676845 -0.00588102 0.109836 -0.0873661 0.128153 -0.123624 -0.0526016 -0.119962 0.104411 -0.075154 -0.036479 0.0487692 -0.0796041 -0.0815851 0.1122 -0.12052 -0.127341 0.0621502 0.0504999 -0.0782777 0.0869029 0.0402955 -0.054178 -0.11452 -0.0450562 0.0237195 -0.0183281 -0.0556896 0.129501 0.0240979 -0.0684104 -0.0640886 -0.0255394 0.165267 -0.0609636 -0.0331438 -0.110448 -0.0152626 0.00483484 -0.0919942 0.00749088 -0.0443152 0.0643148 -0.0333258 0.0500967 -0.0456768 -0.0510926 0.0274766 0.067778 -0.0101463 0.12519 -0.073842 -0.0294344 -0.0205946 -0.075238 -0.0423652 0.0733977 0.100219 0.0105173 0.0162466 -0.0289996 0.0849702 -0.136176 -0.107104 -0.00774683 -0.0440852 -0.0605914 -0.0490932 0.000726113 -0.0178789 -0.047422 0.0338488 -0.0119929 -0.024637 0.209038 -0.0512326 0.0169009 -0.10416 0.181271 0.0731405 -0.0969436 -0.0168015 0.184637 -0.100887 0.035477 0.0446677 0.0528897 -0.0830138 -0.0546432 0.0434576 0.17787 -0.0542048 0.0516889 -0.0660855 0.128801 -0.0776276 -0.00614385 -0.0653138 -0.0547356 
0.137096 -0.0144345 -0.117088 0.0412175 0.118098 0.118985 0.111968 0.0417982 -0.0282295 -0.0295724 0.0907808 0.112541 0.129863 -0.162762 -0.10627 -0.00701648 0.00686868 0.0875995 -0.219321 0.199818 0.167589 -0.127984 0.0531921 0.185124 -0.0230189 -0.092657 -0.0817824 -0.201297 0.0427598 0.0707899 -0.0077604 0.115245 -0.0746492 0.130908 -0.110013 -0.0626256 -0.103917 0.104085 -0.087474 -0.0532302 0.0537401 -0.0714431 -0.0792347 0.115518 -0.122559 -0.118699 0.0644404 0.041466 -0.0849116 0.0780129 0.0461953 -0.0620424 -0.103732 -0.0508397 0.0277748 -0.0113985 -0.0512125 0.119258 0.0258464 -0.0704528 -0.0567856 -0.0320628 0.158207 -0.0757981 -0.0168478 -0.126966 -0.0196798 -0.00250793 -0.0955269 0.006344 -0.0465941 0.0498702 -0.0391196 0.0351555 -0.0609071 -0.0434495 0.0262841 0.0846204 -0.0135755 0.108177 -0.0939408 -0.0138442 -0.0295636 -0.0783571 -0.0304198 0.0672631 0.100072 0.00437834 0.0105196 -0.0233407 0.0788491 -0.136312 -0.115389 -0.0170908 -0.0331063 -0.0514864 -0.0396554 -0.00740732 -0.0235659 -0.0435351 0.0386653 -0.00935992 -0.0221137 0.207713 -0.0544975 -0.000523785 -0.0974495 0.168736 0.058631 -0.0875997 -0.016921 0.174187 -0.0960712 0.0220372 0.049218 0.0450399 -0.0948872 -0.0783978 0.0409853 0.173051 -0.0529652 0.0630359 -0.0670348 0.131624 -0.0608002 -0.0114567 -0.0645858 -0.0711897 
0.135655 -0.0149622 -0.10244 0.0314507 0.109198 0.120031 0.104707 0.0511759 -0.0311333 -0.0259414 0.0970819 0.105471 0.13447 -0.145865 -0.0996138 -0.0121997 -0.0101996 0.0691795 -0.217283 0.19808 0.171877 -0.137418 0.0578506 0.179986 -0.0121724 -0.085793 -0.0755524 -0.187683 0.0530804 0.0633229 -0.00610808 0.0928644 -0.078105 0.124204 -0.117772 -0.0552945 -0.122902 0.118947 -0.0833332 -0.0532211 0.0438716 -0.0762702 -0.0956274 0.115952 -0.12151 -0.123796 0.0554579 0.0459485 -0.0850057 0.0796748 0.0354484 -0.0386169 -0.109544 -0.0502395 0.0341754 -0.0168727 -0.0584132 0.129283 0.0175001 -0.0820199 -0.0613092 -0.0392332 0.172908 -0.0585862 -0.0240777 -0.106682 -0.0195451 0.017935 -0.0911635 0.0177123 -0.0368991 0.0628809 -0.0425222 0.0347854 -0.0479246 -0.0471729 0.0231942 0.070742 -0.000109166 0.128302 -0.095754 -0.0306044 -0.0143504 -0.0829572 -0.0338685 0.052234 0.105021 0.0220826 0.0305092 -0.025972 0.0821617 -0.135714 -0.107186 -0.00190396 -0.0425201 -0.0715056 -0.0388302 -0.00500227 -0.0158723 -0.0555475 0.0412711 -0.00401261 -0.0257448 0.192145 -0.0613102 0.0186836 -0.0999844 0.167532 0.0834708 -0.109425 -0.00845176 0.186744 -0.104797 0.0298461 0.0705685 0.057083 -0.0935455 -0.0646652 0.0482197 0.18215 -0.0581892 0.0509778 -0.0673558 0.128035 -0.0620111 0.00164438 -0.0399254 -0.0518143 
0.143918 -0.0241609 -0.119391 0.0424441 0.115382 0.129424 0.113183 0.0378361 -0.0161642 -0.0461929 0.0965139 0.117126 0.127725 -0.153613 -0.09846 -0.026372 -0.00530973 0.0782234 -0.216926 0.185393 0.170592 -0.115597 0.0497793 0.193638 -0.0143615 -0.100449 -0.0737803 -0.206312 0.0228398 0.0801192 -0.00551363 0.100339 -0.076742 0.132014 -0.109464 -0.0534951 -0.109019 0.0886832 -0.095347 -0.041839 0.0626814 -0.0682041 -0.0940268 0.123531 -0.129944 -0.112957 0.0568452 0.0399844 -0.0744153 0.077312 0.0449991 -0.0586365 -0.0959037 -0.0496136 0.0339313 -0.00454874 -0.0579128 0.129929 0.0226573 -0.0662304 -0.0567052 -0.0303974 0.160987 -0.0718672 -0.0270857 -0.133611 -0.00623402 0.00807951 -0.0854397 0.0178947 -0.0376151 0.0535301 -0.0392428 0.0186645 -0.0578081 -0.0323554 0.00877399 0.0662517 -0.0189756 0.128699 -0.0957113 -0.0106535 -0.023033 -0.0817542 -0.0393581 0.0720637 0.111936 -0.0114427 -0.0102762 -0.0232998 0.081166 -0.145347 -0.108245 -0.0221061 -0.0492624 -0.0606239 -0.0486341 -0.0244389 -0.00547279 -0.0480121 0.0428294 -0.0020461 -0.0114309 0.19537 -0.0646295 -0.00551989 -0.108237 0.169418 0.0373475 -0.0825939 0.00114125 0.16409 -0.101221 0.010295 0.0449009 0.0627516 -0.098072 -0.0811148 0.0399377 0.178061 -0.0401317 0.0553945 -0.0798528 0.135148 -0.0572094 -0.00697519 -0.0597569 -0.0560624 
0.138981 -0.00720788 -0.119284 0.0328489 0.110182 0.128161 0.103216 0.0376476 -0.0415756 -0.0298179 0.0911509 0.105509 0.133153 -0.152459 -0.107919 -0.0105015 0.0059297 0.0836643 -0.212573 0.195371 0.169409 -0.123412 0.0566578 0.180921 -0.0187855 -0.0797465 -0.0734519 -0.199519 0.049925 0.0709212 -0.00912794 0.109527 -0.0786633 0.127133 -0.109139 -0.0613397 -0.107466 0.117453 -0.0793939 -0.0533977 0.0438782 -0.0715284 -0.0846624 0.122094 -0.125032 -0.115269 0.0718295 0.0413141 -0.0959416 0.0767011 0.0477446 -0.0459803 -0.0999321 -0.0448952 0.0304141 -0.0160263 -0.041831 0.126004 0.0301508 -0.0908778 -0.0584009 -0.0304639 0.171755 -0.073358 -0.0203985 -0.118891 -0.0138234 0.0079084 -0.0899924 0.0152719 -0.0456526 0.0507739 -0.0400894 0.0368707 -0.0541312 -0.0513456 0.0166982 0.0766702 -0.00841735 0.115099 -0.0928815 -0.008782 -0.0233965 -0.088403 -0.0302504 0.0549463 0.0983419 0.00685656 0.0195304 -0.0232644 0.0821879 -0.137278 -0.110101 -0.0145723 -0.0325515 -0.0599687 -0.0312371 0.0069363 -0.0205193 -0.0517192 0.039288 0.00303594 -0.0201056 0.213164 -0.0673766 0.00333889 -0.101589 0.168717 0.0661417 -0.0963863 -0.00491035 0.184362 -0.102497 0.0265842 0.0549916 0.0463661 -0.100527 -0.0878748 0.0470566 0.168022 -0.0506459 0.0548239 -0.0572363 0.121469 -0.0624927 -0.0100117 -0.054033 -0.0652348 
0.137914 -0.00294908 -0.119626 0.0374609 0.112076 0.132437 0.117217 0.0399958 -0.0209652 -0.0353882 0.0945353 0.101605 0.128052 -0.156437 -0.0880654 -0.0249217 -0.00712184 0.0768645 -0.217973 0.181236 0.165982 -0.117673 0.0447731 0.190094 -0.00929046 -0.105303 -0.0807799 -0.201909 0.0364978 0.0793423 0.0012435 0.10361 -0.0811742 0.134648 -0.105745 -0.050442 -0.101251 0.0853622 -0.0944014 -0.0439256 0.0664622 -0.0771261 -0.0816656 0.127524 -0.1275 -0.106466 0.0659653 0.0480265 -0.0865689 0.0738709 0.0412873 -0.0569888 -0.100232 -0.05324 0.0321149 -0.001176 -0.0650764 0.129443 0.0302173 -0.0768246 -0.0631851 -0.0267708 0.159801 -0.0776313 -0.028064 -0.119627 -0.0057445 0.00123168 -0.091013 0.0167336 -0.0423374 0.0558769 -0.0400892 0.0260085 -0.0509058 -0.0405765 0.00888514 0.0751357 -0.0152026 0.119429 -0.0904978 -0.00903084 -0.0279724 -0.083029 -0.0356714 0.0753248 0.103156 -0.0150939 -0.00149969 -0.0141324 0.0875437 -0.14659 -0.111605 -0.031848 -0.0470738 -0.0584441 -0.0467685 -0.016195 -0.00823866 -0.0490043 0.0373158 -0.00252773 -0.00631359 0.196268 -0.0760186 0.00126146 -0.11095 0.176363 0.0442973 -0.0819339 0.0039185 0.168337 -0.106532 0.00830804 0.0460213 0.0535363 -0.0938313 -0.0860016 0.0458258 0.176342 -0.0319175 0.0535247 -0.072535 0.146253 -0.0641945 -0.0149546 -0.0602869 -0.0606762 
0.12854 0.00145718 -0.102167 0.0299104 0.121438 0.127069 0.0981324 0.0440738 -0.028128 -0.0292313 0.102095 0.103444 0.128375 -0.138133 -0.0959128 -0.00366153 -0.000769897 0.0849469 -0.22092 0.184529 0.189266 -0.127608 0.046301 0.189501 0.00602455 -0.0938559 -0.0746522 -0.181409 0.0575013 0.0774679 7.12412e-06 0.0875729 -0.0762517 0.12921 -0.110042 -0.0461036 -0.118377 0.0976694 -0.0831527 -0.0540525 0.053044 -0.0621464 -0.0713036 0.123735 -0.114839 -0.119119 0.0720719 0.0391575 -0.0964141 0.0632165 0.0424074 -0.046692 -0.115559 -0.0554633 0.0406019 -0.00121304 -0.070293 0.136871 0.0198972 -0.0926459 -0.060924 -0.0375674 0.170327 -0.0646096 -0.0231307 -0.103082 -0.0266049 0.0237341 -0.0907791 0.0305341 -0.0260971 0.0668089 -0.0438254 0.00822815 -0.0455594 -0.0362579 0.0130604 0.0866679 -0.0111836 0.106914 -0.0963001 0.00181104 -0.0110789 -0.0788027 -0.0452716 0.0642259 0.106154 0.0139267 0.0206622 -0.0146524 0.0770292 -0.148974 -0.11906 -0.0114065 -0.0370939 -0.0639908 -0.048945 -0.00357825 -0.0215364 -0.0537912 0.0344072 -0.00778699 -0.0176315 0.191004 -0.078807 0.0241308 -0.112921 0.162571 0.0666805 -0.113552 -0.0063178 0.174471 -0.111777 0.032881 0.074598 0.051433 -0.107995 -0.0765951 0.0430729 0.178647 -0.0436448 0.0591255 -0.0681129 0.130125 -0.0635264 0.00604093 -0.0419458 -0.0577151 
0.131685 0.00151919 -0.10008 0.028553 0.11672 0.116157 0.0935636 0.0479293 -0.0248539 -0.0348051 0.0977228 0.106581 0.121109 -0.153122 -0.103688 0.00907686 -0.000611162 0.0653345 -0.230608 0.190462 0.177692 -0.120525 0.0484669 0.169894 -0.00632578 -0.0724628 -0.0668908 -0.18103 0.05744 0.0623389 -0.00260618 0.104653 -0.0738315 0.131272 -0.118564 -0.0591556 -0.114617 0.125581 -0.0763614 -0.0470089 0.0508136 -0.0635444 -0.0767926 0.117098 -0.104065 -0.110253 0.0671447 0.0332302 -0.101453 0.0650837 0.042501 -0.0359142 -0.116902 -0.0521952 0.0363753 -0.016561 -0.0661594 0.127016 0.0156773 -0.0915658 -0.0638804 -0.0514294 0.168821 -0.0562924 -0.0228045 -0.108596 -0.0253798 0.0314708 -0.0827841 0.0221378 -0.0276648 0.0570764 -0.0409553 0.0246681 -0.0422282 -0.043505 0.0121801 0.0820702 -0.0176792 0.117955 -0.0889928 -0.000827934 -0.00996616 -0.0834079 -0.0395777 0.0514236 0.107225 0.0220215 0.0221297 -0.0207418 0.0707122 -0.143233 -0.127602 9.03522e-05 -0.0313141 -0.0544068 -0.0299872 -0.0112435 -0.0242765 -0.0589538 0.024557 -0.0150684 -0.02697 0.204309 -0.0782045 0.011519 -0.110425 0.171198 0.0783134 -0.122661 -0.00378351 0.188756 -0.117923 0.0412014 0.0810267 0.041199 -0.122522 -0.0791861 0.0467769 0.169556 -0.0471756 0.0792371 -0.053385 0.12861 -0.0451164 -0.00715169 -0.0363386 -0.0672697 
0.138312 0.00497268 -0.110055 0.0221603 0.122831 0.118735 0.102854 0.0515283 -0.0332794 -0.0332187 0.0908388 0.0984983 0.124993 -0.149417 -0.0854523 -0.00211772 0.00400162 0.0537701 -0.224094 0.193052 0.163685 -0.115107 0.0459809 0.15329 -0.00352507 -0.0737399 -0.0752066 -0.180305 0.053297 0.0594533 0.00224428 0.107612 -0.0795131 0.13153 -0.113877 -0.0537356 -0.106209 0.12253 -0.0765146 -0.0528029 0.0601816 -0.0654098 -0.0722552 0.127873 -0.119301 -0.0948822 0.066671 0.0436326 -0.0974256 0.0677714 0.0364921 -0.0387611 -0.12278 -0.0535143 0.0380871 -0.025042 -0.0800379 0.128048 0.0208422 -0.0903108 -0.0686978 -0.052618 0.164736 -0.0607726 -0.0231322 -0.110619 -0.018632 0.0338019 -0.0782556 0.0125858 -0.0219356 0.0643882 -0.0349264 0.0260093 -0.0459516 -0.0442546 0.00607145 0.0782562 -0.010897 0.123432 -0.0838111 -0.007204 -0.0128907 -0.0816223 -0.0334166 0.0440593 0.107806 0.0197826 0.0274111 -0.0188955 0.0754701 -0.140508 -0.129005 -0.0124479 -0.0382202 -0.0629445 -0.0194256 -0.0149111 -0.0294884 -0.0660549 0.0134497 -0.0071184 -0.0151653 0.19909 -0.0976364 0.0110977 -0.116984 0.183999 0.0825631 -0.108896 0.0106318 0.184014 -0.12998 0.0414787 0.0735687 0.0316541 -0.115805 -0.0877763 0.0452826 0.168265 -0.0428402 0.0791107 -0.0473805 0.145716 -0.0410986 -0.0289397 -0.0359492 -0.0677324 
0.1435 0.00184232 -0.1092 0.0225585 0.124988 0.12404 0.1034 0.0487553 -0.0391432 -0.0288621 0.0942794 0.098976 0.127987 -0.136871 -0.0858329 -0.00569413 0.00732054 0.058023 -0.213558 0.189684 0.172228 -0.119127 0.0431325 0.163825 0.00569538 -0.0747169 -0.0755743 -0.17692 0.0609924 0.0698782 0.00329896 0.100166 -0.087049 0.124867 -0.112962 -0.0508344 -0.11807 0.115663 -0.0680303 -0.0571243 0.051527 -0.0616143 -0.076758 0.126815 -0.115887 -0.101129 0.0645547 0.0455128 -0.0936179 0.0623806 0.0386605 -0.0270162 -0.118412 -0.057543 0.0395167 -0.0220374 -0.0791144 0.140862 0.0201658 -0.0919362 -0.0659491 -0.0493678 0.173742 -0.0621994 -0.0274898 -0.104477 -0.0186955 0.0357986 -0.0814296 0.0162999 -0.0194659 0.0741353 -0.0408611 0.021328 -0.0513291 -0.0440826 0.012265 0.0750548 -0.00411726 0.12976 -0.0861931 -0.00828489 -0.00727298 -0.0831599 -0.0300228 0.0355455 0.10764 0.0212115 0.0338968 -0.022549 0.0763787 -0.135884 -0.123593 -0.00389428 -0.0366629 -0.0715978 -0.019782 -0.0113905 -0.0257444 -0.0677819 0.0209381 0.00179521 -0.0178569 0.196249 -0.102298 0.020558 -0.11448 0.174371 0.0903815 -0.110879 0.0129422 0.18128 -0.131223 0.0425573 0.080281 0.0420206 -0.111853 -0.0823513 0.0427531 0.171622 -0.0473189 0.0674214 -0.0515836 0.13632 -0.0524116 -0.0151403 -0.0316394 -0.0618517 
0.131303 0.00890065 -0.114338 0.0205296 0.122059 0.123145 0.106237 0.0402066 -0.0362755 -0.0348607 0.0857403 0.100275 0.127037 -0.159812 -0.0983091 -0.00632566 -0.0120792 0.0667214 -0.225757 0.193381 0.166788 -0.117818 0.0517305 0.151641 -0.0148057 -0.0790861 -0.0820611 -0.190043 0.0525596 0.0654626 -0.00529642 0.108374 -0.0851078 0.129203 -0.105304 -0.0601398 -0.103301 0.117693 -0.075202 -0.050556 0.0603022 -0.0721686 -0.0707776 0.127937 -0.12673 -0.0993609 0.0732713 0.0457595 -0.10016 0.0739598 0.0332649 -0.0489015 -0.118522 -0.0463712 0.0313685 -0.0227913 -0.0644403 0.124413 0.0182656 -0.08864 -0.0599345 -0.0393698 0.171897 -0.0616691 -0.0158649 -0.119171 -0.0172596 0.0197593 -0.0791172 0.0122676 -0.0324896 0.0608656 -0.0304027 0.0354742 -0.0496207 -0.0456912 0.00391428 0.0747382 -0.0116359 0.114833 -0.0815376 -0.00377944 -0.0202866 -0.0735284 -0.0381145 0.055282 0.103385 0.0163386 0.0214224 -0.0174738 0.0847182 -0.144271 -0.122545 -0.0203074 -0.0413716 -0.0655422 -0.0290821 -0.00276654 -0.0240791 -0.0558966 0.0219733 -0.00725762 -0.0177359 0.204998 -0.0799145 0.0063369 -0.108989 0.193798 0.0686202 -0.0938716 0.00637598 0.179583 -0.121467 0.0380449 0.0568345 0.0376032 -0.111418 -0.0813349 0.0458022 0.164051 -0.0438157 0.0737191 -0.0515468 0.138498 -0.0526217 -0.0258752 -0.0541637 -0.0689203 
0.135112 0.00925736 -0.11085 0.0237173 0.124762 0.126855 0.109131 0.0446497 -0.0358296 -0.0335444 0.0878492 0.102221 0.125088 -0.161102 -0.0897937 -0.0061218 -0.00559576 0.0667541 -0.225266 0.190064 0.165292 -0.111074 0.0469589 0.1557 -0.010115 -0.082775 -0.0847813 -0.188444 0.0524301 0.0670584 -0.000646529 0.111374 -0.0844958 0.133285 -0.106987 -0.0591025 -0.100326 0.108796 -0.073131 -0.0455896 0.065205 -0.0693506 -0.0674553 0.126724 -0.127095 -0.104567 0.0735882 0.0420613 -0.0971474 0.0744476 0.0402226 -0.0510563 -0.122226 -0.048084 0.0308377 -0.0200692 -0.0707422 0.12705 0.0184429 -0.0831883 -0.065883 -0.0427201 0.165914 -0.0692755 -0.0174633 -0.119509 -0.0153956 0.0148375 -0.0846234 0.0117811 -0.0291251 0.0647176 -0.0312774 0.0367594 -0.0504172 -0.0462391 0.00571584 0.075521 -0.0138916 0.115897 -0.0800907 -0.00257066 -0.014933 -0.071728 -0.0333561 0.0563535 0.105781 0.0116476 0.018219 -0.0169873 0.0811139 -0.145019 -0.128337 -0.0184858 -0.0399934 -0.062939 -0.0292613 -0.00792188 -0.0303076 -0.05214 0.0153675 -0.00639002 -0.0159903 0.206983 -0.0854012 0.00831753 -0.109685 0.189478 0.0688783 -0.0945799 0.00576382 0.17599 -0.122651 0.0373926 0.0585998 0.0333549 -0.10693 -0.0830271 0.0443519 0.166985 -0.0377598 0.0740917 -0.0510725 0.14108 -0.0471069 -0.0285507 -0.0487138 -0.0685689 
0.133637 0.0150309 -0.115387 0.0076563 0.125979 0.128844 0.1209 0.0693054 -0.0624547 -0.00619429 0.0767357 0.0822348 0.131265 -0.155058 -0.0552913 -0.00387269 0.00999281 0.0531199 -0.207795 0.170038 0.15278 -0.108626 0.0207512 0.152658 0.00437265 -0.0739955 -0.0882473 -0.17778 0.0669065 0.0569153 0.00627804 0.119513 -0.104465 0.130763 -0.115816 -0.0530224 -0.105015 0.0765628 -0.0704099 -0.0422767 0.0870007 -0.0762146 -0.0491532 0.145937 -0.11563 -0.0818404 0.081559 0.0533555 -0.11093 0.0408082 0.0462491 -0.0611814 -0.132566 -0.0682691 0.0234874 -0.012469 -0.0970548 0.14066 0.0465609 -0.0842448 -0.0614791 -0.0357327 0.143267 -0.0601816 -0.0280893 -0.100075 -0.0145109 0.0164748 -0.0715185 -0.00885133 -0.0344889 0.0779949 -0.0289665 0.0255619 -0.0479849 -0.0444334 0.000129175 0.0936374 -0.00592115 0.109798 -0.069717 -0.00442027 -0.0158103 -0.0762633 -0.035689 0.0529868 0.116617 4.16863e-05 0.017831 -0.0196673 0.0756122 -0.124599 -0.141334 -0.031774 -0.0466976 -0.0447288 -0.0105885 -0.0160902 -0.0360852 -0.0588778 -0.00111502 -0.00633939 0.0024359 0.205472 -0.123424 0.00897696 -0.13495 0.201291 0.063163 -0.0979787 0.0259383 0.170347 -0.138749 0.0197168 0.0599252 0.0157982 -0.111422 -0.0984496 0.036702 0.155581 -0.0273073 0.0647642 -0.0442959 0.155206 -0.0595614 -0.0443941 -0.0717391 -0.0790875 
0.134997 -0.00635692 -0.118772 0.0129092 0.122631 0.128856 0.110944 0.0715617 -0.0466257 -0.0363323 0.0801585 0.0961861 0.128251 -0.155364 -0.0728904 -0.00817661 0.00577706 0.0514845 -0.217613 0.17681 0.156898 -0.103594 0.0304088 0.170186 -0.00701501 -0.0802759 -0.0755517 -0.184035 0.0463931 0.0494143 0.00401726 0.110043 -0.0932148 0.134214 -0.130723 -0.0478593 -0.107987 0.0715 -0.089468 -0.0249202 0.0955093 -0.0671512 -0.0633506 0.138623 -0.117625 -0.0896028 0.0766587 0.0401076 -0.0992925 0.0549279 0.0407882 -0.0738078 -0.121744 -0.0584051 0.0217119 -0.00704866 -0.0825845 0.138588 0.0460475 -0.0762565 -0.0621913 -0.0212791 0.140552 -0.0583964 -0.0376084 -0.113259 -0.00609871 0.0138359 -0.0650168 -0.00652267 -0.0354878 0.0631814 -0.0254645 0.0238642 -0.03763 -0.0316555 -0.00399571 0.0873522 -0.0199559 0.11208 -0.0784462 -0.000407755 -0.0147801 -0.0762111 -0.0440987 0.0800346 0.124431 -0.00659945 -0.00976123 -0.0291662 0.0771703 -0.134878 -0.134492 -0.0350318 -0.0448397 -0.0390043 -0.0251963 -0.0210028 -0.0321515 -0.0525021 0.00261304 -0.0170192 0.00177087 0.20891 -0.108347 0.0028974 -0.139843 0.195557 0.0323141 -0.101772 0.0198935 0.16755 -0.12452 0.0149255 0.0434218 0.0283568 -0.115042 -0.0977145 0.0379996 0.159925 -0.0300783 0.0646693 -0.0577627 0.146419 -0.0637765 -0.0340205 -0.0860802 -0.0697859 
0.130888 -0.0580007 -0.108957 0.0205881 0.146133 0.116873 0.109817 0.0815782 -0.0404712 -0.0520728 0.0607161 0.111102 0.126196 -0.127065 -0.0747546 -0.00130925 0.0158793 0.0651642 -0.19927 0.159764 0.189613 -0.112307 0.0051731 0.211265 0.0205063 -0.0956637 -0.0739842 -0.1814 0.0306497 0.071016 0.0162432 0.0938063 -0.104699 0.115871 -0.129577 -0.0333759 -0.138821 0.0018705 -0.0919349 -0.0345917 0.105847 -0.0403469 -0.0445362 0.144739 -0.0816809 -0.0988256 0.0718905 0.030627 -0.0712663 0.0170216 0.0438211 -0.109025 -0.0919607 -0.0834075 0.0317644 0.0158233 -0.0998593 0.166681 0.0527289 -0.062907 -0.0336427 0.00186363 0.109725 -0.037125 -0.0517125 -0.109503 -0.0215553 0.0142994 -0.052789 -0.0256495 -0.0261446 0.0796911 -0.0339262 -0.0419981 -0.05936 0.0116066 0.0088297 0.0949307 -0.0184185 0.116106 -0.0760947 0.0065135 -0.00895465 -0.0673295 -0.0605053 0.0925614 0.138466 -0.00446391 -0.037208 -0.0472082 0.0613698 -0.110651 -0.140883 -0.0207146 -0.0546909 -0.00688719 -0.0448757 -0.0367737 -0.0307098 -0.045124 0.0132125 -0.0356598 0.00430192 0.18738 -0.118174 0.00788122 -0.158172 0.168506 -0.00220147 -0.100965 0.0154732 0.133942 -0.130106 -0.00754391 0.0378412 0.0574423 -0.126299 -0.074605 0.00476275 0.162285 -0.0434147 0.0616333 -0.0858764 0.120549 -0.0939291 -0.00169823 -0.121123 -0.0744656 
0.143847 -0.0764829 -0.109167 0.0346606 0.155466 0.10637 0.113461 0.0662068 -0.0368697 -0.0559 0.0635547 0.128682 0.127346 -0.110166 -0.0762904 -0.0226884 0.0252782 0.0766846 -0.195449 0.184533 0.180877 -0.114063 0.0198287 0.231528 0.0131759 -0.110115 -0.0752222 -0.179186 0.0142579 0.0845603 0.000107205 0.0815971 -0.0974107 0.115034 -0.127353 -0.0277198 -0.144381 0.00980467 -0.111864 -0.0449529 0.0865157 -0.0263233 -0.0644359 0.133603 -0.101234 -0.0965212 0.0575801 0.0404294 -0.0485672 0.0460914 0.0486259 -0.105231 -0.0860485 -0.082973 0.0438546 0.00891475 -0.0997361 0.172627 0.0456253 -0.0471342 -0.0306418 0.0066577 0.114272 -0.0399874 -0.0515873 -0.123801 -0.021201 0.0169703 -0.0725466 -0.0170181 -0.0148987 0.0824329 -0.0282176 -0.0373608 -0.07347 0.0204557 0.0201617 0.0778597 -0.005331 0.117526 -0.0810204 -0.000409119 -0.0207357 -0.0726263 -0.0487987 0.0751715 0.128862 -0.00106216 -0.0330277 -0.039755 0.0648925 -0.109609 -0.118965 -0.0150791 -0.056419 -0.0250791 -0.0516341 -0.0481739 -0.0190613 -0.051551 0.0300139 -0.0215851 0.00266017 0.169293 -0.116559 0.00913019 -0.150734 0.146002 0.00736238 -0.0842788 0.0246581 0.138058 -0.112285 0.00106455 0.0253045 0.0725592 -0.1103 -0.0653493 -0.00736449 0.176544 -0.0607425 0.0554634 -0.102793 0.119214 -0.0950235 0.0123541 -0.110813 -0.0781598 
0.11325 -0.066575 -0.0851011 0.034159 0.150726 0.122632 0.123298 0.0571991 -0.019506 -0.0314964 0.0796608 0.104789 0.133293 -0.0826514 -0.0543578 -0.0270406 -0.00378231 0.0900869 -0.179672 0.146438 0.208761 -0.146358 0.00497313 0.236776 0.0469768 -0.117185 -0.101626 -0.176852 0.0466535 0.0881265 0.0409379 0.0738251 -0.113375 0.101431 -0.106412 -0.000432064 -0.160328 -0.0101467 -0.0799015 -0.0573617 0.102092 -0.0377388 -0.0701311 0.13185 -0.0949553 -0.125847 0.0485254 0.051631 -0.040602 -0.00772064 0.0123348 -0.086357 -0.0850741 -0.0957897 0.0434026 0.0388561 -0.106669 0.195011 0.0263785 -0.0542752 -0.0399765 0.00813602 0.13168 -0.0391159 -0.0430483 -0.0678611 -0.0183128 0.0188642 -0.06756 0.0119811 -0.0125847 0.114982 -0.0466662 -0.050207 -0.0630145 0.00388853 0.0136535 0.088613 0.00240018 0.106951 -0.0970932 0.0066561 -0.00371318 -0.0663679 -0.0636374 0.0778273 0.139956 0.0112542 -0.0230468 -0.0500756 0.0878447 -0.104539 -0.0958366 -0.0230523 -0.0650069 -0.0546826 -0.0787384 -0.0308452 -0.00770982 -0.0369083 0.0421696 -0.0311465 0.00306148 0.140099 -0.0908663 0.0491425 -0.13246 0.135389 0.0348593 -0.0904137 -0.00333273 0.123639 -0.127493 -0.0137675 0.0655357 0.0868342 -0.095872 -0.0578199 0.0104761 0.187977 -0.0378212 0.0259509 -0.12009 0.122105 -0.131457 0.046757 -0.102841 -0.0349053 
0.127435 -0.067234 -0.103185 0.0258963 0.170661 0.132488 0.117568 0.0376708 -0.0758363 -0.0398807 0.0475187 0.127564 0.128968 -0.0756848 -0.0458455 -0.0343929 0.0155419 0.106278 -0.153563 0.152904 0.181326 -0.0985798 0.0112664 0.248036 0.0358615 -0.116951 -0.0899057 -0.175311 0.0267403 0.115379 0.00461594 0.0730187 -0.124313 0.0959319 -0.0947582 -0.005139 -0.152587 -0.0528476 -0.0870791 -0.0397873 0.0946204 -0.0179349 -0.0347272 0.146585 -0.122929 -0.0871688 0.0854557 0.0512008 -0.050708 0.024886 0.0607981 -0.11636 -0.0796659 -0.0917101 0.0509867 0.0329059 -0.0987594 0.215702 0.0549779 -0.035527 -0.0300089 0.0422795 0.120369 -0.0496788 -0.0393857 -0.106221 -0.024787 -0.000309395 -0.0864064 0.000923015 -0.0071822 0.118103 -0.0259367 -0.0530706 -0.0768373 0.0346309 0.00840962 0.0711774 0.0106046 0.0980808 -0.0578469 0.0148477 -0.0158902 -0.0609068 -0.0648487 0.0701598 0.126854 -0.017317 -0.0480388 -0.0300834 0.0691069 -0.0947266 -0.10704 -0.0285564 -0.0676609 -0.0307079 -0.0638074 -0.0157515 -0.0102182 -0.0435575 0.0294951 -0.00319382 0.0217976 0.152273 -0.132251 0.0325647 -0.158165 0.138765 -0.0098005 -0.0608936 0.0400045 0.110329 -0.109441 -0.0147948 0.00647581 0.0856643 -0.0870601 -0.0541504 -0.0201609 0.180744 -0.0360696 0.00939164 -0.111612 0.0952936 -0.136104 0.0386269 -0.128076 -0.0635825 
0.139091 -0.0874723 -0.107605 0.0417001 0.163431 0.120444 0.122909 0.0364485 -0.0725615 -0.0389787 0.0512287 0.136725 0.127037 -0.0921091 -0.0537676 -0.0445097 0.00900755 0.103024 -0.155599 0.173613 0.168543 -0.107759 0.0266945 0.242214 0.0191315 -0.112798 -0.088052 -0.191987 0.00751349 0.106054 -0.0117216 0.0747658 -0.122628 0.0980452 -0.0982318 -0.0140727 -0.158666 -0.0286764 -0.103268 -0.0466399 0.083467 -0.0251981 -0.0654719 0.145979 -0.13556 -0.0834483 0.0706515 0.0532198 -0.0416235 0.0472697 0.0655 -0.113027 -0.0801675 -0.0878476 0.0523073 0.0138668 -0.0905205 0.198456 0.0550252 -0.0254823 -0.0198455 0.0306026 0.122614 -0.0392726 -0.0330981 -0.131618 -0.0216556 0.00118459 -0.0815107 0.00117058 -0.0123204 0.112607 -0.0184976 -0.0368252 -0.0911006 0.0247351 0.00989174 0.0647282 0.0134449 0.115575 -0.0658849 -0.00474907 -0.0289288 -0.071285 -0.0586647 0.0558376 0.125214 -0.0133774 -0.0455414 -0.0351379 0.0707951 -0.087377 -0.100017 -0.0278557 -0.0774793 -0.0401956 -0.0539956 -0.0332098 -0.000140904 -0.0504318 0.0398741 0.00304427 0.0166672 0.143507 -0.114369 0.0145624 -0.147345 0.14349 -0.000231881 -0.0493816 0.0417025 0.12514 -0.0962208 -0.0186941 0.00417573 0.0878374 -0.0811221 -0.0560096 -0.0207231 0.180284 -0.0537613 0.0156499 -0.113774 0.101684 -0.118045 0.0334773 -0.118905 -0.0661184 
0.134529 -0.0877761 -0.0901018 0.0358751 0.152488 0.106339 0.131949 0.0556688 -0.0526601 -0.0508475 0.0519024 0.127087 0.135125 -0.106339 -0.0648072 -0.039932 -0.014502 0.0809697 -0.181649 0.178299 0.190797 -0.132989 0.0257772 0.216704 0.0166341 -0.115521 -0.0988538 -0.190069 0.0126647 0.098005 -0.00833472 0.0764515 -0.112097 0.110691 -0.106108 -0.0342587 -0.158922 0.0051948 -0.10002 -0.0627289 0.0809628 -0.0465715 -0.0638148 0.135945 -0.115894 -0.0988793 0.0494464 0.0488677 -0.0403115 0.0491951 0.040174 -0.113406 -0.0782962 -0.080042 0.0486684 0.0054546 -0.0954043 0.177158 0.0307682 -0.0376278 -0.0141822 0.0118302 0.118566 -0.0213904 -0.0378357 -0.117738 -0.0280586 0.00463602 -0.0788466 -0.0179599 -0.0231618 0.0957852 -0.029896 -0.0361732 -0.0857224 0.0185535 0.0232003 0.0495331 0.0180698 0.139425 -0.0758916 -0.0330145 -0.0199085 -0.0614506 -0.0557214 0.0558022 0.129831 0.00458658 -0.0251524 -0.0346602 0.0792924 -0.102915 -0.101986 -0.0143046 -0.0912367 -0.0410725 -0.0623952 -0.0361807 0.000814995 -0.0455086 0.0501951 -0.00986036 0.000632919 0.150711 -0.0911078 0.0113552 -0.135932 0.166323 0.0182081 -0.0727174 0.020412 0.127666 -0.122868 -0.0107884 0.0275836 0.0966474 -0.0820232 -0.0357484 -0.00885062 0.190327 -0.0642056 0.0326729 -0.115283 0.111119 -0.103812 0.0251069 -0.103739 -0.0644444 
0.129528 -0.0982766 -0.0958316 0.0516924 0.150418 0.109353 0.13089 0.0401335 -0.0580935 -0.0557284 0.0492986 0.123451 0.1319 -0.0891207 -0.0564505 -0.043281 -0.0154224 0.0899049 -0.164619 0.171003 0.184785 -0.141178 0.0375603 0.22477 0.0270277 -0.128383 -0.105483 -0.199289 -0.00320273 0.098379 0.00052965 0.0792002 -0.121069 0.103 -0.105888 -0.0167423 -0.160442 -0.0138657 -0.100606 -0.0515225 0.0873695 -0.0372306 -0.0643822 0.129821 -0.126218 -0.0995865 0.057905 0.0440858 -0.0256346 0.0464178 0.0395143 -0.126549 -0.0712366 -0.0751604 0.0479803 0.0107139 -0.077826 0.185027 0.0482184 -0.0256057 -0.0125728 0.0339054 0.109362 -0.0341545 -0.0335408 -0.112294 -0.0192852 -0.00293202 -0.0735818 -0.00611618 -0.0230326 0.11421 -0.0237346 -0.0303298 -0.0832011 0.0183553 0.0201279 0.0485648 0.00912599 0.12761 -0.0796931 -0.0286209 -0.0292367 -0.068396 -0.0685942 0.0773998 0.123639 -0.00875646 -0.0502466 -0.0526124 0.083982 -0.0942581 -0.0849492 -0.0384966 -0.0896808 -0.0425653 -0.0717744 -0.0239894 0.00942137 -0.0336319 0.0410454 -0.016042 0.0142511 0.150329 -0.0804337 0.0148806 -0.138973 0.164446 0.0023326 -0.0586301 0.00886155 0.120684 -0.105133 -0.0245333 0.010214 0.102472 -0.0646266 -0.0361498 -0.0108738 0.189848 -0.0591928 0.0247889 -0.123923 0.109502 -0.123737 0.0301398 -0.122745 -0.047262 
0.126444 -0.0907515 -0.0976131 0.0312093 0.166372 0.109704 0.11167 0.0293292 -0.0779331 -0.0361961 0.0355895 0.139189 0.135703 -0.0765757 -0.0571458 -0.039871 -0.00703405 0.103208 -0.161019 0.176578 0.175444 -0.118248 0.0436907 0.229742 0.0191928 -0.104086 -0.0942359 -0.191183 0.00895802 0.108331 -0.0131685 0.079071 -0.12063 0.088711 -0.102887 -0.0141733 -0.172541 -0.0087484 -0.0983119 -0.0436277 0.0719509 -0.0200284 -0.066829 0.142247 -0.137915 -0.0856584 0.0721125 0.0504554 -0.0324925 0.0475058 0.0656546 -0.115086 -0.0786095 -0.0836737 0.053307 0.00663659 -0.071315 0.199243 0.0586486 -0.0352034 -0.0136815 0.033384 0.1166 -0.0176622 -0.0326535 -0.132757 -0.0257198 0.0162682 -0.0761279 0.00294094 -0.00630796 0.121685 -0.0151457 -0.0380583 -0.0901407 0.0312424 0.00139833 0.0479037 0.0173745 0.12037 -0.0620845 -0.00746903 -0.0240328 -0.0581101 -0.0633328 0.0466592 0.128457 0.0031431 -0.0368085 -0.0482244 0.0575844 -0.0807434 -0.0882702 -0.0263521 -0.0859053 -0.0445979 -0.0611474 -0.0111512 0.00267248 -0.0498843 0.0422538 -0.00301412 0.0155455 0.152533 -0.109556 0.0111817 -0.159641 0.150006 0.0161092 -0.0580288 0.03314 0.132806 -0.109149 -0.00974851 0.000692122 0.101634 -0.0818161 -0.0463417 -0.0254084 0.185103 -0.0573247 0.0203024 -0.116364 0.0851862 -0.130374 0.0362825 -0.127754 -0.0538058 
0.132352 -0.0824489 -0.115818 0.0303316 0.160532 0.120269 0.113357 0.0493246 -0.0736168 -0.0386929 0.0467712 0.128416 0.133136 -0.0892741 -0.0488957 -0.0380871 0.00704609 0.0935719 -0.166211 0.173959 0.160278 -0.113165 0.0465098 0.22033 0.0145955 -0.119856 -0.087813 -0.191349 -0.00421046 0.0852686 -0.00514925 0.0778089 -0.115296 0.100408 -0.117029 -0.00999407 -0.155165 -0.0216897 -0.110505 -0.0268827 0.0880784 -0.0244584 -0.064289 0.144113 -0.143512 -0.0846158 0.0723572 0.0498104 -0.0407144 0.0604859 0.0609353 -0.12748 -0.0946478 -0.0786814 0.0368851 0.00750339 -0.0773607 0.189394 0.0673798 -0.0250359 -0.0259056 0.0366047 0.109415 -0.0415286 -0.0364399 -0.135837 -0.0207551 0.0137553 -0.0714391 0.00247067 -0.00849123 0.117006 -0.0118491 -0.0320832 -0.0815157 0.0264664 0.00241357 0.0610342 0.00185224 0.107141 -0.0711686 -0.0119571 -0.0296048 -0.0627592 -0.0720708 0.0815028 0.126176 -0.0177449 -0.047837 -0.0492185 0.0627924 -0.0939834 -0.101546 -0.0447018 -0.0716138 -0.0366819 -0.0618351 -0.0212101 -0.0150051 -0.0451019 0.0216103 -0.0124514 0.0231757 0.155934 -0.108114 0.0106966 -0.164379 0.157708 -0.00928739 -0.057758 0.0287865 0.128889 -0.0910562 -0.0124285 -0.00648309 0.0803469 -0.0756838 -0.0571769 -0.0118406 0.18338 -0.0491608 0.0223094 -0.110419 0.112693 -0.119126 0.0103623 -0.133949 -0.0537286 
0.164443 -0.0829765 -0.129725 0.0197727 0.154505 0.114752 0.135358 0.0746093 -0.110172 -0.0390983 0.0238195 0.108408 0.14134 -0.116794 -0.0427061 -0.0240257 0.0297752 0.0628487 -0.157635 0.188173 0.156861 -0.102647 0.0323001 0.164276 -0.00619171 -0.0788672 -0.103391 -0.210408 -0.00350422 0.079603 -0.0296168 0.119684 -0.123461 0.111622 -0.106343 -0.044768 -0.125543 0.0296773 -0.0895353 -0.0612579 0.082378 -0.0364396 -0.0460349 0.145139 -0.131068 -0.0489553 0.0773588 0.0430775 -0.0703942 0.0547849 0.0662747 -0.128182 -0.087944 -0.0589918 0.044504 -0.0302789 -0.074099 0.156174 0.0711458 -0.0489318 -0.00748975 0.0113811 0.097095 -0.0476076 -0.024021 -0.139572 -0.0191931 0.0188303 -0.0516296 -0.0486171 -0.0257249 0.0919451 -0.0150873 -0.021603 -0.0988242 0.0151463 0.0106997 0.0555174 0.0173905 0.130245 -0.0570932 -0.0282885 -0.0401152 -0.0791307 -0.0444824 0.0447583 0.123169 -0.0107314 -0.0216705 -0.0397557 0.0672993 -0.0857393 -0.13069 -0.0379274 -0.0865083 -0.016883 0.00106168 -0.0205221 -0.0267272 -0.0539777 0.0190096 0.00789995 0.0190584 0.18192 -0.134914 -0.0203173 -0.16088 0.192211 0.00481002 -0.0592394 0.0402355 0.134025 -0.130056 -0.0207491 0.0135744 0.0571229 -0.0926355 -0.0882636 -0.0214575 0.152927 -0.0623876 0.0490313 -0.0557569 0.126211 -0.0739975 -0.0364877 -0.113837 -0.0924322 
0.136266 -0.0924815 -0.106481 0.0474364 0.149464 0.0975873 0.124209 0.058526 -0.0679722 -0.0439639 0.0511336 0.123911 0.138286 -0.1068 -0.0677365 -0.0338104 0.00368061 0.0839258 -0.168712 0.192973 0.180646 -0.148415 0.0438994 0.207885 0.0124615 -0.121099 -0.101909 -0.201587 -0.000340207 0.0905637 -0.0109783 0.0801825 -0.102598 0.106086 -0.11591 -0.0305315 -0.158379 0.00715034 -0.111718 -0.0625153 0.0715865 -0.0415592 -0.0667808 0.135716 -0.122924 -0.0891114 0.0580451 0.0416512 -0.0433182 0.0563413 0.0450313 -0.120866 -0.0831037 -0.0780341 0.0391663 -0.00204292 -0.0816905 0.161405 0.0515599 -0.0278358 -0.00939029 0.0178321 0.106193 -0.0318271 -0.0266041 -0.134001 -0.0315853 0.00205145 -0.0750995 -0.0228616 -0.0243047 0.0954524 -0.0271366 -0.0351309 -0.0908337 0.0193534 0.0287299 0.0616028 0.0108766 0.132251 -0.0911931 -0.0461583 -0.0374903 -0.0652758 -0.0582731 0.0723344 0.11779 -0.00724822 -0.0302797 -0.0493621 0.0678872 -0.0920967 -0.103151 -0.0269229 -0.081857 -0.0386104 -0.0553025 -0.0263479 -0.00880787 -0.0436212 0.0397059 -0.0120411 0.00810944 0.153019 -0.0846955 0.00821168 -0.134095 0.17348 0.0164536 -0.0666526 0.00319007 0.125681 -0.106127 -0.0181375 0.0162179 0.0878227 -0.0749169 -0.0454673 -0.00654417 0.188456 -0.0795624 0.0343704 -0.116256 0.117655 -0.100097 0.0147342 -0.111312 -0.0624867 
0.15921 -0.0644414 -0.120244 0.036654 0.147539 0.116856 0.152975 0.0567914 -0.0666241 -0.0476094 0.0532868 0.106417 0.137564 -0.131249 -0.0519226 -0.038594 0.00120577 0.0715987 -0.17827 0.19317 0.171039 -0.122712 0.034591 0.174616 -0.00706939 -0.120381 -0.118164 -0.211292 0.00290591 0.0947659 -0.0237337 0.101376 -0.110391 0.12526 -0.0912096 -0.0438295 -0.113808 0.0338673 -0.0988431 -0.0739445 0.0778708 -0.0562686 -0.0539491 0.130749 -0.136666 -0.070064 0.0609629 0.0534459 -0.064977 0.0742747 0.036101 -0.117126 -0.0925832 -0.0555136 0.0476086 -0.0168982 -0.0889581 0.147944 0.0325116 -0.0347194 -0.016863 0.00381016 0.122664 -0.0654005 -0.0151856 -0.132771 -0.0211113 -0.00370219 -0.0796795 -0.0290524 -0.0295795 0.0825842 -0.0282704 -0.00629911 -0.0950801 0.00166648 0.0285556 0.054692 0.0158398 0.125233 -0.0742441 -0.0393785 -0.0491391 -0.0733909 -0.0448086 0.0656216 0.106534 -0.0180636 -0.0177202 -0.0148789 0.0993749 -0.118458 -0.117535 -0.0389384 -0.083461 -0.0445695 -0.0361581 -0.0319214 -0.00780599 -0.0401044 0.0377759 0.0023063 0.00689826 0.161479 -0.0966519 -0.00185122 -0.123764 0.19191 0.0149732 -0.0476184 0.0181901 0.124637 -0.117311 -0.0160618 0.023362 0.0712271 -0.0663187 -0.064272 -0.00248906 0.175506 -0.0611952 0.046228 -0.0790472 0.15301 -0.0714957 -0.0217483 -0.0889385 -0.0831857 
0.154794 -0.0643827 -0.103978 0.0374927 0.14182 0.111405 0.142546 0.0577206 -0.0651682 -0.0362995 0.0639382 0.104719 0.145181 -0.122829 -0.0538415 -0.0314175 -0.00336594 0.0734271 -0.187973 0.195348 0.179115 -0.131135 0.0398541 0.181103 -0.00315977 -0.117917 -0.11894 -0.204324 0.0111419 0.0940908 -0.0205583 0.0964658 -0.11131 0.121204 -0.100537 -0.039871 -0.134135 0.0428628 -0.0968123 -0.0673825 0.0613978 -0.0575854 -0.0712043 0.126276 -0.12709 -0.0821865 0.0514729 0.0568535 -0.0615959 0.0703442 0.0422353 -0.10181 -0.100315 -0.0620793 0.0421619 -0.0183933 -0.089271 0.14864 0.0340983 -0.0350517 -0.0188439 -0.00329206 0.121248 -0.0504769 -0.0210416 -0.131426 -0.0226771 0.00878578 -0.0823997 -0.0227927 -0.0225282 0.0901286 -0.0274769 -0.0109803 -0.0945575 -0.00287261 0.0281405 0.052163 0.0177266 0.139874 -0.0716533 -0.0508892 -0.0425625 -0.0741876 -0.0500848 0.0618248 0.11031 -0.0116054 -0.0103235 -0.0224051 0.0879511 -0.113072 -0.111219 -0.0225475 -0.0901886 -0.0499442 -0.0442802 -0.0350547 -0.00833331 -0.0438071 0.046945 0.0037047 -0.00243792 0.157019 -0.0866036 0.00530798 -0.123596 0.185301 0.0412577 -0.0610072 0.00896588 0.135802 -0.120086 -0.00804532 0.0332047 0.0809434 -0.0723286 -0.0497651 -0.00550692 0.181524 -0.0705161 0.0418988 -0.0871776 0.148303 -0.0716289 -0.00772726 -0.0818551 -0.0734394 
0.157394 -0.0558257 -0.106257 0.0337805 0.134083 0.121518 0.148375 0.0573638 -0.0710764 -0.0344389 0.0642911 0.0956986 0.151337 -0.129089 -0.0426956 -0.0324519 -0.00778075 0.0733076 -0.190054 0.190004 0.172083 -0.121586 0.0411871 0.172105 -0.0146224 -0.12418 -0.128622 -0.211903 0.00486608 0.0954715 -0.0212882 0.103833 -0.116344 0.127765 -0.095888 -0.0396831 -0.120073 0.0405908 -0.0919339 -0.05432 0.0637878 -0.0654069 -0.0682177 0.121531 -0.132301 -0.0819496 0.0549423 0.0586731 -0.0651585 0.079475 0.0463751 -0.111361 -0.104067 -0.0500413 0.0331778 -0.0198406 -0.0815601 0.141806 0.0374239 -0.0295636 -0.0223455 0.0037541 0.114873 -0.0651761 -0.0183581 -0.13434 -0.0129696 -0.000201305 -0.0848596 -0.0284222 -0.0272632 0.087726 -0.0254598 0.0013402 -0.0921651 -0.00866786 0.0251738 0.0455945 0.0171125 0.138693 -0.0623854 -0.0567142 -0.0468685 -0.0718943 -0.0546394 0.0760481 0.106774 -0.0288382 -0.0178123 -0.0180207 0.0918287 -0.121839 -0.109258 -0.0307242 -0.0962362 -0.0457284 -0.0464831 -0.0317898 -0.0112196 -0.0307489 0.0444706 0.00674796 -0.00132227 0.166489 -0.0785862 -6.94582e-05 -0.124635 0.193584 0.0283453 -0.0505107 0.00382673 0.128683 -0.116649 -0.0131482 0.0205105 0.0803452 -0.0616284 -0.0483673 -0.00655593 0.178004 -0.0614661 0.0346465 -0.0789774 0.155529 -0.0671961 -0.0214247 -0.0897297 -0.0721736 
0.162892 -0.055213 -0.103539 0.0058164 0.140589 0.125587 0.141606 0.0726738 -0.11024 -0.0172635 0.0344115 0.0744945 0.158602 -0.145222 -0.0252841 -0.0161855 -0.0198182 0.0601917 -0.192065 0.197499 0.145976 -0.0949641 0.0548067 0.127654 -0.0402464 -0.098158 -0.142188 -0.21363 0.00660295 0.064663 -0.0269254 0.107464 -0.146697 0.116193 -0.0851391 -0.0411877 -0.117742 0.0472938 -0.0779281 -0.0387023 0.0548504 -0.0577909 -0.070908 0.13448 -0.138869 -0.0671294 0.0612528 0.0775195 -0.0676206 0.101708 0.0543454 -0.131456 -0.125954 -0.0419157 0.0157377 -0.0571337 -0.0623056 0.131907 0.0635529 -0.0360689 -0.0134105 0.0154025 0.101517 -0.0462951 -0.0176204 -0.162358 -0.00432819 0.00810026 -0.0594928 -0.0530905 -0.0209863 0.105437 0.0116458 0.0207461 -0.113084 -0.0236935 0.00495549 0.0440811 0.0326768 0.14185 -0.0134892 -0.064642 -0.0553505 -0.0581961 -0.0499607 0.0585976 0.103963 -0.011936 -0.00261677 -0.0275301 0.0913703 -0.0903621 -0.119301 -0.0380764 -0.108657 -0.0355888 -0.0206193 -0.0150599 -0.0412279 -0.0294332 0.029879 0.0122546 -0.00377974 0.164398 -0.0880679 -0.0164868 -0.135713 0.206866 0.0444246 -0.0219423 0.021583 0.141891 -0.113941 0.000654456 -0.00414816 0.0715409 -0.0609894 -0.0399692 -0.0387755 0.139047 -0.0717444 0.0405436 -0.0389772 0.151231 -0.0704031 -0.0590848 -0.115436 -0.0812677 
0.141923 -0.0362525 -0.0970235 0.0213105 0.140839 0.107637 0.125284 0.0639183 -0.0593797 -0.0212031 0.0676986 0.0897935 0.150409 -0.135534 -0.062599 0.00473716 -0.0126386 0.0711826 -0.227692 0.200024 0.169377 -0.122066 0.0558588 0.162699 -0.021227 -0.115385 -0.12461 -0.185452 0.0407478 0.0669283 -0.0100652 0.113933 -0.120824 0.117607 -0.120861 -0.0421154 -0.135992 0.063368 -0.0837119 -0.0270839 0.0564732 -0.0532847 -0.0784533 0.111787 -0.117888 -0.103542 0.0490271 0.0679038 -0.058952 0.080268 0.0424153 -0.0894209 -0.132633 -0.0576783 0.0122784 -0.0353032 -0.063791 0.135163 0.0445238 -0.0409108 -0.0398169 0.00152992 0.119791 -0.0396309 -0.0416265 -0.13018 -0.0159693 0.0172046 -0.0720031 -0.0241939 -0.0169727 0.101303 -0.00629474 0.0262451 -0.0789281 -0.0221 0.0180967 0.062572 0.00142721 0.124142 -0.0405782 -0.0394593 -0.0368534 -0.0590037 -0.0514369 0.0886807 0.104706 0.00510325 -0.00716977 -0.0419095 0.0829786 -0.107642 -0.119364 -0.0186657 -0.0733982 -0.0474448 -0.0521452 -0.0178929 -0.0345558 -0.0342675 0.0363599 -0.0236843 -0.0107023 0.186149 -0.0719311 0.00922902 -0.131216 0.192275 0.0715859 -0.0682189 -0.00796344 0.162929 -0.109573 0.0227585 0.0225258 0.0713283 -0.082695 -0.0282422 -0.00555547 0.165769 -0.0736107 0.0567838 -0.0689995 0.145975 -0.088501 -0.0203712 -0.112406 -0.0662095 
0.141355 -0.0418366 -0.1023 0.0408613 0.122266 0.10108 0.124356 0.0498342 -0.0434258 -0.0297858 0.0890173 0.100996 0.148322 -0.131615 -0.0941401 -0.00891635 -0.0107863 0.0779691 -0.226516 0.203352 0.174627 -0.146056 0.0619807 0.17943 -0.0245198 -0.121374 -0.111169 -0.188627 0.0309879 0.0725428 -0.0246751 0.0961005 -0.103097 0.11473 -0.127199 -0.0483588 -0.144454 0.0808425 -0.0973706 -0.0318096 0.0412254 -0.0531424 -0.102184 0.0973347 -0.117121 -0.112367 0.0386839 0.0536946 -0.0577179 0.0834772 0.0382962 -0.0733686 -0.117771 -0.0524333 0.0126946 -0.0261794 -0.0489121 0.130039 0.0331462 -0.0358091 -0.034499 -0.000217816 0.135255 -0.0420956 -0.0348413 -0.128446 -0.0183188 0.0151486 -0.0817249 -0.0114225 -0.0211071 0.0818626 -0.0150358 0.0263972 -0.0709046 -0.0149798 0.0278118 0.0544923 -0.00514386 0.122873 -0.0731383 -0.052239 -0.0380049 -0.0688973 -0.0571624 0.0978122 0.102527 -0.0021982 -0.0117186 -0.0488446 0.0793308 -0.121851 -0.0951001 -0.0148698 -0.0664214 -0.0615885 -0.0586763 -0.0235349 -0.0132414 -0.0290778 0.0542439 -0.015036 -0.0153524 0.184309 -0.0450342 0.0103769 -0.111063 0.183442 0.0623554 -0.0797514 -0.0175062 0.160514 -0.0876085 0.0184811 0.0270742 0.0877445 -0.0855389 -0.0176011 0.00958142 0.174489 -0.0923941 0.0447537 -0.092603 0.133525 -0.0801098 0.00869564 -0.102819 -0.0582284 
0.141631 -0.0286484 -0.0969538 0.0306229 0.134389 0.1087 0.120238 0.0565454 -0.0515702 -0.0209616 0.0768948 0.0918391 0.14842 -0.131398 -0.0751983 -0.00529313 -0.00777518 0.0753068 -0.229336 0.204759 0.172609 -0.1362 0.0503814 0.168754 -0.00873165 -0.116295 -0.121544 -0.175801 0.0413545 0.0702752 -0.00433636 0.104458 -0.116934 0.116913 -0.120442 -0.0414671 -0.142273 0.0734395 -0.0822854 -0.0424851 0.0477887 -0.0522318 -0.0804185 0.111552 -0.112416 -0.118244 0.0465478 0.0665793 -0.0569397 0.0843194 0.0413504 -0.0713421 -0.129965 -0.0597442 0.0191027 -0.0352108 -0.0743006 0.136014 0.0404174 -0.0572463 -0.043284 -0.00574876 0.132643 -0.0423996 -0.0448236 -0.120362 -0.0165261 0.0194232 -0.0842129 -0.0156644 -0.0132076 0.09902 -0.00867656 0.0278312 -0.0795697 -0.028989 0.0244818 0.0586275 0.0040473 0.128288 -0.0560536 -0.0400652 -0.0300107 -0.0655895 -0.0446483 0.0754246 0.100443 0.0135972 0.0135581 -0.04133 0.0780418 -0.115354 -0.109253 -0.0127239 -0.0672319 -0.0598475 -0.0501569 -0.0200502 -0.0366961 -0.0411409 0.0370103 -0.0128861 -0.0145349 0.184577 -0.0734264 0.0207336 -0.122649 0.183286 0.0827382 -0.073683 -0.00767404 0.166977 -0.11329 0.0359654 0.0348605 0.0675153 -0.08109 -0.0277967 0.00647537 0.169137 -0.0792388 0.0560574 -0.0711328 0.14034 -0.0830233 -0.0154976 -0.0898553 -0.0622202 
0.140523 -0.0494574 -0.0934476 0.0265562 0.116666 0.110374 0.105401 0.0537566 -0.0440441 -0.046877 0.0790766 0.108371 0.142803 -0.125422 -0.0979194 -0.0236619 -0.0351743 0.0654473 -0.228585 0.202244 0.175107 -0.129484 0.0649572 0.178344 -0.0186871 -0.103218 -0.087336 -0.181499 0.0246133 0.065244 -0.0200791 0.0789464 -0.105789 0.113444 -0.129867 -0.0446795 -0.159695 0.0892148 -0.0991566 -0.0294932 0.0374919 -0.0550013 -0.110056 0.11495 -0.12162 -0.118857 0.0430231 0.0522734 -0.0551773 0.0990967 0.0391505 -0.0591924 -0.1092 -0.0452254 0.0291534 -0.033889 -0.0538701 0.142116 0.0324839 -0.0639814 -0.0382629 -0.00515787 0.15289 -0.0193609 -0.0508386 -0.127834 -0.00993161 0.0309657 -0.0710611 0.00704457 -0.0152622 0.0844319 -0.0112475 0.0273973 -0.064307 -0.0225061 0.00955988 0.0331345 -0.000453137 0.146426 -0.0647145 -0.0427183 -0.0225746 -0.0759329 -0.0555021 0.0706103 0.112012 0.0186483 0.00394486 -0.0426186 0.0816823 -0.122604 -0.0968123 -0.00545061 -0.0737226 -0.0677583 -0.0564099 -0.0178017 -0.00710659 -0.0497813 0.0509633 -0.00545086 -0.0182646 0.177786 -0.0622545 0.0128882 -0.126297 0.176708 0.0666485 -0.0896916 0.00713987 0.180373 -0.105111 0.0279122 0.0337185 0.0924493 -0.084608 -0.0290567 0.0200898 0.175112 -0.0790052 0.0468294 -0.0805479 0.117178 -0.0826881 0.00560558 -0.0747875 -0.0433277 
0.164713 -0.0632283 -0.0778084 0.0156377 0.128944 0.108438 0.115595 0.0816004 -0.0925685 -0.0210711 0.0431364 0.0804838 0.151095 -0.14971 -0.055369 0.013356 -0.00282669 0.0558657 -0.223806 0.217606 0.154863 -0.101367 0.0570509 0.150695 -0.0493101 -0.0761525 -0.129692 -0.199477 0.0285085 0.0365578 -0.0243464 0.119619 -0.138446 0.119373 -0.113616 -0.0455992 -0.138313 0.0931077 -0.0833195 -0.0356628 0.0316286 -0.0451895 -0.0977741 0.106931 -0.0946159 -0.0900274 0.0465824 0.0662258 -0.075984 0.101491 0.0549341 -0.108573 -0.125366 -0.047836 0.0127136 -0.0632584 -0.0547043 0.129212 0.0625185 -0.0543083 -0.0162196 0.0101525 0.105323 -0.0339664 -0.0327666 -0.151453 -0.00419597 0.0193723 -0.0636175 -0.0454747 -0.0259183 0.0895499 0.0104296 0.0414561 -0.106961 -0.0430493 0.0209375 0.0533683 0.0252773 0.139154 -0.0156753 -0.0529961 -0.0565786 -0.0850905 -0.0370321 0.0418137 0.101598 0.0131194 0.00592959 -0.0355408 0.0865576 -0.0812355 -0.12107 -0.000180128 -0.0779154 -0.0102232 -0.0141484 -0.0243332 -0.0482134 -0.0272764 0.0324662 -0.00980011 -0.0364311 0.180521 -0.0832471 -0.0102495 -0.128287 0.171692 0.0766971 -0.0607592 0.0085135 0.186986 -0.105127 0.0178316 0.0271074 0.0655695 -0.0917855 -0.0398896 -0.0355047 0.129773 -0.0970144 0.0673854 -0.028083 0.134805 -0.063642 -0.040731 -0.105255 -0.0984111 
0.147832 -0.0801383 -0.0708996 0.0161997 0.132936 0.117141 0.090309 0.0566411 -0.0863264 -0.0444773 0.0456527 0.118865 0.133802 -0.142449 -0.0768198 0.0220985 -0.0385668 0.0598968 -0.218134 0.222089 0.172299 -0.0941468 0.060708 0.180911 -0.0440026 -0.0582185 -0.0996749 -0.201633 0.0161448 0.0521639 -0.0372642 0.0983213 -0.13027 0.125716 -0.118578 -0.0268586 -0.15164 0.0753761 -0.0872806 -0.0250411 0.033148 -0.0422025 -0.0802471 0.108349 -0.0906456 -0.104369 0.0779853 0.0491937 -0.0817178 0.118937 0.060321 -0.130849 -0.124122 -0.0349434 0.0525673 -0.0428336 -0.0618141 0.158739 0.0382142 -0.0538863 -0.0107117 0.0206916 0.140495 -0.0287547 -0.020389 -0.146607 -0.0198053 0.0175828 -0.0709919 -0.0119466 -0.0290565 0.0983569 0.00311364 0.0423475 -0.0855471 -0.0281732 0.025199 0.0500352 0.0190479 0.124921 -0.00747101 -0.0273892 -0.0456608 -0.0828906 -0.0694756 0.0454584 0.108967 0.0238026 -0.00357677 -0.0220975 0.0910184 -0.102811 -0.120494 0.0161464 -0.0713316 0.00466254 -0.0372261 -0.0159431 -0.0217462 -0.021759 0.0277709 -0.0273431 -0.0519927 0.16706 -0.0779463 0.0112667 -0.143502 0.152939 0.0334046 -0.0762029 0.0102151 0.194292 -0.0861262 0.0203113 0.0317009 0.0796626 -0.0838135 -0.0319119 -0.0329337 0.146255 -0.0763916 0.0625702 -0.0242152 0.101834 -0.0851803 0.00390437 -0.0943315 -0.0903931 
0.153377 -0.0743419 -0.0874449 0.0176104 0.140384 0.108377 0.0869536 0.0440129 -0.102725 -0.0354969 0.036689 0.121711 0.137186 -0.145829 -0.0850068 0.0352663 -0.0213121 0.0676434 -0.206787 0.232824 0.168429 -0.0893869 0.0692644 0.152802 -0.0474498 -0.032252 -0.10282 -0.208367 0.0203543 0.0573765 -0.0502348 0.124236 -0.125346 0.117121 -0.109635 -0.0409031 -0.139307 0.102264 -0.0663935 -0.0380757 0.0247373 -0.031984 -0.0707616 0.108983 -0.103375 -0.0958455 0.0891966 0.0452936 -0.0792141 0.113511 0.0742077 -0.119273 -0.123846 -0.0241729 0.0547785 -0.0629683 -0.0390089 0.138268 0.0428259 -0.0675561 -0.00720839 0.00150827 0.14035 -0.0259818 -0.0124006 -0.157811 -0.0211433 0.0260386 -0.0583485 -0.0229454 -0.0241483 0.0977426 0.0103293 0.0446561 -0.0953745 -0.031097 0.0170039 0.0503644 0.0151565 0.124482 -0.0018734 -0.011786 -0.0428365 -0.0778767 -0.0534639 0.0276741 0.104014 0.0373567 0.0103583 -0.0322006 0.0765105 -0.0921552 -0.130519 0.0174003 -0.0728984 -0.00690489 -0.0163839 0.00154538 -0.0320681 -0.0349649 0.0268744 -0.0207102 -0.0435173 0.187826 -0.0837617 -0.00196691 -0.139226 0.164351 0.0530561 -0.0700487 0.0107648 0.197447 -0.0968406 0.0308778 0.0289541 0.063942 -0.0970308 -0.049172 -0.0425055 0.128132 -0.0825475 0.0807582 -0.00342802 0.0920578 -0.0735358 -0.00995897 -0.0891318 -0.0941577 
0.149388 -0.0159646 -0.0899076 0.0088546 0.108784 0.0923709 0.108334 0.0713829 -0.0790188 -0.0278255 -0.000185897 0.0800724 0.139178 -0.167331 -0.0888717 0.0512106 0.00670011 -0.00285943 -0.226298 0.216219 0.124889 -0.0639541 0.0276166 0.100913 -0.0680367 -0.00982178 -0.132071 -0.176321 0.0597864 0.0373172 -0.0282369 0.16773 -0.13268 0.0915405 -0.12589 -0.0733925 -0.107829 0.150529 -0.0593046 -0.0115823 0.0220427 -0.025018 -0.0598244 0.0907156 -0.0546987 -0.0692815 0.0692935 0.0353805 -0.0619195 0.0898822 0.0883164 -0.0677356 -0.110207 -0.0288786 0.0322605 -0.0881582 -0.0348001 0.0977239 0.0900568 -0.0987312 -0.028987 -0.0187632 0.0903984 -0.032054 -0.0495953 -0.16142 0.0269222 0.0170527 -0.041979 -0.090021 -0.0118365 0.0779447 0.0291611 0.0767245 -0.0785044 -0.0245233 0.00323984 0.0469844 0.0114219 0.151828 0.0405247 -0.0186346 -0.0246084 -0.0550401 0.0136585 0.00396906 0.0971227 0.0389921 0.0261823 -0.0582194 0.0191057 -0.0697931 -0.140821 0.0191717 -0.0705141 0.00628082 0.0585366 -0.0158621 -0.0604368 -0.0332273 0.00524698 -0.00476297 -0.0369003 0.238526 -0.148827 -0.0370108 -0.1383 0.18182 0.0872172 -0.0598878 0.0302685 0.201522 -0.144872 0.0372697 0.0126724 0.0403445 -0.138783 -0.0465277 -0.0649215 0.0817576 -0.10154 0.11458 0.0411133 0.0828671 -0.0362981 -0.057059 -0.107863 -0.110656 
0.13014 0.0146971 -0.0785479 0.0191537 0.0779317 0.0809493 0.11165 0.037871 -0.0457056 -0.0348894 0.0219558 0.085634 0.135409 -0.200439 -0.111024 0.0245752 -0.0217306 -0.00527296 -0.245422 0.230471 0.11327 -0.0748903 0.028991 0.0679333 -0.0966739 -0.0078511 -0.142665 -0.190708 0.0523969 0.0447905 -0.0232384 0.174027 -0.105207 0.102339 -0.0934541 -0.0822721 -0.0737209 0.201089 -0.051371 -0.0270255 0.0191714 -0.0596431 -0.0867126 0.0798241 -0.0707907 -0.0578357 0.0632171 0.0356327 -0.0841748 0.0949797 0.0510488 -0.0362734 -0.10321 -0.0100027 0.0245598 -0.0953498 -0.03897 0.0597937 0.037194 -0.0939857 -0.0400154 -0.042952 0.114267 -0.0412769 -0.0146375 -0.172599 0.0394889 0.00533471 -0.0617231 -0.0916583 -0.0135752 0.034668 0.0234984 0.0974828 -0.0719081 -0.0370383 -0.00803928 0.0385706 0.0107133 0.163245 0.00784237 -0.0359338 -0.0359744 -0.0431848 0.0131517 0.00197961 0.0874809 0.0313677 0.0292592 -0.0430432 0.0333881 -0.105686 -0.107024 0.0269766 -0.0865373 -0.0322547 0.0525639 -0.027242 -0.0428237 -0.0338873 0.0152553 0.0127977 -0.0627686 0.241196 -0.0947767 -0.0383237 -0.0854255 0.209953 0.0992311 -0.0406642 0.00546855 0.18502 -0.158393 0.0477144 0.00857549 0.0335383 -0.148256 -0.0545072 -0.0351741 0.084644 -0.0992005 0.121858 0.0258432 0.104991 0.0079509 -0.0587056 -0.0747521 -0.113738 
