{
  "descriptor": [
    -0.13879548013210297,
    0.10090644657611847,
    -0.01700323261320591,
    -0.06590928137302399,
    -0.12307517230510712,
    -0.06819090247154236,
    0.02796870842576027,
    -0.11799659579992294,
    0.11267102509737015,
    -0.04325221851468086,
    0.264619916677475,
    -0.08442499488592148,
    -0.2549876272678375,
    -0.07876317203044891,
    -0.0007404874195344746,
    0.1287650614976883,
    -0.1756274253129959,
    -0.12808513641357422,
    -0.15255114436149597,
    -0.1116340309381485,
    0.012409632094204426,
    0.11341962218284607,
    0.010682119987905025,
    0.09998800605535507,
    -0.10050316154956818,
    -0.31107234954833984,
    -0.0033962600864470005,
    -0.13380253314971924,
    0.05230111628770828,
    -0.06525500118732452,
    0.1065269485116005,
    0.169252410531044,
    -0.1063455119729042,
    -0.01692679338157177,
    0.06233939900994301,
    0.05813626945018768,
    -0.08265011757612228,
    -0.043307866901159286,
    0.20835967361927032,
    0.00422965781763196,
    -0.14614450931549072,
    0.030749952420592308,
    0.041279759258031845,
    0.3571838438510895,
    0.1774154156446457,
    -0.03534260764718056,
    0.024435151368379593,
    -0.10798633843660355,
    0.11538185924291611,
    -0.27901026606559753,
    0.013279149308800697,
    0.18360723555088043,
    0.12167026847600937,
    0.0573183111846447,
    0.12497436255216599,
    -0.0967012494802475,
    0.05084844306111336,
    0.12895698845386505,
    -0.2582165002822876,
    0.12787091732025146,
    0.08184786885976791,
    -0.053872447460889816,
    -0.06371649354696274,
    -0.12423645704984665,
    0.1452774554491043,
    0.10799331218004227,
    -0.10322660952806473,
    -0.12915515899658203,
    0.10851054638624191,
    -0.18583521246910095,
    -0.1626492589712143,
    0.16051369905471802,
    -0.12438942492008209,
    -0.21739251911640167,
    -0.22192397713661194,
    -0.012609736062586308,
    0.3322579562664032,
    0.17886000871658325,
    -0.2144717425107956,
    -0.026208927854895592,
    0.017284559085965157,
    -0.01917116530239582,
    0.12003054469823837,
    0.009425753727555275,
    -0.10542282462120056,
    -0.14210939407348633,
    -0.11256390064954758,
    0.02598901093006134,
    0.21369434893131256,
    -0.011585154570639133,
    -0.08037800341844559,
    0.2945125102996826,
    0.04504423588514328,
    -0.06507961452007294,
    0.02866058610379696,
    0.009012415073812008,
    -0.04524494707584381,
    -0.011674257926642895,
    -0.12214455008506775,
    -0.06281381845474243,
    0.0769941434264183,
    -0.12205985933542252,
    -0.007823644205927849,
    0.02234187163412571,
    -0.16461725533008575,
    0.20241883397102356,
    -0.012401139363646507,
    0.049086861312389374,
    0.000276282342383638,
    -0.03324952349066734,
    -0.09667405486106873,
    0.07668647170066833,
    0.2137123942375183,
    -0.2006678283214569,
    0.26517045497894287,
    0.14766862988471985,
    0.08131919056177139,
    0.10381859540939331,
    0.03152383863925934,
    -0.0075981467962265015,
    -0.052192460745573044,
    -0.07464546710252762,
    -0.11472573131322861,
    -0.1031883955001831,
    0.08266174793243408,
    -0.03254147991538048,
    0.037155259400606155,
    -0.009524213150143623
  ]
}