{
  "descriptor": [
    -0.09321790933609009,
    0.07017506659030914,
    0.09964226186275482,
    -0.09666368365287781,
    -0.16970624029636383,
    0.023389052599668503,
    -0.08883152157068253,
    -0.013335585594177246,
    0.15849807858467102,
    -0.14984844624996185,
    0.17943091690540314,
    -0.03084557317197323,
    -0.1898861825466156,
    0.06988004595041275,
    -0.0637153834104538,
    0.15140557289123535,
    -0.18275666236877441,
    -0.1731909215450287,
    -0.021700594574213028,
    -0.02197607047855854,
    0.022486763074994087,
    0.10669083148241043,
    -0.05368556082248688,
    0.057398341596126556,
    -0.13354039192199707,
    -0.4060854911804199,
    -0.06188813969492912,
    -0.060178082436323166,
    0.05514861270785332,
    -0.08887732028961182,
    -0.06425600498914719,
    0.09302231669425964,
    -0.1451343297958374,
    -0.008616909384727478,
    0.07105634361505508,
    0.07143700122833252,
    -0.01427359227091074,
    -0.10410398244857788,
    0.2203630656003952,
    0.10201022028923035,
    -0.26724353432655334,
    0.017067134380340576,
    0.06627464294433594,
    0.26846933364868164,
    0.11956734210252762,
    -0.007444893941283226,
    0.05377362668514252,
    -0.0693599060177803,
    0.15346211194992065,
    -0.2688902020454407,
    0.02734651416540146,
    0.18189987540245056,
    0.05424295738339424,
    0.06474298238754272,
    0.06017015129327774,
    -0.1421949714422226,
    0.001424869755282998,
    0.09519262611865997,
    -0.1717367023229599,
    0.05537597835063934,
    0.06228116154670715,
    -0.06447750329971313,
    0.011286048218607903,
    -0.07317452877759933,
    0.17374618351459503,
    0.0750870332121849,
    -0.07058659195899963,
    -0.18236738443374634,
    0.21843869984149933,
    -0.13756458461284637,
    -0.09250540286302567,
    0.0788886696100235,
    -0.08724330365657806,
    -0.15307150781154633,
    -0.20786722004413605,
    0.05401802062988281,
    0.4033365547657013,
    0.1628827303647995,
    -0.13287727534770966,
    0.08070790767669678,
    -0.026629386469721794,
    -0.09283486753702164,
    0.02623678743839264,
    0.13108840584754944,
    -0.06673270463943481,
    0.0602860227227211,
    -0.030579544603824615,
    0.03487546741962433,
    0.2652999460697174,
    0.045876942574977875,
    0.01670517958700657,
    0.2118789404630661,
    0.04836009442806244,
    0.051687899976968765,
    0.10424023121595383,
    0.0728280171751976,
    -0.1355297565460205,
    -0.05187907814979553,
    -0.17780038714408875,
    -0.020720476284623146,
    -0.018371809273958206,
    -0.05408677086234093,
    -0.023026451468467712,
    0.17320950329303741,
    -0.20566049218177795,
    0.17887000739574432,
    -0.06622619926929474,
    -0.10816347599029541,
    -0.05009353533387184,
    0.06824954599142075,
    -0.03871319070458412,
    -0.0478697270154953,
    0.11653512716293335,
    -0.20200300216674805,
    0.0983368530869484,
    0.1557939052581787,
    0.1049380674958229,
    0.15938282012939453,
    0.08995884656906128,
    0.003068872494623065,
    0.023086026310920715,
    -0.05617474764585495,
    -0.16688387095928192,
    -0.13470405340194702,
    0.06058672070503235,
    -0.04699176177382469,
    -0.00817514955997467,
    0.012266881763935089
  ]
}