{
  "descriptor": [
    -0.1253010630607605,
    0.056718453764915466,
    0.05979594960808754,
    -0.13341554999351501,
    -0.123448446393013,
    0.041577041149139404,
    0.0011010064044967294,
    -0.08258653432130814,
    0.137288436293602,
    -0.1176842451095581,
    0.24525991082191467,
    -0.04369710385799408,
    -0.21874715387821198,
    -0.07130900025367737,
    0.010856724344193935,
    0.1838548183441162,
    -0.17757636308670044,
    -0.15210440754890442,
    -0.07902780175209045,
    -0.007628409657627344,
    0.009902480989694595,
    0.06519711017608643,
    -0.03259497508406639,
    0.07682662457227707,
    -0.14994028210639954,
    -0.3893588185310364,
    -0.05767650902271271,
    -0.05679241567850113,
    -0.03024088591337204,
    -0.03856208175420761,
    0.0019760332070291042,
    0.1409115344285965,
    -0.18945695459842682,
    -0.03107500821352005,
    0.02050766721367836,
    0.07189060747623444,
    -0.09494464099407196,
    -0.1160280704498291,
    0.20115123689174652,
    0.04990358278155327,
    -0.22844462096691132,
    -0.0005684144562110305,
    0.07392297685146332,
    0.29849371314048767,
    0.12290602177381516,
    -0.037945300340652466,
    0.021871015429496765,
    -0.0010959795909002423,
    0.13051265478134155,
    -0.3437504470348358,
    0.04848345369100571,
    0.14599314332008362,
    0.07199061661958694,
    0.061171457171440125,
    0.053364966064691544,
    -0.11755092442035675,
    0.05631265789270401,
    0.14069923758506775,
    -0.2551839053630829,
    0.04192148149013519,
    0.029928408563137054,
    -0.09592098742723465,
    -0.014185348525643349,
    -0.10938825458288193,
    0.17181655764579773,
    0.1352047622203827,
    -0.10285402089357376,
    -0.11472463607788086,
    0.14425836503505707,
    -0.07505999505519867,
    -0.04973727464675903,
    0.06361008435487747,
    -0.1597425639629364,
    -0.24433571100234985,
    -0.28531521558761597,
    0.07949946075677872,
    0.3659265637397766,
    0.17114438116550446,
    -0.13378076255321503,
    0.010572328232228756,
    -0.015776706859469414,
    -0.05261661857366562,
    0.05683652311563492,
    0.0692666545510292,
    -0.02443445287644863,
    -0.03659924119710922,
    -0.04629286751151085,
    0.08285754173994064,
    0.21954840421676636,
    0.005843746475875378,
    -0.028379075229167938,
    0.2981802523136139,
    0.03009340725839138,
    -0.04081958904862404,
    0.022304799407720566,
    0.049758851528167725,
    -0.03858893737196922,
    0.006437721662223339,
    -0.14936457574367523,
    0.0627659484744072,
    0.017857352271676064,
    -0.076297327876091,
    -0.009553670883178711,
    0.12656845152378082,
    -0.22124728560447693,
    0.18999654054641724,
    0.004210656508803368,
    -0.03466285392642021,
    -0.009450362995266914,
    -0.048635948449373245,
    -0.11871438473463058,
    -0.01451668981462717,
    0.11797814816236496,
    -0.22407688200473785,
    0.142025426030159,
    0.17287129163742065,
    0.0905294194817543,
    0.16036535799503326,
    0.06406014412641525,
    -0.030051223933696747,
    0.002778351306915283,
    -0.08236756175756454,
    -0.2006131261587143,
    -0.07781222462654114,
    0.1587698608636856,
    -0.037384457886219025,
    0.019805168733000755,
    0.038536250591278076
  ]
}