0.06827 0.0292134 -0.0567889 -0.0324875 0.117181 0.11008 0.0891301 -0.0961177 -0.166592 -0.0105108 -0.0321101 0.0761675 0.133265 0.0479253 -0.0137316 -0.0656866 -0.0190595 0.0560515 -0.0369711 0.162442 0.085961 -0.0690105 0.0988292 0.0751022 -0.0283641 0.0517629 -0.134617 -0.159223 0.102196 0.0971125 -0.0459802 0.127888 -0.0963271 0.0271978 0.0302968 0.00804054 -0.0435817 0.246911 0.00794706 -0.0901512 0.0170396 0.0275041 -0.0548817 0.0340296 -0.211763 0.0424522 0.143313 0.0378307 -0.112438 0.0140047 -0.0244537 0.0262559 -0.0164768 0.0287224 0.129678 -0.0365161 0.0441818 0.212698 -0.0210318 -0.135591 -0.0465053 0.0546155 0.20567 -0.0962457 0.0982682 0.00965074 0.0243507 0.0530159 -0.0859451 0.0590579 0.024155 0.103402 -0.0137443 0.0935038 -0.0048012 0.000638859 -0.0620793 -0.0364804 0.114369 0.0244891 -0.0437091 0.0783484 -0.0188044 -0.0714304 0.00344058 -0.133316 0.0614745 0.0848385 0.0434521 -0.00545213 0.120709 -0.0666012 0.0600316 -0.0337997 -0.0556044 -0.172644 0.0750947 0.16553 0.0724818 -0.053644 0.0149183 0.0847771 -0.00111532 0.166962 -0.169765 0.0704729 -0.0740187 0.114158 0.136793 -0.0436071 0.0724227 0.162086 -0.124852 0.0344017 0.0367621 0.0681704 -0.10132 -0.137693 -0.0215661 0.12199 -0.0242044 -0.0133286 -0.0115776 0.00288398 -0.1029 0.0764823 -0.0359161 -0.0314315 
0.0789701 -0.0054191 -0.0656926 -0.0628837 0.12316 0.117653 0.0558224 -0.0845989 -0.198825 -0.0165224 -0.0775942 0.0856955 0.111356 -0.0162014 0.00997522 -0.0348619 -0.049841 0.0460977 -0.0124408 0.150768 0.0879017 -0.0158304 0.0855069 0.0922606 -0.0278611 0.0900195 -0.0894835 -0.218561 0.0363524 0.107542 -0.0792012 0.0919673 -0.105825 0.0441191 0.0596413 -0.004415 -0.0314359 0.179366 0.00253675 -0.088171 0.0150643 -0.00169638 0.00184911 0.102834 -0.188698 0.0934025 0.192785 0.0423298 -0.153362 0.0445 0.0393845 -0.08923 0.00183236 0.0266435 0.168696 -0.0369719 0.0374993 0.200452 0.0203592 -0.153064 0.0119632 0.0447291 0.177191 -0.0552874 0.110577 -0.0653142 -0.00840062 0.0656203 -0.0354129 0.0230591 -0.005723 0.102394 -0.014942 0.0219555 -0.0257989 0.0214382 -0.0957947 -0.00533305 0.125439 0.0568566 0.0192065 0.0923171 -0.0402399 -0.0721839 -0.041263 -0.131724 0.0763044 0.0654429 0.0299434 0.0302262 0.0910726 -0.0513656 0.00214282 -0.050099 -0.10936 -0.0741086 0.080955 0.153327 0.0713104 -0.0742816 0.0271191 0.0726297 0.00419646 0.124426 -0.187242 -0.00247166 -0.144229 0.122031 0.027997 -0.0112694 0.1275 0.153326 -0.121883 -0.0140063 0.00712058 0.0803402 -0.140551 -0.158715 -0.0812247 0.0867603 0.00762443 0.0115004 0.0380848 0.00334779 -0.0974291 0.0411453 -0.0556739 -0.0720125 
0.124498 -0.0419399 -0.0820436 -0.0622619 0.174806 0.167306 0.0666918 -0.0543244 -0.149605 -0.0625567 -0.0645626 0.113808 0.0915617 -0.0324717 -0.0265876 -0.0143228 -0.0373024 0.078051 -0.0703861 0.13413 0.146543 0.0297021 0.0680852 0.124525 -0.0258866 0.0312552 -0.0628759 -0.198365 0.0161309 0.126142 -0.0797679 0.049207 -0.120809 0.0657381 0.0575542 -0.00864291 -0.0633488 0.0924999 -0.026792 -0.094165 0.00686736 0.0453077 0.0163589 0.12818 -0.170044 0.047236 0.159577 0.0463861 -0.13503 0.0779694 0.0626063 -0.119015 -0.0217888 0.0108387 0.169235 -0.0314161 -0.00942083 0.230997 0.000627725 -0.138841 0.0153064 0.0487048 0.197728 -0.0662094 0.0895756 -0.114389 -0.0485407 0.0783179 -0.0527256 0.0524792 0.0264765 0.107606 -0.0105132 -0.0463841 -0.0888038 0.053715 -0.0598096 -0.00610225 0.0911677 0.0433044 0.0557237 0.104028 -0.020675 -0.0613042 -0.0469991 -0.111332 0.0854262 0.0593136 0.0113698 0.0787352 0.0956629 -0.0917273 -0.0882249 -0.0137195 -0.0759107 -0.0232716 0.0426075 0.103268 0.0300159 -0.0428095 0.0582745 0.0559418 -0.0161606 0.0956171 -0.205774 0.00216094 -0.165952 0.07066 -0.0199821 -0.0118905 0.149413 0.133847 -0.0961528 0.0147913 0.0281316 0.0989353 -0.134055 -0.109085 -0.100333 0.0971095 0.00168989 0.0158249 0.0574239 -0.0043296 -0.0743376 0.050243 -0.0406659 -0.103466 
0.115607 -0.0809266 -0.0800032 -0.0512764 0.172841 0.147378 0.0560157 -0.0528273 -0.11535 -0.10649 -0.0679745 0.146041 0.0547925 -0.0449966 -0.0609267 -0.0221366 -0.0467501 0.0520589 -0.0606585 0.142138 0.144047 0.0277434 0.0476889 0.128139 -0.0175071 0.0715626 -0.0294832 -0.198583 -0.00085093 0.0933406 -0.060612 0.0362768 -0.129198 0.0623007 0.0475952 -0.00786289 -0.0696808 0.106213 -0.023814 -0.0863653 0.0348628 0.0666861 -0.00421766 0.134838 -0.149665 0.0323989 0.154964 0.0206964 -0.105308 0.0726926 0.032238 -0.12516 -0.0183282 0.00750822 0.182517 -0.0345247 -0.0221718 0.253296 -0.0167548 -0.138305 0.0302114 0.0320684 0.217906 -0.0453677 0.0856467 -0.124249 -0.0261941 0.0743482 -0.0126859 0.060108 0.0217006 0.107735 0.000492105 -0.0191479 -0.0924835 0.0297158 -0.0642653 0.01071 0.0709612 0.04632 0.0335288 0.138125 -0.0125815 -0.0828213 -0.0423104 -0.141048 0.108528 0.0897347 0.00459177 0.0383655 0.106567 -0.0754563 -0.0827276 -0.0160144 -0.0475519 -0.0230856 0.0556782 0.06956 0.0392804 -0.0492871 0.012442 0.0277153 -0.0286184 0.0968793 -0.202697 0.00117672 -0.157972 0.0585824 -0.0454943 -0.0167726 0.156932 0.142284 -0.10343 0.020571 0.0381074 0.0854304 -0.137812 -0.134916 -0.092328 0.0777594 -0.0107418 0.0683664 0.0518396 -0.0104866 -0.0780386 0.0435838 -0.0483062 -0.102113 
0.114338 -0.0677502 -0.103979 -0.0369173 0.182369 0.135072 0.0382147 -0.0779788 -0.101864 -0.11835 -0.0753042 0.134329 0.0454892 -0.0253239 -0.0628684 -0.00483651 -0.0286088 0.0338817 -0.0488443 0.149771 0.13554 0.0228993 0.0577977 0.0976848 -0.000386758 0.0776321 -0.0330079 -0.199627 -0.0150918 0.0977662 -0.0493433 0.0551909 -0.1147 0.0509636 0.051912 0.0116524 -0.053517 0.121177 -0.0241091 -0.0996174 0.0305673 0.0821457 0.0101174 0.125386 -0.14305 0.069842 0.160806 0.0168447 -0.0885853 0.0612558 0.0297231 -0.109283 -0.00795075 0.009753 0.201732 -0.0426885 -0.0162484 0.239873 1.18706e-05 -0.144789 0.0273604 0.0247164 0.207958 -0.0610362 0.101381 -0.126171 -0.0285256 0.0958337 0.00887136 0.0717423 0.0342697 0.111893 0.00427124 -0.0320135 -0.0854835 0.0411375 -0.0663813 0.022875 0.0511279 0.0391624 0.0375964 0.149555 -0.0181219 -0.0787725 -0.0396397 -0.138009 0.0955045 0.0950436 -0.00151938 0.0344484 0.0931254 -0.0765554 -0.0808192 -0.0275674 -0.0373875 -0.0256255 0.0696328 0.0748931 0.0473232 -0.0543386 0.00199145 0.031722 -0.0181082 0.0957009 -0.215563 -0.00173489 -0.159904 0.0562895 -0.0426431 -0.00242121 0.151522 0.131517 -0.109065 0.0262594 0.0382018 0.0736098 -0.148307 -0.151294 -0.0929845 0.0682849 -0.00752918 0.0971094 0.0674253 -0.00437615 -0.0621026 0.0370184 -0.0384269 -0.0973387 
0.0792721 -0.0037481 -0.097991 -0.0229878 0.174472 0.161659 0.0119672 -0.134721 -0.155985 -0.0445292 -0.0462985 0.117613 0.088849 0.02826 -0.0407612 0.002144 0.0122482 0.117785 0.0175819 0.11866 0.167365 0.00705822 0.0658469 0.155366 0.0195696 0.0416598 -0.0735776 -0.196817 0.0499991 0.189348 -0.0486393 0.065517 -0.0817654 0.00959341 0.0863996 0.037853 -0.0598145 0.0503343 0.00783054 -0.108486 -0.0277773 0.0710642 0.0393382 0.0994205 -0.146689 0.0614656 0.210938 0.0314804 -0.121967 0.00730852 0.0651934 -0.0776978 0.0298174 -0.0177324 0.172966 0.0207567 0.0212479 0.237348 0.0133796 -0.133804 0.00447171 0.0695517 0.204261 -0.102742 0.115846 -0.0821106 -0.0432533 0.0480175 -0.06785 0.0834599 0.0301189 0.111348 -0.0453753 -0.0760872 -0.0773321 0.0595378 -0.0521979 0.0202549 0.075418 0.0129443 0.0267203 0.149328 -0.0298692 -0.049262 -0.0371524 -0.09838 0.0426537 0.0375559 -0.00548112 0.0568535 0.0733047 -0.0482594 -0.0501392 0.00508743 -0.0312189 -0.0474396 0.0284922 0.168318 0.0384813 -0.0426574 0.0685241 0.0722525 -0.000675934 0.076481 -0.205144 0.0545272 -0.114909 0.0144526 0.0013752 0.0106989 0.100946 0.0760308 -0.0806686 -0.0140384 0.0217757 0.102495 -0.126787 -0.134703 -0.0962531 0.103487 0.00340405 -0.00994028 0.0257106 -0.0505454 -0.129085 0.127372 -0.0365259 -0.0654488 
0.0687873 -0.00618025 -0.103076 -0.0267524 0.136542 0.134762 0.00312945 -0.153214 -0.165364 -0.0206911 -0.033626 0.113827 0.115252 0.0382408 -0.050001 -0.000711896 0.00504357 0.107858 0.0118274 0.140372 0.144042 -0.0227896 0.0762506 0.164476 -0.00493213 0.0655124 -0.0716235 -0.20728 0.044254 0.181929 -0.0576898 0.0652776 -0.0818071 0.00456777 0.0711727 0.0438384 -0.0748453 0.106935 -0.000445216 -0.0867293 -0.0627392 0.0579862 0.000825168 0.0982593 -0.133791 0.0686388 0.210503 0.0434976 -0.127841 0.0118691 0.0648307 -0.074324 0.022493 -0.013667 0.166063 0.00825115 0.0291142 0.237044 0.0315066 -0.135034 0.0119406 0.069619 0.206458 -0.0850308 0.11451 -0.0891946 -0.0283231 0.0642565 -0.0641298 0.0644061 0.0266063 0.10333 -0.0385815 -0.0526656 -0.0647612 0.0413312 -0.062328 0.0221951 0.0887628 0.0288667 0.0199687 0.119606 -0.0574204 -0.073805 -0.0622786 -0.109624 0.0399468 0.0269156 0.0100463 0.0297119 0.0503204 -0.0398289 -0.00265327 0.0035385 -0.0443781 -0.0548385 0.0290197 0.162131 0.0632944 -0.0534538 0.0674921 0.0757369 -0.0147257 0.0915086 -0.189234 0.0429373 -0.125426 0.0254817 0.0159206 0.00317646 0.0959132 0.107363 -0.0720228 -0.0142815 0.00298542 0.119783 -0.137907 -0.132337 -0.105003 0.100354 -0.0247749 -0.0130793 0.0156989 -0.0407205 -0.14372 0.127035 -0.0642438 -0.0675858 
0.0609753 -0.00605067 -0.11504 -0.0171418 0.119426 0.140886 -0.00771605 -0.157017 -0.156721 -0.0413015 -0.0278238 0.111809 0.103987 0.0452104 -0.060425 -0.00342884 0.00434767 0.0930356 0.0198436 0.138558 0.128546 -0.022872 0.0814007 0.174803 -0.0132385 0.0651952 -0.0502241 -0.211035 0.0339989 0.1684 -0.0456285 0.0646514 -0.0729578 0.00298437 0.0559725 0.0638175 -0.0679029 0.10588 -0.0258248 -0.067503 -0.0554533 0.059611 -0.00802872 0.10084 -0.130655 0.0793943 0.227037 0.0338247 -0.133684 0.0137513 0.0503856 -0.0802527 0.035594 -0.0126153 0.166742 0.0261407 0.034312 0.247091 0.0457638 -0.134793 -0.00105581 0.0872765 0.219382 -0.101237 0.117962 -0.0786696 -0.0109889 0.050517 -0.0617833 0.0836317 0.0158693 0.0920459 -0.0378634 -0.0367703 -0.0432904 0.0354879 -0.0611802 0.0317806 0.0686717 0.00793691 0.0132176 0.126486 -0.0772941 -0.0940304 -0.073716 -0.0866623 0.0333788 0.00908559 -0.0141868 0.0266902 0.066677 -0.0461918 0.00151778 -0.0141743 -0.0172903 -0.0362442 0.0318811 0.165713 0.0775323 -0.0443044 0.0464525 0.0682387 -0.0123386 0.0900184 -0.195782 0.0506635 -0.130813 0.0140738 -0.0142698 -0.00516405 0.0903025 0.116424 -0.0523964 -0.0309386 -0.00679507 0.115348 -0.126057 -0.149818 -0.0833052 0.0978704 -0.018366 -0.0160961 0.0188375 -0.0336059 -0.150665 0.129772 -0.0690573 -0.0628765 
0.0712838 -0.0113585 -0.0901059 -0.0274544 0.134479 0.139558 -0.00171144 -0.14586 -0.174318 -0.0196517 -0.0312796 0.116331 0.112371 0.037384 -0.0426893 -0.00611193 0.00932055 0.113659 0.0171176 0.139808 0.14415 -0.0175199 0.0793253 0.173744 -0.00380689 0.0665772 -0.0645675 -0.209799 0.0434601 0.176209 -0.0574249 0.0581587 -0.0803726 0.0131349 0.0704634 0.0433733 -0.0739162 0.104317 0.000299125 -0.0846232 -0.0613675 0.0552231 -0.00401633 0.0963893 -0.136909 0.0644355 0.211216 0.0373047 -0.133507 0.0143349 0.0714143 -0.0766746 0.0235122 -0.0117687 0.164147 0.0129027 0.0330882 0.239162 0.0299492 -0.132726 0.0129788 0.0713643 0.202794 -0.0887662 0.118311 -0.0900221 -0.0258289 0.0594178 -0.0696086 0.0745501 0.0218377 0.100481 -0.0427496 -0.0522628 -0.0638762 0.0361346 -0.0598557 0.0249761 0.0929848 0.0283186 0.0116565 0.119943 -0.0528057 -0.0784342 -0.0610475 -0.114476 0.0439688 0.0262961 0.00729039 0.0349389 0.0540055 -0.0404954 0.000806551 0.010156 -0.0433162 -0.0524849 0.0281803 0.163562 0.0602495 -0.0511208 0.0643741 0.080459 -0.0212187 0.0949265 -0.179972 0.0416283 -0.122161 0.0163866 0.013997 -0.00546864 0.091702 0.111867 -0.0674801 -0.0144509 0.00693628 0.11842 -0.135232 -0.13992 -0.104074 0.104152 -0.0213635 -0.0184493 0.0106815 -0.0430527 -0.136908 0.129072 -0.0575108 -0.0693651 
0.0659438 -0.0132195 -0.0778827 -0.0292634 0.148106 0.13398 -0.00773928 -0.142332 -0.173522 -0.0231003 -0.0450521 0.111049 0.103006 0.0399165 -0.0289996 0.00276307 0.00745261 0.11154 0.024423 0.139393 0.144767 -0.00916604 0.0882029 0.149329 0.0033909 0.0814205 -0.0690209 -0.215071 0.0354456 0.163195 -0.0527177 0.0700647 -0.0692333 0.0148001 0.0808312 0.0436789 -0.0536183 0.121355 0.00675215 -0.0961075 -0.0458345 0.0634737 0.0129314 0.088485 -0.145603 0.0726756 0.215927 0.0278373 -0.130004 0.00984081 0.0664944 -0.0847831 0.0267003 -0.00208706 0.17801 0.00902565 0.0471105 0.222957 0.0297804 -0.143248 0.0179494 0.059775 0.186318 -0.0878963 0.133398 -0.085615 -0.0336193 0.0714734 -0.0500778 0.0829245 0.0240081 0.103798 -0.0402235 -0.0574613 -0.0611346 0.0384154 -0.0747451 0.0306136 0.0904883 0.0139593 0.00936135 0.143589 -0.0439925 -0.0667045 -0.0537202 -0.120824 0.0518204 0.0489187 0.00919856 0.0350423 0.0576462 -0.0339234 -0.00508864 -0.00132428 -0.0465177 -0.0483225 0.0344123 0.178957 0.0566875 -0.0542052 0.0555656 0.0736532 -0.0120076 0.0903001 -0.178557 0.0312628 -0.122541 0.0150032 0.0211636 -0.00365196 0.0836931 0.110201 -0.0779826 -0.0160915 0.0193485 0.104963 -0.140434 -0.162982 -0.114189 0.0925044 -0.00268017 0.00743335 0.0233652 -0.0431211 -0.127312 0.116351 -0.0433991 -0.0600241 
0.0815168 -0.0197299 -0.0691359 -0.0201739 0.164085 0.131707 0.00582272 -0.136205 -0.157815 -0.0381284 -0.0401367 0.111625 0.0888474 0.0362439 -0.0408835 0.0170747 0.0137654 0.112565 -0.00795278 0.146009 0.156888 0.00827233 0.0731561 0.146195 0.004359 0.0710266 -0.079316 -0.204004 0.0336891 0.158297 -0.0623002 0.069545 -0.0877961 0.0231076 0.083138 0.0438946 -0.0621461 0.121847 -0.00194707 -0.0988112 -0.0471667 0.0849388 0.010832 0.0812616 -0.127052 0.0810022 0.198268 0.0288616 -0.123399 0.0162899 0.0689087 -0.0744242 0.00688367 -0.00156397 0.188395 -0.00794424 0.0332135 0.224185 0.0270714 -0.13583 0.0279318 0.0530187 0.184078 -0.0826661 0.129095 -0.105048 -0.0368911 0.0872308 -0.0399525 0.0924244 0.0458261 0.114341 -0.0219826 -0.0608455 -0.078117 0.0436485 -0.0687464 0.045289 0.0791796 0.00498419 0.0311752 0.15555 -0.0423421 -0.0751854 -0.0539542 -0.121578 0.0536004 0.0605277 0.00398344 0.0454916 0.0619032 -0.0406592 -0.0241386 0.00653844 -0.0470596 -0.0374664 0.038537 0.145499 0.0551618 -0.0488795 0.0581437 0.0751337 -0.0217363 0.0854046 -0.184858 0.0266168 -0.12537 0.0103026 0.0231881 -0.00152049 0.0924784 0.113075 -0.081373 -0.000714044 0.0332755 0.106105 -0.149577 -0.151581 -0.130069 0.0819154 -0.0175568 0.0357133 0.0403778 -0.0342626 -0.109862 0.114845 -0.0387024 -0.080679 
0.0785794 -0.0191515 -0.0836805 -0.0307762 0.131348 0.138271 0.00619486 -0.13613 -0.169544 -0.0353461 -0.043092 0.117785 0.106994 0.0259344 -0.0449322 -0.00663302 -0.00170094 0.101296 -0.00118434 0.145351 0.13905 -0.00370102 0.0758809 0.168206 -0.0171822 0.0687346 -0.062376 -0.209639 0.0245419 0.168035 -0.0697298 0.0589915 -0.0833482 0.0279542 0.0735343 0.0341594 -0.061434 0.119799 -0.0110963 -0.0847929 -0.0552343 0.054527 0.00514692 0.0946435 -0.133511 0.068993 0.208092 0.0358193 -0.134382 0.0363121 0.0768889 -0.0913669 0.0213412 0.00480594 0.18176 0.000320779 0.0289606 0.232446 0.0286311 -0.143202 0.0201407 0.0701856 0.195993 -0.0857022 0.116954 -0.0981336 -0.0259961 0.0634791 -0.0678418 0.066402 0.0198752 0.0903366 -0.0330454 -0.0447947 -0.0634112 0.0402751 -0.0600064 0.0175161 0.0970266 0.0296538 0.0281129 0.119303 -0.0523893 -0.0840474 -0.0628513 -0.119691 0.0490426 0.0330643 0.00891608 0.0487183 0.0561818 -0.0555256 -0.00475046 0.00708355 -0.0569419 -0.0354252 0.0363392 0.150734 0.0657033 -0.0477831 0.0639266 0.0818422 -0.0256931 0.101986 -0.182633 0.0248292 -0.136965 0.0227292 -0.00606198 -0.00509647 0.101916 0.121364 -0.0710081 -0.0100782 0.00336485 0.119477 -0.136024 -0.137854 -0.11347 0.0980401 -0.0185906 -0.00454425 0.0297978 -0.040762 -0.120905 0.114284 -0.0543888 -0.0847753 
0.0842586 -0.0132967 -0.087841 -0.0232139 0.142618 0.142115 0.00153601 -0.136995 -0.174443 -0.0295632 -0.038845 0.105787 0.107217 0.0348989 -0.04335 0.00854357 0.0234181 0.106321 -0.00355961 0.145592 0.143461 -3.44984e-06 0.0730027 0.160427 -0.0103908 0.0635624 -0.0724922 -0.208618 0.0217647 0.167782 -0.0671165 0.0717586 -0.0855077 0.0276247 0.0710223 0.0439437 -0.0599016 0.113032 -0.00912986 -0.0844267 -0.0587711 0.0654734 0.0115968 0.0845662 -0.121773 0.0811518 0.208584 0.0361964 -0.135313 0.0237866 0.0868285 -0.0822733 0.0169419 0.0021617 0.178135 -0.00221165 0.0375661 0.221227 0.0471922 -0.14099 0.0231839 0.0725639 0.180933 -0.096629 0.119151 -0.104439 -0.0276267 0.078562 -0.0568799 0.0722823 0.0311158 0.0967611 -0.0286322 -0.061934 -0.0670538 0.0489465 -0.0588611 0.0360123 0.0840874 0.0191735 0.0294618 0.129827 -0.0520687 -0.0812359 -0.0660634 -0.105129 0.0470853 0.029338 -0.000836683 0.0449136 0.0455674 -0.0512087 -0.011115 0.00759813 -0.0538121 -0.0272593 0.04133 0.149548 0.0557356 -0.0455514 0.0655843 0.0882587 -0.021086 0.106688 -0.183839 0.0226675 -0.142746 0.0197704 -0.00524233 -0.00359161 0.0926056 0.111908 -0.0711366 -0.0097516 0.00688759 0.115087 -0.148814 -0.143446 -0.126489 0.0894611 -0.0233696 0.00479768 0.0395252 -0.0381451 -0.113651 0.112259 -0.0586496 -0.086016 
0.0771251 -0.0329997 -0.0952234 -0.0217533 0.146512 0.133733 0.00899715 -0.142236 -0.140498 -0.0487233 -0.0448911 0.111783 0.105824 0.0378331 -0.0461958 -0.00749523 -0.000229052 0.112785 0.000992319 0.136688 0.153269 -0.0099713 0.0849166 0.181825 -0.00522977 0.0438431 -0.068853 -0.216072 0.0260388 0.17817 -0.0471166 0.0553146 -0.0761093 0.00948718 0.0801419 0.0394772 -0.0646161 0.098187 -0.0191631 -0.0955826 -0.050326 0.0751188 0.000556352 0.104177 -0.140589 0.0584741 0.199876 0.0434356 -0.102429 0.0237934 0.0526958 -0.100794 0.0485118 -0.00986833 0.17351 0.0086746 0.0397903 0.232312 0.036034 -0.151027 0.0131986 0.0771574 0.192034 -0.0758262 0.0958566 -0.089141 -0.0209516 0.0621916 -0.0506736 0.0579795 0.0236686 0.0955165 -0.0354186 -0.0674962 -0.0725991 0.0453412 -0.0720934 0.0141672 0.0879458 0.0308995 0.0334458 0.13569 -0.0652267 -0.0819122 -0.0437727 -0.097419 0.0421914 0.0325717 -0.00414548 0.0336301 0.0720692 -0.0388192 -0.0117617 -0.0126437 -0.049448 -0.0428737 0.011754 0.163667 0.0641918 -0.0498752 0.0787003 0.0599579 -0.00172997 0.0794752 -0.191319 0.0261788 -0.132368 0.00918114 0.0018776 0.0144638 0.102979 0.108955 -0.0721806 -0.0258958 -0.0051496 0.13408 -0.135118 -0.135545 -0.117866 0.0916769 -0.0190689 0.00145911 0.0121173 -0.0358141 -0.154645 0.116399 -0.0675057 -0.0662851 
0.0901401 -0.0198987 -0.101294 -0.024291 0.16535 0.133308 0.0123067 -0.1285 -0.165176 -0.0297793 -0.0468267 0.110254 0.0998539 0.0243431 -0.053379 0.0106006 0.0239558 0.114451 -0.0069507 0.158499 0.142887 -0.00599423 0.0831469 0.133756 -0.00973221 0.0670403 -0.073783 -0.207732 0.0268731 0.15249 -0.0709571 0.078224 -0.0875749 0.0222678 0.0755229 0.029718 -0.0560636 0.126239 -0.00714138 -0.108312 -0.0447709 0.0752069 0.011022 0.0922689 -0.145642 0.0796378 0.197278 0.0401487 -0.123905 0.0303514 0.0682408 -0.0786925 0.00476177 -0.000123936 0.176997 -0.0192194 0.0412004 0.209071 0.0383738 -0.145676 0.0277543 0.0555428 0.189382 -0.0861357 0.123617 -0.113291 -0.0424962 0.0876861 -0.0399714 0.0757587 0.0362178 0.105364 -0.019852 -0.0539691 -0.0865184 0.0434039 -0.0638711 0.0445876 0.0806805 0.00271586 0.0215489 0.14293 -0.0490883 -0.0727695 -0.0459667 -0.116136 0.0500221 0.0602993 0.0175456 0.0381583 0.0605954 -0.0412804 -0.0276821 -0.00793592 -0.0422479 -0.0452247 0.0486937 0.155339 0.0424336 -0.0552516 0.0639761 0.0796844 -0.0111066 0.0984345 -0.183555 0.0167261 -0.128347 0.0274345 0.0163143 0.00898205 0.0951615 0.114905 -0.0730257 0.0042792 0.015486 0.0945643 -0.147486 -0.154138 -0.121165 0.0800175 -0.0265432 0.0288669 0.0437775 -0.0302158 -0.109939 0.0931181 -0.0516901 -0.0849749 
0.0817292 -0.0161179 -0.104583 -0.0193092 0.169365 0.147229 -0.00403141 -0.140755 -0.156071 -0.0460976 -0.050228 0.11054 0.0906357 0.0372994 -0.0534822 0.0124382 0.032874 0.122729 0.00958794 0.137999 0.14729 0.00870956 0.0790699 0.153785 0.00175877 0.0574623 -0.0618077 -0.19946 0.024758 0.163847 -0.0539575 0.0725466 -0.0770347 0.0134907 0.0866641 0.0414459 -0.0425726 0.08509 -0.00272431 -0.109077 -0.0373413 0.0878748 0.0334026 0.0913873 -0.139261 0.0686062 0.211623 0.0386736 -0.115421 0.0211087 0.0670205 -0.0957239 0.0350946 -0.00481552 0.175852 0.00570306 0.0428919 0.220119 0.0426552 -0.156431 0.0160124 0.0772411 0.188488 -0.0985993 0.11248 -0.08834 -0.0369976 0.0693784 -0.0464263 0.0775844 0.0291378 0.0960599 -0.0284972 -0.072918 -0.0791664 0.0499348 -0.063822 0.0353217 0.0742346 -0.00730443 0.0338392 0.164646 -0.0482935 -0.0700014 -0.039385 -0.0984676 0.0373362 0.0466228 -0.00297853 0.0474029 0.0687832 -0.0392097 -0.0322245 -0.00742841 -0.0264244 -0.0294655 0.0320553 0.174141 0.0359297 -0.0497812 0.0670625 0.0700085 -0.000204692 0.0884839 -0.191798 0.0305181 -0.127172 -0.000987952 -0.0104477 0.018048 0.0985537 0.0961117 -0.0609067 -0.00420227 0.0031789 0.0936809 -0.144936 -0.152492 -0.119249 0.0728949 -0.00819832 0.0150665 0.0408048 -0.0483232 -0.128225 0.106687 -0.0551813 -0.077581 
0.0928836 -0.0266708 -0.089691 -0.0256426 0.174381 0.13347 0.0140527 -0.118636 -0.16142 -0.0321582 -0.046485 0.110163 0.091343 0.0276307 -0.0512195 0.0172521 0.0265993 0.114819 -0.0144383 0.155376 0.150681 0.00113705 0.0830773 0.131511 -0.0048903 0.0679505 -0.0759622 -0.202334 0.032732 0.142511 -0.0669678 0.0744342 -0.0921281 0.0261887 0.071707 0.0334646 -0.0648244 0.129941 -0.00852292 -0.105727 -0.0449902 0.0878324 0.00550822 0.0874098 -0.138249 0.0742606 0.187045 0.0367037 -0.117356 0.0277549 0.0663833 -0.0719974 -0.00441026 -0.0019361 0.177673 -0.0227497 0.0421455 0.218829 0.0339298 -0.141393 0.029018 0.0519521 0.188883 -0.0837739 0.12571 -0.114712 -0.0453107 0.0963185 -0.0352411 0.0915179 0.04283 0.115894 -0.0169818 -0.0523532 -0.0917631 0.0406419 -0.0601327 0.0514033 0.0766479 -0.00588387 0.0224913 0.150627 -0.0431124 -0.076344 -0.0459414 -0.125193 0.054822 0.0744561 0.0193937 0.0376425 0.0649696 -0.0385841 -0.0332071 -0.00231329 -0.0326485 -0.0400604 0.0489734 0.145755 0.0390043 -0.0482598 0.0593658 0.075462 -0.0192781 0.0941369 -0.184269 0.018327 -0.129952 0.0136267 0.0274977 -0.00124287 0.095199 0.122062 -0.0731959 0.0114102 0.0336228 0.0962178 -0.144054 -0.153367 -0.123936 0.079615 -0.027636 0.0392832 0.0480001 -0.0306132 -0.107389 0.095343 -0.0476861 -0.0863673 
0.0765298 -0.0254656 -0.0555287 -0.0245489 0.141392 0.143986 0.00420893 -0.145285 -0.178517 -0.0376998 -0.0487851 0.113091 0.0958092 0.0311457 -0.0194433 -0.000395027 -0.00276228 0.102922 0.00812206 0.135803 0.134948 0.0126567 0.0735306 0.156286 -0.0074626 0.0814909 -0.0836532 -0.214804 0.0214372 0.155426 -0.0591722 0.0721401 -0.0903985 0.0271572 0.0885631 0.04863 -0.0590471 0.113667 0.00298948 -0.0875402 -0.0442079 0.0618904 0.00430876 0.0743755 -0.130759 0.0862682 0.205781 0.0317819 -0.137555 0.019316 0.0736729 -0.0916907 0.0317549 0.00229664 0.18233 -0.000729977 0.0368042 0.228838 0.0254195 -0.129554 0.0234339 0.0796914 0.177759 -0.0900472 0.133345 -0.0882233 -0.0221161 0.0717002 -0.0603636 0.080026 0.0275217 0.100451 -0.0304822 -0.0468758 -0.0635532 0.0412305 -0.0755043 0.0150861 0.0963974 0.0264572 0.0352559 0.134217 -0.0491718 -0.0832797 -0.0630025 -0.126456 0.0549748 0.0374042 -0.0121538 0.053705 0.0678201 -0.0348593 0.00157748 0.0143627 -0.0677273 -0.0249805 0.042528 0.150796 0.0674311 -0.0445833 0.061681 0.0803493 -0.0311227 0.0858229 -0.176424 0.0244786 -0.125599 0.0141528 0.0053417 0.00478763 0.0965492 0.115891 -0.0730091 -0.0240858 0.0187939 0.116162 -0.148761 -0.144423 -0.126519 0.0911328 -0.00499821 0.000173336 0.0355229 -0.0434764 -0.113519 0.121951 -0.0441614 -0.081666 
0.0642445 -0.0140274 -0.0820056 -0.0358866 0.15668 0.127927 -0.00762924 -0.141464 -0.173846 -0.0275743 -0.0484795 0.10578 0.100441 0.0453184 -0.0317287 0.014865 0.0129833 0.103511 0.0142569 0.14457 0.14581 -0.0049906 0.0958509 0.126036 -0.0015462 0.0802414 -0.0787812 -0.214855 0.0377736 0.153239 -0.0512115 0.0703111 -0.069932 0.0106014 0.0830853 0.0526056 -0.0623243 0.136401 0.00391829 -0.0915364 -0.0583088 0.0799208 0.00584668 0.0818177 -0.136846 0.0916934 0.209143 0.0314785 -0.130594 0.010026 0.0517053 -0.0766399 0.0180243 -0.0042913 0.16556 -0.00352294 0.0527352 0.224382 0.024819 -0.132469 0.0178207 0.062229 0.189119 -0.0890495 0.146094 -0.0984539 -0.0408731 0.089876 -0.0450146 0.0848393 0.0395721 0.109649 -0.0346422 -0.0584284 -0.0680184 0.0443274 -0.076707 0.0324012 0.08422 0.00903688 0.0102788 0.137716 -0.0522248 -0.065454 -0.0642685 -0.12138 0.0463021 0.0549988 0.00488941 0.0293753 0.0571226 -0.0290224 -0.00656663 0.00126358 -0.0346298 -0.0445565 0.0406169 0.177198 0.0486358 -0.0466443 0.0501993 0.0693016 -0.0232837 0.0853036 -0.180852 0.0323906 -0.122225 0.0164567 0.0353021 -0.0057383 0.0798127 0.108075 -0.0776092 -0.0065283 0.0247194 0.11079 -0.146846 -0.15252 -0.117828 0.0947672 -0.0177124 0.0173951 0.030364 -0.0361594 -0.123162 0.111901 -0.0500197 -0.0679328 
0.0916699 -0.0286855 -0.115722 -0.0277642 0.173347 0.138356 0.0169229 -0.124065 -0.153712 -0.0386366 -0.0588306 0.114089 0.093162 0.0150473 -0.0630082 0.0106477 0.0151589 0.106936 -0.0114373 0.154658 0.138269 -0.00595768 0.0822482 0.122263 -0.0111027 0.0744922 -0.0712341 -0.211009 0.0216936 0.138801 -0.0610547 0.0855446 -0.0973198 0.0192062 0.0700526 0.0284699 -0.0587082 0.118772 -0.00854942 -0.107421 -0.0265458 0.0795979 0.0103894 0.102875 -0.14825 0.0722438 0.193085 0.0416703 -0.112255 0.0292556 0.0544354 -0.0894189 0.0082975 -0.00149871 0.170496 -0.0219135 0.0431726 0.217225 0.0410657 -0.150418 0.0276071 0.0586668 0.197617 -0.080812 0.117244 -0.111278 -0.0391405 0.088217 -0.0229882 0.0722786 0.0315293 0.110844 -0.0113049 -0.0463521 -0.0917234 0.0409555 -0.069483 0.0425018 0.0714263 -0.003525 0.0252269 0.153806 -0.0485167 -0.0713658 -0.0439169 -0.113326 0.0586794 0.0693023 0.0134161 0.0258699 0.0707479 -0.0370521 -0.0353881 -0.0215361 -0.032733 -0.0404313 0.0521206 0.153466 0.0406003 -0.0524718 0.055097 0.0624464 -0.00507349 0.0990033 -0.189754 0.0134917 -0.137106 0.0313593 0.00467095 0.0172442 0.10593 0.119398 -0.0735298 0.0046761 0.0118252 0.0870623 -0.148849 -0.156104 -0.114576 0.0672716 -0.0215636 0.0397142 0.0512709 -0.0302401 -0.118765 0.0789716 -0.0666406 -0.0822924 
0.119197 -0.0211219 -0.128281 -0.0248554 0.188981 0.174403 0.0326868 -0.103651 -0.162427 -0.0531958 -0.0612852 0.112598 0.0820507 -0.0152891 -0.0733144 0.0127407 0.0342112 0.100297 -0.0376677 0.153416 0.128637 0.0166056 0.071887 0.108286 -0.0188267 0.0587874 -0.0679282 -0.194577 0.0151121 0.115482 -0.0682297 0.100369 -0.120359 0.0460228 0.0587169 0.0128277 -0.044529 0.0930091 -0.00715029 -0.112311 0.0041087 0.0674803 0.0263587 0.0938872 -0.156151 0.0648371 0.1826 0.0493108 -0.121907 0.0488842 0.0723937 -0.0850731 -0.00429185 0.00694652 0.163558 -0.0355632 0.0386003 0.209239 0.0449764 -0.15436 0.0204769 0.0739708 0.197579 -0.107356 0.108911 -0.108505 -0.0438664 0.085115 -0.0340493 0.0801574 0.0213514 0.103357 -0.00159291 -0.0307644 -0.0939314 0.044179 -0.0470526 0.0436728 0.0578293 -0.0110685 0.0394645 0.14907 -0.022666 -0.070165 -0.031639 -0.102925 0.0642636 0.0698053 0.000750922 0.0518025 0.0874554 -0.0610897 -0.0642627 -0.0135374 -0.0305139 -0.0284748 0.0693579 0.137124 0.0160494 -0.0434571 0.0575611 0.0782263 -0.0108846 0.127716 -0.185347 0.00732252 -0.137963 0.0493751 -0.0262528 0.0198418 0.118639 0.122125 -0.0600411 0.0268632 0.0137593 0.059288 -0.154458 -0.14253 -0.103733 0.0655276 -0.0148752 0.0368569 0.0776673 -0.0339213 -0.0856621 0.0597325 -0.0645862 -0.104471 
0.110917 -0.0177133 -0.1347 -0.0315347 0.187455 0.168989 0.0229543 -0.0988719 -0.154298 -0.0568153 -0.0535238 0.114339 0.0808545 -0.0280473 -0.0847275 0.0054433 0.0249344 0.100002 -0.0480948 0.168108 0.125576 0.0114702 0.0792739 0.103392 -0.0283266 0.0633012 -0.0569279 -0.197104 0.0166289 0.100576 -0.0609251 0.090431 -0.115344 0.0494232 0.0492246 0.0156371 -0.0462588 0.104518 -0.0181867 -0.102023 0.0130699 0.0618614 0.0119359 0.110695 -0.165576 0.056481 0.186462 0.0555573 -0.118203 0.0552403 0.0590912 -0.0839553 -0.0232498 0.00728614 0.156715 -0.0381543 0.0323977 0.207677 0.0426746 -0.158208 0.0142989 0.065702 0.209298 -0.0980848 0.109524 -0.126084 -0.0367968 0.0795701 -0.0243266 0.0853997 0.0206891 0.0996598 0.0078351 -0.0185087 -0.0889316 0.028967 -0.0566892 0.0627038 0.0519347 -0.0141539 0.0274699 0.153438 -0.023996 -0.0668729 -0.0352203 -0.0976741 0.0719024 0.0820996 0.00709484 0.0410676 0.0926371 -0.0651206 -0.063762 -0.0259644 -0.0242458 -0.0435141 0.0644691 0.1345 0.00795061 -0.0490101 0.0421312 0.0750195 -0.012314 0.131762 -0.174049 0.00911989 -0.138561 0.0589203 -0.0226437 0.0181524 0.115413 0.131948 -0.0646312 0.0417752 0.00344226 0.0503154 -0.149918 -0.157047 -0.093969 0.0630206 -0.0186295 0.0478871 0.0701687 -0.0239133 -0.0897758 0.0485621 -0.0743547 -0.0984575 
0.103122 -0.0422857 -0.11021 -0.03799 0.173359 0.139084 0.0208586 -0.0990726 -0.134079 -0.0731274 -0.0645276 0.111952 0.0751368 -0.0212518 -0.0775491 0.0107363 -0.0128259 0.0801974 -0.0514304 0.164104 0.139408 0.000357727 0.0837037 0.0982461 -0.0193005 0.0783532 -0.0584602 -0.215697 0.00303879 0.101537 -0.0609691 0.0772458 -0.113351 0.0373988 0.0515165 0.0135968 -0.0661896 0.143018 -0.018629 -0.0937625 -0.00331151 0.073228 -0.00515254 0.110637 -0.142809 0.0654941 0.176479 0.0376664 -0.108929 0.0528251 0.0428613 -0.0951228 -0.00739733 0.0125597 0.169249 -0.0482582 0.0378979 0.213353 0.0308127 -0.163408 0.0351712 0.0474 0.201978 -0.0607546 0.107282 -0.130361 -0.0289616 0.103133 0.0047674 0.0701291 0.0292013 0.108295 0.00758641 -0.0264169 -0.0880108 0.0286253 -0.0777515 0.0422762 0.0567908 0.0158961 0.0330654 0.154921 -0.0382631 -0.0804411 -0.0498528 -0.109446 0.078314 0.0931884 0.010216 0.0200052 0.0821811 -0.0570629 -0.0531363 -0.0299089 -0.0439541 -0.0355452 0.0595016 0.121928 0.036543 -0.0537498 0.0364037 0.0452424 -0.0199061 0.116222 -0.179521 -0.00664849 -0.151807 0.0602276 -0.0124919 0.00681444 0.120602 0.14362 -0.0881018 0.0248461 0.0162998 0.0819384 -0.165502 -0.152058 -0.107064 0.0559285 -0.0264256 0.0764495 0.0678266 -0.0175482 -0.0902414 0.0477938 -0.0730613 -0.0913376 
0.10809 -0.0352975 -0.112578 -0.0349572 0.174233 0.140914 0.0268733 -0.093034 -0.144833 -0.0494754 -0.0507283 0.121449 0.0851107 -0.0355128 -0.0762605 0.0166302 -0.010588 0.0891083 -0.0573756 0.176188 0.146089 -0.0104302 0.0861584 0.100436 -0.0229571 0.0743939 -0.0713929 -0.220685 0.0192193 0.109767 -0.0679913 0.0861584 -0.112636 0.0427547 0.0431978 0.00881032 -0.0805874 0.144706 -0.0118933 -0.094637 -0.016941 0.0561228 -0.0130041 0.109546 -0.148621 0.0553249 0.173008 0.0387724 -0.119636 0.0575279 0.0589244 -0.0750045 -0.0321547 0.00804923 0.162564 -0.0546027 0.0371087 0.205591 0.0237593 -0.146161 0.0296249 0.0336613 0.209013 -0.0664005 0.112748 -0.148237 -0.0422999 0.101774 -0.0154405 0.0762227 0.0312591 0.11505 -0.0032731 -0.0190764 -0.0946155 0.0253339 -0.0663113 0.0486283 0.0575015 0.0282121 0.02113 0.132906 -0.0298643 -0.0683439 -0.050497 -0.112117 0.0807643 0.0905747 0.0251708 0.0216704 0.0702928 -0.0590116 -0.0620496 -0.0110224 -0.0450598 -0.0485052 0.0594942 0.118759 0.0264384 -0.0531446 0.0433754 0.0560222 -0.0324505 0.124087 -0.168002 -0.00131625 -0.14065 0.071707 0.0160241 -0.00148671 0.102502 0.145484 -0.0881263 0.0270521 0.0305855 0.0818201 -0.15369 -0.14618 -0.0956569 0.08036 -0.0296889 0.0634042 0.0646556 -0.0146693 -0.0858723 0.0538543 -0.057856 -0.0882453 
0.131063 -0.0272369 -0.116362 -0.0207257 0.191819 0.16867 0.0307197 -0.113635 -0.150864 -0.0725369 -0.061337 0.0929051 0.0698922 -0.00085098 -0.063611 0.00918851 0.0378184 0.0762642 -0.0326921 0.151141 0.114733 0.0397033 0.0685083 0.0878503 -0.0150643 0.0743725 -0.0649033 -0.18765 0.00449537 0.0996411 -0.0694362 0.0957773 -0.125338 0.0428819 0.0638637 0.0159297 -0.0233608 0.112766 -0.000579905 -0.106161 0.0201125 0.0807453 0.0146216 0.0802342 -0.160181 0.0892018 0.168899 0.0512941 -0.0956805 0.0378547 0.0682402 -0.0679661 0.00498397 0.0262292 0.177501 -0.0585913 0.0561036 0.194896 0.0499223 -0.157957 0.0288397 0.0642537 0.180573 -0.0945158 0.102462 -0.110807 -0.0152114 0.103324 0.00912324 0.0803425 0.0322829 0.106587 0.0170418 -0.0311058 -0.0768667 0.0427653 -0.0670514 0.0535744 0.05128 -0.000892514 0.0631852 0.172498 -0.00611064 -0.0712453 -0.0149572 -0.104028 0.073707 0.0882445 -0.0210931 0.0407291 0.0937074 -0.0565851 -0.053995 -0.022501 -0.0592892 -0.04903 0.0859844 0.121479 0.0333463 -0.054148 0.0560271 0.0876915 0.00149484 0.126232 -0.184675 -0.00984233 -0.136517 0.0528601 -0.0271902 0.0316779 0.13475 0.118228 -0.0688702 0.0325271 0.00688474 0.0624256 -0.177313 -0.148865 -0.134344 0.0368539 -0.0181436 0.0613858 0.0878469 -0.0345175 -0.0689678 0.0535497 -0.0693347 -0.0892073 
0.131355 -0.0136255 -0.126104 -0.0205329 0.188939 0.169228 0.0393611 -0.0987895 -0.150418 -0.0527942 -0.0530081 0.0987882 0.0770722 -0.0349902 -0.0737651 0.0257164 0.033662 0.071112 -0.0528773 0.16558 0.120111 0.0234346 0.0632922 0.087912 -0.0212159 0.0714527 -0.0675698 -0.196072 0.0189811 0.104253 -0.0757328 0.104785 -0.129048 0.0495528 0.0460598 0.00234585 -0.0312448 0.116807 -0.00169211 -0.0988899 0.0144297 0.0565679 0.0164638 0.0882176 -0.153243 0.0765323 0.174067 0.0486404 -0.110709 0.042852 0.0853462 -0.0662653 -0.0206747 0.0185407 0.172289 -0.0621998 0.0429486 0.185943 0.0486805 -0.15349 0.0217202 0.0413909 0.187428 -0.0992039 0.105637 -0.128941 -0.0242219 0.097952 -0.00537414 0.064747 0.0256294 0.112177 0.011218 -0.0244666 -0.075398 0.0429932 -0.054447 0.0720042 0.0454446 0.0115453 0.060097 0.153004 -0.00416433 -0.0624485 -0.0218909 -0.0942998 0.0773438 0.0850032 -0.00636705 0.0380351 0.0727923 -0.069012 -0.0757756 -0.0110648 -0.06011 -0.0439046 0.0881278 0.107402 0.0217352 -0.0516678 0.0534012 0.0791262 -0.0136287 0.144035 -0.181367 -0.0111373 -0.138282 0.0755273 -0.0199153 0.0215514 0.119764 0.128727 -0.0716206 0.0380576 0.0125827 0.0584073 -0.184397 -0.13791 -0.128527 0.0464512 -0.027886 0.0655252 0.09429 -0.0223783 -0.0578463 0.0525058 -0.0756207 -0.101373 
0.136417 -0.0186561 -0.133488 -0.0126083 0.192437 0.155965 0.0323461 -0.0889312 -0.159656 -0.0569027 -0.0585969 0.0968361 0.0713132 -0.0259723 -0.0766438 0.034377 0.0632745 0.0701753 -0.0409785 0.169612 0.122666 0.0170407 0.0692945 0.0831329 -0.0106257 0.0712262 -0.0549393 -0.190792 0.0156125 0.0997985 -0.0777549 0.109858 -0.12053 0.053289 0.0365104 -0.00300786 -0.0236924 0.119659 0.000240517 -0.110184 0.00786633 0.0668675 0.0301806 0.0857405 -0.145073 0.081408 0.175739 0.037996 -0.110005 0.0435589 0.0904332 -0.0660981 -0.0191667 0.0174027 0.172018 -0.0660278 0.0496423 0.178704 0.058463 -0.156874 0.0307073 0.0360855 0.175691 -0.101705 0.103392 -0.12656 -0.0315236 0.100565 9.64103e-05 0.0672589 0.0201369 0.107811 0.00617807 -0.0298315 -0.0820946 0.0392042 -0.0386219 0.0832599 0.0403137 0.00339866 0.0452407 0.156067 -0.00795875 -0.071635 -0.0156214 -0.0996463 0.0677327 0.0874583 -0.000369687 0.0332254 0.0685172 -0.0638269 -0.0843638 -0.0113863 -0.0407152 -0.0326415 0.0968387 0.110689 0.010497 -0.0553171 0.0413308 0.076884 -0.00886322 0.153687 -0.185992 -0.016246 -0.140127 0.0694761 -0.0168994 0.00817268 0.113295 0.130458 -0.07068 0.0436975 0.0209285 0.0434162 -0.178724 -0.151979 -0.121955 0.0415094 -0.0347404 0.0841818 0.0986594 -0.0205361 -0.049349 0.0390084 -0.0673753 -0.111961 
0.150178 -0.016634 -0.134746 -0.00819342 0.189765 0.154168 0.0595302 -0.0750865 -0.155114 -0.0363489 -0.0520109 0.0988377 0.089148 -0.0240725 -0.0829428 0.0461706 0.078269 0.0697798 -0.0614633 0.171324 0.133236 0.00286379 0.0586707 0.0895609 -0.0204364 0.0582211 -0.072141 -0.183581 0.0313837 0.115257 -0.0937013 0.128056 -0.128654 0.0531007 0.0199593 -0.0181574 -0.0324733 0.128948 0.000192526 -0.108869 -0.00686195 0.0624172 0.0234978 0.0684409 -0.132054 0.0677982 0.15425 0.035895 -0.10724 0.0372537 0.109969 -0.0519248 -0.03107 0.015537 0.165795 -0.0706175 0.0458485 0.174282 0.0587465 -0.145755 0.0332832 0.0229693 0.164885 -0.110147 0.0986321 -0.128408 -0.0345925 0.104928 -0.017398 0.0500937 0.0196017 0.112192 0.00296799 -0.0337738 -0.0908605 0.0532929 -0.012661 0.0824811 0.0419574 0.00986427 0.0497626 0.133028 -0.00441293 -0.0686105 -0.00715951 -0.100213 0.0704466 0.0802167 0.00839866 0.0318698 0.0457358 -0.0736987 -0.0884101 0.00691056 -0.0490863 -0.0310212 0.103419 0.0907756 0.0117024 -0.0424276 0.0636661 0.0813877 -0.0201672 0.170488 -0.186015 -0.0211199 -0.140175 0.0725065 -0.00564546 -0.00231591 0.0997681 0.131186 -0.0691152 0.044635 0.0306974 0.0548122 -0.183261 -0.125366 -0.131716 0.0493503 -0.055372 0.0764289 0.0983789 -0.0176635 -0.0381178 0.0500122 -0.0766881 -0.124277 
0.139473 0.000829365 -0.113356 -0.0192953 0.183524 0.152724 0.0721471 -0.0645302 -0.144816 -0.0324012 -0.0437984 0.0983887 0.0850954 -0.0428311 -0.0646428 0.0379568 0.0647522 0.0579695 -0.0768931 0.172958 0.130111 0.00859354 0.0447487 0.0766389 -0.029784 0.0678677 -0.0825765 -0.187167 0.0454876 0.103987 -0.0842383 0.132852 -0.121366 0.0675884 0.0268748 -0.0165061 -0.0167547 0.156664 -0.00313906 -0.102526 0.0121559 0.0469759 0.0135993 0.0673734 -0.136179 0.081306 0.154328 0.0283898 -0.132037 0.025117 0.0904724 -0.0430118 -0.0530046 0.0164607 0.168653 -0.0634028 0.0192068 0.173908 0.0261642 -0.133576 0.0200836 0.00119826 0.17203 -0.118859 0.121481 -0.1284 -0.029943 0.102876 -0.0262938 0.057986 0.0267525 0.102889 -0.00215794 -0.0206878 -0.0734628 0.0491751 -0.0238018 0.0964427 0.0466627 0.00204127 0.026814 0.134629 -0.00158316 -0.0627256 -0.0150536 -0.10893 0.0861814 0.0844713 0.00919718 0.0457276 0.0539481 -0.0946161 -0.087588 0.00629896 -0.0533299 -0.04283 0.110071 0.0696929 0.0147965 -0.0422238 0.0440307 0.0788864 -0.0365584 0.170059 -0.184032 -0.0151844 -0.133791 0.0861604 0.00655258 -0.0193566 0.093134 0.134067 -0.0917175 0.0455049 0.052641 0.0416335 -0.192159 -0.147196 -0.117984 0.060687 -0.0382116 0.0870877 0.0927529 0.0125161 -0.0114517 0.0464822 -0.0575244 -0.13149 
0.147208 -0.00987469 -0.111232 -0.0182924 0.200566 0.169777 0.0917553 -0.0614384 -0.129817 -0.041729 -0.0478199 0.107797 0.0890406 -0.0449547 -0.0647842 0.0305042 0.0552258 0.0612549 -0.0987329 0.168819 0.135515 0.00625321 0.0414066 0.0881112 -0.0330944 0.0417532 -0.100629 -0.186853 0.037137 0.108834 -0.0769856 0.130693 -0.129804 0.0671575 0.0271817 -0.0150531 -0.024219 0.135755 -0.0139889 -0.104979 0.0284884 0.0535981 0.0132535 0.0609406 -0.142797 0.0643862 0.138115 0.0358298 -0.116834 0.0279973 0.0866844 -0.060917 -0.0451766 0.0115707 0.169296 -0.056542 0.00717821 0.187098 0.0212061 -0.128833 0.0101799 0.0174169 0.168661 -0.127148 0.117273 -0.120617 -0.0338222 0.103107 -0.0415047 0.0487796 0.0332139 0.110617 0.00229546 -0.0301196 -0.0793446 0.0714015 -0.0197954 0.078398 0.0482361 0.00330567 0.0354291 0.126965 0.000937951 -0.0519433 -0.0137173 -0.0959566 0.0956653 0.0841754 -0.00138935 0.0519246 0.0596053 -0.104618 -0.0877359 0.00924836 -0.0633224 -0.037977 0.0963127 0.0579777 0.011546 -0.0274581 0.0610973 0.0723886 -0.037222 0.160845 -0.187022 -0.010115 -0.138983 0.0816714 -0.00535366 -0.00842697 0.0966318 0.12707 -0.0857556 0.0430055 0.047361 0.0574085 -0.19531 -0.115029 -0.12405 0.069963 -0.0372533 0.0742503 0.0833052 0.0111004 -0.0175702 0.056526 -0.0713483 -0.132713 
0.143575 -0.00946021 -0.101968 -0.023904 0.206603 0.166532 0.0888846 -0.061056 -0.131274 -0.0385223 -0.0509105 0.104659 0.0818992 -0.0303418 -0.0553267 0.0305727 0.0587193 0.0636096 -0.0896004 0.160888 0.135387 0.0139611 0.0431871 0.0831754 -0.0250282 0.045875 -0.0979818 -0.177182 0.0442205 0.103893 -0.071618 0.119858 -0.129997 0.0607207 0.0360979 -0.00976416 -0.0242551 0.141204 -0.00903199 -0.108227 0.0258722 0.0684008 0.0142836 0.0624897 -0.145464 0.0685038 0.133912 0.0366138 -0.111384 0.0233305 0.0820123 -0.0537004 -0.0498466 0.00911949 0.171966 -0.056006 0.0078994 0.195605 0.0171152 -0.128661 0.0114727 0.0135497 0.17034 -0.122161 0.122225 -0.117778 -0.0366627 0.111816 -0.034698 0.0622582 0.044118 0.120463 0.00384239 -0.0323442 -0.082946 0.0689205 -0.0254074 0.0824646 0.0523351 -0.00792101 0.0358058 0.137414 0.00642606 -0.0500869 -0.0100113 -0.113437 0.0956889 0.0972958 0.00317185 0.0524328 0.0622145 -0.0975759 -0.0872045 0.00695759 -0.0541965 -0.0455647 0.09902 0.062046 0.0101504 -0.0284696 0.055075 0.0750129 -0.03447 0.150222 -0.193211 -0.00765896 -0.137174 0.0679197 0.00992047 -0.0115932 0.102253 0.126898 -0.0868139 0.0509818 0.0577097 0.0561486 -0.190708 -0.119983 -0.128689 0.0684677 -0.0350822 0.0775426 0.08215 0.00923253 -0.0200965 0.056711 -0.0630448 -0.128083 
0.140492 -0.0238485 -0.111844 -0.0304075 0.210965 0.153036 0.0821732 -0.0607703 -0.138907 -0.0401223 -0.0520137 0.115762 0.0862109 -0.0256638 -0.0712256 0.0170815 0.0607026 0.0734619 -0.0854861 0.172398 0.132235 0.00659823 0.0558178 0.0717667 -0.0318681 0.0513022 -0.0863032 -0.170849 0.0402619 0.0951759 -0.075342 0.110829 -0.127665 0.0545119 0.034115 -0.0167146 -0.0358781 0.15001 -0.00971172 -0.11394 0.0237804 0.0800914 0.00303949 0.0755959 -0.162842 0.0603373 0.128126 0.0394191 -0.099466 0.0327833 0.0704736 -0.0550084 -0.0582284 0.0104597 0.158804 -0.0667752 0.0115477 0.198037 0.00929542 -0.126193 0.0183229 0.0141299 0.180089 -0.103762 0.1219 -0.133101 -0.041694 0.112783 -0.0268211 0.0610865 0.0494261 0.118201 0.0132453 -0.0244772 -0.0991864 0.0619217 -0.0273501 0.0752605 0.0550955 -0.0128795 0.0202993 0.132062 0.00669035 -0.0452571 -0.00900368 -0.126987 0.0981142 0.110515 0.0127866 0.0352497 0.0661581 -0.0902558 -0.0773558 0.00110532 -0.0432529 -0.0658044 0.0949792 0.0701673 -0.000678847 -0.034761 0.0480768 0.0787837 -0.0333142 0.154377 -0.180234 -0.00936398 -0.130777 0.0723543 0.0197648 -0.00822764 0.104431 0.126049 -0.0850687 0.0714485 0.045578 0.0501986 -0.179001 -0.123509 -0.121086 0.0673364 -0.0496189 0.0800899 0.0663062 0.00245223 -0.027036 0.0464123 -0.0725848 -0.123439 
0.143292 -0.0244007 -0.10822 -0.0263294 0.219053 0.155851 0.0851485 -0.0494898 -0.135196 -0.0395005 -0.071758 0.108674 0.0779837 -0.0333879 -0.0623535 0.0322524 0.064288 0.0763799 -0.0802888 0.155945 0.13943 0.0147366 0.0494723 0.080506 -0.0211936 0.0362939 -0.0882412 -0.177339 0.0365143 0.10632 -0.0744424 0.115994 -0.130302 0.0521419 0.0426089 -0.0249528 -0.0274751 0.123628 -0.0114454 -0.119669 0.022796 0.0799112 0.0255023 0.0771377 -0.147257 0.0685191 0.13149 0.0365564 -0.0990167 0.0295056 0.0897931 -0.0714095 -0.0417777 -0.000199165 0.166234 -0.0607376 0.0187983 0.189425 0.0241525 -0.132312 0.0290383 0.0166872 0.158664 -0.103317 0.116155 -0.134891 -0.0511564 0.107578 -0.0257172 0.0537355 0.0418673 0.12058 0.00768057 -0.0493507 -0.106953 0.0752639 -0.022654 0.079438 0.053938 -0.0111943 0.0400538 0.137665 0.00181114 -0.0421385 0.000590137 -0.121129 0.0899135 0.10422 0.00610685 0.0473903 0.0550366 -0.0803704 -0.101015 -0.000764265 -0.0458942 -0.0355393 0.0960929 0.0724756 -0.00402837 -0.0265753 0.0597383 0.0677125 -0.0253695 0.14594 -0.193692 -0.0222191 -0.142025 0.0613989 0.00484582 -0.00193243 0.109101 0.117904 -0.0839879 0.0503855 0.0462997 0.0552915 -0.183781 -0.115077 -0.133441 0.0604452 -0.0439248 0.0884503 0.0767497 -0.0014645 -0.0258654 0.0436886 -0.0725339 -0.134024 
0.136398 -0.0148864 -0.0961755 -0.0452618 0.202892 0.162057 0.0737382 -0.0607313 -0.147314 -0.0494668 -0.0487049 0.111281 0.0802095 -0.0127617 -0.0611369 0.0115432 0.0493191 0.056296 -0.0702357 0.154636 0.137407 0.0262905 0.0427153 0.0671127 -0.0206905 0.0665307 -0.0692143 -0.157454 0.0552247 0.0934886 -0.0721979 0.0951738 -0.136145 0.0531206 0.0378445 -0.011214 -0.0352027 0.143602 0.00476607 -0.0991075 0.0265922 0.0800819 0.00221795 0.080348 -0.157427 0.0686479 0.134671 0.0357378 -0.107748 0.0185557 0.0677915 -0.0396096 -0.0633094 0.0144679 0.1611 -0.062337 0.00468469 0.215621 -0.00659801 -0.122717 0.017258 0.0108498 0.192682 -0.0968502 0.121696 -0.123891 -0.0312253 0.111117 -0.018665 0.0745264 0.0506749 0.123772 0.0103054 -0.0236318 -0.0818763 0.0551506 -0.035749 0.0757249 0.0569512 -0.00176474 0.0289248 0.135182 0.0247237 -0.0446336 -0.0156178 -0.141914 0.105774 0.112334 0.00281332 0.0360706 0.0745881 -0.0920916 -0.0778491 0.00974633 -0.0470782 -0.0764108 0.101154 0.0704155 0.00960152 -0.0380662 0.0330742 0.0868597 -0.0398106 0.153138 -0.1915 0.000212995 -0.131404 0.0750756 0.0162723 -0.0224827 0.11669 0.122887 -0.101112 0.0776329 0.0544752 0.0526431 -0.180043 -0.126781 -0.120886 0.0683574 -0.0428067 0.074294 0.0650415 -0.00561857 -0.0248804 0.0549696 -0.0652725 -0.114556 
0.128808 -0.0121951 -0.0973296 -0.0506919 0.201208 0.155931 0.0648028 -0.0575658 -0.145376 -0.0519344 -0.0514166 0.107271 0.0730303 -0.0082923 -0.0612185 0.0105812 0.0527706 0.0494942 -0.0606609 0.154838 0.132366 0.0329729 0.0404919 0.0657922 -0.0206797 0.0751383 -0.0547294 -0.152114 0.0603736 0.0841157 -0.0712269 0.0871203 -0.132422 0.0513712 0.0369021 -0.00671757 -0.027896 0.145066 -0.000161672 -0.0959746 0.0303986 0.0830759 0.00186463 0.0862589 -0.155306 0.0788937 0.140415 0.0365365 -0.106483 0.0143059 0.0605821 -0.0369564 -0.0651282 0.0125872 0.164519 -0.0576083 0.00268558 0.217356 -0.00432258 -0.126069 0.0199326 0.0081233 0.195217 -0.0905936 0.121597 -0.125161 -0.0270889 0.107745 -0.00536902 0.0800119 0.0478598 0.120809 0.0120684 -0.020166 -0.0757104 0.0496074 -0.0380443 0.0913461 0.0555681 -0.0137122 0.028155 0.147678 0.0238766 -0.0470408 -0.0123316 -0.146777 0.104908 0.119304 0.00315326 0.0347828 0.0795646 -0.0884363 -0.077869 0.00294749 -0.0370199 -0.0783542 0.105647 0.071389 0.0122359 -0.0437351 0.0233957 0.0853063 -0.0358344 0.148434 -0.196997 0.000863036 -0.132925 0.0665599 0.0123114 -0.0234261 0.123112 0.124284 -0.102081 0.0810749 0.051978 0.0443936 -0.17812 -0.144166 -0.121222 0.0592893 -0.0417737 0.083958 0.0659078 -0.00376795 -0.029108 0.0529695 -0.0685822 -0.115123 
0.127121 -0.0214869 -0.103258 -0.0479035 0.193112 0.13834 0.0652469 -0.0443575 -0.149487 -0.0526898 -0.0628346 0.0992174 0.0748909 -0.0167393 -0.0555421 0.00150593 0.0568495 0.0400613 -0.0622349 0.174606 0.112452 0.02142 0.0563909 0.0645392 -0.0304338 0.0756937 -0.0533679 -0.15733 0.0468332 0.0617295 -0.0695193 0.0892675 -0.122953 0.0590085 0.025718 -0.00845216 -0.023571 0.167838 -0.0269429 -0.102644 0.0372182 0.0771212 -0.00318732 0.094565 -0.164028 0.0836535 0.140731 0.0429196 -0.102156 0.0323339 0.0518566 -0.0510862 -0.0629903 0.0135401 0.165289 -0.0658783 0.00335305 0.20421 0.0193367 -0.139092 0.0184032 0.0110074 0.180921 -0.0842507 0.118867 -0.127832 -0.0206842 0.100128 -0.0033479 0.0669305 0.0373744 0.109375 0.023729 -0.00204986 -0.0735644 0.0390998 -0.0390413 0.0943835 0.0628263 -0.0140509 0.0182286 0.13763 0.00685923 -0.0584792 -0.00534326 -0.151012 0.101429 0.124382 0.0134719 0.029616 0.0823001 -0.0774183 -0.0701145 -0.0210166 -0.0364828 -0.072176 0.116009 0.0741987 0.00999698 -0.0549063 0.0144448 0.0828433 -0.0222305 0.150672 -0.199116 -0.0116629 -0.142165 0.0725175 0.0181686 -0.0203662 0.127512 0.144812 -0.100675 0.0765278 0.0382393 0.033371 -0.169224 -0.164067 -0.11584 0.0553973 -0.0475534 0.0937722 0.0677657 0.0110065 -0.0327674 0.0286659 -0.0738525 -0.12033 
0.126642 -0.011931 -0.0949192 -0.0518314 0.199592 0.150137 0.0608035 -0.0549111 -0.158768 -0.0432496 -0.0524753 0.101551 0.0777088 0.00796729 -0.0541904 0.010022 0.0657641 0.0511577 -0.0457006 0.155887 0.130684 0.0315108 0.0445509 0.073543 -0.0178579 0.0783855 -0.0513492 -0.148282 0.0671978 0.0876274 -0.0732955 0.0852017 -0.126262 0.0505555 0.0335307 -0.00221122 -0.0265774 0.148691 -0.00343507 -0.0966806 0.0232792 0.0877308 0.00500257 0.0836745 -0.154244 0.0836456 0.145769 0.0364068 -0.105115 0.0104233 0.0631094 -0.0351288 -0.0622265 0.0112796 0.168067 -0.0515168 0.00914643 0.221508 0.0062108 -0.126332 0.0193023 0.0112198 0.189956 -0.0936227 0.124141 -0.118202 -0.0255151 0.102584 -0.008148 0.0804358 0.0441198 0.121377 0.00951835 -0.0200285 -0.0719112 0.0495362 -0.0317138 0.0971682 0.0612472 -0.0210693 0.0247274 0.145432 0.0210482 -0.0499875 -0.00952382 -0.152862 0.100359 0.118503 0.00724219 0.0336957 0.0776891 -0.079401 -0.0692369 0.00148316 -0.0297619 -0.0773348 0.108308 0.0821819 0.0168196 -0.0446377 0.0226684 0.0920456 -0.0290907 0.148356 -0.20357 0.00317744 -0.13385 0.0546148 0.0195598 -0.0300582 0.12044 0.125627 -0.100068 0.0774706 0.0522965 0.0463123 -0.168266 -0.15272 -0.12368 0.0617356 -0.0441329 0.0766671 0.0633334 -0.00616635 -0.039405 0.0591324 -0.0704929 -0.113076 
0.130294 -0.0191529 -0.0982398 -0.0446702 0.210114 0.150039 0.0690793 -0.0603261 -0.155546 -0.0451992 -0.0514887 0.115237 0.0750093 0.00152265 -0.0594844 0.00943214 0.0657822 0.0630016 -0.0513753 0.156104 0.131073 0.0269935 0.0409653 0.0781854 -0.0127923 0.0743095 -0.0555388 -0.146833 0.0625887 0.0924769 -0.0731894 0.0891598 -0.129389 0.0525294 0.0329066 -0.00870859 -0.0331307 0.135012 0.0037906 -0.101627 0.0306095 0.0898136 0.0139672 0.0849613 -0.157785 0.0694582 0.143529 0.0345237 -0.0996141 0.0142942 0.0660242 -0.0456018 -0.0629273 0.00546683 0.166345 -0.0516131 0.00160284 0.228982 -0.000522643 -0.119587 0.0189786 0.0130658 0.194052 -0.0923217 0.119593 -0.11266 -0.0346656 0.099277 -0.0166895 0.0770597 0.0468097 0.126003 0.0105256 -0.0173163 -0.0809889 0.0512506 -0.0262344 0.0853534 0.0592933 -0.0245715 0.0235702 0.14936 0.0235992 -0.0496658 -0.00972235 -0.15205 0.102717 0.11781 0.00788979 0.0330851 0.0777336 -0.07921 -0.0747889 0.00403348 -0.025432 -0.0735488 0.101231 0.0775329 0.0100907 -0.0420934 0.0203784 0.0837229 -0.0264397 0.149521 -0.202577 0.0071816 -0.131777 0.056686 0.0170088 -0.0282302 0.123433 0.123143 -0.0954542 0.081548 0.0516978 0.0416044 -0.165194 -0.139809 -0.118425 0.0646658 -0.041523 0.0772845 0.0594083 -0.00903197 -0.043794 0.0585633 -0.0693357 -0.116946 
