{
  "descriptor": [
    -0.12676478922367096,
    0.12316707521677017,
    0.041242342442274094,
    -0.08409574627876282,
    -0.12022510915994644,
    -0.03415803983807564,
    -0.039007075130939484,
    -0.09235263615846634,
    0.12552177906036377,
    -0.05919720232486725,
    0.20595437288284302,
    -0.05213319510221481,
    -0.26350414752960205,
    -0.004020774737000465,
    -0.005852374713867903,
    0.07701817899942398,
    -0.15609434247016907,
    -0.07949912548065186,
    -0.079459547996521,
    -0.11466700583696365,
    0.09726305305957794,
    0.08096906542778015,
    -0.058261070400476456,
    0.06319992989301682,
    -0.07348117232322693,
    -0.3198927044868469,
    -0.011192461475729942,
    -0.06478836387395859,
    0.04394828528165817,
    -0.11093679070472717,
    0.07799771428108215,
    0.018965328112244606,
    -0.14599022269248962,
    -0.011030595749616623,
    0.013399803079664707,
    0.05014897510409355,
    -0.11969992518424988,
    -0.07191152125597,
    0.1657528430223465,
    -0.03239257261157036,
    -0.12824171781539917,
    -0.03584429621696472,
    -0.0008121353457681835,
    0.29293307662010193,
    0.1230287253856659,
    -0.0074569531716406345,
    0.022408492863178253,
    -0.06664205342531204,
    0.15148159861564636,
    -0.2505214214324951,
    0.09418986737728119,
    0.19596076011657715,
    0.1779690682888031,
    0.05714895948767662,
    0.16959837079048157,
    -0.11609477549791336,
    0.05796903371810913,
    0.1298946738243103,
    -0.19528420269489288,
    0.1380961686372757,
    0.14900515973567963,
    -0.06703323870897293,
    -0.03341231867671013,
    -0.10548850893974304,
    0.1510322540998459,
    0.09242367744445801,
    -0.09823843091726303,
    -0.14503003656864166,
    0.08746565133333206,
    -0.11910390853881836,
    -0.13075926899909973,
    0.06692001223564148,
    -0.08121493458747864,
    -0.20606881380081177,
    -0.21997308731079102,
    0.0351400300860405,
    0.3077862560749054,
    0.19209639728069305,
    -0.24749702215194702,
    -0.025936581194400787,
    -0.016771012917160988,
    0.012093257158994675,
    0.15164795517921448,
    0.0009495762642472982,
    -0.10167070478200912,
    -0.06820247322320938,
    -0.13260318338871002,
    0.04372913017868996,
    0.14951571822166443,
    -0.0032038299832493067,
    -0.07606762647628784,
    0.24663975834846497,
    0.01007115188986063,
    -0.04577939957380295,
    0.019732914865016937,
    0.01888682320713997,
    -0.13851392269134521,
    0.025366488844156265,
    -0.060770418494939804,
    -0.037221334874629974,
    0.14324600994586945,
    -0.10714319348335266,
    0.005435149185359478,
    0.09424858540296555,
    -0.1700846254825592,
    0.2483164668083191,
    -0.0372854508459568,
    0.08347384631633759,
    0.01631302386522293,
    -0.021666862070560455,
    -0.1487085223197937,
    0.04246620088815689,
    0.16807737946510315,
    -0.20667392015457153,
    0.24268926680088043,
    0.09270380437374115,
    0.027940429747104645,
    0.12185534089803696,
    0.03218941017985344,
    0.023264892399311066,
    -0.0032608574256300926,
    -0.061642151325941086,
    -0.15663570165634155,
    -0.11243637651205063,
    0.03788856789469719,
    -0.01066818367689848,
    0.027935011312365532,
    0.016472676768898964
  ]
}