0.0278791 -0.0117368 -0.0545537 -0.0803428 -0.0395053 0.110556 -0.028402 -0.0423686 -0.133565 0.0427137 -0.00604069 0.0539301 0.113138 0.0130131 -0.0667863 -0.0696371 -0.165941 -0.0047501 -0.0163682 0.141808 0.0242743 -0.0969811 0.133124 0.0709163 -0.085307 0.150965 0.0150725 -0.166119 0.000973116 -0.00504694 -0.0992254 0.0246245 -0.0876939 0.0240148 -0.0500392 0.0123717 -0.106274 0.287679 -0.0266934 0.00267052 -0.0740738 -0.0713262 -0.170829 0.0646461 -0.145463 -0.041215 0.103762 0.0293867 -0.119048 0.108169 0.0157584 0.0291925 -0.0403856 0.0918273 0.116972 -0.044692 0.0772546 0.161617 0.0230526 -0.179937 -0.00526577 0.0220097 0.245898 -0.00611078 0.0383989 -0.017721 0.0623 0.0974982 0.0186189 0.104039 -0.0416043 0.0801297 0.0176323 0.144733 0.0290399 -0.0939007 -0.0707248 -0.047831 0.101827 0.0673228 -0.0286189 0.00983309 -0.0382598 -0.128365 -0.0742239 -0.121187 0.0771995 0.0951074 0.158743 -0.0264095 0.0785333 -0.0744451 0.10731 -0.00574986 -0.0694035 -0.123973 0.0476688 0.105079 0.127535 -0.0590024 0.0319772 0.0592981 -0.0639763 0.086908 -0.0684643 0.0411516 -0.115407 0.0517645 0.0359181 -0.0838058 0.0825377 0.265951 -0.0203588 -0.00168246 0.0468838 0.0725188 -0.0524733 -0.110796 0.0368822 0.0285827 -0.00384189 -0.0538294 0.0692227 -0.0443165 -0.0812816 0.0782693 -0.00717631 0.0214179 
0.0533847 0.0406489 -0.0565855 -0.0986536 -0.0429877 0.1045 -0.0452041 -0.0445922 -0.1576 0.0643371 0.0151061 0.0249252 0.121245 -0.00462828 -0.0564535 -0.0524926 -0.110811 -0.00747797 -0.014646 0.168033 -0.00201179 -0.0473721 0.10849 0.107713 -0.107845 0.143329 0.0362018 -0.123055 0.0495546 -0.000779547 -0.119718 -0.0161384 -0.100651 0.0194888 -0.0443048 0.0119674 -0.0829759 0.255105 -0.00976943 0.031206 -0.107307 -0.0685873 -0.165265 0.0600639 -0.122918 0.00178771 0.117651 0.0800864 -0.136291 0.134862 0.0456506 0.0776037 -0.0578248 0.075316 0.0946414 -0.0701374 0.0749885 0.14296 0.0479282 -0.174981 -0.00806886 0.032541 0.23958 -0.00574961 -0.0135038 -0.0496896 0.0766734 0.0846891 0.00875423 0.0694928 -0.0399822 0.0627124 0.0172043 0.148921 0.0465226 -0.104516 -0.0720349 0.00935368 0.1287 0.0902296 0.0344398 0.0203466 -0.0343665 -0.122363 -0.0367689 -0.110858 0.0373301 0.075305 0.16273 0.00142463 0.067523 -0.0501377 0.0938253 0.0340836 -0.0700881 -0.145949 0.0612589 0.0916315 0.103859 -0.115589 0.0466197 0.0879535 -0.0684139 0.0992295 -0.0977019 0.0466236 -0.0978615 0.0468333 0.0581824 -0.0558276 0.126318 0.267657 -0.00335591 0.035876 -0.000678752 0.0609601 -0.0857535 -0.107112 -0.0104768 0.00268175 -0.0320105 -0.0615053 0.0754705 -0.0340106 -0.0971994 0.0754392 -0.025021 -0.0126373 
0.0480556 -0.00900805 -0.0635414 -0.083784 -0.0198338 0.0867095 -0.0481682 -0.0452179 -0.196679 0.0741139 -0.00597899 0.0358032 0.128541 0.0513659 -0.0398807 -0.0485728 -0.0953564 0.00717684 0.0336502 0.1699 0.00798244 -0.0836502 0.146145 0.0761666 -0.0853995 0.144862 0.0112021 -0.133757 0.0246173 0.0147347 -0.125071 0.00618629 -0.0881926 0.00272445 -0.0459937 0.0200881 -0.106639 0.266973 0.00303172 0.00372816 -0.130692 -0.0351316 -0.164685 0.0287019 -0.13665 -0.00932746 0.10629 0.064392 -0.104587 0.113759 0.041892 0.060472 -0.0330396 0.0778108 0.0950889 -0.0717662 0.109411 0.147928 0.0464476 -0.161311 0.0100351 0.0489094 0.219934 -0.00804211 0.011136 -0.013561 0.0544652 0.110152 0.00877516 0.0599788 -0.0309954 0.0958242 0.0163248 0.134845 0.0226071 -0.0853957 -0.0596805 -0.0470339 0.140416 0.0893183 0.010255 -0.0028584 -0.037415 -0.124902 -0.0469325 -0.133595 0.0315045 0.0954102 0.175288 -0.0292984 0.0569781 -0.0186218 0.119786 0.042156 -0.0685052 -0.144684 0.0606373 0.122556 0.100014 -0.0987044 0.056927 0.0815949 -0.0608086 0.0792365 -0.0884141 0.0530041 -0.0947332 0.02295 0.0813361 -0.0552923 0.101767 0.252466 0.004855 0.0240255 0.0117446 0.0781545 -0.0639216 -0.0887846 -0.0137502 0.014082 -0.0481212 -0.0773618 0.0624754 -0.062762 -0.111577 0.0931703 -0.0253962 0.00344521 
0.0571317 0.0281784 -0.0490962 -0.0814551 -0.0403094 0.121494 -0.0343288 -0.0461956 -0.188243 0.0880944 0.0134684 0.01898 0.112901 0.00935851 -0.0242927 -0.0627405 -0.116698 0.0124662 0.0335008 0.14556 -0.00868148 -0.0574422 0.114346 0.0930561 -0.0854066 0.140561 0.0120279 -0.13117 0.0521015 0.000287689 -0.117438 -0.00264615 -0.110201 0.00889117 -0.0283596 0.0170926 -0.0900689 0.232317 0.0186236 0.0168126 -0.103368 -0.0693895 -0.165321 0.0364481 -0.142563 -0.0154187 0.113808 0.0791306 -0.128158 0.117471 0.0448972 0.0876814 -0.0380004 0.0767092 0.0903015 -0.066386 0.10312 0.142099 0.0410022 -0.163687 -0.00987049 0.051952 0.239585 -0.0197154 -0.00439076 -0.0015574 0.0764769 0.0741984 0.000901686 0.0772458 -0.0469176 0.0918689 0.00983397 0.168737 0.0443404 -0.11636 -0.0698378 -0.0255499 0.141437 0.088713 0.0275649 0.012186 -0.0256562 -0.126475 -0.0275211 -0.118748 0.0287829 0.0763128 0.168563 -0.0043796 0.0838143 -0.0199394 0.10775 0.0327419 -0.0737298 -0.158375 0.0630739 0.11575 0.105992 -0.10394 0.0563403 0.0931706 -0.0537244 0.0714857 -0.086415 0.0636424 -0.0740728 0.0338788 0.07568 -0.0412304 0.118971 0.25455 0.0127228 0.00602932 0.0171847 0.0603134 -0.053205 -0.09745 0.00644454 0.00505179 -0.0158613 -0.103878 0.0785585 -0.0542598 -0.109471 0.0898026 -0.00373184 0.0136151 
0.0493043 0.0593805 -0.0528128 -0.0827482 -0.0664067 0.124629 -0.0546527 -0.0577481 -0.175119 0.10309 0.0286471 -0.000384075 0.0903421 -0.0117108 -0.00620779 -0.0647918 -0.102823 0.00669762 0.0766439 0.122808 -0.0274682 -0.0334724 0.0924588 0.0993229 -0.0843864 0.163313 0.0303208 -0.149388 0.0804838 -0.00474896 -0.102288 -0.00613116 -0.0894172 -0.00590173 -0.00727709 0.0229049 -0.0494991 0.218904 0.0490717 0.0324758 -0.0982093 -0.0859969 -0.181916 0.0270678 -0.129031 0.0155038 0.134279 0.0672309 -0.150336 0.0819959 0.0311193 0.126755 -0.00965698 0.0713221 0.0712623 -0.0453416 0.126969 0.120735 0.0266702 -0.158398 -0.0173369 0.0459539 0.244181 -0.0342772 -0.00921617 0.0025062 0.100656 0.053059 0.0202212 0.0794406 -0.0669512 0.0593753 -0.021007 0.165095 0.0799723 -0.133282 -0.0921233 0.0113284 0.133945 0.0853822 0.0111203 0.0492807 -0.0322223 -0.120297 0.00494184 -0.100785 0.0141645 0.0544528 0.145242 -0.00211171 0.0917857 -0.00240645 0.112529 0.045436 -0.062259 -0.171878 0.0748865 0.116207 0.118589 -0.110817 0.0493848 0.0893322 -0.0561396 0.0637195 -0.0833248 0.0703924 -0.0388157 0.0161017 0.0701919 -0.0275409 0.122336 0.230735 0.0214084 -0.0287665 0.0156867 0.0480018 -0.0736541 -0.143591 0.0167891 -0.0150559 0.0110991 -0.112601 0.0774963 -0.0560189 -0.102058 0.0997117 0.00863311 0.0225199 
0.0451974 0.00721186 -0.0854397 -0.075922 -0.0450332 0.114419 -0.0439433 -0.0609425 -0.128821 0.0300793 0.004351 0.0358824 0.105364 0.00022504 -0.0681728 -0.0641678 -0.146376 -0.020309 0.00897892 0.141159 0.0178139 -0.0715216 0.124962 0.0921658 -0.0864013 0.152665 0.0365314 -0.174755 0.0180045 0.00442099 -0.0893653 0.00145429 -0.0917948 0.00671017 -0.0381388 0.0227229 -0.0878038 0.262737 -0.0150224 0.0196503 -0.081173 -0.0659202 -0.175823 0.0783166 -0.134077 -0.00908194 0.124324 0.0521755 -0.114076 0.106213 0.0146363 0.0589764 -0.0193087 0.0830895 0.113677 -0.0533817 0.0938882 0.159696 0.0414065 -0.186934 -0.0101941 0.0277279 0.259306 -0.00924701 0.0134412 -0.0376894 0.084421 0.0872405 0.0416051 0.092107 -0.0504845 0.0733131 0.00486857 0.140882 0.0483201 -0.10535 -0.089778 -0.0121302 0.0967441 0.0924649 -0.000647028 0.0298547 -0.0432406 -0.134196 -0.0547081 -0.1014 0.0534788 0.0760345 0.137325 -0.0322778 0.083257 -0.0535576 0.0975612 -0.00790476 -0.0640709 -0.141105 0.0608408 0.110839 0.130052 -0.08827 0.0348595 0.0692707 -0.0483514 0.0854741 -0.0938719 0.038027 -0.104365 0.0549929 0.031589 -0.0529265 0.10817 0.256797 -0.0140081 -0.0105826 0.0222647 0.0805522 -0.0710339 -0.130313 0.0226296 0.0151622 -0.00668764 -0.0559826 0.0764021 -0.0387251 -0.107162 0.0759572 -0.0197584 0.027276 
0.0333396 -0.0166104 -0.052348 -0.0864419 -0.0325255 0.116839 -0.033438 -0.0372464 -0.136669 0.0270503 0.000879848 0.0579875 0.109955 0.0052515 -0.0623298 -0.0764976 -0.164129 0.0015896 -0.0199507 0.148911 0.0271112 -0.0839033 0.133269 0.0832579 -0.0877822 0.144734 0.0202539 -0.169178 0.00781133 -0.014497 -0.0917124 0.0118526 -0.0894524 0.0270369 -0.0458998 0.0222176 -0.108126 0.271182 -0.0324169 0.00637465 -0.0566435 -0.0712901 -0.179626 0.077485 -0.156234 -0.0327285 0.108632 0.0403811 -0.127989 0.111113 -0.00214698 0.0257151 -0.0413846 0.0885633 0.112498 -0.0469659 0.0733526 0.166832 0.0177289 -0.175154 -0.00810119 0.0328364 0.251734 -0.00236747 0.0338225 -0.0270036 0.0660725 0.0946866 0.0210769 0.106539 -0.0425839 0.0753993 0.0179355 0.14064 0.0357824 -0.0948376 -0.0866125 -0.0319678 0.103537 0.0684582 -0.02971 0.0207885 -0.0396127 -0.131983 -0.0746808 -0.108669 0.0807376 0.0913339 0.137352 -0.0212611 0.0969694 -0.0712325 0.0988622 -0.0120995 -0.069629 -0.129614 0.0425764 0.103942 0.118832 -0.0713024 0.0305585 0.0559295 -0.0626164 0.0816904 -0.0691175 0.0457348 -0.11345 0.0587594 0.0303272 -0.0807882 0.0907736 0.261887 -0.020202 -0.0043665 0.0386418 0.0715167 -0.062135 -0.125876 0.0382015 0.0345157 -0.000495969 -0.0579255 0.0574077 -0.0323752 -0.0930984 0.0729036 -0.0138641 0.0219585 
0.0419218 -0.00709866 -0.0528 -0.0715263 -0.0329472 0.110602 -0.0193297 -0.0313146 -0.144732 0.0215427 -0.00625273 0.0569239 0.112808 -0.0330176 -0.0839422 -0.0605583 -0.154587 0.0167547 -0.0355643 0.16586 0.0405604 -0.0901231 0.128141 0.0897283 -0.100609 0.143289 -0.00284404 -0.178921 0.0133292 -0.00844541 -0.101263 0.0362653 -0.0940394 0.0455272 -0.0428718 -0.00338223 -0.0923344 0.275128 -0.0326095 -0.0107808 -0.0556922 -0.0819134 -0.141249 0.081575 -0.150427 -0.0479687 0.130125 0.0339631 -0.134251 0.134193 0.0205879 9.99074e-06 -0.0491477 0.097431 0.123967 -0.0561872 0.0833139 0.143043 0.035875 -0.191391 0.00391479 0.0275863 0.237284 -0.00801307 0.0322433 -0.0436645 0.0587962 0.0583663 0.0110258 0.0868479 -0.0626681 0.0657956 0.0200879 0.167206 0.0221255 -0.109266 -0.0677012 -0.0150399 0.104886 0.0616075 -0.0210656 0.0267483 -0.0433002 -0.130236 -0.0548047 -0.100964 0.069327 0.0909757 0.148918 -0.0132648 0.0979083 -0.0706933 0.0779302 -0.026506 -0.0641049 -0.107887 0.0449034 0.124717 0.100055 -0.0671807 0.0301946 0.0585844 -0.0540806 0.111622 -0.0600873 0.0294084 -0.108192 0.078707 0.0304428 -0.0726749 0.075557 0.267056 -0.0284757 -0.00340126 0.0316497 0.0559928 -0.0438435 -0.138825 0.0308814 0.0274186 -0.00495972 -0.0304781 0.0795162 -0.0314353 -0.0969644 0.0527605 -0.0116886 0.00409879 
0.0384535 0.001801 -0.0604026 -0.0876825 -0.0336065 0.118476 -0.0191065 -0.0272813 -0.132455 0.0371516 0.00553908 0.0497056 0.114365 -0.0090151 -0.0711052 -0.0705508 -0.151969 0.00863508 -0.0386605 0.153855 0.0214391 -0.0884118 0.133602 0.0776714 -0.100353 0.135095 0.0106228 -0.158709 0.0182665 -0.0240646 -0.0927448 0.0217986 -0.0934216 0.0342365 -0.0499577 0.00955819 -0.0985011 0.282495 -0.0376681 0.00322969 -0.0574186 -0.0757131 -0.172449 0.0785632 -0.161421 -0.0413418 0.105448 0.0451561 -0.131666 0.127672 0.00364944 0.0249104 -0.0611265 0.0890195 0.103079 -0.0524449 0.0699088 0.158143 0.0250158 -0.178389 -0.0137635 0.0277002 0.251454 -0.0132052 0.0312057 -0.034051 0.0628579 0.0865439 0.0090792 0.105219 -0.0440011 0.0723684 0.0241469 0.161097 0.0282606 -0.105734 -0.0733507 -0.0217405 0.101937 0.0489642 -0.031347 0.0195619 -0.0436315 -0.131945 -0.0650075 -0.104833 0.0731213 0.0906587 0.152231 -0.0168654 0.0996893 -0.0810426 0.0911937 -0.0238258 -0.0525728 -0.129009 0.0454916 0.105636 0.10114 -0.0677774 0.0279159 0.0583957 -0.0605425 0.0969001 -0.0658291 0.0426269 -0.109063 0.063313 0.0400646 -0.0807769 0.0855055 0.270028 -0.0139441 0.0112397 0.0371449 0.0537173 -0.0519067 -0.126089 0.0442506 0.0318029 -0.00451351 -0.0495391 0.0666629 -0.0195569 -0.086824 0.0551768 -0.0165466 0.00988247 
0.0327255 -0.0246305 -0.0311995 -0.0790759 -0.029604 0.104618 -0.0375102 -0.0235857 -0.137617 0.0245309 -0.00577778 0.0617337 0.102651 -0.00198906 -0.0538154 -0.0759095 -0.163785 -0.00907631 -0.0257986 0.158966 0.0190194 -0.0782352 0.144412 0.0889649 -0.0876513 0.141133 0.0234463 -0.155731 0.000326492 -0.0302777 -0.0942804 -0.00250618 -0.0842096 0.0382163 -0.0568626 0.0149514 -0.107056 0.27805 -0.0417801 0.0142705 -0.0569029 -0.0671708 -0.17207 0.0694539 -0.158417 -0.0442935 0.103397 0.0370068 -0.107173 0.138627 0.0163973 0.0261079 -0.05523 0.0950754 0.123867 -0.0592367 0.0748859 0.154153 0.0256419 -0.171323 -0.00974494 0.0239736 0.231209 0.00927684 0.0274936 -0.0409954 0.0634814 0.0897379 0.0195264 0.111958 -0.0402807 0.0848484 0.025275 0.162765 0.0377631 -0.0987189 -0.0821942 -0.0307386 0.108498 0.0810927 -0.023388 0.00929805 -0.0227293 -0.125301 -0.0628715 -0.119668 0.0825597 0.108662 0.146946 -0.0220629 0.0871321 -0.0655805 0.100155 -0.0109283 -0.0718458 -0.132196 0.0429634 0.100191 0.112144 -0.079025 0.0202175 0.0616054 -0.0576383 0.082891 -0.0613715 0.0352857 -0.11488 0.0563406 0.0473072 -0.0841321 0.0869712 0.274625 -0.0178055 0.00963574 0.0386865 0.0676414 -0.0425021 -0.117994 0.0307011 0.0414588 -0.00235299 -0.0395821 0.0563265 -0.0369805 -0.0911428 0.0646311 0.0022835 0.0286566 
0.0402276 -0.0100239 -0.0555474 -0.0813028 -0.0324291 0.123885 -0.0229943 -0.0332227 -0.133587 0.0272097 0.00204817 0.049862 0.106601 -0.00248466 -0.0606709 -0.0772536 -0.172054 0.00164385 -0.0273796 0.147233 0.0192623 -0.0811254 0.133362 0.0780318 -0.089802 0.132457 0.0135034 -0.158812 0.00979798 -0.0199276 -0.0903325 0.0171556 -0.100648 0.0294711 -0.0483769 0.0190046 -0.106686 0.263905 -0.0344888 0.00986275 -0.0514822 -0.0767466 -0.172483 0.0782351 -0.16446 -0.0427592 0.105011 0.0470817 -0.121802 0.127936 0.000974499 0.0279362 -0.0520462 0.0925636 0.110399 -0.0543615 0.0706156 0.163762 0.0241139 -0.173741 -0.0156832 0.0356784 0.254452 -0.00555199 0.0232462 -0.0223579 0.0709379 0.0833522 0.0170189 0.110236 -0.0440952 0.0850256 0.0264736 0.164239 0.0343435 -0.107249 -0.079633 -0.038466 0.0996062 0.0640667 -0.0152015 0.0179086 -0.0416548 -0.135493 -0.0673711 -0.100399 0.0729267 0.090861 0.144081 -0.0173558 0.107913 -0.0734132 0.0896883 -0.026955 -0.0644597 -0.13096 0.0395038 0.105659 0.116551 -0.0676951 0.0253192 0.0553251 -0.0508866 0.0798942 -0.0703683 0.047886 -0.112986 0.0666138 0.0339559 -0.0729902 0.0947651 0.267949 -0.0167546 -0.0016189 0.0364255 0.0631703 -0.0398261 -0.1164 0.0491326 0.0318031 0.00469169 -0.0594502 0.0701372 -0.0265786 -0.0950537 0.0598183 -0.00802425 0.0260916 
0.0333856 -0.024934 -0.0372191 -0.0772118 -0.0245177 0.118424 -0.033653 -0.0319896 -0.13364 0.0354218 8.87402e-05 0.0511034 0.10158 0.0111924 -0.0411488 -0.0714237 -0.161577 -0.00833759 -0.00750501 0.145456 0.0216841 -0.0790223 0.148501 0.0945756 -0.0800642 0.132764 0.0190917 -0.159342 0.0152335 -0.0224227 -0.0821605 -0.00775009 -0.0862345 0.0227307 -0.0478599 0.0264335 -0.111721 0.269298 -0.032647 0.0113634 -0.0705109 -0.0577632 -0.189942 0.0583684 -0.155294 -0.0460805 0.0970052 0.0474957 -0.101866 0.121973 0.00339527 0.040126 -0.0354668 0.0815154 0.112504 -0.0497978 0.0836314 0.168967 0.0153471 -0.165657 -0.0196083 0.0358456 0.247847 -0.00274435 0.0280041 -0.0148162 0.0644077 0.0943641 0.0114073 0.114637 -0.0410316 0.0950952 0.0119385 0.155973 0.0394682 -0.0990839 -0.0798428 -0.0439244 0.113669 0.081689 -0.0189036 0.00735598 -0.0291876 -0.131076 -0.055521 -0.121863 0.0706388 0.106809 0.143075 -0.0243972 0.101862 -0.0527253 0.107104 0.00438717 -0.0607363 -0.13966 0.0394083 0.105236 0.120677 -0.0695173 0.037111 0.053829 -0.0631318 0.0587119 -0.0700332 0.0515836 -0.101186 0.0293671 0.0648204 -0.0757392 0.0920235 0.271953 -0.00106756 -0.0024616 0.0520985 0.0856862 -0.0433435 -0.101236 0.0307453 0.0469166 -0.00238442 -0.0666706 0.0543169 -0.0429477 -0.107592 0.0891784 0.00108248 0.0360264 
0.0260581 -0.00198867 -0.0430976 -0.0800923 -0.0462422 0.114637 -0.0292426 -0.0348601 -0.128107 0.0243336 0.00135433 0.0627929 0.0983026 -0.00899055 -0.0724407 -0.0864299 -0.167211 0.00769912 -0.014691 0.142743 0.023625 -0.0753492 0.121134 0.0917701 -0.092709 0.151104 0.0240692 -0.166853 0.0125845 -0.0152077 -0.0950499 0.0101773 -0.0840525 0.0312192 -0.0424283 0.00974817 -0.0942907 0.274035 -0.0356093 0.0146112 -0.0467259 -0.0739054 -0.170122 0.0815655 -0.159451 -0.0442667 0.118275 0.0213663 -0.126928 0.117228 0.00883937 0.0264644 -0.0457596 0.0966897 0.123791 -0.0370814 0.0757161 0.158488 0.0198645 -0.181894 -0.0085276 0.0207211 0.25122 -0.00682923 0.033597 -0.0392737 0.0786823 0.0653876 0.0203702 0.11775 -0.0487345 0.06816 0.0203107 0.163541 0.0415896 -0.106523 -0.0890561 -0.0172774 0.0980508 0.0540375 -0.0395076 0.0400605 -0.0291861 -0.126846 -0.0589684 -0.116745 0.0847941 0.0891774 0.142408 -0.0198317 0.0919983 -0.07707 0.100553 -0.0266511 -0.0601771 -0.131462 0.0470967 0.107055 0.117877 -0.0663235 0.0182799 0.0659797 -0.056906 0.0918359 -0.0674719 0.0391557 -0.10412 0.053851 0.0193437 -0.0799854 0.0893359 0.257873 -0.0236972 -0.00779625 0.032496 0.0590627 -0.0449059 -0.147865 0.0435225 0.0245456 0.0105623 -0.045442 0.0592856 -0.0386406 -0.0874935 0.0681758 -0.00270153 0.0262368 
0.032774 0.000710968 -0.0459712 -0.0742756 -0.0313239 0.108726 -0.0214851 -0.0297073 -0.138553 0.0340197 -0.000149233 0.055133 0.112863 -0.0338385 -0.0761343 -0.0651532 -0.150222 0.0200197 -0.029803 0.163485 0.0407852 -0.0947274 0.126834 0.0928482 -0.0956233 0.148929 -0.00583481 -0.180862 0.0271089 -0.0151527 -0.0880615 0.030197 -0.0874456 0.0402104 -0.0399604 -0.00094816 -0.087821 0.28254 -0.0245985 -0.00874997 -0.0478762 -0.0784445 -0.150884 0.0798411 -0.1549 -0.0543675 0.128786 0.0322426 -0.127623 0.11781 0.0122982 0.0103227 -0.0528536 0.0922414 0.119136 -0.0497032 0.0850402 0.143157 0.0290335 -0.192407 -0.00250293 0.0193462 0.237381 -0.00829287 0.0351445 -0.0422622 0.0636744 0.0592103 0.0163803 0.0894826 -0.0598769 0.070121 0.0153566 0.16701 0.0308169 -0.113109 -0.0783547 0.000149021 0.108559 0.0591113 -0.0379073 0.0367418 -0.0328466 -0.11918 -0.0461551 -0.106764 0.0773812 0.0994913 0.151893 -0.0253139 0.0950456 -0.0658224 0.0896087 -0.0267482 -0.0616962 -0.128933 0.0440346 0.125879 0.0936418 -0.0698659 0.0249663 0.0574334 -0.0541169 0.111056 -0.0555317 0.0356971 -0.097119 0.0720919 0.048905 -0.0743964 0.0691508 0.263223 -0.0325522 -5.84422e-05 0.0366923 0.0539738 -0.050182 -0.150115 0.0282811 0.0280294 -0.00157072 -0.028155 0.0644838 -0.0305136 -0.102929 0.057226 -0.0141719 0.0166412 
0.0216576 -0.0069188 -0.00952239 -0.0622305 -0.0418112 0.0830515 -0.0471533 -0.0223875 -0.151013 0.0385271 -0.019981 0.0548202 0.106644 -0.00976056 -0.0583163 -0.0703713 -0.125379 0.0212162 -0.00383721 0.165463 0.0246242 -0.0749438 0.146721 0.107002 -0.0998862 0.150096 0.00549536 -0.158746 0.0159448 -0.0199804 -0.0953306 0.0042902 -0.0641361 0.0404098 -0.0344149 -0.00398981 -0.0738477 0.299111 -0.0396499 0.00188999 -0.0715616 -0.0457547 -0.140004 0.0591499 -0.156357 -0.0628628 0.127849 0.022602 -0.094685 0.142299 0.0491169 0.0148405 -0.0459901 0.105763 0.136821 -0.0546694 0.115588 0.116379 0.0603598 -0.202225 -0.00133154 0.0164864 0.191981 0.00171644 0.0305991 -0.0563603 0.07031 0.0507337 0.0162033 0.103515 -0.0506762 0.0672316 0.0229384 0.17978 0.0326543 -0.113356 -0.0866732 -0.000964892 0.124224 0.0621904 -0.0283971 0.0346926 -0.00982935 -0.112448 -0.0152556 -0.137652 0.0703387 0.112888 0.163425 -0.0243245 0.0657735 -0.0434458 0.116327 -0.0257973 -0.0605397 -0.13516 0.0475866 0.147067 0.0860286 -0.0813403 0.0238581 0.0859562 -0.0418737 0.106377 -0.050961 0.0120356 -0.0922847 0.0314358 0.0720352 -0.0687333 0.0609095 0.264675 -0.0188238 0.00824038 0.0235747 0.0553601 -0.0212465 -0.158303 0.00169751 0.0166189 -0.00472174 -0.0140558 0.0545338 -0.0605896 -0.106744 0.0559567 0.0126034 0.0339091 
0.0179332 -0.00799183 -0.0100528 -0.0646554 -0.0417822 0.0730311 -0.056389 -0.0137252 -0.146472 0.0482794 -0.0148888 0.0582274 0.101722 -0.012063 -0.0491978 -0.0647682 -0.118525 0.0173989 0.000662654 0.165187 0.0174868 -0.0689466 0.151738 0.108167 -0.0992206 0.158032 0.0255997 -0.162241 0.016858 -0.0283088 -0.0935361 -0.00289956 -0.0527712 0.0385742 -0.0415996 -0.00386307 -0.0707842 0.306077 -0.0418165 0.0159327 -0.0732736 -0.0422696 -0.150241 0.063966 -0.159174 -0.0577803 0.127708 0.0150251 -0.0898842 0.138065 0.0566849 0.0206104 -0.0557768 0.102408 0.132765 -0.052976 0.11829 0.112217 0.0616641 -0.193676 -0.00526534 -0.00317275 0.186732 0.00416467 0.0343439 -0.0731441 0.0696786 0.0600953 0.0271871 0.108015 -0.0485861 0.0701563 0.019553 0.173836 0.0371928 -0.114295 -0.0946393 0.0186944 0.116106 0.0622442 -0.0360531 0.0368676 -0.00609515 -0.108535 -0.0169095 -0.138578 0.0773202 0.114575 0.161317 -0.0341021 0.0499809 -0.0405941 0.111394 -0.0240848 -0.0544622 -0.137819 0.0501268 0.137424 0.0845861 -0.087849 0.0122305 0.0795295 -0.0431444 0.109354 -0.0489458 0.00362006 -0.0944265 0.0248179 0.0773924 -0.0758206 0.055579 0.268524 -0.015036 0.0105649 0.0255745 0.0507879 -0.0273992 -0.170555 -0.00113943 0.0162084 -0.00121385 -0.0032867 0.0484526 -0.0536669 -0.0983613 0.0509262 0.0106788 0.0382229 
0.0291656 -0.000142015 -0.0273614 -0.0630291 -0.0486962 0.0920102 -0.0446478 -0.00536187 -0.144437 0.0411154 -0.00579683 0.0635146 0.0932665 -0.0519132 -0.0668368 -0.0596111 -0.132613 0.00372046 -0.0136348 0.167708 0.0156672 -0.0720552 0.136261 0.10784 -0.0998618 0.159633 0.0388324 -0.169878 0.0175184 -0.0352413 -0.0999044 0.00278188 -0.0632703 0.0530626 -0.0565594 -0.0172343 -0.0698511 0.286787 -0.0378832 0.0166814 -0.0552564 -0.0783846 -0.137909 0.0760753 -0.152307 -0.0616606 0.137124 0.0118138 -0.114819 0.147922 0.0596901 0.0181428 -0.0641304 0.104925 0.133258 -0.0544652 0.0997487 0.113442 0.0526248 -0.191285 -0.00768519 -0.00806741 0.206583 -0.00505298 0.0331165 -0.0729534 0.0648419 0.0421422 0.0191625 0.101442 -0.0690232 0.0613627 0.0116384 0.186533 0.0488598 -0.121869 -0.0743033 0.029647 0.104159 0.0694389 -0.0354995 0.0271866 -0.00434998 -0.112441 -0.0240904 -0.119352 0.0774264 0.104945 0.160215 -0.0230987 0.0583282 -0.0604166 0.0811457 -0.019397 -0.0539821 -0.122188 0.0590454 0.122046 0.0857004 -0.084741 0.00327445 0.0725554 -0.04804 0.12202 -0.0479006 0.00933929 -0.0957249 0.0534818 0.0469624 -0.0860851 0.0619525 0.275694 -0.0126575 0.00590775 0.0303787 0.036968 -0.0311311 -0.163711 0.0210195 0.0242681 0.00377305 -0.00832942 0.0692123 -0.0470792 -0.0819657 0.0470675 0.0138481 0.0243891 
0.0169521 -0.00751719 -0.00176949 -0.0583438 -0.0391911 0.0718647 -0.0535369 -0.0131162 -0.14789 0.0425606 -0.0224395 0.0557689 0.0989697 -0.00915961 -0.0499381 -0.068934 -0.113743 0.0212016 -0.00539176 0.166044 0.0150439 -0.0699846 0.150689 0.116029 -0.0948235 0.147396 0.0160412 -0.15019 0.0172569 -0.0319067 -0.0901446 -0.000227658 -0.0619215 0.0404362 -0.0441506 -0.00490994 -0.0757362 0.302293 -0.0499247 0.0152123 -0.0697111 -0.0348765 -0.143509 0.0607148 -0.157741 -0.0647185 0.125392 0.0169776 -0.082118 0.144567 0.0622636 0.0164317 -0.0578343 0.098803 0.133879 -0.0565047 0.114085 0.116225 0.0723873 -0.198853 -0.0041206 0.00739302 0.176744 0.00484303 0.0286175 -0.070376 0.0736522 0.0508152 0.0195919 0.112663 -0.0458715 0.0763932 0.0300361 0.187784 0.0316502 -0.118931 -0.0899 0.0145553 0.120188 0.0569201 -0.0312867 0.0402276 -0.00418334 -0.114458 -0.00751142 -0.145448 0.0730712 0.117019 0.161199 -0.0326793 0.0506773 -0.0372981 0.116094 -0.0324303 -0.049895 -0.135404 0.050586 0.138257 0.0791169 -0.0861097 0.0073658 0.0828617 -0.0382589 0.113527 -0.0530899 0.00260609 -0.0980399 0.0221533 0.0809591 -0.0723001 0.0587346 0.273615 -0.0163168 0.0174322 0.0208885 0.0456579 -0.0185957 -0.167528 -0.00170259 0.0144183 -0.00594222 0.00253285 0.0474742 -0.0578008 -0.103895 0.0466418 0.00748447 0.0320563 
0.0166126 -0.00827633 0.00246216 -0.0529792 -0.0473239 0.0851593 -0.0541898 0.00649598 -0.158269 0.0557117 -0.0149792 0.0368054 0.102637 -0.0188687 -0.0468869 -0.0607103 -0.117275 0.02711 0.00184749 0.167496 0.0272019 -0.092388 0.145509 0.122534 -0.0836411 0.135704 0.00712085 -0.150593 0.0399229 -0.0365045 -0.0843529 0.00562697 -0.0635416 0.0427999 -0.0540037 -0.0071017 -0.0799183 0.281366 -0.0412283 -0.00242769 -0.0676081 -0.0604474 -0.131656 0.0473825 -0.145223 -0.0919756 0.128918 0.0229458 -0.0933649 0.136363 0.0538274 0.0194824 -0.0422946 0.0963147 0.127053 -0.047958 0.124562 0.10209 0.0753281 -0.217345 -0.00838197 0.0224775 0.177443 0.00447237 0.00910425 -0.0215 0.0695718 0.0303621 0.0136598 0.0999913 -0.0750314 0.0699311 0.0127963 0.194907 0.048096 -0.134375 -0.069062 0.0144565 0.128999 0.0625176 -0.0321695 0.0286018 -0.00247135 -0.120771 0.00974568 -0.1186 0.0581853 0.125012 0.177977 -0.025005 0.0713912 -0.0260641 0.106992 -0.0161216 -0.052186 -0.131649 0.0394445 0.159965 0.075455 -0.0838932 0.0253032 0.0713803 -0.0316688 0.104301 -0.0424997 0.0263653 -0.0818878 0.0200434 0.0946578 -0.0827515 0.0443059 0.277461 -0.0102726 -0.0033336 0.0379676 0.0433881 -0.00638979 -0.153194 0.0167823 0.0181628 -0.00319498 -0.0257977 0.0555304 -0.0694221 -0.123735 0.0634532 0.0212234 0.0413854 
0.029844 -0.0152008 -0.0146309 -0.0501062 -0.0286255 0.0784373 -0.0445004 0.0137943 -0.166378 0.0603003 -0.0158606 0.0365852 0.113733 -0.00247872 -0.049852 -0.0536124 -0.0871037 0.0293461 -0.00891845 0.187028 0.0250174 -0.0988838 0.143419 0.134082 -0.0796808 0.118605 0.00380218 -0.138063 0.0397063 -0.0276993 -0.0858075 0.00965086 -0.0768979 0.0425793 -0.069283 -0.00284333 -0.0905447 0.278377 -0.0607303 -0.0101304 -0.076292 -0.0435946 -0.126748 0.0564232 -0.141907 -0.0875784 0.122313 0.0403324 -0.0803321 0.139995 0.0649996 0.0127222 -0.0551436 0.07795 0.131799 -0.0548382 0.100025 0.113858 0.101498 -0.215951 -0.0103616 0.0242988 0.168168 0.00118443 -0.000118287 -0.0330855 0.0642556 0.0394954 0.00805956 0.0940548 -0.0628095 0.083723 0.0240376 0.186783 0.0277089 -0.126432 -0.052121 0.0284495 0.130878 0.0584362 -0.0221213 0.0201182 -0.0129885 -0.133605 0.01022 -0.12549 0.0528684 0.126424 0.186125 -0.0275299 0.0645351 -0.0222718 0.0979526 -0.0199765 -0.0456882 -0.125529 0.0490938 0.146747 0.066684 -0.0939414 0.0277759 0.0780076 -0.022475 0.106295 -0.0678375 0.0264019 -0.0989968 0.0152645 0.108972 -0.0784193 0.051347 0.287853 -0.0133317 0.0144565 0.028804 0.0385029 -0.00793807 -0.147217 0.00240291 0.0197074 -0.0265491 -0.0142515 0.0553231 -0.0567361 -0.13082 0.0565269 0.00338489 0.0201018 
0.0410515 -0.0230405 -0.00380469 -0.0519673 0.00404703 0.0743561 -0.0471702 0.0045485 -0.188182 0.0461755 -0.0343499 0.0474267 0.105684 -0.00462426 -0.0255599 -0.060553 -0.0705751 0.0314602 0.0106186 0.203596 0.0317811 -0.0782414 0.142774 0.14507 -0.0670086 0.119638 -0.00752572 -0.151146 0.032374 -0.0141246 -0.0872037 -0.00484926 -0.0752723 0.0461889 -0.0490331 -0.00285865 -0.0768397 0.260935 -0.0534205 -0.0239233 -0.0627886 -0.0276577 -0.101529 0.0611998 -0.154808 -0.0566485 0.141756 0.0401338 -0.0778026 0.146335 0.0690986 -0.00709522 -0.0462607 0.0755232 0.154662 -0.0626149 0.0997906 0.113609 0.0980884 -0.212888 0.00275974 0.0325491 0.151225 0.00150908 0.00675849 -0.0573196 0.0569884 0.0381319 0.0135908 0.0832974 -0.0507601 0.0915236 0.0179366 0.169119 0.0222755 -0.106853 -0.0659475 0.0397966 0.149132 0.0726058 -0.017752 0.0430627 -0.00463373 -0.114995 0.0238565 -0.13852 0.0560523 0.136116 0.172609 -0.0206783 0.0667755 -0.00734592 0.0908104 -0.0189784 -0.0619698 -0.133072 0.0554319 0.155014 0.0548119 -0.113717 0.0247818 0.0858432 -0.00979158 0.100466 -0.0928153 0.0209906 -0.103532 0.0199451 0.109051 -0.0566681 0.0708585 0.268942 -0.0304016 0.0143489 0.0141266 0.0426161 -0.021097 -0.168703 -0.0344579 0.0271914 -0.0258919 0.00839688 0.0459257 -0.0549692 -0.142766 0.052141 0.00726576 0.0127016 
0.033386 -0.00453385 0.015953 -0.0438455 -0.0449203 0.0915176 -0.0282303 0.0185167 -0.161785 0.0732991 -0.0131668 0.0238463 0.109955 -0.0314902 -0.0376511 -0.0741069 -0.10212 0.0483317 0.00749833 0.162993 0.0468639 -0.103395 0.130836 0.132775 -0.0787443 0.111174 -0.0284919 -0.163107 0.0489119 -0.017916 -0.0798299 0.000352248 -0.0718012 0.0439859 -0.0304189 -0.0250269 -0.0795026 0.273946 -0.0294777 -0.0349833 -0.0771826 -0.0687464 -0.136996 0.0381704 -0.139948 -0.102135 0.109824 0.0350724 -0.0919023 0.127189 0.056389 0.0372982 -0.0240376 0.0820808 0.120819 -0.0489468 0.130089 0.0805946 0.0707015 -0.222235 -0.00329927 0.02165 0.161046 -0.00258841 0.000341427 -0.0203505 0.0682847 0.0142997 -0.00629601 0.0892902 -0.0777879 0.0619222 -0.0084892 0.179006 0.0201793 -0.133933 -0.0569154 0.00762544 0.154905 0.0899079 -0.0484198 0.0134072 0.00221016 -0.111729 0.0399542 -0.138969 0.0528133 0.123986 0.196545 -0.0153321 0.0762732 -0.0127684 0.112584 -0.00164448 -0.0716232 -0.150888 0.0446189 0.163524 0.0603113 -0.088256 0.0670765 0.0965227 -0.0318581 0.0927246 -0.0321139 0.0258086 -0.0494172 0.0102455 0.127347 -0.061981 0.0412943 0.258692 -0.0232717 -0.0135963 0.0506046 0.0577308 -0.000740822 -0.150099 0.00790269 0.0297705 -0.0147837 -0.0401483 0.0406792 -0.0686142 -0.122597 0.0680154 0.0455071 0.0410861 
0.0293587 -0.0127136 0.00655981 -0.0370644 -0.057011 0.0947984 -0.0235122 0.0332 -0.136307 0.0662152 -0.010735 0.0139848 0.107849 -0.0455892 -0.0377078 -0.0839535 -0.109822 0.0298417 0.00228971 0.162461 0.0398958 -0.118689 0.126051 0.119099 -0.0817103 0.108443 -0.0353956 -0.17432 0.0399468 -0.0408534 -0.0540785 0.00160303 -0.0702164 0.0437143 -0.0286615 -0.016148 -0.0682839 0.28317 -0.0383208 -0.043785 -0.056167 -0.0762284 -0.150567 0.0416868 -0.140337 -0.115642 0.0985666 0.0404627 -0.0781207 0.12093 0.0239191 0.0336558 -0.0132312 0.0830849 0.115741 -0.0494165 0.120822 0.0696982 0.0707486 -0.235392 -0.016281 0.0144674 0.1632 -0.00948201 -0.00240626 -0.00763785 0.0855761 0.0136549 0.00725687 0.0752983 -0.0838989 0.0562355 -0.0065836 0.182191 0.0252769 -0.143951 -0.0625458 0.0122727 0.151504 0.0985802 -0.0624977 0.00546894 -0.00336838 -0.117356 0.0450597 -0.128369 0.0589021 0.13206 0.20042 -0.0309365 0.0886587 -0.0127264 0.120716 -0.0196096 -0.0731454 -0.156985 0.0482235 0.152686 0.0549401 -0.0866932 0.0591843 0.0849842 -0.0292137 0.0820312 -0.0267447 0.0286086 -0.0418196 0.0119186 0.123456 -0.0522959 0.0338074 0.258121 -0.0266618 -0.0258594 0.0568467 0.0512905 0.000716211 -0.159243 0.021064 0.0221596 -0.0139367 -0.0364294 0.0439223 -0.0502141 -0.118025 0.0517025 0.045416 0.0508295 
-0.000267182 0.0198214 0.0489222 -0.0549282 -0.0705712 0.113578 -0.0199937 0.0643971 -0.127388 0.115989 -0.0237113 -0.0348431 0.047761 -0.0293486 0.0434419 -0.138163 -0.0821326 0.0708059 0.0964349 0.0597317 -0.0118006 -0.053693 0.0833285 0.125983 -0.059451 0.0979959 -0.0088834 -0.139519 0.0902825 -0.079981 -0.0226243 -0.0480408 -0.0697655 -0.00222192 0.0319484 -0.0153935 -0.0386312 0.202505 -0.0402926 -0.0320929 -0.0318248 -0.0517475 -0.172366 0.0501374 -0.156481 -0.0907787 0.0788105 0.0412895 -0.0849694 0.0548422 0.0235658 0.0847804 0.0178342 0.0387265 0.0748144 -0.00247546 0.135723 0.0679456 0.0759671 -0.228581 -0.0309581 0.0312124 0.142792 -0.0184831 -0.00244943 0.0306096 0.119433 -0.0377143 0.0114865 0.135854 -0.0838276 0.0553301 -0.00684887 0.173637 0.0235873 -0.168027 -0.10399 0.0398948 0.167183 0.0243343 -0.0760827 0.064894 0.00288274 -0.114877 0.124841 -0.169527 0.0447415 0.118708 0.186634 -0.00371101 0.106228 0.0483773 0.12687 -0.0531108 -0.0248362 -0.179054 0.0714794 0.154129 0.0420571 -0.0799736 0.059493 0.103493 0.00456414 -0.00296051 -0.0543836 0.0360187 0.00758635 -0.0873426 0.134845 -0.0178163 0.0823219 0.20885 0.0102458 -0.0794401 0.0645498 0.0127216 0.0307029 -0.206072 0.0471203 -0.0311726 0.0376283 -0.0913333 0.019911 -0.0744693 -0.110228 0.0570596 0.0700691 0.0655047 
0.0103398 -0.00699876 0.000621877 -0.0908555 -0.0426775 0.141058 -0.0282544 0.0711412 -0.126577 0.0549456 -0.0119405 -0.006288 0.0712892 0.00161324 0.0243684 -0.125286 -0.0850995 0.00222566 0.0608046 0.116405 -0.0125188 -0.043694 0.0945997 0.122437 -0.0759392 0.107446 0.0277621 -0.138658 0.0834062 -0.0997902 -0.00551321 -0.0782564 -0.0781456 0.00544813 -0.0156431 0.0438172 -0.0585442 0.223896 -0.0756388 0.00232813 -0.0120711 -0.0193237 -0.190917 0.0860911 -0.162646 -0.0680224 0.0894522 0.0464026 -0.086817 0.0785286 -0.0458332 0.0411537 -0.0145264 0.0400928 0.0860096 -0.00215132 0.0662732 0.146525 0.0654503 -0.21435 -0.0662456 0.048785 0.208074 -0.0382772 0.00429611 0.012269 0.123707 0.0101659 0.0255426 0.130523 -0.0568869 0.0688508 0.00571111 0.164132 0.0510757 -0.146407 -0.10367 0.0553963 0.146695 0.0253895 -0.0699182 0.0518064 -0.00974391 -0.123244 0.0655984 -0.141943 0.070926 0.122046 0.155368 -0.0197923 0.140271 -0.000765558 0.103634 -0.0429129 0.00232565 -0.165427 0.0711805 0.129625 0.0435459 -0.0756373 0.00476384 0.0814887 -0.0191276 0.00599278 -0.122073 0.0805347 -0.0439277 -0.0695688 0.0971574 -0.0535609 0.100971 0.230146 0.00847041 -0.0355295 0.0543362 0.0319827 0.00650905 -0.204318 0.040391 0.0048799 0.0176921 -0.0883701 0.0246915 -0.0372698 -0.137123 0.0601433 0.0256504 0.056878 
0.0409371 -0.0315758 -0.0547663 -0.0762467 -0.0132121 0.102401 0.000581711 0.0318152 -0.133644 0.0462686 0.00265442 0.0393903 0.103975 -0.0184134 -0.0482067 -0.0998007 -0.108987 0.00357912 0.0169638 0.171552 0.0254989 -0.0762667 0.0963009 0.121522 -0.0935054 0.129836 0.0184085 -0.163481 0.0546053 -0.0397254 -0.0644043 -0.0409111 -0.097647 0.0177944 -0.0352924 0.00519114 -0.0819316 0.243843 -0.0626795 -0.0146025 -0.0295139 -0.0412176 -0.171632 0.124059 -0.169877 -0.0668727 0.101409 0.0559714 -0.0725197 0.0998563 -0.0178554 0.0210746 -0.0575721 0.0577212 0.11762 -0.0354898 0.0557323 0.150975 0.0647614 -0.194762 -0.0192241 0.00676454 0.231033 0.00243729 0.00204189 -0.0530449 0.0975929 0.0269811 0.0563193 0.0822142 -0.0602257 0.0804536 0.023059 0.157636 0.0153388 -0.135003 -0.0827467 0.0609069 0.131853 0.0658593 -0.040588 0.0344324 -0.0195458 -0.123034 0.0206022 -0.136278 0.0917336 0.12391 0.172105 -0.0416757 0.123922 -0.0201018 0.0750578 -0.0452611 -0.0432816 -0.172847 0.0649352 0.108833 0.0766989 -0.0969675 0.0257711 0.079593 -0.00707344 0.0467971 -0.107431 0.0465926 -0.0714985 0.0227299 0.0836165 -0.0426896 0.103801 0.242805 -0.0276099 -0.0115085 0.032996 0.0497362 -0.00872886 -0.179266 0.0104611 0.0061769 -0.0240502 -0.0363782 0.0288433 -0.0158252 -0.149839 0.0486701 -0.0123989 0.0372682 
0.0902231 -0.0221883 -0.0806506 -0.0743475 0.0536899 0.118377 0.0111312 0.00873751 -0.124255 -0.0118888 0.000774974 0.0629979 0.0945636 -0.0381841 -0.0659765 -0.0501862 -0.0640556 0.0220603 -0.0603466 0.166362 0.0577178 -0.0360849 0.127122 0.108659 -0.0784831 0.107882 0.0318291 -0.169317 0.0419762 -0.0214113 -0.055929 0.0364499 -0.0968225 0.0764283 -0.048737 -0.032178 -0.0477442 0.259881 -0.0330429 -0.0237637 -0.0022969 -0.030957 -0.114384 0.121574 -0.191907 -0.0569789 0.10872 0.0533336 -0.0799287 0.11947 0.0180988 -0.00414899 -0.0692086 0.0626411 0.11512 -0.0606543 0.081356 0.154194 0.0510701 -0.192877 -0.0289351 -0.0175948 0.227721 -0.0296739 0.00836932 -0.0839898 0.0495643 0.0727075 0.0435464 0.109677 -0.0542823 0.0764903 0.0076015 0.138324 -0.00785559 -0.124569 -0.0642847 0.0571657 0.0795735 0.0569001 -0.0219113 0.0774195 0.00331767 -0.125372 0.00505616 -0.12211 0.0990179 0.130163 0.120878 -0.0254159 0.130887 -0.0632977 0.00281419 -0.0532302 -0.0169329 -0.131067 0.0578713 0.122283 0.0425417 -0.105833 0.0134852 0.0533012 -0.0146401 0.153753 -0.100755 -0.00860578 -0.120192 0.0684319 0.0726571 -0.0737414 0.0978127 0.269249 -0.0570219 0.0590849 0.043323 0.0257588 -0.0497149 -0.188275 0.00515723 0.038221 -0.00174755 0.0432871 0.0533589 0.0123407 -0.117343 -0.0109735 -0.0248774 -0.00520496 
0.0565784 -0.0191509 -0.10463 -0.0714078 0.0329592 0.156738 0.00375364 0.00747041 -0.0833749 -0.0154974 0.0222053 0.0752258 0.0516161 -0.0930457 -0.0782307 -0.0934544 -0.147958 0.0106416 -0.0165761 0.139316 0.0376649 -0.0350531 0.0952823 0.0623175 -0.0693889 0.119293 0.0690557 -0.196889 0.0357362 -0.041104 -0.0249618 -0.0105742 -0.0917751 0.0422097 -0.0224287 -0.00111042 -0.0645695 0.186732 -0.035026 -0.0111576 0.0475489 -0.0783396 -0.150292 0.178586 -0.225233 -0.061247 0.117182 0.0442659 -0.0832627 0.0910437 -0.0318287 0.0248873 -0.0643647 0.0536213 0.100681 -0.029912 0.0510718 0.151028 0.000968775 -0.161534 -0.0474973 -0.0374743 0.300112 -0.018525 0.0401152 -0.103648 0.0715703 0.0320271 0.0729875 0.146822 -0.0566014 0.0865665 0.00644116 0.127686 0.00454469 -0.134379 -0.102489 0.0775242 0.0405605 0.053818 -0.0557281 0.0788445 0.0138496 -0.0923719 -0.0207879 -0.0952095 0.118791 0.12926 0.110049 -0.032543 0.156618 -0.0689586 -0.0140443 -0.0642666 -0.022206 -0.166537 0.0540727 0.0920633 0.0675814 -0.0960699 -0.00977814 0.0518904 -0.0135227 0.0778798 -0.0777777 0.028748 -0.0756303 0.0829064 0.0216259 -0.0376246 0.102069 0.220529 -0.0489521 0.0137133 0.0491969 0.0197182 -0.0270416 -0.196118 0.066545 0.0404791 0.036276 -0.00964901 0.0499502 0.00973256 -0.100024 0.00623692 0.00452485 0.0514126 
