0.0767743 0.0620706 -0.182917 -0.0192938 0.093834 0.10713 0.0265563 -0.0785862 -0.103804 -0.00532306 0.0703826 0.0830094 0.111187 -0.0187985 -0.101005 0.0120396 -0.0724981 -0.00209294 -0.0511984 0.150018 0.130898 -0.131918 0.0864171 0.113264 0.0467811 0.0205899 0.00603173 -0.161422 0.092329 0.135678 -0.0317383 0.0447273 -0.0871386 0.00667377 -0.107044 0.0151764 -0.151448 0.120463 0.00493948 0.0161785 -0.0270553 -0.0432169 -0.0652681 0.139651 -0.123607 0.0197425 0.163668 0.0209318 -0.106423 0.020878 0.0190909 0.0662084 -0.0832502 -0.0263274 0.0835137 -0.00721894 0.00297279 0.226775 0.0294583 -0.0996006 -0.0533109 -0.0168686 0.281817 -0.0419162 0.000690587 -0.0665123 -0.00230396 0.0798813 -0.009394 0.0817014 0.00601275 0.15665 -0.0595445 0.0438604 0.0387065 -0.0155948 -0.0309449 0.060772 -0.0195638 0.110323 -0.0504604 0.0381349 -0.00838443 -0.0595191 -0.0895869 0.0176086 0.0565285 0.0143462 0.0444536 -0.0748826 0.0526628 -0.0952752 -0.0566534 -0.021041 -0.00432202 -0.138111 7.0018e-05 0.105272 0.098166 -0.101993 -0.0233327 0.00840788 0.0164551 0.162148 -0.180502 0.0898582 -0.138522 0.185448 0.0735389 -0.112852 0.0635977 0.170675 -0.0971102 0.0306061 0.0444848 0.0985222 -0.0977649 -0.0827943 0.0545472 0.15097 -0.0248593 0.0124517 -0.0170004 0.0488074 -0.159709 0.0819383 -0.057972 0.0216982 
0.0795346 0.0578525 -0.156261 -0.012226 0.080884 0.159281 0.0329081 -0.0868764 -0.0910179 -0.0424621 0.0728719 0.085453 0.105788 -0.084198 -0.123413 0.00496842 -0.136559 0.0259431 -0.0921113 0.136902 0.170923 -0.114713 0.0641979 0.127529 0.0283523 -0.00600136 -0.0172034 -0.190547 0.0731099 0.148956 -0.0376832 0.0278559 -0.10673 0.0337359 -0.0569068 0.00589689 -0.151437 0.059968 -0.00375082 -0.00558769 -0.00608145 -0.0891955 -0.0425853 0.159417 -0.11677 -0.00823513 0.174679 0.0347253 -0.141949 0.0460347 0.020529 0.02609 -0.0675406 -0.0109623 0.089791 -0.000984526 -0.0109597 0.202004 0.00537579 -0.112889 -0.0409318 0.0125483 0.294843 -0.0335949 0.00907597 -0.081754 -0.0084456 0.0339547 -0.0367766 0.0820361 -0.0185445 0.116917 -0.0575642 0.0201052 0.0253904 -0.0174409 -0.0399983 0.0392819 -0.0141412 0.135465 -0.0164363 0.0255109 -0.0109624 -0.0501016 -0.118165 0.0569152 0.058623 -0.00401237 0.016772 -0.0112121 0.087696 -0.127758 -0.083539 -0.0129909 -0.0608266 -0.108635 -0.0336099 0.105489 0.0971874 -0.0810907 0.0289827 0.0206813 -0.00082592 0.139004 -0.128183 0.0843534 -0.12031 0.213344 0.0155941 -0.0845168 0.0605694 0.145696 -0.0983206 0.00365675 0.0347035 0.122739 -0.100197 -0.0424057 0.0571532 0.157305 -0.00606579 -0.0259637 -0.004788 0.0328167 -0.139082 0.0943797 -0.0368515 0.0121013 
0.101948 0.0641601 -0.173401 -0.0231281 0.0764459 0.147345 0.0186321 -0.0642676 -0.103178 -0.0514285 0.0716596 0.0827406 0.109535 -0.0997165 -0.142054 0.032277 -0.104135 -0.00152344 -0.11097 0.149507 0.163468 -0.0930779 0.0607207 0.107406 0.0156479 0.0165609 0.00985696 -0.168896 0.0739335 0.130577 -0.0513987 0.0372791 -0.105541 0.0512925 -0.0871571 -0.0182881 -0.136269 0.0800196 0.00192521 0.00868676 -0.0200396 -0.0862733 -0.0250761 0.164428 -0.0955714 -0.0118255 0.177153 0.0334406 -0.145393 0.0688829 0.0485353 0.0288273 -0.0895486 0.000778886 0.0796147 -0.0306632 -0.0102745 0.184655 0.02311 -0.124716 -0.0405958 -0.00594101 0.284088 -0.0223202 -0.0165548 -0.10178 -0.00827556 0.0458274 -0.0221088 0.0587319 -0.0241629 0.099103 -0.0482149 0.0356446 0.028293 -0.0270199 -0.0298463 0.0464865 -0.0283391 0.150051 0.00891192 0.0203905 0.00389648 -0.0561476 -0.11222 0.0538235 0.0578652 -0.00126526 0.0273051 -0.0191558 0.0680932 -0.132305 -0.114053 0.000195507 -0.0468112 -0.0876373 -0.00943823 0.0969955 0.0675443 -0.0920518 0.00874572 0.027509 -0.0018678 0.177558 -0.143826 0.0615853 -0.139736 0.228634 0.0148329 -0.106705 0.0709075 0.162484 -0.107534 0.03446 0.0302165 0.0995679 -0.110316 -0.0454329 0.0512414 0.138037 -0.0230402 0.00393582 0.0254198 0.031142 -0.114431 0.0579831 -0.037087 -0.00713045 
0.108156 0.0486686 -0.145129 -0.0169337 0.081756 0.138095 0.0356306 -0.0345928 -0.0703632 -0.0676532 0.0734561 0.0899574 0.103658 -0.139796 -0.146551 0.0198459 -0.113019 -0.00253594 -0.170538 0.181004 0.154717 -0.0927473 0.0679136 0.122801 -0.0148027 -0.01547 -0.0105792 -0.162614 0.0693961 0.0925659 -0.0441207 0.0317472 -0.106718 0.0743753 -0.0982834 -0.0232208 -0.14319 0.09385 -0.0474882 0.00800584 -0.000982029 -0.0898373 -0.0587013 0.159466 -0.100545 -0.0294866 0.142543 0.0537472 -0.134548 0.10687 0.0264849 0.0158243 -0.106983 -0.0127437 0.0674023 -0.0484286 -0.035687 0.168117 0.00633553 -0.107888 -0.0513628 0.00268825 0.268477 -0.00589586 -0.025789 -0.12283 -0.00785293 0.0341501 -0.0458166 0.0521088 -0.022344 0.0822267 -0.0281823 0.0619523 0.0187714 -0.0331353 -0.0251599 0.0455989 -0.0211169 0.152978 0.00979937 0.00116689 -0.0117156 -0.059989 -0.0997491 0.0647089 0.0614826 0.0135805 0.0167355 -0.00570778 0.0917095 -0.137171 -0.11999 0.00215685 -0.0482539 -0.0815345 -0.0207413 0.0563986 0.0496326 -0.0865266 0.0187224 0.0137563 -0.0189557 0.164804 -0.123353 0.0547285 -0.129747 0.230085 0.0368384 -0.0986419 0.0723051 0.185309 -0.0975277 0.0439551 0.0255691 0.0961149 -0.110359 -0.0271573 0.0541423 0.153799 -0.042457 0.0205701 0.00392413 0.0587602 -0.101858 0.0456641 -0.0377004 -0.0303959 
0.102165 0.0626494 -0.163004 -0.0231515 0.0758763 0.138071 0.0286836 -0.0468126 -0.0870817 -0.0494334 0.0734693 0.0801705 0.112527 -0.127883 -0.147655 0.030735 -0.112295 -0.00834626 -0.140543 0.165955 0.159535 -0.0974731 0.0561674 0.111623 0.000742738 0.00435499 -0.00481444 -0.162182 0.0856535 0.11293 -0.0465766 0.0371285 -0.113695 0.0579835 -0.0943931 -0.0256655 -0.143728 0.0810838 -0.0125697 0.0101573 -0.0115373 -0.0965502 -0.0421541 0.165366 -0.0880384 -0.0241797 0.157417 0.0519764 -0.137066 0.0801855 0.0342283 0.029704 -0.101093 -0.011417 0.0633852 -0.0429869 -0.025722 0.171425 0.0169665 -0.115854 -0.0435745 -0.00385745 0.275911 -0.00307048 -0.0315699 -0.111745 -0.00478219 0.0337652 -0.0282764 0.0376293 -0.0309566 0.0920439 -0.0381532 0.0517892 0.0246516 -0.0350596 -0.0258459 0.0501081 -0.0217249 0.162875 0.0178221 0.00429125 -0.00157429 -0.0503042 -0.101184 0.0613975 0.0583679 0.00682397 0.0282289 -0.0207646 0.0774996 -0.125214 -0.118752 0.00657412 -0.0534941 -0.0897584 -0.0139423 0.0761898 0.0567403 -0.0944136 0.0175615 0.0182965 -0.00984305 0.174113 -0.133275 0.06026 -0.129942 0.240765 0.0337258 -0.0975374 0.0713674 0.171065 -0.109474 0.0393098 0.0233642 0.0985253 -0.111961 -0.0276581 0.0505033 0.140293 -0.0382142 0.00977846 0.0158495 0.0450512 -0.118316 0.0510875 -0.0477675 -0.016719 
0.0781282 0.074454 -0.166503 -0.0274318 0.0803523 0.138771 0.0136226 -0.0557554 -0.0822194 -0.0321571 0.0791473 0.082094 0.111308 -0.0982582 -0.152192 0.0313028 -0.11013 0.011026 -0.108831 0.142531 0.18167 -0.119045 0.0579426 0.115534 0.0327677 -0.00270469 0.00704171 -0.156466 0.104034 0.134905 -0.0269036 0.0145288 -0.096775 0.028153 -0.086828 -0.0188876 -0.163662 0.0654233 0.00779795 0.00281125 -0.0273827 -0.0890487 -0.0369297 0.171661 -0.0838735 -0.0357475 0.158294 0.0384034 -0.135411 0.0456646 0.0283122 0.0523793 -0.0879085 -0.0278522 0.055915 -0.0162997 -0.0203175 0.188595 0.00823226 -0.12242 -0.0475477 -0.0129333 0.292347 -0.00794297 -0.0239925 -0.096661 -0.0198893 0.0388897 -0.033007 0.0559075 -0.019194 0.106815 -0.0621455 0.0136654 0.0231979 -0.0244763 -0.024461 0.0521154 -0.0239637 0.16018 -0.0157566 0.00809751 0.0141292 -0.0282935 -0.103642 0.0530748 0.0553896 0.0102987 0.0465724 -0.0362943 0.0544725 -0.120937 -0.109529 0.0195071 -0.0316807 -0.110646 -0.0316111 0.100635 0.0540105 -0.0943169 0.0216175 0.0146065 -0.0107349 0.161496 -0.131423 0.0837704 -0.115926 0.219457 0.0467048 -0.11258 0.054245 0.148507 -0.113334 0.0442536 0.0401389 0.111552 -0.111324 -0.0214057 0.065435 0.155805 -0.0340001 -0.0104179 -0.0103489 0.0229494 -0.135942 0.0793412 -0.0415426 0.0100065 
0.0941375 0.0741291 -0.16544 -0.0296818 0.0859817 0.15008 0.0273468 -0.0443045 -0.0883423 -0.0391546 0.0762226 0.0819862 0.112495 -0.1186 -0.138881 0.012811 -0.101863 0.00682148 -0.13452 0.159084 0.152308 -0.0969838 0.056606 0.124973 0.010341 -0.0153222 -0.0040801 -0.151194 0.092447 0.110518 -0.0334831 0.0116801 -0.111977 0.046705 -0.0911817 -0.0162284 -0.152672 0.0582628 -0.022785 0.0137316 -0.00357825 -0.086763 -0.0463629 0.177468 -0.10595 -0.0268238 0.154745 0.0597281 -0.134606 0.0776479 0.0320264 0.0351353 -0.107195 -0.0270895 0.053116 -0.0322483 -0.0378246 0.185668 0.0207407 -0.114363 -0.0576608 0.00641466 0.279946 -0.010456 -0.0329693 -0.116156 -0.00593244 0.0327555 -0.0409773 0.0483579 -0.0128747 0.102701 -0.0352763 0.0383705 0.0231811 -0.0245807 -0.0365419 0.0573169 -0.01755 0.153628 0.00251441 0.00827369 0.00582993 -0.0370918 -0.0989126 0.061784 0.0611404 0.00414318 0.0282725 -0.0230608 0.0700717 -0.125346 -0.113074 0.000565467 -0.0429898 -0.108186 -0.0207604 0.0777603 0.0404506 -0.0984422 0.0153486 0.0268636 -0.00123699 0.162196 -0.146691 0.0743838 -0.129275 0.22954 0.0366385 -0.0906948 0.0835462 0.159491 -0.101469 0.047637 0.0139559 0.0974891 -0.113107 -0.0263499 0.0524627 0.151092 -0.0374996 -0.00892328 -0.00774625 0.0443537 -0.128279 0.0573001 -0.0549946 -0.00856954 
0.0857126 0.0792687 -0.15473 -0.0277961 0.0759626 0.164933 0.022254 -0.0525039 -0.0925874 -0.0377999 0.0757146 0.0835796 0.109743 -0.115622 -0.13601 0.0030604 -0.117149 0.0176484 -0.118394 0.1435 0.157792 -0.0908571 0.0523474 0.142345 0.0158372 -0.0225178 0.00104931 -0.154792 0.0918307 0.126733 -0.0338457 -0.00931243 -0.108261 0.0413956 -0.0764434 -0.0117952 -0.159422 0.0311657 -0.0258764 0.0167116 -0.0113899 -0.0960016 -0.0410939 0.185177 -0.107027 -0.0298887 0.16488 0.0558523 -0.141094 0.0778648 0.0447083 0.0355808 -0.0931859 -0.0291804 0.058238 -0.0155764 -0.0361031 0.190896 0.0225608 -0.116506 -0.0571314 0.0150537 0.28399 -0.0123409 -0.028532 -0.117329 -0.00624654 0.0140845 -0.0550871 0.0619899 -0.0169844 0.0998211 -0.0431722 0.0230879 0.0253468 -0.0187382 -0.0398285 0.0500908 -0.0115961 0.160868 0.00642525 0.00399842 0.0101858 -0.028237 -0.102084 0.0595717 0.0563847 -0.00893001 0.0232376 -0.00722647 0.0631375 -0.124592 -0.109051 0.005242 -0.0524476 -0.105796 -0.0297332 0.0892148 0.0506129 -0.0937916 0.0290261 0.0414888 -0.000259019 0.144897 -0.144321 0.0801155 -0.123785 0.217211 0.021323 -0.0857117 0.086755 0.146979 -0.0943874 0.0307469 0.00785144 0.1134 -0.102191 -0.0176684 0.0530765 0.159254 -0.0265105 -0.0369119 -0.0151477 0.0243371 -0.13294 0.0783899 -0.042776 0.00185863 
0.0915727 0.0709972 -0.144224 -0.0250005 0.0610966 0.159865 0.0322751 -0.0397438 -0.0747368 -0.0503287 0.0802382 0.0787756 0.1168 -0.129808 -0.138455 0.00386891 -0.131621 0.000465518 -0.147277 0.152745 0.158675 -0.0932333 0.0588209 0.130057 -0.00578633 -0.0199801 -0.0138267 -0.161742 0.0829551 0.110412 -0.0354143 0.0116579 -0.107139 0.0615215 -0.0891098 -0.0179837 -0.146689 0.0679107 -0.0296679 0.0250756 -0.00210483 -0.106095 -0.0569623 0.163661 -0.10624 -0.045245 0.150333 0.0519838 -0.133693 0.092067 0.0312858 0.0348877 -0.0981856 -0.00599835 0.0577543 -0.027185 -0.0226491 0.171062 0.0107593 -0.117569 -0.0614815 0.0098986 0.275684 -0.0129935 -0.0353037 -0.111247 0.00906802 0.0190538 -0.0467601 0.054958 -0.0253561 0.0886626 -0.0409125 0.0547529 0.0367559 -0.0294964 -0.0399183 0.0365971 -0.0148426 0.165895 0.00683157 -0.00412827 0.0108112 -0.0366071 -0.101638 0.0772976 0.0650637 -0.00181405 0.0215827 -0.0117533 0.0805739 -0.139975 -0.100678 0.00269062 -0.064281 -0.106115 -0.0325167 0.0803133 0.055671 -0.0844193 0.0300917 0.0313553 -0.00723999 0.163607 -0.1215 0.0689769 -0.123917 0.231036 0.024936 -0.0932208 0.0692076 0.163043 -0.101563 0.0294232 0.0137768 0.114858 -0.0981608 -0.0196529 0.0591952 0.15821 -0.0239515 -0.0216671 -0.00505955 0.0416782 -0.122546 0.0648724 -0.040029 0.00658288 
0.0857846 0.0778211 -0.14922 -0.0396357 0.0633704 0.165149 0.0180045 -0.045467 -0.0912203 -0.0409091 0.0748629 0.0737387 0.11492 -0.121474 -0.135335 0.00859736 -0.130782 0.00432806 -0.131911 0.148372 0.152105 -0.0809202 0.0554409 0.13312 -0.0043763 -0.0114083 0.0013718 -0.153931 0.089131 0.112668 -0.04134 -0.00718572 -0.111679 0.0508961 -0.0793438 -0.00791996 -0.152612 0.0471355 -0.0293501 0.0269247 -0.0146753 -0.104744 -0.0505131 0.178611 -0.100389 -0.0266979 0.161854 0.0650197 -0.14702 0.0909497 0.0368238 0.0327973 -0.099536 -0.0161385 0.0588122 -0.024717 -0.0327732 0.181949 0.0173847 -0.119196 -0.0566767 0.0195332 0.284938 -0.0058814 -0.03152 -0.116369 0.000111367 0.0230022 -0.0467815 0.0571689 -0.0238725 0.0890143 -0.0384777 0.0380523 0.0348128 -0.0252891 -0.0414544 0.046437 -0.00767524 0.159947 0.0236793 -0.00127082 0.00483032 -0.0351934 -0.110138 0.0671369 0.0578978 -0.00437039 0.0243837 0.000795967 0.0756994 -0.129279 -0.106717 0.00980144 -0.0605608 -0.096818 -0.0285481 0.0839189 0.0545513 -0.0905109 0.0335777 0.0374231 -0.0111033 0.14404 -0.136103 0.0762377 -0.131239 0.219765 0.0166445 -0.0861551 0.0892581 0.160535 -0.0912853 0.0301253 0.00527304 0.115993 -0.104325 -0.0159414 0.0496875 0.151875 -0.0267954 -0.0361905 0.00224247 0.0312508 -0.129307 0.0735339 -0.044811 -0.00313909 
0.0664396 0.0711356 -0.149957 -0.0399677 0.05905 0.157756 0.0222004 -0.0435938 -0.0944122 -0.0255132 0.0739016 0.0836088 0.11939 -0.105677 -0.128118 -0.0153882 -0.13457 0.0120491 -0.112298 0.135922 0.145532 -0.0929037 0.0356187 0.146741 0.00841795 -0.0126665 0.00638104 -0.152778 0.0840852 0.123723 -0.0365822 -0.0168594 -0.10315 0.0355016 -0.0806799 0.000269092 -0.170652 0.0161871 -0.0450667 0.0241571 -0.00347012 -0.110736 -0.0513702 0.200633 -0.108779 -0.0185545 0.16268 0.0613945 -0.145567 0.0635463 0.0384638 0.0265545 -0.0908665 -0.0373775 0.0611968 -0.000704436 -0.058054 0.193038 0.0298828 -0.112555 -0.0555951 0.0183003 0.27545 0.0109652 -0.0326764 -0.113901 -0.000721694 0.0161053 -0.0466806 0.0522709 -0.0169669 0.0885743 -0.037957 0.00661506 0.0355453 -0.00532511 -0.0542328 0.0483434 -0.00614035 0.161333 0.00497206 -0.00856179 0.00354191 -0.0262338 -0.115593 0.0636173 0.0712608 -0.0181501 0.020436 -0.0046602 0.0549599 -0.118398 -0.0978789 0.00036425 -0.0750967 -0.10035 -0.0357209 0.074796 0.0673703 -0.100443 0.0343795 0.0438781 0.00747574 0.123606 -0.151329 0.0805483 -0.138711 0.220197 0.00175568 -0.0846262 0.0979246 0.144045 -0.0990045 0.00568881 -0.00368404 0.118669 -0.103884 -0.0240741 0.056027 0.157328 -0.0196442 -0.0573985 -0.0268537 0.0268773 -0.136455 0.0858563 -0.0531879 0.00789726 
0.0860776 0.0751629 -0.153783 -0.0426498 0.0584566 0.158648 0.0130601 -0.0498662 -0.103113 -0.0461677 0.0687235 0.074465 0.116197 -0.111273 -0.141798 0.00702326 -0.131197 0.0030425 -0.122797 0.151096 0.149728 -0.0821285 0.056008 0.121252 -0.00907706 -0.00150945 0.0050727 -0.152647 0.0821835 0.117403 -0.0525033 -0.00405038 -0.110262 0.0449993 -0.0798314 -0.00927589 -0.156036 0.0529418 -0.0283617 0.0243326 -0.0248012 -0.101966 -0.0458606 0.179984 -0.100106 -0.0154843 0.168823 0.059194 -0.154678 0.0936931 0.0372502 0.0318565 -0.0947076 -0.00953612 0.0628009 -0.0292703 -0.0275446 0.18201 0.0227854 -0.123015 -0.0482663 0.022825 0.287239 -0.000385611 -0.03162 -0.116262 -0.00183755 0.0257871 -0.0421516 0.0534885 -0.0217312 0.0829588 -0.0351282 0.0375331 0.0307348 -0.022193 -0.0420638 0.0352879 -0.00681384 0.158974 0.0249925 -0.00383642 -0.00112572 -0.0392142 -0.113832 0.0624436 0.0533982 -0.00761711 0.0307826 0.00036681 0.0721319 -0.126903 -0.103845 0.00831742 -0.0597963 -0.0931433 -0.0215469 0.0918703 0.0591291 -0.0936623 0.0301582 0.0432589 -0.00834391 0.144882 -0.142695 0.0758249 -0.13474 0.224959 0.0103846 -0.0874084 0.0949111 0.157804 -0.094016 0.0269633 0.00146535 0.115767 -0.10065 -0.0208307 0.0525417 0.144373 -0.0317404 -0.0372762 0.00989616 0.023829 -0.12667 0.0709714 -0.0415261 -0.0052105 
0.0803931 0.0706775 -0.154313 -0.0335207 0.0577263 0.158106 0.0179162 -0.0507494 -0.100649 -0.0370041 0.0684424 0.0761525 0.114785 -0.12128 -0.140089 0.00649388 -0.139108 0.00961257 -0.116836 0.145739 0.153371 -0.0924738 0.0527771 0.128862 -0.000976406 -0.00758172 0.00262201 -0.164628 0.0805189 0.121618 -0.0503908 -0.00180646 -0.109169 0.0418443 -0.0750289 -0.0109499 -0.159906 0.0334616 -0.0313779 0.017223 -0.0161246 -0.113822 -0.0434364 0.189164 -0.102821 -0.0162393 0.170709 0.0604207 -0.153037 0.0818885 0.0407393 0.0253431 -0.0885448 -0.0194144 0.0612379 -0.0221623 -0.0280279 0.174334 0.0278592 -0.117755 -0.0429884 0.0207573 0.280443 0.00736769 -0.0280373 -0.119504 -0.00640835 0.015583 -0.0391615 0.0526222 -0.0308408 0.085454 -0.0395298 0.023577 0.0294416 -0.0196921 -0.0445146 0.0451497 -0.0102812 0.163945 0.0202137 -0.00861015 -0.00460521 -0.0333623 -0.115773 0.0712584 0.0549814 -0.0124109 0.0216969 -0.00161917 0.0677388 -0.117414 -0.109435 0.00258417 -0.0723912 -0.0912626 -0.0285829 0.0918765 0.0663099 -0.0955224 0.0393656 0.0387254 2.17283e-06 0.136429 -0.132409 0.0707891 -0.130804 0.233558 0.00519706 -0.0817353 0.0869223 0.152276 -0.0924575 0.00869652 0.000509417 0.118158 -0.101427 -0.0186767 0.0535795 0.148944 -0.0276715 -0.0426032 0.000126582 0.0244898 -0.131196 0.075759 -0.0447782 0.000946292 
0.082415 0.0581425 -0.142873 -0.0324367 0.0671997 0.132386 0.0254881 -0.0427494 -0.0900487 -0.0503165 0.0557915 0.0775425 0.122254 -0.126699 -0.151124 0.0167212 -0.142275 0.000218238 -0.148138 0.172491 0.161392 -0.108253 0.0691117 0.111465 -0.0172768 -0.017809 -0.0231294 -0.161469 0.0767802 0.114767 -0.0540752 0.0120866 -0.109997 0.0463836 -0.085154 -0.0201977 -0.170486 0.0710323 -0.0413074 0.00838413 -0.0281897 -0.107783 -0.054117 0.16752 -0.0916411 -0.0190243 0.147846 0.0640485 -0.138476 0.100481 0.0251068 0.0204527 -0.0932985 -0.0186038 0.0565175 -0.0457202 -0.0245627 0.162593 0.0138314 -0.108791 -0.0344452 0.0215647 0.268021 0.0202224 -0.027045 -0.128001 -0.017327 0.0268608 -0.0467689 0.0314967 -0.0248098 0.0830214 -0.0329186 0.0380579 0.0152351 -0.0139733 -0.0305557 0.0255178 -0.00421607 0.1741 0.0226889 -0.0306493 -0.0154718 -0.0294012 -0.115539 0.0675721 0.0516435 0.00727833 0.0293279 -0.00994509 0.069721 -0.117349 -0.105611 0.0147132 -0.0715922 -0.08606 -0.0286796 0.0824962 0.0585489 -0.0863916 0.0448113 0.0257761 -0.0213345 0.14564 -0.117994 0.0642032 -0.128122 0.243444 0.0355664 -0.0832663 0.0709712 0.160814 -0.100966 0.0254274 0.00371931 0.129803 -0.103728 0.00860365 0.045275 0.158317 -0.0581162 -0.0176401 -0.00426056 0.0328503 -0.125778 0.0697927 -0.0520792 -0.0157956 
0.0719306 0.0476298 -0.152297 -0.0280806 0.0582372 0.140708 0.0124729 -0.0546836 -0.102769 -0.0485594 0.0524061 0.0891879 0.114734 -0.110732 -0.150542 0.00125493 -0.148122 0.00456593 -0.111942 0.155265 0.154476 -0.104913 0.0591488 0.129791 0.000148135 -0.00242932 0.0058042 -0.166411 0.0607688 0.125147 -0.0571532 -0.00512321 -0.102576 0.035901 -0.0794938 -0.0102027 -0.174472 0.0381468 -0.0476661 0.00588639 -0.0231217 -0.10919 -0.0426746 0.191022 -0.100052 -0.0107124 0.169336 0.0554687 -0.140902 0.0871769 0.0392259 0.0106696 -0.0731279 -0.0228974 0.0763122 -0.0253012 -0.0299079 0.175542 0.0322104 -0.119616 -0.0297689 0.0257045 0.272007 0.0282781 -0.0262332 -0.12268 -0.0151023 0.0217062 -0.0372726 0.0433513 -0.030622 0.0829356 -0.0340676 0.012526 0.0248638 -0.00478472 -0.0433077 0.0299068 -0.00560432 0.174066 0.0163945 -0.0200369 -0.0116141 -0.0340296 -0.122981 0.0589026 0.0559377 -0.0034805 0.0219564 -0.00753991 0.0569211 -0.106787 -0.100309 0.00459902 -0.0819905 -0.0810655 -0.029277 0.0901932 0.0773136 -0.10027 0.0441449 0.0369761 -0.000982335 0.125939 -0.134941 0.0635278 -0.139806 0.232617 0.000194692 -0.0807282 0.0900819 0.154289 -0.0929602 0.00102536 -0.00503994 0.130484 -0.101317 -0.010196 0.0477253 0.154101 -0.0389908 -0.0378555 -0.00874155 0.0101575 -0.13535 0.0847888 -0.0481176 -0.00117009 
0.0801068 0.0639342 -0.152019 -0.029495 0.0650981 0.131779 0.0225002 -0.051389 -0.100283 -0.0485186 0.0503113 0.084022 0.116546 -0.122867 -0.152639 0.012485 -0.133822 0.00274256 -0.135182 0.166561 0.151558 -0.100254 0.0573459 0.116024 -0.0100305 -0.00667094 -0.0119355 -0.160719 0.0730381 0.122942 -0.0602735 0.0183751 -0.109492 0.040862 -0.0855486 -0.021967 -0.16815 0.0599471 -0.0431426 0.0113601 -0.0239302 -0.1044 -0.0410465 0.180083 -0.0925858 -0.00382777 0.166037 0.0561474 -0.145597 0.0908495 0.0410688 0.019216 -0.0883422 -0.0224888 0.063913 -0.0404729 -0.0296929 0.16773 0.0305029 -0.114187 -0.0314817 0.0209738 0.263481 0.0223464 -0.029436 -0.132557 -0.0143885 0.0222162 -0.042757 0.0310086 -0.0229413 0.0809464 -0.0282773 0.032431 0.0178323 -0.00821027 -0.0384115 0.0319459 -0.00943623 0.169193 0.0247707 -0.0160124 -0.0160414 -0.0335226 -0.113464 0.0629909 0.0515707 -0.00280598 0.0230723 -0.0114553 0.055057 -0.112391 -0.110184 0.00538608 -0.0714588 -0.0774646 -0.0173081 0.0831089 0.0636636 -0.0954069 0.0338341 0.0339384 -0.00741786 0.15344 -0.14023 0.0581562 -0.139917 0.247251 0.0196112 -0.0819064 0.0874273 0.158892 -0.105546 0.017155 -0.0078288 0.118231 -0.1101 -0.00957995 0.0445054 0.148903 -0.0512265 -0.0152739 -0.000427566 0.0248619 -0.123003 0.0665408 -0.0561006 -0.021472 
0.0898284 0.0563054 -0.161801 -0.0281829 0.0697363 0.129697 0.0265441 -0.0430271 -0.116875 -0.0358278 0.0484202 0.086247 0.124449 -0.11966 -0.148962 0.0180725 -0.112272 0.0106482 -0.131793 0.175816 0.145791 -0.104681 0.0658491 0.11211 -0.0150988 -0.00559352 -0.0143675 -0.16304 0.0691048 0.118941 -0.0690716 0.0314481 -0.109973 0.0449228 -0.0948103 -0.0264273 -0.168988 0.0678814 -0.0422127 0.0076321 -0.0312961 -0.100423 -0.0407302 0.175961 -0.0992602 -0.0056416 0.164576 0.0570611 -0.146337 0.0983301 0.0542145 0.0136625 -0.0949283 -0.022599 0.0580746 -0.0477447 -0.0211387 0.164204 0.0417616 -0.111245 -0.0292664 0.0208853 0.256108 0.0135829 -0.0271449 -0.135564 -0.0209197 0.0289852 -0.0459338 0.0250901 -0.0234432 0.0839531 -0.0272076 0.0364561 0.00693367 -0.00926636 -0.0285137 0.0331147 -0.00761726 0.162625 0.0196923 -0.022114 -0.0188909 -0.0387978 -0.109934 0.0591318 0.0508182 -0.00423188 0.0301807 -0.0166134 0.04882 -0.107942 -0.113255 0.00666748 -0.0643849 -0.0723405 -0.00912213 0.0860069 0.0528187 -0.0959318 0.0329378 0.0361102 -0.00643954 0.165042 -0.140591 0.0515173 -0.144633 0.244839 0.0242648 -0.0845788 0.0820106 0.165667 -0.0963309 0.0201078 -0.00707245 0.109888 -0.106 -0.0151793 0.0415759 0.148593 -0.0595548 -0.0151831 0.00536465 0.0276452 -0.120116 0.057711 -0.060161 -0.0290022 
0.0977587 0.0504569 -0.154204 -0.0240461 0.0716968 0.124221 0.0331434 -0.0412827 -0.105015 -0.0543516 0.0481617 0.0916499 0.116554 -0.129854 -0.159963 0.0266292 -0.11307 -2.59366e-05 -0.150976 0.180107 0.150374 -0.101592 0.0641917 0.103449 -0.0211224 -0.00147488 -0.0164861 -0.160458 0.0696045 0.112259 -0.0713319 0.0440492 -0.113154 0.053266 -0.0995828 -0.036901 -0.16613 0.0857305 -0.0375472 0.006492 -0.028932 -0.0961909 -0.0443407 0.161982 -0.0870738 -0.0111928 0.153633 0.0488884 -0.145484 0.10241 0.0467679 0.0132546 -0.0954675 -0.0173938 0.0563204 -0.0581092 -0.022076 0.163653 0.0240539 -0.106595 -0.0266644 0.016495 0.258826 0.0147223 -0.0267498 -0.131793 -0.022385 0.0307883 -0.0485526 0.0205776 -0.0261614 0.0766867 -0.0252488 0.0499451 0.00499259 -0.0132713 -0.0183863 0.0223494 -0.0131728 0.164031 0.0235571 -0.0228333 -0.0177327 -0.0456872 -0.108386 0.0548421 0.0517711 0.00298589 0.0251772 -0.0174405 0.0575988 -0.116542 -0.119925 0.0181415 -0.058589 -0.0627026 -0.00423879 0.0719863 0.0522665 -0.0847782 0.0281427 0.0253781 -0.0221505 0.176769 -0.13307 0.0473334 -0.138689 0.248345 0.0271858 -0.094703 0.0792323 0.172774 -0.100043 0.0304973 0.00439647 0.10792 -0.114203 -0.00296519 0.0444211 0.14624 -0.0677339 0.00195119 0.012334 0.0282878 -0.103462 0.0540245 -0.0572396 -0.0435456 
0.103893 0.0445824 -0.148404 -0.0199435 0.0724034 0.121925 0.0386919 -0.0437748 -0.110207 -0.0432221 0.0509173 0.0862727 0.127942 -0.115178 -0.151441 0.0313177 -0.105593 0.00238413 -0.149092 0.182204 0.157708 -0.111468 0.0696324 0.0986278 -0.0184228 0.00504567 -0.0349456 -0.162813 0.0741534 0.113492 -0.0677388 0.0632586 -0.120418 0.0551202 -0.100919 -0.0354346 -0.167784 0.10781 -0.0192386 -0.00104321 -0.0370829 -0.091345 -0.05128 0.145588 -0.0867215 -0.0240109 0.144052 0.0506153 -0.134829 0.095465 0.0472723 0.022982 -0.0970517 -0.0110329 0.0582974 -0.0646129 -0.00918761 0.16411 0.0225088 -0.110334 -0.0252538 0.0101872 0.256235 0.00880463 -0.0261764 -0.117117 -0.019186 0.0438846 -0.0446437 0.0209865 -0.0235417 0.0897421 -0.0293628 0.0606529 -0.00145911 -0.0244782 -0.0132095 0.0136173 -0.00681263 0.16794 0.0208458 -0.0254229 -0.0125485 -0.053308 -0.103389 0.0426183 0.0560425 0.0126765 0.0389409 -0.0288512 0.0604481 -0.111345 -0.106869 0.0242808 -0.06196 -0.0730153 -0.00106017 0.0788452 0.0503868 -0.0825426 0.0325753 0.0285167 -0.0259597 0.186176 -0.124584 0.0499164 -0.134629 0.242141 0.0536696 -0.0980072 0.0636651 0.180903 -0.109053 0.0358315 0.0214623 0.109992 -0.10746 -0.00494323 0.0416072 0.146054 -0.0696951 0.00556836 0.0178423 0.0304237 -0.108903 0.0538488 -0.0506417 -0.0337303 
0.0943405 0.0447262 -0.146571 -0.0227755 0.0719013 0.113202 0.0305131 -0.0390686 -0.111383 -0.0358367 0.0487266 0.0891548 0.128474 -0.11657 -0.155812 0.0348834 -0.107457 0.00961002 -0.148465 0.184118 0.159553 -0.119946 0.0809116 0.0911224 -0.0197592 0.00525894 -0.0304185 -0.166731 0.0712985 0.110518 -0.0708621 0.0556358 -0.109133 0.0484175 -0.101196 -0.0395213 -0.177474 0.116598 -0.027122 -0.00242526 -0.0480573 -0.0913267 -0.0572468 0.150994 -0.0898848 -0.0193927 0.143116 0.0446977 -0.138081 0.0937084 0.0513607 0.0231418 -0.0994285 -0.016878 0.0517838 -0.063065 -0.00368946 0.156938 0.0251552 -0.108906 -0.0203087 0.00229178 0.252591 0.017727 -0.0151554 -0.129907 -0.0295409 0.0509039 -0.0449405 0.0259011 -0.0199077 0.0879482 -0.0294337 0.0475338 -0.00783097 -0.018093 -0.0175719 0.0156674 -0.00854653 0.166769 0.00717953 -0.0328796 -0.0157773 -0.0456942 -0.10958 0.0374641 0.0570456 0.0159888 0.0438245 -0.0328017 0.0452462 -0.107786 -0.107206 0.0250402 -0.0589529 -0.0735418 -0.00371056 0.0831902 0.0480918 -0.0842421 0.0337766 0.0271734 -0.0304528 0.181713 -0.115717 0.0435332 -0.132452 0.241036 0.0601891 -0.104128 0.0556253 0.181178 -0.106067 0.0360783 0.0231975 0.111999 -0.113014 -0.0049544 0.0428696 0.149498 -0.0773309 0.0079672 0.00823271 0.0276306 -0.100446 0.0562005 -0.0492827 -0.033098 
0.11758 0.0515072 -0.147464 -0.021901 0.065841 0.118157 0.0435143 -0.030286 -0.117372 -0.0340495 0.0575077 0.0759813 0.13588 -0.118518 -0.140821 0.0346866 -0.0857653 -0.00476642 -0.157594 0.18829 0.14713 -0.106183 0.0720482 0.0858836 -0.0263193 0.00469982 -0.0388124 -0.158269 0.0751427 0.103193 -0.0719622 0.0710447 -0.116839 0.063839 -0.106351 -0.0440351 -0.161046 0.129166 -0.019551 0.000177538 -0.0486818 -0.0929354 -0.0604966 0.138609 -0.0862023 -0.0161094 0.130884 0.0510894 -0.139869 0.10396 0.0561684 0.0341571 -0.106923 -0.00961099 0.0455379 -0.0771052 -0.0102471 0.149525 0.0284601 -0.106269 -0.030332 -0.00157285 0.242866 -0.00024501 -0.0274454 -0.123849 -0.0162836 0.0515651 -0.051446 0.0114703 -0.0203806 0.0804399 -0.0287905 0.0660484 -0.00592407 -0.0314498 -0.00788826 0.00960636 -0.00389193 0.178339 0.0201141 -0.0449422 -0.0144389 -0.0591018 -0.0942469 0.0350599 0.0529679 0.00308815 0.0458956 -0.0257629 0.0531722 -0.113055 -0.111431 0.0313528 -0.060822 -0.0717922 0.0108607 0.0693455 0.0395815 -0.0843725 0.0289267 0.039372 -0.0308124 0.197402 -0.12589 0.0393991 -0.128747 0.245506 0.0720669 -0.10322 0.0624979 0.187934 -0.110921 0.0441495 0.0263743 0.0992551 -0.109563 -0.00799272 0.0412957 0.145034 -0.0784525 0.00947405 0.0245995 0.0448178 -0.0825069 0.0354089 -0.037973 -0.0438432 
0.117735 0.0482438 -0.158611 -0.0194374 0.0791868 0.113255 0.0295689 -0.0325477 -0.150602 -0.0094366 0.0416066 0.0713185 0.13813 -0.0881757 -0.134592 0.0605634 -0.0442446 0.0158953 -0.12687 0.187588 0.148361 -0.116861 0.0923593 0.0808267 -0.00827668 0.0230427 -0.0348585 -0.155497 0.0818865 0.102048 -0.0721985 0.0914008 -0.116362 0.0546109 -0.108607 -0.0451123 -0.158436 0.146357 0.00442003 -0.0148337 -0.0695155 -0.0682384 -0.035338 0.129077 -0.0836197 -0.0236405 0.147961 0.0436733 -0.138106 0.0959437 0.0826249 0.0265266 -0.103983 -0.0101417 0.0487775 -0.0807064 0.0213505 0.153916 0.0576104 -0.128209 -0.0208485 -0.00332511 0.23314 -0.0181514 -0.0182316 -0.105013 -0.0336349 0.069155 -0.0457226 0.0184479 -0.0219572 0.103353 -0.0318525 0.0666888 -0.020805 -0.0421657 0.00563851 0.0219277 0.00296688 0.150648 0.012043 -0.0261148 -0.0101253 -0.0710213 -0.0855072 0.00643097 0.0417459 0.0204872 0.0732832 -0.0443295 0.0338989 -0.0902044 -0.108317 0.0281933 -0.0294728 -0.062587 0.0294808 0.107771 0.0170018 -0.088307 0.0178296 0.0370694 -0.0257226 0.217055 -0.13573 0.0357686 -0.138276 0.21652 0.0925313 -0.112596 0.0495035 0.202149 -0.100166 0.0569679 0.0408555 0.080212 -0.105249 -0.0274701 0.0299111 0.132023 -0.0823469 0.0210318 0.0445933 0.0249247 -0.0993158 0.0294946 -0.0429083 -0.0466524 
0.124306 0.0632089 -0.156424 -0.0303025 0.0729312 0.128739 0.0454767 -0.0256296 -0.130482 -0.0219343 0.0550818 0.0737916 0.136239 -0.104744 -0.135958 0.0487387 -0.0528838 -0.00399842 -0.152708 0.182896 0.138585 -0.0974686 0.0726102 0.0715177 -0.0263788 0.0193183 -0.0362647 -0.143746 0.0872407 0.0921624 -0.0687676 0.0907658 -0.119909 0.0673291 -0.112343 -0.0460711 -0.144006 0.146906 0.000633313 0.00277002 -0.0493759 -0.0767373 -0.0453737 0.125919 -0.0863035 -0.0223061 0.135722 0.0444878 -0.148278 0.101139 0.0658478 0.0370791 -0.119907 -0.00204891 0.0415897 -0.0791247 -0.00230128 0.158483 0.0327475 -0.113822 -0.0387716 -0.00486716 0.24567 -0.029998 -0.0197449 -0.106434 -0.020054 0.0650106 -0.0544316 0.0187185 -0.0170191 0.08853 -0.028678 0.084142 -0.00516795 -0.040167 0.00316377 0.0182338 -0.00505245 0.147762 0.0160707 -0.0286533 -0.00180937 -0.0645202 -0.0850555 0.0191542 0.0524916 0.010067 0.0594198 -0.0292956 0.0500238 -0.118552 -0.114969 0.0323334 -0.0302425 -0.0668737 0.0299285 0.0804582 0.0165167 -0.0771688 0.0101354 0.0396021 -0.0361807 0.222107 -0.139418 0.0422047 -0.134308 0.229679 0.077492 -0.115341 0.0593954 0.196962 -0.10409 0.0666055 0.040504 0.0720727 -0.109812 -0.023465 0.0422084 0.136043 -0.0718638 0.0168481 0.0476705 0.0420155 -0.0778795 0.0215092 -0.0394396 -0.0512258 
0.126156 0.0392487 -0.165225 -0.0320054 0.0831199 0.131013 0.0322421 -0.0290261 -0.136969 -0.0324424 0.0445728 0.076441 0.133113 -0.0976778 -0.140568 0.0541693 -0.0545741 0.00575517 -0.144911 0.184855 0.143637 -0.0991069 0.0941309 0.0632713 -0.0292311 0.0235375 -0.0307412 -0.160643 0.0679735 0.0837792 -0.0707021 0.0878813 -0.121466 0.062254 -0.105592 -0.0381179 -0.151214 0.148816 -0.0028427 -0.00496476 -0.0554617 -0.0634255 -0.0529932 0.129889 -0.0947348 -0.016177 0.138089 0.0450648 -0.147184 0.106689 0.0600599 0.0180819 -0.11137 0.00124074 0.0411115 -0.0850931 0.0185144 0.160937 0.0377945 -0.117508 -0.0247481 0.00707783 0.249799 -0.0259462 -0.00800588 -0.116843 -0.027731 0.0835359 -0.0369578 0.0307991 -0.0149993 0.0940931 -0.0248794 0.0711547 -0.0213793 -0.0387037 -0.00481266 0.0157314 -0.00757531 0.139373 0.0126886 -0.0209714 -0.0142381 -0.0741356 -0.100248 0.0190994 0.0517304 0.018639 0.052474 -0.0364928 0.0583182 -0.109829 -0.114006 0.0234691 -0.0246761 -0.0591416 0.0276212 0.0919512 0.0129782 -0.0752325 0.0136196 0.0299932 -0.0387862 0.211064 -0.129381 0.0328971 -0.141588 0.220665 0.0662936 -0.108553 0.057871 0.198968 -0.0895963 0.0628861 0.0407154 0.0789887 -0.114234 -0.02931 0.0376168 0.129562 -0.0774086 0.0217717 0.0517075 0.036054 -0.0829159 0.0183903 -0.0494894 -0.0508485 
0.1247 0.062495 -0.159266 -0.0252576 0.0656754 0.124207 0.0417738 -0.0359672 -0.130983 -0.0302925 0.0535367 0.0725498 0.137986 -0.1006 -0.135983 0.0368916 -0.064184 -0.00523308 -0.142426 0.182946 0.140543 -0.0963838 0.0743157 0.0725629 -0.0213479 0.0169373 -0.0337545 -0.151164 0.0760569 0.108806 -0.0744482 0.082205 -0.111877 0.0632348 -0.104825 -0.0474734 -0.144885 0.144017 -0.00406033 -0.000470439 -0.0569424 -0.0812251 -0.0445442 0.134284 -0.0929144 -0.0131751 0.142428 0.0416906 -0.141689 0.105303 0.0699998 0.0428762 -0.105545 0.00303179 0.0513628 -0.0811785 0.00322589 0.150999 0.0382486 -0.121036 -0.0356156 -0.00875742 0.243918 -0.0204703 -0.0266641 -0.114292 -0.0125207 0.05947 -0.0492854 0.0154767 -0.0144198 0.0832458 -0.0311347 0.0734798 -0.00435696 -0.034433 -0.00743066 0.00514041 -0.00438011 0.169019 0.0202868 -0.0323775 -0.00413343 -0.0626091 -0.0829153 0.020179 0.0484023 0.00172808 0.0586256 -0.0280703 0.0441931 -0.117226 -0.109988 0.0263063 -0.0482835 -0.0764467 0.0271696 0.086989 0.0316144 -0.0881462 0.0168401 0.0522952 -0.0219269 0.215505 -0.145067 0.037513 -0.134176 0.238358 0.0739275 -0.106848 0.0663375 0.187981 -0.114598 0.054787 0.0285347 0.0853775 -0.10427 -0.0259017 0.0409599 0.136743 -0.0691596 0.0131351 0.043628 0.0367015 -0.0768039 0.0231857 -0.0264673 -0.0408613 
0.120458 0.0710097 -0.16395 -0.0228926 0.0612116 0.129405 0.0406584 -0.0386187 -0.121719 -0.0268146 0.0612508 0.0632274 0.139074 -0.108071 -0.141557 0.0324661 -0.0728761 -0.00647765 -0.140625 0.180701 0.144651 -0.104065 0.0694353 0.0780679 -0.0177559 0.008618 -0.0378329 -0.150505 0.0894572 0.109985 -0.0655283 0.0763299 -0.11791 0.057028 -0.103085 -0.043977 -0.145448 0.130874 0.00257416 -0.000988541 -0.051281 -0.0911672 -0.0509674 0.133913 -0.0901496 -0.0230082 0.139433 0.0522602 -0.136233 0.0975226 0.0565296 0.0569907 -0.101013 0.000732527 0.0431945 -0.0775329 0.00640234 0.145471 0.035907 -0.124982 -0.0399718 -0.00280489 0.251915 -0.0192042 -0.0384147 -0.106351 -0.00316151 0.0489304 -0.0437462 0.0111453 -0.0225084 0.0841976 -0.0356965 0.0785504 0.00282372 -0.0428086 -0.00824229 0.0123893 -0.0040969 0.176366 0.0204961 -0.0330574 -0.00133948 -0.0569199 -0.0757271 0.035943 0.0437331 0.00264602 0.0601817 -0.0334774 0.0551797 -0.113818 -0.104855 0.0267684 -0.0510505 -0.0929839 0.0189004 0.0913922 0.0336002 -0.0908677 0.0258632 0.0506201 -0.0181614 0.211421 -0.137137 0.0473083 -0.121446 0.244619 0.0781844 -0.0960418 0.0626717 0.182221 -0.115059 0.0526113 0.0251061 0.0891933 -0.101572 -0.0201904 0.0474014 0.135087 -0.0695384 0.00326397 0.0383344 0.0365736 -0.0942206 0.029375 -0.0328292 -0.0285981 
0.119393 0.0701745 -0.160984 -0.0279631 0.0657486 0.131835 0.0403064 -0.0355294 -0.127465 -0.0265983 0.0565217 0.0650502 0.138941 -0.112459 -0.134595 0.0310297 -0.0716586 -0.00419407 -0.14356 0.185876 0.137838 -0.0960957 0.0712587 0.0747099 -0.0250343 0.0120354 -0.0403339 -0.153999 0.0855577 0.101984 -0.0656084 0.0763253 -0.118421 0.0612482 -0.0991585 -0.0402797 -0.141467 0.133761 -0.00410442 0.00110344 -0.0467016 -0.0886912 -0.0508464 0.139817 -0.097672 -0.0146969 0.144557 0.053908 -0.142905 0.104184 0.0564136 0.0457062 -0.108142 0.00110457 0.0441077 -0.0795079 0.00185559 0.145735 0.0384759 -0.123881 -0.0406474 -0.000929601 0.249204 -0.0206925 -0.0298452 -0.115888 -0.00271779 0.050203 -0.0440726 0.0137784 -0.01846 0.0836959 -0.0292406 0.0808398 -0.000486814 -0.0429528 -0.0155093 0.018063 -0.00107635 0.168659 0.0221571 -0.028186 -0.00601202 -0.0572845 -0.0780315 0.0316696 0.0472546 0.00370327 0.0574477 -0.0282265 0.0574899 -0.113893 -0.107188 0.0203497 -0.050969 -0.0886392 0.0224224 0.090029 0.0274649 -0.0905793 0.0186067 0.051591 -0.0193447 0.208853 -0.140828 0.0439829 -0.126747 0.244084 0.0755725 -0.0916173 0.0669164 0.184436 -0.114231 0.0535171 0.0209181 0.0825484 -0.103344 -0.0304108 0.0422985 0.133163 -0.0673345 0.00781169 0.0414649 0.042555 -0.0903737 0.0215053 -0.0348349 -0.0347889 
0.121798 0.063807 -0.150394 -0.0207194 0.0599493 0.12955 0.0466808 -0.0292921 -0.130455 -0.0158521 0.060554 0.0695779 0.138405 -0.111829 -0.130132 0.0347786 -0.0689761 0.002568 -0.14071 0.181458 0.143297 -0.104218 0.0708893 0.0893622 -0.0199885 0.0130493 -0.0383164 -0.15844 0.0863633 0.105581 -0.0713575 0.0787234 -0.114553 0.0671869 -0.103854 -0.0479238 -0.148032 0.139094 -0.00529852 -0.00312535 -0.0536946 -0.0925965 -0.0511286 0.134072 -0.0915073 -0.0248157 0.14161 0.0452306 -0.146731 0.101473 0.0693547 0.0441816 -0.106508 -0.00190596 0.0498352 -0.0726843 0.00209407 0.14925 0.037049 -0.121856 -0.0378448 -0.00952475 0.245842 -0.0229 -0.0253367 -0.107068 -0.0118531 0.0476865 -0.056024 0.0181287 -0.0252751 0.0844435 -0.0382338 0.078848 -0.00177588 -0.0452851 -0.0034096 0.0159327 0.002555 0.168397 0.0126669 -0.0360518 -0.00531525 -0.0658662 -0.0783465 0.0222259 0.0497746 0.00185564 0.0629611 -0.0245222 0.0508338 -0.113588 -0.107786 0.0285113 -0.050289 -0.0790221 0.0220319 0.0867879 0.0343953 -0.0863146 0.0240888 0.050722 -0.0238874 0.209809 -0.134998 0.0421195 -0.124937 0.232885 0.0807458 -0.107809 0.0594667 0.193 -0.108993 0.0441534 0.0375736 0.0865297 -0.09804 -0.0278744 0.0455621 0.141624 -0.0655999 0.00311237 0.0382813 0.0398093 -0.0848198 0.0321897 -0.0229317 -0.0377264 
0.118009 0.0563841 -0.155801 -0.0350326 0.0750799 0.131856 0.034018 -0.0291215 -0.137338 -0.0189963 0.0472913 0.071001 0.135325 -0.110883 -0.136762 0.0542832 -0.0637951 0.00790123 -0.14366 0.181904 0.146392 -0.0960295 0.0842214 0.0620943 -0.0306302 0.0289596 -0.0387362 -0.163072 0.0814723 0.0892189 -0.0688837 0.087189 -0.120028 0.0624494 -0.096608 -0.0440318 -0.146419 0.151683 0.00641293 -0.00276425 -0.0575333 -0.0756792 -0.0492878 0.133306 -0.0904103 -0.0179567 0.143843 0.0443617 -0.154668 0.100745 0.0635663 0.0277756 -0.115454 0.00156456 0.0400526 -0.0811825 0.0178542 0.151725 0.0337812 -0.122236 -0.0264047 -0.00474007 0.250285 -0.0230456 -0.00537786 -0.120412 -0.0248302 0.0717467 -0.0399105 0.0269641 -0.0169348 0.0899881 -0.030168 0.075092 -0.0180949 -0.0455612 -0.00990609 0.0226375 -0.00219081 0.145758 0.0146433 -0.0204967 -0.00880284 -0.0631313 -0.0936784 0.0151004 0.0534422 0.0179871 0.063398 -0.0324415 0.0514163 -0.109187 -0.114409 0.028419 -0.0328291 -0.0658733 0.0287334 0.0960751 0.0124345 -0.0763486 0.0159651 0.0381235 -0.0400624 0.213073 -0.125503 0.033502 -0.132129 0.225425 0.0775692 -0.105592 0.0539783 0.194449 -0.102181 0.0603458 0.0426858 0.0776743 -0.113031 -0.0327124 0.0360016 0.127573 -0.0708134 0.0196446 0.0538412 0.0350651 -0.0816453 0.0201585 -0.0390437 -0.0471679 
0.104818 0.0621233 -0.153117 -0.0226852 0.0653386 0.122997 0.0332354 -0.0374354 -0.145887 -0.00397108 0.0455061 0.0689448 0.140664 -0.105804 -0.135764 0.0577621 -0.0735035 0.016671 -0.124431 0.175023 0.157899 -0.119997 0.0835039 0.0765963 -0.010537 0.0231176 -0.0410764 -0.16981 0.0861299 0.113802 -0.0748132 0.0850946 -0.112139 0.0539936 -0.094963 -0.048087 -0.157073 0.135933 0.00784508 -0.0124077 -0.0666707 -0.0908659 -0.0307343 0.134942 -0.0838007 -0.0196607 0.158839 0.0378672 -0.15503 0.0859359 0.0779032 0.0271068 -0.0998224 -0.00571837 0.0489486 -0.0673127 0.023507 0.144941 0.0462563 -0.127875 -0.0190938 -0.00747091 0.240815 -0.0154763 -0.00668545 -0.107221 -0.033904 0.0574846 -0.0475859 0.0187672 -0.0288613 0.0954218 -0.0436811 0.0570954 -0.0103227 -0.0360538 -0.00442679 0.0214305 0.00127893 0.158164 0.00916999 -0.0311491 -0.00843861 -0.0547054 -0.0962079 0.0212136 0.0455741 0.00960216 0.0683776 -0.0342438 0.0327949 -0.0978384 -0.11034 0.027656 -0.0483048 -0.064239 0.0199342 0.11493 0.0313418 -0.0826876 0.0273099 0.0396435 -0.026166 0.209721 -0.123467 0.0366876 -0.130948 0.233193 0.0780563 -0.110454 0.0415594 0.187856 -0.105742 0.0356824 0.0416525 0.0921684 -0.106028 -0.0246952 0.0361562 0.138621 -0.068783 0.0065578 0.0421365 0.0226115 -0.0967372 0.0418821 -0.0356729 -0.0354763 
0.117101 0.0520707 -0.164118 -0.029713 0.0819186 0.134369 0.0324025 -0.0291646 -0.142245 -0.0153979 0.0464352 0.0776325 0.13351 -0.113655 -0.141874 0.0617686 -0.0526736 0.0209166 -0.138966 0.183382 0.149038 -0.0985358 0.0876533 0.0717072 -0.0302124 0.0268755 -0.033093 -0.168662 0.0809344 0.0909777 -0.0748064 0.0897872 -0.11697 0.0624088 -0.0981336 -0.0453033 -0.143807 0.139523 0.00205888 -0.00535171 -0.0540541 -0.0729788 -0.0401373 0.135018 -0.0951446 -0.0202102 0.1545 0.0410469 -0.158982 0.0984264 0.0719874 0.013294 -0.115232 -0.000451871 0.040472 -0.0750386 0.0234036 0.151267 0.0413285 -0.120939 -0.022619 -0.000435563 0.248538 -0.0296281 0.000132881 -0.123271 -0.0325102 0.0665706 -0.0406 0.0288422 -0.0227431 0.0917411 -0.0310836 0.0687565 -0.0204749 -0.0405132 -0.00536313 0.0369613 -0.00743331 0.129071 0.010647 -0.0108062 -0.0117902 -0.0640621 -0.0958208 0.0252095 0.0514024 0.0157436 0.0561818 -0.0327113 0.0488935 -0.10754 -0.122446 0.0233643 -0.0249548 -0.0572434 0.0254449 0.102642 0.00880096 -0.0742394 0.0163528 0.0308889 -0.0362336 0.21607 -0.122854 0.0315122 -0.134316 0.22133 0.0630717 -0.10502 0.0487277 0.192836 -0.0879787 0.0546788 0.0382889 0.0724338 -0.115729 -0.0384437 0.0319446 0.126629 -0.0716559 0.0201804 0.0532771 0.0321708 -0.0879422 0.0243857 -0.0513977 -0.0516017 
0.11368 0.063298 -0.159185 -0.0179097 0.0662368 0.120493 0.0441125 -0.0375956 -0.139355 -0.00331035 0.0507965 0.073069 0.14103 -0.109828 -0.136723 0.0485315 -0.0662959 0.0176814 -0.129558 0.180847 0.148945 -0.114463 0.0748871 0.0875105 -0.0173875 0.0154255 -0.0392523 -0.165985 0.0856151 0.121905 -0.0819351 0.0874587 -0.111332 0.0575252 -0.0975749 -0.052517 -0.152243 0.131485 -0.00207915 -0.0124441 -0.0651796 -0.0936139 -0.0348581 0.137361 -0.08733 -0.0165695 0.154042 0.0439808 -0.150646 0.0926305 0.081552 0.0328306 -0.0997438 -0.00891965 0.0517861 -0.0679319 0.0112224 0.144597 0.0460247 -0.120971 -0.023737 -0.0102093 0.240704 -0.0178172 -0.0159566 -0.113177 -0.0281968 0.0483879 -0.0562618 0.0117388 -0.0296034 0.0873825 -0.0421188 0.0611087 -0.0123257 -0.0334284 0.00136615 0.0222242 0.00190881 0.159683 0.0147751 -0.0325921 -0.0142818 -0.0587554 -0.0852559 0.0222711 0.041868 0.000546695 0.0672329 -0.0252581 0.0343655 -0.102175 -0.113984 0.027444 -0.0498662 -0.0660573 0.02105 0.099604 0.0374259 -0.0873972 0.0329048 0.0458342 -0.020952 0.209367 -0.132379 0.0351733 -0.129556 0.232943 0.0756895 -0.103138 0.0526102 0.187772 -0.10386 0.0343502 0.032802 0.0903594 -0.102366 -0.0251172 0.036664 0.139099 -0.0703116 0.00420707 0.0398196 0.0305848 -0.0924703 0.0400083 -0.034613 -0.0450335 
0.114731 0.0570954 -0.16288 -0.0367189 0.0788197 0.131045 0.0260549 -0.0295247 -0.134987 -0.0205313 0.0483343 0.0757408 0.131512 -0.106097 -0.141449 0.0606386 -0.0576448 0.00629616 -0.142045 0.181911 0.144489 -0.0957348 0.0870152 0.0615413 -0.0274895 0.0321143 -0.0255242 -0.158476 0.0803652 0.0863458 -0.0688067 0.0844411 -0.113534 0.0595025 -0.103794 -0.0410407 -0.145321 0.149584 0.00427848 0.00146483 -0.0550176 -0.0709802 -0.0445933 0.13427 -0.0915212 -0.0163169 0.147593 0.0406869 -0.155936 0.0979 0.0649424 0.0256779 -0.117736 0.00120839 0.0410041 -0.0784798 0.0167673 0.154374 0.0354257 -0.122268 -0.0302043 -0.00655932 0.252953 -0.0249909 -0.00448743 -0.119174 -0.0283727 0.0791056 -0.0358841 0.0314696 -0.0139482 0.0917276 -0.0297895 0.0687959 -0.0117874 -0.0385435 -0.0096872 0.0301374 -0.0100056 0.13682 0.0114021 -0.0125863 -0.00542504 -0.061405 -0.0989558 0.0205949 0.0543625 0.0205664 0.0600058 -0.0352452 0.0450002 -0.112743 -0.118612 0.0284431 -0.0239491 -0.0641884 0.0278431 0.0960421 0.010867 -0.0798019 0.00959496 0.0301568 -0.0390515 0.214852 -0.129865 0.0351272 -0.138086 0.222483 0.0690787 -0.11315 0.0541749 0.195478 -0.0956328 0.0659028 0.0422484 0.0726313 -0.121643 -0.035241 0.0364803 0.127234 -0.0697288 0.0234868 0.0540404 0.0334156 -0.0813562 0.0227082 -0.0446202 -0.0469123 
0.0830553 0.049284 -0.150722 -0.0639191 0.0798729 0.168244 -0.00299184 -0.0220162 -0.106141 -0.0266519 0.0658462 0.0772225 0.107919 -0.107212 -0.127412 0.0176885 -0.10404 0.0137008 -0.105105 0.136951 0.158842 -0.0638675 0.0571922 0.0902187 -0.00015691 0.0549482 0.0203588 -0.162555 0.100802 0.0679226 -0.0182184 0.020702 -0.12423 0.0387741 -0.0734929 -0.0102546 -0.149857 0.0936575 0.0166252 0.0183898 0.00110249 -0.0671993 -0.0722694 0.191727 -0.111649 -0.0506399 0.155047 0.0523389 -0.142116 0.0472295 0.0242784 0.0316857 -0.111037 -0.0124099 0.0452542 -0.0328548 -0.00973323 0.196657 0.00780248 -0.150732 -0.0476969 -0.0136127 0.30275 0.000703626 -0.0128 -0.109221 0.00521763 0.0652802 0.0133584 0.0718917 -0.0161505 0.111131 -0.0291608 0.0427923 0.00664349 -0.0683674 -0.0670803 0.0635525 -0.0106272 0.134343 -0.00213038 0.0426273 0.0310278 -0.0545794 -0.0989627 0.00717434 0.0971092 0.0483993 0.0545874 -0.0468251 0.0834485 -0.104149 -0.112585 0.0143181 -0.0267897 -0.10869 0.00563072 0.0977917 0.0159094 -0.0916418 -0.0035594 0.0220146 -0.02291 0.163044 -0.138657 0.0660498 -0.133471 0.190432 0.0425508 -0.104892 0.088078 0.180474 -0.11841 0.0572912 0.0496685 0.0695276 -0.124032 -0.0803115 0.0503946 0.109447 -0.0198328 -0.000101105 0.0273049 0.018081 -0.121878 0.039571 -0.046585 0.00431498 
0.098208 0.068037 -0.164374 -0.0551022 0.0822464 0.161067 0.00724584 -0.0413683 -0.11904 -0.0238679 0.0684735 0.07198 0.121107 -0.0875879 -0.132269 0.0255615 -0.0859713 0.0196633 -0.111339 0.141855 0.159114 -0.0689119 0.0630039 0.0797571 0.00218188 0.0359354 0.0052669 -0.153385 0.0954965 0.100304 -0.0401006 0.0385202 -0.120241 0.0401303 -0.0754212 -0.0165513 -0.147752 0.100398 0.020224 0.0117786 -0.0260896 -0.065373 -0.0552253 0.175754 -0.110879 -0.0266419 0.1582 0.0522501 -0.150381 0.057216 0.0430341 0.0500938 -0.108535 -0.00683087 0.0468647 -0.0443343 -0.00128312 0.186236 0.0184701 -0.142776 -0.0461575 -0.0103302 0.293008 -0.012824 -0.0183688 -0.108813 -0.0043047 0.0779277 -0.00474116 0.0669281 -0.00247156 0.106023 -0.0333985 0.0361507 0.000721531 -0.0480816 -0.0533558 0.0439395 -0.0144482 0.137872 0.00722137 0.0301236 0.021777 -0.0521829 -0.102679 0.0186753 0.076986 0.0248517 0.0546745 -0.035803 0.0681511 -0.114562 -0.112385 0.0161343 -0.0324129 -0.109143 0.00669496 0.104843 0.0238995 -0.0964571 0.00973764 0.0409312 -0.0137713 0.178515 -0.147064 0.0626581 -0.138205 0.207005 0.0510708 -0.102635 0.0854024 0.171428 -0.12052 0.0628686 0.0417961 0.0791567 -0.122326 -0.064111 0.0490357 0.118172 -0.0309722 -0.00342585 0.0326005 0.0223013 -0.111403 0.0398598 -0.038177 -0.00372956 
0.113491 0.0667279 -0.152918 -0.0415526 0.0696721 0.149355 0.0240329 -0.0238189 -0.115622 -0.0397612 0.0687032 0.0737677 0.126332 -0.115731 -0.139313 0.0273261 -0.0771995 0.00200175 -0.148065 0.175704 0.146715 -0.0771027 0.0686702 0.0862724 -0.0245458 0.0175326 -0.0133663 -0.149798 0.0897576 0.0843634 -0.0518451 0.0492436 -0.113402 0.0665013 -0.0985239 -0.0312569 -0.137627 0.12363 -0.00673333 0.0127963 -0.0285875 -0.0811901 -0.0569186 0.153705 -0.103709 -0.031468 0.146672 0.0490937 -0.153327 0.102119 0.0429461 0.0387802 -0.11853 0.00367638 0.0433921 -0.0636992 -0.00782931 0.16255 0.0196794 -0.129032 -0.0520865 -0.00252429 0.272234 -0.0227311 -0.0261573 -0.117626 -0.00198992 0.0551149 -0.036885 0.0397916 -0.0140385 0.0794172 -0.0298532 0.073606 0.00893519 -0.0498846 -0.0275506 0.0363744 -0.00831372 0.149319 0.00956297 -0.00506146 0.00793061 -0.0584943 -0.0905378 0.0381125 0.063918 0.0155304 0.0502833 -0.0222377 0.0732394 -0.131104 -0.114516 0.0230765 -0.0334944 -0.0912374 0.0100082 0.0861039 0.0162526 -0.0867867 0.00786864 0.0408093 -0.0278177 0.199879 -0.135316 0.0548263 -0.129774 0.224811 0.0572232 -0.107286 0.0725924 0.186606 -0.108352 0.0673857 0.0309451 0.0744435 -0.111973 -0.0449909 0.0520942 0.132009 -0.0526791 0.00550011 0.03525 0.0410403 -0.0905629 0.0271578 -0.0321532 -0.0287131 
0.115011 0.0840039 -0.15928 -0.0344365 0.0615711 0.143173 0.0332207 -0.0299021 -0.119325 -0.0268739 0.0720278 0.0630407 0.13523 -0.102555 -0.130603 0.0308563 -0.0694587 -0.00628089 -0.140578 0.169917 0.144349 -0.0876813 0.0624394 0.0829575 -0.014425 0.0138368 -0.0221845 -0.144264 0.0987293 0.102816 -0.0546961 0.0677844 -0.108985 0.0638958 -0.10514 -0.0339108 -0.131643 0.127975 0.00145563 0.0127007 -0.0348161 -0.0892519 -0.0456612 0.141237 -0.0979059 -0.0237434 0.150287 0.0455136 -0.153128 0.0893526 0.0530693 0.0554825 -0.114254 0.0043668 0.0460104 -0.0603476 -0.00524142 0.155711 0.0302968 -0.129383 -0.0578323 -0.00989322 0.260983 -0.0327638 -0.0331959 -0.0987382 0.000990464 0.0520947 -0.0424706 0.0305269 -0.016621 0.0819516 -0.0394659 0.0753163 0.0208909 -0.0452451 -0.0188332 0.0313978 -0.0103142 0.156468 0.011362 -0.0146774 0.00987313 -0.0559302 -0.081787 0.0420667 0.0558526 0.000576125 0.0556604 -0.0237217 0.0602679 -0.130586 -0.111063 0.0208191 -0.0405125 -0.0955109 0.0159045 0.0936948 0.0283023 -0.0900427 0.00867038 0.0472338 -0.0151561 0.211456 -0.147585 0.0581773 -0.130825 0.236141 0.0671182 -0.112924 0.0642583 0.181958 -0.119501 0.0571966 0.0338329 0.0746942 -0.104839 -0.0444056 0.0567233 0.13733 -0.0467826 0.00153512 0.038538 0.0450105 -0.090134 0.0282545 -0.0256083 -0.0215497 
0.110119 0.0687746 -0.158011 -0.032422 0.0690678 0.134422 0.0307532 -0.0345433 -0.115321 -0.0265445 0.0605239 0.0754661 0.128127 -0.116231 -0.141749 0.0393222 -0.0801772 0.00376526 -0.143855 0.178269 0.149573 -0.0949392 0.0710798 0.0851634 -0.0195762 0.0192791 -0.0212244 -0.157191 0.0888724 0.102634 -0.0619364 0.0659541 -0.108361 0.0618504 -0.097248 -0.0389548 -0.14331 0.131309 -0.00549272 0.00140481 -0.0443617 -0.087952 -0.0470233 0.149014 -0.0931385 -0.0232038 0.152039 0.046227 -0.15184 0.0968142 0.0545037 0.0397992 -0.109996 -0.00274162 0.0520812 -0.064336 -0.00297378 0.154958 0.0264922 -0.128964 -0.0419414 -0.0115171 0.26374 -0.0176051 -0.02044 -0.115619 -0.014927 0.0541382 -0.0427867 0.0326771 -0.0205637 0.0828273 -0.0374432 0.0681841 0.00235747 -0.0431313 -0.0165667 0.0315414 -0.00770443 0.153803 0.0121116 -0.0110686 -0.00251059 -0.0578946 -0.0881493 0.0287437 0.0533441 0.012315 0.0596176 -0.0218388 0.0569628 -0.120481 -0.116582 0.0233026 -0.038131 -0.0814032 0.0130744 0.0913967 0.030348 -0.0889592 0.0170217 0.0374849 -0.0267708 0.200281 -0.136436 0.047536 -0.130284 0.228388 0.0676767 -0.105866 0.0634695 0.188465 -0.110837 0.0540721 0.0364304 0.082309 -0.10922 -0.0389863 0.0491166 0.136945 -0.0547244 0.0122536 0.038909 0.0383753 -0.09243 0.0327015 -0.0285176 -0.0335093 
