{
  "descriptor": [
    -0.09516502916812897,
    0.0647842213511467,
    0.07673224061727524,
    -0.0270400233566761,
    -0.09162724763154984,
    -0.0025477418676018715,
    -0.0402403399348259,
    -0.0810210332274437,
    0.12948191165924072,
    -0.04415517300367355,
    0.18813735246658325,
    -0.027209332212805748,
    -0.21325309574604034,
    -0.04007745161652565,
    -0.06102708727121353,
    0.09127015620470047,
    -0.1401590257883072,
    -0.13279356062412262,
    -0.05312325060367584,
    -0.07071243226528168,
    0.025971857830882072,
    0.07962211966514587,
    0.0217994786798954,
    0.007620286662131548,
    -0.13818742334842682,
    -0.294418066740036,
    -0.062486276030540466,
    -0.10737878829240799,
    0.04785146191716194,
    -0.10510173439979553,
    0.0012994986027479172,
    0.10859954357147217,
    -0.20390407741069794,
    -0.026407958939671516,
    0.014675966463983059,
    0.0740170106291771,
    -0.04455205425620079,
    -0.07328148931264877,
    0.21089887619018555,
    0.05511085316538811,
    -0.14746524393558502,
    0.028399646282196045,
    0.045381154865026474,
    0.2801876366138458,
    0.16415363550186157,
    -0.01897602528333664,
    -0.0058385650627315044,
    -0.028072398155927658,
    0.09824575483798981,
    -0.2590097188949585,
    0.01935276761651039,
    0.22253583371639252,
    0.0944363996386528,
    0.1093679666519165,
    0.04353835806250572,
    -0.12175803631544113,
    0.04050677642226219,
    0.10078887641429901,
    -0.17252539098262787,
    0.0769595056772232,
    0.04608575254678726,
    -0.04773806035518646,
    -0.005416869185864925,
    -0.046271149069070816,
    0.18823745846748352,
    0.08253730088472366,
    -0.08301064372062683,
    -0.12706397473812103,
    0.12868215143680573,
    -0.11576848477125168,
    -0.08079986274242401,
    0.08041957765817642,
    -0.1553066521883011,
    -0.16465862095355988,
    -0.21611951291561127,
    0.10182886570692062,
    0.3453768193721771,
    0.1141754686832428,
    -0.14333423972129822,
    0.06357331573963165,
    -0.06251810491085052,
    -0.05271532014012337,
    -0.0047086626291275024,
    0.05468733608722687,
    -0.08067513257265091,
    -0.003800551174208522,
    -0.04432464390993118,
    0.04045208916068077,
    0.20310495793819427,
    -0.0032684665638953447,
    -0.01574927754700184,
    0.21772019565105438,
    0.00010225921869277954,
    0.0014768056571483612,
    0.03941653296351433,
    0.012272820807993412,
    -0.06288333982229233,
    -0.009984176605939865,
    -0.1214231327176094,
    -0.0012387284077703953,
    0.02364243008196354,
    -0.11237052828073502,
    -0.0006840641726739705,
    0.1251152604818344,
    -0.18408173322677612,
    0.1360374093055725,
    -0.01670203171670437,
    -0.05741777643561363,
    -0.012111173011362553,
    -0.008329544216394424,
    -0.07804381847381592,
    -0.002263581147417426,
    0.14813575148582458,
    -0.23973368108272552,
    0.24820861220359802,
    0.15964385867118835,
    0.061813775449991226,
    0.12074431777000427,
    0.06483330577611923,
    0.05292906239628792,
    -0.002945992862805724,
    0.01595991663634777,
    -0.10110945254564285,
    -0.10276976227760315,
    0.0673883706331253,
    -0.019781332463026047,
    -0.024617396295070648,
    0.01834673434495926
  ]
}