{
  "descriptor": [
    -0.13931690156459808,
    0.11395447701215744,
    0.11392702162265778,
    -0.05181579664349556,
    -0.08527620881795883,
    -0.11023164540529251,
    0.012301645241677761,
    -0.11296046525239944,
    0.11620257049798965,
    -0.07258224487304688,
    0.21833159029483795,
    -0.05631190910935402,
    -0.2826041877269745,
    -0.08459234237670898,
    -0.02789384126663208,
    0.16427811980247498,
    -0.17320466041564941,
    -0.1623297929763794,
    -0.025707941502332687,
    -0.07912594825029373,
    0.020580405369400978,
    -0.018672656267881393,
    0.019672494381666183,
    0.141322523355484,
    -0.08318988978862762,
    -0.25266048312187195,
    -0.05176391825079918,
    -0.15656888484954834,
    -0.021733848378062248,
    -0.0910179540514946,
    0.04123044013977051,
    0.10828117281198502,
    -0.2030773162841797,
    -0.00815723929554224,
    -0.013525965623557568,
    0.024011941626667976,
    -0.01877422071993351,
    -0.004356394987553358,
    0.22954387962818146,
    -0.0341978445649147,
    -0.20684364438056946,
    -0.11401011794805527,
    0.04273167997598648,
    0.22619687020778656,
    0.17126815021038055,
    -0.026892995461821556,
    0.02748061902821064,
    -0.014756872318685055,
    0.07988335937261581,
    -0.21249814331531525,
    -0.02835429087281227,
    0.1503177434206009,
    0.13668829202651978,
    0.030006393790245056,
    -0.01378765981644392,
    -0.22126922011375427,
    -0.034527551382780075,
    0.10956424474716187,
    -0.2280566394329071,
    0.04073735326528549,
    0.02215762808918953,
    -0.18801191449165344,
    -0.11400161683559418,
    -0.0678940936923027,
    0.2888951003551483,
    0.07321060448884964,
    -0.15957053005695343,
    -0.19608986377716064,
    0.2474384754896164,
    -0.20460021495819092,
    -0.03466380760073662,
    0.1684533655643463,
    -0.09639991074800491,
    -0.13790301978588104,
    -0.2626538872718811,
    0.03837762027978897,
    0.26074132323265076,
    0.07380843162536621,
    -0.11759798228740692,
    0.07425213605165482,
    -0.14680807292461395,
    -0.012717665173113346,
    -0.12349899858236313,
    0.11045122891664505,
    -0.08140643686056137,
    0.10831480473279953,
    -0.06284558773040771,
    -0.04676549881696701,
    0.09892185032367706,
    -0.023536209017038345,
    0.029817713424563408,
    0.2667408585548401,
    -0.033712875097990036,
    0.005389312747865915,
    0.010463716462254524,
    -0.058641206473112106,
    -0.0587182343006134,
    -0.03922739997506142,
    -0.10635977983474731,
    -0.004466642159968615,
    -0.07056443393230438,
    -0.1218811646103859,
    0.009448778815567493,
    0.058126769959926605,
    -0.19873276352882385,
    0.06796585023403168,
    -0.06398303806781769,
    -0.002046668203547597,
    -0.10225419700145721,
    0.0020226824562996626,
    -0.1074448972940445,
    -0.09554027020931244,
    0.1685909479856491,
    -0.311786025762558,
    0.16325931251049042,
    0.15981540083885193,
    0.06463027745485306,
    0.11925669759511948,
    0.07117913663387299,
    0.07415541261434555,
    -0.006696885917335749,
    -0.08049561828374863,
    -0.14225158095359802,
    -0.003328846301883459,
    0.15990544855594635,
    -0.12804391980171204,
    0.017141008749604225,
    0.01275694090873003
  ]
}