{
  "descriptor": [
    -0.1251537948846817,
    0.05054016783833504,
    0.059207722544670105,
    -0.03145083039999008,
    -0.13945508003234863,
    0.021316025406122208,
    -0.07837000489234924,
    -0.05995158851146698,
    0.2050558477640152,
    -0.12070565670728683,
    0.1766129583120346,
    -0.044072747230529785,
    -0.2735348343849182,
    0.10057062655687332,
    -0.07198749482631683,
    0.10823452472686768,
    -0.1391085535287857,
    -0.13295483589172363,
    -0.05854150280356407,
    -0.04518293961882591,
    0.027978282421827316,
    0.038646310567855835,
    0.023420969024300575,
    0.09659777581691742,
    -0.13641783595085144,
    -0.3983704447746277,
    -0.08207320421934128,
    -0.11141666769981384,
    0.03881322592496872,
    -0.13788318634033203,
    -0.0783165916800499,
    0.05942140519618988,
    -0.1724582016468048,
    -0.022297328338027,
    0.03171759843826294,
    0.09629406780004501,
    -0.07591895759105682,
    -0.10291042923927307,
    0.271990031003952,
    0.08573256433010101,
    -0.2555345892906189,
    -0.028253305703401566,
    0.05188792198896408,
    0.2852386236190796,
    0.15797805786132812,
    0.009415384382009506,
    0.015472733415663242,
    -0.06397306174039841,
    0.12917298078536987,
    -0.3211172819137573,
    0.06655465066432953,
    0.23807451128959656,
    0.045398492366075516,
    0.10861891508102417,
    0.12229334563016891,
    -0.12669987976551056,
    0.018639549612998962,
    0.11544512957334518,
    -0.10817056149244308,
    0.07168406248092651,
    0.11527298390865326,
    -0.036990322172641754,
    -0.01223622728139162,
    -0.09454245865345001,
    0.22699156403541565,
    0.08355443179607391,
    -0.10369421541690826,
    -0.09108417481184006,
    0.1574452966451645,
    -0.14534643292427063,
    -0.07867023348808289,
    0.11455614864826202,
    -0.1114489734172821,
    -0.23908482491970062,
    -0.19464415311813354,
    0.0914834514260292,
    0.4212207496166229,
    0.22435489296913147,
    -0.110175222158432,
    0.08490615338087082,
    -0.0672459751367569,
    -0.07846134155988693,
    0.03394286334514618,
    0.10182042419910431,
    -0.07168500870466232,
    0.0860237255692482,
    -0.009900289587676525,
    0.06842067837715149,
    0.22822341322898865,
    0.04404333606362343,
    0.035170555114746094,
    0.2606526017189026,
    0.006414294242858887,
    0.03886616230010986,
    0.0817682147026062,
    0.059851303696632385,
    -0.11142078787088394,
    -0.08320935815572739,
    -0.1966640204191208,
    -0.03606787696480751,
    0.054615214467048645,
    -0.06110682338476181,
    0.002893170341849327,
    0.08514085412025452,
    -0.25557923316955566,
    0.13696825504302979,
    -0.04367772489786148,
    -0.09960079193115234,
    0.002900996245443821,
    0.0068892426788806915,
    -0.10494188964366913,
    0.014143414795398712,
    0.16837851703166962,
    -0.3049998879432678,
    0.16027696430683136,
    0.15056008100509644,
    0.09668891131877899,
    0.13730087876319885,
    0.090553417801857,
    0.004634682089090347,
    0.024347402155399323,
    -0.06338051706552505,
    -0.155244380235672,
    -0.10770241916179657,
    0.09702887386083603,
    -0.0160799790173769,
    -0.013747533783316612,
    -0.0173091571778059
  ]
}