{
  "descriptor": [
    -0.04112591594457626,
    0.10223311930894852,
    0.012184823863208294,
    -0.11898928135633469,
    -0.1908426284790039,
    0.0005546965985558927,
    -0.07151447236537933,
    -0.14735513925552368,
    0.18189533054828644,
    -0.16317147016525269,
    0.2271372228860855,
    -0.06677494198083878,
    -0.2642430067062378,
    -0.04963591694831848,
    -0.026425018906593323,
    0.18152697384357452,
    -0.1812356561422348,
    -0.19424289464950562,
    -0.13660526275634766,
    -0.03365373611450195,
    -0.008574244566261768,
    0.028536757454276085,
    0.04211065545678139,
    0.04195711761713028,
    -0.1337006688117981,
    -0.33258500695228577,
    -0.07374337315559387,
    -0.09171297401189804,
    0.06375440955162048,
    -0.11921148747205734,
    -0.006004709284752607,
    0.11967787146568298,
    -0.13237769901752472,
    -0.019643109291791916,
    0.05046524107456207,
    0.09452290832996368,
    -0.07276454567909241,
    -0.1165604218840599,
    0.2120445817708969,
    -0.03131772205233574,
    -0.29220321774482727,
    -0.025360416620969772,
    0.04256335273385048,
    0.20565743744373322,
    0.19954241812229156,
    -0.0041087111458182335,
    0.029134277254343033,
    -0.12141764163970947,
    0.09874313324689865,
    -0.23954902589321136,
    0.029399199411273003,
    0.15967963635921478,
    0.04710611701011658,
    0.09652156382799149,
    0.018846385180950165,
    -0.16021201014518738,
    0.0461803674697876,
    0.14806944131851196,
    -0.2055627554655075,
    -0.06633396446704865,
    0.10171984881162643,
    -0.13265885412693024,
    -0.03791492059826851,
    -0.040453940629959106,
    0.19158045947551727,
    0.12779878079891205,
    -0.09515771269798279,
    -0.16175353527069092,
    0.2169760763645172,
    -0.17280671000480652,
    -0.05254030227661133,
    0.12374680489301682,
    -0.09162995219230652,
    -0.12631124258041382,
    -0.19166411459445953,
    -0.09410940110683441,
    0.38839271664619446,
    0.08918285369873047,
    -0.1252615600824356,
    -0.029230386018753052,
    -0.09508583694696426,
    -0.05284936726093292,
    0.0028085617814213037,
    0.03543124347925186,
    -0.048693131655454636,
    -0.08123108744621277,
    -0.09947404265403748,
    0.016610249876976013,
    0.25168657302856445,
    -0.0842936709523201,
    0.06676171720027924,
    0.239522323012352,
    0.07234689593315125,
    -0.0320301316678524,
    0.04817856475710869,
    0.09331809729337692,
    -0.09438282251358032,
    0.013796411454677582,
    -0.09175539016723633,
    0.0005789282149635255,
    -0.0034347502514719963,
    -0.09500307589769363,
    -0.0288271214812994,
    0.0807851105928421,
    -0.1942588835954666,
    0.21281249821186066,
    0.022326858714222908,
    -0.0183958001434803,
    0.014565489254891872,
    -0.061605826020240784,
    0.004717121832072735,
    -0.06654822826385498,
    0.19445151090621948,
    -0.24708795547485352,
    0.1501760184764862,
    0.18064674735069275,
    0.0739387571811676,
    0.16043590009212494,
    0.03416028991341591,
    0.08733731508255005,
    -0.03604806959629059,
    -0.14525029063224792,
    -0.2086924910545349,
    -0.09675262868404388,
    0.0352100133895874,
    -0.03730536252260208,
    -0.02408963069319725,
    0.03787439316511154
  ]
}