0.0537589 0.0137304 -0.128713 -0.0286841 0.132303 0.1456 0.0378333 -0.0565538 -0.0471596 -0.0832707 0.0386355 0.110333 0.095997 -0.0879367 -0.123718 -0.0129171 -0.134766 0.0148117 -0.142835 0.130631 0.181548 -0.104351 0.00804135 0.1137 0.0474327 -0.00708472 -0.03757 -0.160757 0.0390752 0.111711 0.0263508 0.0103401 -0.128956 0.0342408 -0.044549 0.0190162 -0.165288 0.0125154 -0.0279393 -0.0297143 0.0644883 -0.0460761 -0.0193553 0.206594 -0.097597 -0.0355297 0.141377 0.0472343 -0.0988507 0.00631076 -0.0108433 -0.0503248 -0.074998 -0.0610064 0.0916559 0.00857065 -0.118565 0.23507 -0.00635829 -0.123688 -0.0401226 0.0057156 0.26078 0.0124083 0.00547419 -0.0889433 -0.0147033 0.058564 -0.0165096 0.0423513 0.0274483 0.124159 -0.0106416 -0.0585362 -0.012625 0.0233272 -0.0702291 0.0382972 -0.016842 0.143198 -0.010361 0.0391883 0.011599 -0.0239232 -0.142993 0.0291566 0.123202 0.045289 0.00543913 -0.0291474 0.0694707 -0.125148 -0.101965 -0.0126956 -0.0844741 -0.0807184 -0.0361537 0.0352387 0.0314496 -0.0758778 -0.00131733 -0.00547238 -0.00575405 0.107328 -0.156839 0.0819346 -0.15741 0.210077 -0.0118175 -0.0678608 0.0916184 0.11761 -0.1646 0.039488 0.0341935 0.101676 -0.154492 -0.0229845 0.0260149 0.140366 -0.0155275 0.0204219 -0.035027 0.0425898 -0.115838 0.0644022 -0.073271 -0.0135116 
0.0557646 -0.0336012 -0.120437 -0.0185476 0.140684 0.126977 0.0204843 -0.0490175 -0.0521008 -0.0952911 0.0252823 0.14484 0.0786274 -0.0956565 -0.147867 -0.00383312 -0.117606 0.0369921 -0.147928 0.16039 0.17901 -0.112284 0.0369337 0.132371 0.028516 0.0160938 -0.0124267 -0.178137 0.00989581 0.0788132 0.0101947 0.0125108 -0.117098 0.0474572 -0.0611695 0.0137468 -0.176583 0.0465971 -0.0563261 -0.0351612 0.0548032 -0.0232233 -0.038931 0.199087 -0.0985476 -0.0475618 0.145562 0.0297913 -0.0956547 0.0332697 -0.0031062 -0.0880347 -0.0770598 -0.0590305 0.100576 0.00147157 -0.0976501 0.239392 -0.00173183 -0.122598 -0.0162034 0.00883748 0.260903 0.0219651 0.0298847 -0.112761 -0.0330222 0.0657469 -0.0156148 0.062691 0.0174976 0.116465 0.00439585 -0.0412404 -0.0348174 0.013712 -0.0582988 0.0505403 -0.0178076 0.10582 -0.0370085 0.0575069 -0.00739445 -0.0514181 -0.147831 0.00284765 0.128811 0.0721136 0.0073884 -0.0386444 0.0672656 -0.112795 -0.0949187 -0.0116383 -0.0506351 -0.0497776 -0.0324647 0.0287147 0.0268369 -0.0680676 -0.0138322 -0.0270706 -0.0305334 0.112473 -0.132579 0.0626799 -0.162693 0.169305 -0.0249024 -0.0814022 0.0832791 0.153071 -0.126505 0.0480426 0.03805 0.0904029 -0.15664 -0.0431366 0.0196251 0.130019 -0.036223 0.0536354 -0.0337051 0.0280841 -0.1115 0.0657398 -0.0840236 -0.0417736 
0.0585679 -0.0463523 -0.108844 -0.0087751 0.14604 0.126709 0.040886 -0.0385992 -0.0314431 -0.101485 0.023926 0.150169 0.0785059 -0.0842149 -0.142003 -0.0283697 -0.11137 0.0465564 -0.161759 0.164659 0.175729 -0.117394 0.042356 0.165228 0.0215618 -0.0184882 -0.0249857 -0.167257 0.00900122 0.0724458 0.0147351 0.00325002 -0.114208 0.0538364 -0.0674006 0.0185444 -0.179686 0.0430664 -0.0918494 -0.0395181 0.0648448 -0.0113051 -0.0558824 0.188208 -0.113091 -0.0622723 0.125117 0.0384121 -0.0726765 0.0494463 -0.0150213 -0.0895754 -0.073821 -0.0650509 0.10681 0.00983585 -0.100652 0.247228 -0.00479361 -0.115387 -0.026267 0.0275802 0.25207 0.0160867 0.0182814 -0.106765 -0.0280038 0.0555546 -0.0358234 0.074129 0.0226048 0.11459 0.00846302 -0.0286075 -0.0349834 0.0233513 -0.0510938 0.0456964 -0.00784335 0.0886856 -0.0481033 0.0572731 -0.0101702 -0.0558967 -0.130951 0.00628343 0.12927 0.0768579 -0.000783691 -0.0291176 0.0845493 -0.117276 -0.0802474 -0.0244502 -0.0444473 -0.05961 -0.0454565 0.0187577 0.0295994 -0.0615991 0.000428087 -0.0260151 -0.0238601 0.101386 -0.133023 0.0683596 -0.161369 0.145451 -0.018619 -0.0746578 0.0871357 0.158179 -0.110538 0.0435174 0.0330926 0.101821 -0.135265 -0.0401747 0.0209431 0.148198 -0.0394243 0.0452211 -0.058893 0.034468 -0.127081 0.0768603 -0.0861167 -0.0390263 
0.0505311 -0.0345441 -0.126995 -0.00491432 0.154042 0.131375 0.0394813 -0.0430754 -0.0407129 -0.0874338 0.00829874 0.137155 0.0670873 -0.0886654 -0.120581 -0.0341491 -0.104146 0.0522745 -0.132775 0.159107 0.157011 -0.118514 0.0528421 0.159819 0.0341307 -0.0202509 -0.032483 -0.182943 0.0151286 0.0648786 0.0397423 0.0121417 -0.117549 0.040415 -0.0539992 0.0315777 -0.172884 0.0353611 -0.0898156 -0.0438525 0.0778757 -0.00585194 -0.0527468 0.20642 -0.134741 -0.0454407 0.141535 0.0461369 -0.0658459 0.0416359 -0.0171817 -0.0837114 -0.0698592 -0.0796469 0.10267 0.0120393 -0.086262 0.246101 0.0249831 -0.124785 -0.0378359 0.0322468 0.248551 0.00288383 0.0246921 -0.117939 -0.0184357 0.0433888 -0.0242395 0.0873611 0.0234427 0.136597 0.00802545 -0.0146932 -0.0416594 0.00495807 -0.0704979 0.0677666 -0.0112392 0.0789119 -0.0575774 0.0753223 -0.0195111 -0.0566116 -0.112374 -0.0031605 0.117752 0.0750106 0.000337896 -0.0453553 0.0901224 -0.0907338 -0.0788291 -0.0651125 -0.0243285 -0.06972 -0.0301178 0.0447835 0.0197584 -0.0696045 -0.0200135 -0.0217105 0.00243743 0.0983423 -0.153851 0.0629368 -0.162189 0.143922 -0.000158186 -0.0488695 0.0884595 0.156615 -0.114424 0.0290947 0.0278061 0.0839053 -0.115662 -0.0797011 0.031877 0.145581 -0.0196932 0.0518113 -0.0563881 0.0435776 -0.150695 0.0520624 -0.0920197 -0.0235731 
0.0481609 0.00380985 -0.154235 -0.00519563 0.139761 0.182776 0.0707294 -0.0660136 0.00360911 -0.0611708 0.0503075 0.124218 0.0683187 -0.0595274 -0.129876 -0.0669201 -0.10675 0.0818626 -0.103825 0.114401 0.160074 -0.122789 0.0332522 0.174564 0.0331647 -0.0675431 -0.0313839 -0.163581 0.0453097 0.107161 0.0487632 -0.0200103 -0.104487 0.024912 -0.0228754 0.0465043 -0.148583 0.00238485 -0.0710441 -0.0528929 0.0651297 -0.0174091 -0.0587385 0.183095 -0.149828 -0.0813159 0.116709 0.0603708 -0.064443 0.0282355 -0.0515663 -0.031487 -0.044647 -0.0666947 0.0964607 0.0610417 -0.0850255 0.261719 -0.026314 -0.112808 -0.0734679 0.0438737 0.311319 -0.0655013 0.0259213 -0.0662983 -0.0105156 0.0195321 -0.0669163 0.125632 0.0255007 0.12694 -0.0315651 -0.0185727 -0.0304553 0.00956486 -0.0396922 0.0549711 -0.0111406 0.0293338 -0.0838109 0.0890165 -0.0108572 -0.0408304 -0.100698 0.0220211 0.0905495 0.0510875 0.0205367 -0.00770413 0.128029 -0.132207 -0.0527689 -0.0542573 0.00988061 -0.117201 -0.0645745 0.0543046 0.0411435 -0.0383112 0.0303026 -0.00138213 -0.000617149 0.0574426 -0.138409 0.112863 -0.11052 0.089278 -0.0158745 -0.0268422 0.0822646 0.117187 -0.0677291 0.0210716 0.0400771 0.104228 -0.0740066 -0.0569972 0.0672729 0.161893 0.00689514 -0.0319732 -0.066224 0.0380872 -0.169354 0.104109 -0.066654 0.00876172 
0.0522543 -0.00970068 -0.1474 -0.00299897 0.149403 0.166789 0.0628935 -0.0469363 -0.00847717 -0.0674074 0.0485231 0.134133 0.068386 -0.0869697 -0.141637 -0.0465019 -0.101629 0.0899561 -0.123135 0.126425 0.176249 -0.125795 0.0323108 0.184074 0.0347397 -0.06251 -0.0261827 -0.171553 0.0420957 0.0974756 0.0376607 -0.0131457 -0.105883 0.0373099 -0.0394164 0.0294649 -0.158884 -0.00961338 -0.076086 -0.0513612 0.0753643 -0.021327 -0.0449791 0.195331 -0.137164 -0.0842697 0.126815 0.0524584 -0.0725694 0.0285618 -0.0355803 -0.0557673 -0.0617139 -0.0736758 0.0903753 0.0522665 -0.0857069 0.247889 -0.0164505 -0.10827 -0.0561767 0.03613 0.289024 -0.0381862 0.0180827 -0.0896221 -0.0261467 0.0172993 -0.0555273 0.106034 0.0151561 0.120832 -0.0256947 -0.0276609 -0.0339674 0.0106497 -0.0409074 0.0766302 -0.0181043 0.038552 -0.0828181 0.0863216 -0.0089619 -0.0374552 -0.110221 0.0401094 0.102431 0.0537918 0.00851065 -0.0167657 0.113805 -0.124794 -0.0797333 -0.0531387 0.00161587 -0.0948234 -0.0686521 0.0476123 0.0267298 -0.0448208 0.0217231 -0.0166345 0.00186807 0.0773291 -0.125081 0.0941217 -0.122863 0.11437 -0.0224998 -0.0428991 0.073506 0.12075 -0.0751323 0.0209589 0.0390019 0.0982052 -0.0916645 -0.0580117 0.0602202 0.159174 -0.00409281 -0.00627388 -0.0708971 0.0376206 -0.166262 0.0928172 -0.0824364 -0.00581396 
0.053114 -0.0148064 -0.114547 -0.00383493 0.136336 0.18204 0.0684296 -0.0409895 -0.0269187 -0.0582039 0.0434695 0.126836 0.0751941 -0.0920884 -0.105044 -0.0611626 -0.120609 0.0795038 -0.111508 0.122925 0.167856 -0.1259 0.032869 0.198357 0.0358983 -0.061808 -0.0451482 -0.180302 0.0419314 0.0866005 0.0472832 -0.0235177 -0.120284 0.0425936 -0.0294748 0.0361886 -0.165081 -0.013806 -0.0734954 -0.0474029 0.080742 -0.0410921 -0.0556006 0.189422 -0.145635 -0.0922195 0.125617 0.056404 -0.0792444 0.0398395 -0.0295944 -0.0644668 -0.0573793 -0.0725578 0.093593 0.0527952 -0.0895092 0.256717 -0.0149975 -0.110129 -0.0578568 0.0483673 0.281435 -0.0446472 0.0260594 -0.0752826 -0.0144983 -1.4606e-05 -0.0724045 0.107318 0.00734741 0.131841 -0.0295085 -0.0123959 -0.0280282 0.00048356 -0.0454328 0.0601196 0.0103804 0.0642826 -0.0769849 0.0618446 -0.00210451 -0.0428486 -0.107328 0.0241042 0.107964 0.0484096 0.00899843 -0.00848137 0.122031 -0.117016 -0.0593427 -0.0515829 -0.0242649 -0.100276 -0.062344 0.0532917 0.0305833 -0.0399578 0.0257658 -0.00478076 -0.00540701 0.0646103 -0.118308 0.102086 -0.116046 0.112739 -0.0132528 -0.0400623 0.0717624 0.125697 -0.0756552 0.00330764 0.042466 0.105767 -0.0778927 -0.0504332 0.0534971 0.172113 0.00592877 -0.0333435 -0.074785 0.0395461 -0.168593 0.0994494 -0.0700328 0.00720685 
0.0320469 0.0496469 -0.122033 -0.0104947 0.098471 0.194192 0.086513 -0.0608955 -0.0121916 -0.0168637 0.0698406 0.0660133 0.0795936 -0.0672027 -0.0592223 -0.0465052 -0.163038 0.0400328 -0.10298 0.0753128 0.149305 -0.140248 0.0202689 0.113126 0.0624159 -0.0486956 -0.0714499 -0.166899 0.0768374 0.0909525 0.0734833 0.00514056 -0.123643 0.00887319 -0.0169222 0.0595405 -0.16529 0.018775 -0.0353402 -0.0384473 0.0752573 -0.0646138 -0.0606096 0.189085 -0.138846 -0.072349 0.113207 0.0535143 -0.104149 -0.0113194 -0.0655683 -0.0208489 -0.0720248 -0.0733246 0.0712172 0.0642861 -0.117076 0.263532 -0.0252803 -0.107381 -0.0947361 0.0181035 0.311309 -0.0631697 0.0501907 0.00251936 0.00131021 0.0143159 -0.0692022 0.106627 0.0207174 0.158487 -0.0231114 0.000642781 -0.000769999 -0.027506 -0.0599467 0.0238899 -0.00952246 0.0628487 -0.062925 0.0329374 -0.0197963 -0.0513766 -0.127412 0.0212169 0.0909717 0.0159721 0.0314231 -0.0138227 0.128875 -0.131538 -0.0606849 -0.0699211 -0.0231176 -0.118111 -0.0481078 0.0541371 0.0599389 -0.0200403 -0.00362729 -0.0120348 0.00617807 0.0315128 -0.141663 0.140048 -0.0951205 0.1434 0.0323861 -0.0577356 0.0629299 0.122984 -0.101817 -0.00850204 0.0868104 0.0845601 -0.0708172 -0.0341935 0.09976 0.160013 0.0392152 -0.0644113 -0.0482894 0.0768948 -0.135782 0.0884705 -0.0315139 0.0396979 
0.0534875 0.00544542 -0.11593 -0.0111751 0.132677 0.186642 0.072239 -0.0256528 -0.030218 -0.0197811 0.065335 0.113818 0.086279 -0.102845 -0.0943815 -0.0460259 -0.121819 0.0901866 -0.12116 0.114185 0.167662 -0.132794 0.0278573 0.190901 0.0404739 -0.0628652 -0.0473769 -0.170767 0.0624642 0.0830031 0.0482047 -0.0157392 -0.122206 0.0488645 -0.0444191 0.030522 -0.169919 -0.0208012 -0.0546386 -0.0368459 0.0831486 -0.0603727 -0.055939 0.186937 -0.143541 -0.116829 0.117239 0.0639703 -0.0857554 0.0313642 -0.0169328 -0.0526074 -0.0874396 -0.0756226 0.0718685 0.0582557 -0.0904239 0.246426 -0.0142533 -0.102275 -0.0671772 0.0305479 0.280753 -0.0436353 0.0169004 -0.0621984 -0.0216895 0.00241497 -0.0767327 0.104009 0.00185228 0.143276 -0.0333727 -0.00441162 -0.0230088 -0.014455 -0.0389732 0.0710442 0.00355465 0.0575254 -0.0797124 0.0544609 0.0106063 -0.0318413 -0.112983 0.0390518 0.113177 0.0439342 0.0273731 -0.0133174 0.112928 -0.120745 -0.0702654 -0.046705 -0.0239893 -0.107178 -0.0717817 0.0507868 0.0196137 -0.038304 0.0245105 -0.0118096 -0.00428737 0.0723198 -0.101307 0.109232 -0.113385 0.12206 0.00439288 -0.0550687 0.0555413 0.129672 -0.073192 0.0122767 0.0558067 0.0923592 -0.0702701 -0.0408312 0.0632668 0.174932 0.0160778 -0.0444325 -0.0721841 0.0512644 -0.169118 0.092885 -0.0699288 0.0205095 
0.0418037 0.0289245 -0.111557 -0.00282323 0.111554 0.197807 0.0857029 -0.0444906 -0.0347969 -0.0103564 0.0671376 0.103123 0.0804875 -0.105624 -0.0840242 -0.0487727 -0.13414 0.0697074 -0.100156 0.102668 0.157049 -0.139913 0.00779683 0.176553 0.0465632 -0.0457801 -0.0658893 -0.173915 0.0800161 0.0895912 0.0591202 -0.00137549 -0.133876 0.0375769 -0.0305098 0.039649 -0.16268 -0.0111898 -0.0346247 -0.0368298 0.0883496 -0.0767573 -0.0525784 0.177301 -0.13456 -0.10875 0.126538 0.0536998 -0.0988655 0.00804401 -0.0283326 -0.0363925 -0.078934 -0.0742361 0.0764966 0.0681143 -0.101557 0.256494 -0.0264659 -0.0981491 -0.0776034 0.0289127 0.297192 -0.0694232 0.0391441 -0.0336268 -0.0047877 -0.0220641 -0.088058 0.100724 -0.00555046 0.149529 -0.0392711 0.0227651 -0.00910543 -0.0266272 -0.032935 0.0673073 0.00799681 0.0590557 -0.0802651 0.0444643 0.00691403 -0.0352075 -0.11064 0.024931 0.1064 0.0314204 0.0300265 -0.0164541 0.120067 -0.122148 -0.0519742 -0.0471283 -0.0211886 -0.112816 -0.0494711 0.0526857 0.0368269 -0.0245454 0.0109868 -0.00304646 -0.0118289 0.0685645 -0.107895 0.127745 -0.0898277 0.129125 0.0100734 -0.0509387 0.0466685 0.123207 -0.0815323 -0.00181466 0.0676798 0.0852153 -0.0609579 -0.0399762 0.0772956 0.171668 0.0237943 -0.0616017 -0.0626094 0.0536031 -0.164936 0.106179 -0.0569414 0.0226318 
0.0501141 0.0580388 -0.139674 -0.0226792 0.111782 0.198588 0.0699041 -0.0573933 -0.035298 -0.0116887 0.07143 0.0741194 0.0884323 -0.0824955 -0.0739158 -0.0339986 -0.136876 0.0488554 -0.100647 0.0884538 0.152558 -0.118839 0.0185757 0.141766 0.0549313 -0.0462746 -0.049552 -0.164947 0.0932509 0.104783 0.0598633 -0.00397711 -0.131837 0.0142208 -0.0284373 0.0472475 -0.163062 -0.00444208 -0.0214836 -0.0226621 0.0650406 -0.0669586 -0.0545618 0.198919 -0.135615 -0.0649614 0.129754 0.06849 -0.108446 -0.000770347 -0.0329108 -0.00847082 -0.0807917 -0.0768859 0.0606887 0.0551344 -0.10146 0.261059 -0.00881915 -0.106116 -0.0886375 0.0210701 0.308396 -0.0587559 0.0236949 -0.0396327 0.000405707 0.0124641 -0.0635558 0.0956891 0.0129735 0.155399 -0.0332691 -0.00359564 -0.00281042 -0.0255966 -0.0565746 0.0558719 -0.00785758 0.079443 -0.0443537 0.0432375 -0.00586407 -0.037742 -0.114763 0.030717 0.0898728 0.0111178 0.0263466 -0.0176072 0.1145 -0.123129 -0.0735169 -0.05249 -0.0220539 -0.121314 -0.0447848 0.0618139 0.0437232 -0.0425613 0.00485293 0.00203839 0.00655286 0.0632327 -0.149196 0.127197 -0.10727 0.150096 0.0272277 -0.0515642 0.0765117 0.120883 -0.0992012 0.00795545 0.0593252 0.0887635 -0.0836112 -0.0395184 0.0763655 0.159686 0.0265381 -0.0599112 -0.0495714 0.0667612 -0.158236 0.0854364 -0.0578263 0.0292524 
0.0407079 0.0459306 -0.114668 -0.0107664 0.0963483 0.196115 0.0736038 -0.0448147 -0.0333453 -0.0206628 0.0692759 0.0877168 0.0839711 -0.106483 -0.0805463 -0.0473079 -0.15717 0.0558704 -0.109337 0.0899245 0.157506 -0.127675 0.00812398 0.162849 0.0515355 -0.0493469 -0.0533066 -0.172577 0.0783272 0.0990196 0.0555863 -0.00769368 -0.133237 0.0292063 -0.0314268 0.0359672 -0.167199 -0.0164836 -0.0326882 -0.0202922 0.0835876 -0.088595 -0.0510003 0.19772 -0.133794 -0.0902182 0.131315 0.0552299 -0.11003 0.00767722 -0.0234255 -0.0263144 -0.0767842 -0.0698919 0.0675983 0.0616516 -0.103741 0.247912 -0.0102863 -0.110031 -0.0807864 0.0241491 0.29263 -0.0476693 0.0192926 -0.0425968 0.00555089 -0.015911 -0.0724585 0.0904795 -0.00253838 0.143547 -0.0317856 0.00499135 0.00316301 -0.0266339 -0.0575413 0.0540023 -0.00307819 0.0929652 -0.0561283 0.036188 0.00549874 -0.034216 -0.117958 0.0416598 0.102031 0.0114597 0.0214021 -0.0154133 0.109505 -0.128503 -0.0665272 -0.0538171 -0.0453761 -0.113264 -0.0541955 0.0540718 0.0460747 -0.0396239 0.00902143 0.000777303 0.00349436 0.071027 -0.121818 0.118159 -0.102948 0.161368 0.00408838 -0.0554871 0.0636687 0.120526 -0.101467 -0.00721102 0.0529435 0.0902909 -0.0760159 -0.0366236 0.0816662 0.164226 0.0301189 -0.0640524 -0.0622222 0.0576244 -0.154284 0.0905164 -0.0568394 0.033254 
0.0558476 0.0311289 -0.11105 -0.0215925 0.0921374 0.199686 0.0638735 -0.0372183 -0.0549167 -0.0443734 0.0567903 0.100485 0.0920973 -0.125902 -0.0848435 -0.0540044 -0.151729 0.0448595 -0.122234 0.122613 0.148916 -0.10584 0.0229031 0.163713 0.0150872 -0.0292678 -0.04276 -0.186516 0.0568516 0.0821865 0.0305391 -0.00415151 -0.129168 0.0606713 -0.0325625 0.0269298 -0.141413 0.0139456 -0.0501819 -0.0188403 0.0854057 -0.0960726 -0.047931 0.195735 -0.147728 -0.0751986 0.150708 0.0554607 -0.129511 0.0514647 -0.011648 -0.0496383 -0.0851113 -0.040417 0.08478 0.0392573 -0.0927669 0.232334 -0.00730968 -0.122557 -0.0704011 0.0303156 0.285959 -0.0507865 0.0251173 -0.0737325 0.0117656 -0.0148374 -0.0691176 0.0876115 -0.0158987 0.11605 -0.0258047 0.0278019 0.00519684 -0.0302807 -0.0607481 0.0584833 0.0123962 0.0966569 -0.0466758 0.036127 0.000535252 -0.044801 -0.114556 0.0364798 0.107579 0.0177424 0.0167089 0.00491213 0.122499 -0.1439 -0.0658034 -0.0534944 -0.0590241 -0.100465 -0.0404817 0.0611131 0.0428095 -0.049822 0.00314866 0.0140567 -0.00913899 0.097069 -0.117326 0.0945148 -0.119044 0.176035 -0.021088 -0.0553396 0.0694762 0.137096 -0.100578 0.00134011 0.0342724 0.0836703 -0.0791658 -0.0636813 0.0671728 0.162305 0.028285 -0.0443252 -0.0402284 0.0631679 -0.138206 0.066025 -0.0548302 0.0118531 
0.0373483 0.0169617 -0.120155 -0.0111983 0.103239 0.191134 0.051038 -0.0366916 -0.0499155 -0.02836 0.0615304 0.116461 0.0877672 -0.131861 -0.114518 -0.0429489 -0.14808 0.0746586 -0.100375 0.114706 0.173674 -0.128823 0.0149038 0.168162 0.0337198 -0.0246014 -0.0411366 -0.191703 0.063944 0.0921567 0.0404987 -0.0111809 -0.121334 0.0378008 -0.0340317 0.0218074 -0.163604 -0.0206642 -0.0338745 -0.0304876 0.087065 -0.0878097 -0.0414171 0.207026 -0.141157 -0.109853 0.150997 0.0459342 -0.104479 0.020216 -0.0083973 -0.0488815 -0.0801169 -0.0563526 0.07535 0.0519443 -0.0761068 0.221845 -0.0094731 -0.119872 -0.0580783 0.0217084 0.287001 -0.0285843 0.0228307 -0.0820721 -0.00240865 -0.0220585 -0.0527146 0.0861699 -0.0140705 0.12868 -0.033866 0.000767579 -0.00780253 -0.0231474 -0.0614321 0.0777441 -0.000861792 0.0946565 -0.0694482 0.0487813 0.0221397 -0.0157918 -0.115233 0.0458004 0.117769 0.0363889 0.024845 -0.0249415 0.0976617 -0.118598 -0.0727682 -0.0424019 -0.051804 -0.113117 -0.0564285 0.0741831 0.0233315 -0.0481409 0.0142723 0.00450575 0.000357087 0.0883201 -0.093733 0.0994107 -0.101878 0.164575 -0.0155111 -0.0491086 0.048074 0.113647 -0.0966297 -0.00277708 0.0392158 0.0877469 -0.0787444 -0.055447 0.0659152 0.157577 0.0199495 -0.047128 -0.0599495 0.0289806 -0.164263 0.090141 -0.0644235 0.0350751 
0.0318929 0.0242773 -0.108788 -0.00662967 0.101165 0.195763 0.0567759 -0.0357692 -0.0393544 -0.0185867 0.0660362 0.106873 0.0873832 -0.127305 -0.0992589 -0.0434299 -0.148254 0.0797074 -0.101096 0.105324 0.176811 -0.137689 0.0137407 0.173795 0.04419 -0.0359215 -0.052396 -0.191395 0.0709012 0.0913121 0.0552968 -0.00744087 -0.119018 0.0391327 -0.0285313 0.0279725 -0.160826 -0.0204871 -0.0319824 -0.0359674 0.0911199 -0.0925919 -0.0417713 0.198772 -0.138084 -0.120145 0.14508 0.0471139 -0.103738 0.0105888 -0.0136038 -0.048949 -0.076898 -0.0614001 0.0727533 0.0638558 -0.0814499 0.22239 -0.0135306 -0.121991 -0.0656835 0.0200728 0.28306 -0.0411763 0.0285693 -0.0627425 -0.0019041 -0.0268209 -0.0649904 0.0931887 -0.0160256 0.133387 -0.0414518 -0.00213981 -0.00496595 -0.0290228 -0.0565365 0.0789108 0.00244781 0.0886154 -0.0781559 0.0487873 0.0205695 -0.017648 -0.112838 0.0449171 0.115006 0.034848 0.027568 -0.0211465 0.101402 -0.120426 -0.0663727 -0.0451073 -0.0496747 -0.113997 -0.0621872 0.075841 0.0236207 -0.0402481 0.0182825 -0.00176564 -0.00197074 0.0802468 -0.0869878 0.10707 -0.0944453 0.152491 -0.00481905 -0.0523024 0.0347611 0.114192 -0.0963707 -0.00866679 0.0523466 0.0856036 -0.0747027 -0.0540732 0.0709621 0.165295 0.0282383 -0.0536814 -0.065882 0.0369123 -0.16381 0.0954949 -0.0570675 0.0394477 
0.0325915 0.0153649 -0.12072 -0.0179106 0.108642 0.200193 0.0458399 -0.0370101 -0.0506206 -0.0284655 0.047979 0.111252 0.0866554 -0.138465 -0.101249 -0.0479279 -0.148564 0.0827201 -0.095279 0.112407 0.168084 -0.118171 0.0279609 0.169691 0.0272531 -0.0330076 -0.0435947 -0.206786 0.0535416 0.0872797 0.0495967 -0.022509 -0.11806 0.0358926 -0.0151751 0.0280888 -0.155249 -0.0277999 -0.0464132 -0.0304877 0.0861339 -0.0843076 -0.0429051 0.216767 -0.153767 -0.0962048 0.156881 0.0544371 -0.106228 0.0294197 -0.00758662 -0.0659867 -0.0729877 -0.0609211 0.0719594 0.0533445 -0.068755 0.217587 0.000489859 -0.121622 -0.0582409 0.0313371 0.278759 -0.0372038 0.0369431 -0.103769 -0.00299924 -0.0215304 -0.0526053 0.0937447 -0.0112059 0.128128 -0.0337344 -0.0130079 -0.0163437 -0.0185639 -0.0761328 0.0854755 0.00442248 0.0905605 -0.0675348 0.051795 0.0108708 -0.0111524 -0.115522 0.0455189 0.114032 0.033431 0.0156738 -0.0171849 0.0988487 -0.112405 -0.0708997 -0.0554805 -0.052077 -0.107887 -0.0597238 0.0844992 0.0151358 -0.0463448 0.0195896 0.00814027 0.0010228 0.0758734 -0.0929221 0.0874278 -0.105443 0.154454 -0.0236432 -0.0284963 0.0502462 0.10912 -0.0871886 -0.0111745 0.0257785 0.0919476 -0.080711 -0.0646474 0.053997 0.158881 0.0260676 -0.0488536 -0.0603657 0.0332621 -0.165447 0.082612 -0.0726768 0.0332799 
0.0384542 0.00996711 -0.118402 -0.0131284 0.108371 0.194549 0.0570731 -0.0253437 -0.0402153 -0.0259184 0.0604356 0.11933 0.0864755 -0.125207 -0.107733 -0.0532214 -0.1379 0.0786309 -0.101434 0.115905 0.170297 -0.13404 0.0215598 0.181339 0.0324092 -0.0401421 -0.0376033 -0.187278 0.0609044 0.084781 0.0456671 -0.0233382 -0.115502 0.0428175 -0.0368855 0.0254499 -0.163194 -0.0208261 -0.0506731 -0.0342214 0.0855953 -0.0818712 -0.0490866 0.202058 -0.145092 -0.116166 0.140099 0.0499986 -0.0988111 0.0303868 -0.0140304 -0.0538385 -0.0797618 -0.0625147 0.0733856 0.0606115 -0.083576 0.229122 -0.013552 -0.115478 -0.0619715 0.0257673 0.286032 -0.041383 0.026533 -0.0811776 -0.00830414 -0.0213588 -0.0671391 0.0976819 -0.0131263 0.127867 -0.0392015 -0.00272405 -0.0133201 -0.0189832 -0.0497358 0.080021 0.00517941 0.0806115 -0.0856431 0.0455523 0.0181188 -0.0190671 -0.110819 0.0399769 0.115744 0.0391348 0.0300654 -0.016946 0.102692 -0.122803 -0.0660307 -0.0432206 -0.0364186 -0.112782 -0.0616647 0.0686662 0.0199972 -0.0425919 0.0178617 0.00186907 -0.00630083 0.0786112 -0.0927476 0.103086 -0.10206 0.141391 -0.016356 -0.0498315 0.0467556 0.116833 -0.0823412 -0.000661694 0.0428179 0.0890433 -0.0692939 -0.0553878 0.0681883 0.169975 0.0182122 -0.0520012 -0.069415 0.0360629 -0.16433 0.0924158 -0.0634866 0.0303597 
0.0342177 0.0373399 -0.108907 -0.0101012 0.090309 0.197463 0.0723354 -0.0444369 -0.0365798 -0.0330437 0.0598027 0.100923 0.0787227 -0.128704 -0.090006 -0.0635179 -0.171907 0.0528357 -0.106734 0.101783 0.149666 -0.122416 0.000544428 0.162115 0.0361008 -0.0373421 -0.0532643 -0.181082 0.0620507 0.0911156 0.0479175 -0.0120767 -0.135573 0.0381216 -0.0235073 0.03205 -0.157306 -0.0221006 -0.039136 -0.0221602 0.100601 -0.101373 -0.0459938 0.202569 -0.141741 -0.0913976 0.141136 0.0517695 -0.112283 0.0228147 -0.0253833 -0.0407724 -0.0746908 -0.0577755 0.0775416 0.0579232 -0.106736 0.234973 -0.0160751 -0.113012 -0.0717584 0.0288766 0.290816 -0.0436238 0.0234049 -0.0589082 0.0149757 -0.0338406 -0.067974 0.0861601 -0.0120257 0.13108 -0.0262594 0.0199841 0.00300883 -0.0270344 -0.0633847 0.0574168 0.00450641 0.0965796 -0.0589638 0.0384248 0.00872509 -0.0267349 -0.116014 0.0415713 0.109278 0.0181751 0.020837 -0.00909424 0.116082 -0.131219 -0.0594053 -0.057625 -0.0588579 -0.113396 -0.0502706 0.05288 0.0463324 -0.0433836 0.00474366 0.00730679 0.000485382 0.0721546 -0.109156 0.108968 -0.0975707 0.173306 -0.0214803 -0.0386234 0.0648631 0.113907 -0.103032 -0.0113112 0.0364831 0.084201 -0.0693447 -0.0476269 0.0796823 0.157889 0.0340579 -0.0593359 -0.0572995 0.0532506 -0.15137 0.0827938 -0.0572608 0.0309432 
0.0313928 0.0319211 -0.102194 -0.0152549 0.0842065 0.211695 0.0648368 -0.0476351 -0.0309122 -0.0362285 0.0536025 0.093947 0.073301 -0.141225 -0.0737523 -0.0725666 -0.189427 0.0535365 -0.0956513 0.0896411 0.144132 -0.102138 -0.000498752 0.161946 0.0334655 -0.033773 -0.0529446 -0.196308 0.0513277 0.0879275 0.0596351 -0.0241532 -0.137104 0.0362676 9.84334e-05 0.0386993 -0.147797 -0.0385605 -0.0361934 -0.0196981 0.106787 -0.107539 -0.0502222 0.213012 -0.147212 -0.0915293 0.142979 0.0601713 -0.108965 0.0286543 -0.0284 -0.0518681 -0.0601891 -0.0557949 0.0783269 0.0596094 -0.102878 0.227613 -0.0154377 -0.118177 -0.0737774 0.033376 0.288687 -0.0431567 0.0261126 -0.0673532 0.0274309 -0.0401931 -0.0595891 0.0880758 -0.0151385 0.128673 -0.0258626 0.0119281 1.20067e-05 -0.0323152 -0.0834926 0.0528491 0.00962681 0.108818 -0.0450905 0.0448553 0.00730981 -0.0235053 -0.113096 0.0396186 0.111557 0.0141417 0.0138142 -0.00103251 0.124982 -0.123275 -0.056474 -0.0629615 -0.0732498 -0.112252 -0.0550638 0.0551487 0.0456378 -0.0435523 0.0123962 0.0105659 0.00175401 0.0511564 -0.10448 0.100215 -0.093266 0.162765 -0.034554 -0.0139649 0.0729768 0.105914 -0.101435 -0.0271081 0.0280239 0.0895215 -0.0674681 -0.0540462 0.0715071 0.148745 0.0531446 -0.0688129 -0.050737 0.0508363 -0.152416 0.0773379 -0.0522037 0.040748 
0.0437082 0.0333278 -0.120659 -0.0149617 0.108522 0.204627 0.0731298 -0.0494833 -0.0397638 -0.0267009 0.05807 0.0962225 0.0777532 -0.114209 -0.0763639 -0.0620914 -0.154321 0.0604657 -0.0921945 0.0962125 0.148163 -0.110222 0.00113956 0.163889 0.0453384 -0.0412684 -0.0542276 -0.179942 0.0696511 0.0972977 0.0565117 -0.0161238 -0.140292 0.0286733 -0.0128111 0.0423316 -0.157474 -0.0385414 -0.0311905 -0.0283711 0.0949838 -0.082478 -0.0462613 0.207886 -0.146636 -0.0848931 0.138853 0.0629087 -0.103773 0.016536 -0.0288472 -0.0407102 -0.0714099 -0.0700671 0.0736026 0.0588738 -0.110199 0.250892 -0.0150116 -0.105887 -0.0754674 0.0341781 0.297354 -0.0507008 0.0245216 -0.0587253 0.011554 -0.0257504 -0.0658781 0.0881566 -0.00204187 0.145446 -0.027262 0.00705725 -0.011065 -0.026211 -0.0630028 0.0587045 0.00539583 0.0865411 -0.0500045 0.0511954 0.00272288 -0.0284791 -0.108941 0.0314365 0.104068 0.0167356 0.0196901 -0.00947836 0.123402 -0.117567 -0.0655071 -0.0578673 -0.0448616 -0.116218 -0.0484666 0.054623 0.0380451 -0.0423309 0.00415899 0.00746528 0.00647437 0.0560388 -0.128644 0.117229 -0.0982518 0.1524 -0.0123702 -0.0244145 0.0784338 0.106657 -0.0977765 -0.010024 0.0372324 0.0848405 -0.0658994 -0.0505556 0.0700838 0.154995 0.0349393 -0.0640021 -0.0548014 0.0547783 -0.162354 0.0823867 -0.0602643 0.0292521 
0.041236 0.0576155 -0.127473 -0.0223007 0.0912726 0.197881 0.0703482 -0.0458628 -0.0385453 -0.0109212 0.0737663 0.081289 0.0872178 -0.108834 -0.0789037 -0.0492462 -0.150254 0.0446113 -0.102938 0.0901522 0.14418 -0.118111 0.0115208 0.142575 0.0423219 -0.0277281 -0.0427462 -0.17556 0.0882584 0.0884872 0.0589972 -0.00452226 -0.130645 0.02351 -0.0315177 0.0355507 -0.159928 0.00472979 -0.027848 -0.0127176 0.0774559 -0.0870561 -0.065352 0.211276 -0.139533 -0.0760541 0.134355 0.0590029 -0.11668 0.00346265 -0.0266612 -0.0127734 -0.089384 -0.0709106 0.0562003 0.055575 -0.103492 0.25032 -0.0069692 -0.1096 -0.0856214 0.0105836 0.305019 -0.0480323 0.0281305 -0.0555114 0.0156278 -0.00902681 -0.0590252 0.0946531 -0.0037407 0.14138 -0.0266135 0.0160188 0.00157327 -0.0436626 -0.0666537 0.0651041 -0.00715852 0.090582 -0.0577786 0.0353303 -0.00128185 -0.0371319 -0.11242 0.022725 0.104752 0.00875453 0.0273248 -0.0239812 0.110476 -0.124808 -0.0674392 -0.0593413 -0.032645 -0.122979 -0.0370201 0.0558804 0.0448584 -0.0430439 -0.00850014 0.0093962 0.00373594 0.0757154 -0.131843 0.113116 -0.102056 0.165929 0.0179862 -0.0567152 0.0723947 0.127931 -0.106424 0.000522006 0.0539153 0.0772586 -0.0780587 -0.057446 0.0878109 0.155622 0.0321011 -0.0578657 -0.05394 0.0659364 -0.145726 0.0724828 -0.0564346 0.0329382 
0.0424565 0.0451885 -0.1196 -0.0316902 0.0703494 0.189993 0.0661972 -0.0065848 -0.0340483 -0.0151168 0.0859529 0.109682 0.0911688 -0.127615 -0.109406 -0.0807461 -0.131485 0.0280727 -0.121139 0.141004 0.119954 -0.10994 0.00332496 0.164679 -0.00596972 -0.0169597 -0.0140452 -0.147073 0.0854841 0.0544447 0.0261568 -0.032394 -0.110823 0.0589822 -0.0684468 0.028042 -0.139677 0.0347418 -0.0687253 -0.00332423 0.0813962 -0.100791 -0.0859015 0.193741 -0.147533 -0.101872 0.126876 0.0598219 -0.115898 0.0559247 -0.0282561 -0.000512238 -0.115667 -0.0397135 0.0763844 0.0449033 -0.115744 0.224999 -0.027693 -0.11145 -0.0896045 0.00712469 0.308781 -0.0450355 0.0119644 -0.073388 0.0269233 -0.0223406 -0.0701078 0.0949776 -0.0142929 0.101145 -0.0198569 0.0684032 0.0253903 -0.0453017 -0.0401324 0.0911752 0.0133969 0.0677188 -0.0801171 0.0290232 0.0175221 -0.0371305 -0.0906922 0.0249581 0.117827 0.0403369 0.0588237 -0.00675033 0.118546 -0.152863 -0.0489674 -0.0309261 -0.024416 -0.136315 -0.0302492 0.0239093 0.0337996 -0.0546637 -0.00700742 0.0270786 -0.0232457 0.0900794 -0.117789 0.120805 -0.0972379 0.147907 -0.00269535 -0.0690885 0.0744209 0.151245 -0.082058 0.0287015 0.0366173 0.0609122 -0.0565995 -0.071121 0.0901713 0.158267 0.00953079 -0.0567114 -0.0478813 0.0631973 -0.133847 0.0763756 -0.0450221 0.0156588 
0.0303537 0.0213938 -0.105057 -0.00632215 0.0838415 0.198012 0.0675877 -0.0366814 -0.0360304 -0.0207269 0.0701058 0.104346 0.0676467 -0.116 -0.0874111 -0.0654666 -0.16718 0.0598061 -0.0736666 0.0888001 0.154184 -0.126595 0.000369219 0.170219 0.0446378 -0.0236858 -0.0379602 -0.185972 0.0714175 0.0859546 0.0522658 -0.0365961 -0.125215 0.0196757 -0.0217125 0.0388904 -0.17042 -0.025622 -0.039903 -0.0261075 0.0859441 -0.0865144 -0.0657419 0.210009 -0.14084 -0.107376 0.137162 0.0390446 -0.103544 0.00669021 -0.0301905 -0.033536 -0.0699754 -0.0651412 0.0811192 0.0708753 -0.101159 0.249767 -0.0241056 -0.107806 -0.0715825 0.0163087 0.310405 -0.0383634 0.0375995 -0.0514242 0.012103 -0.0389525 -0.0623291 0.104282 -0.00855174 0.140652 -0.0310503 0.0108226 -0.000903724 -0.0348565 -0.0609338 0.0656761 0.00413505 0.0838037 -0.077046 0.0430069 0.0105466 -0.0339432 -0.11216 0.0214242 0.113289 0.0272449 0.0309503 -0.0204749 0.114073 -0.111819 -0.057121 -0.0512481 -0.0385274 -0.121038 -0.0460551 0.0512688 0.0497292 -0.034127 0.00317382 0.00651523 -0.000924491 0.0385848 -0.110829 0.124107 -0.0811953 0.133103 -0.00955618 -0.0484903 0.0636939 0.115408 -0.0848922 -0.0273751 0.0621256 0.0914496 -0.0543643 -0.0528875 0.0849037 0.153423 0.0303585 -0.0771231 -0.0614698 0.0360372 -0.155146 0.110263 -0.0369438 0.0480144 
0.0365475 0.0300953 -0.113103 -0.0133749 0.0948405 0.196657 0.0750746 -0.0346427 -0.0246911 -0.0159247 0.074748 0.0909007 0.0785709 -0.0955168 -0.0753478 -0.0651689 -0.15197 0.0474866 -0.0964529 0.0968098 0.145055 -0.137503 0.017938 0.149702 0.0462639 -0.0358752 -0.0457773 -0.172111 0.0720526 0.0698197 0.0649047 -0.02573 -0.119223 0.0260111 -0.0320048 0.0465541 -0.163898 0.0105171 -0.0464447 -0.0311424 0.0854536 -0.076247 -0.0759127 0.196669 -0.149094 -0.0988453 0.118278 0.0504438 -0.0993894 0.0101497 -0.0478982 -0.0250501 -0.0836079 -0.0668823 0.0743484 0.0627681 -0.111452 0.255823 -0.0269332 -0.109055 -0.086747 0.0129074 0.310621 -0.0539908 0.0413185 -0.0312743 0.00779117 -0.00479939 -0.0683275 0.109332 0.00601559 0.146242 -0.0282884 0.0155186 0.00358408 -0.0336714 -0.0565226 0.057314 0.00416952 0.0715518 -0.0877458 0.0344833 0.00394895 -0.0422966 -0.113682 0.0151636 0.11131 0.0341621 0.0399902 -0.0218575 0.122427 -0.127636 -0.0507079 -0.0587305 -0.0254154 -0.130922 -0.0437765 0.045182 0.0442174 -0.0332545 -0.00464734 0.000625813 -0.00265233 0.0436455 -0.119818 0.132022 -0.0907489 0.133484 0.0161695 -0.0613596 0.0623722 0.130418 -0.0868675 -0.00253917 0.0754844 0.0816871 -0.0648103 -0.0507959 0.0924971 0.164214 0.0296332 -0.0667405 -0.06113 0.0619754 -0.141068 0.0939164 -0.0362061 0.0424241 
0.0240346 0.0630443 -0.147382 -0.0128832 0.0811036 0.177045 0.0656765 -0.068081 -0.0354179 0.0142517 0.0731774 0.0572023 0.0872279 -0.0677706 -0.0702761 -0.0351482 -0.158266 0.0493024 -0.0690986 0.0862489 0.141525 -0.150471 0.0381016 0.104309 0.0531211 -0.01976 -0.0467291 -0.189618 0.0909349 0.102142 0.0530558 0.00836301 -0.102821 -0.0158145 -0.0155187 0.0511886 -0.162735 0.0436488 -0.0357967 -0.041151 0.0432603 -0.0777639 -0.0696327 0.216433 -0.149599 -0.0484726 0.140906 0.0542272 -0.119024 -0.0243816 -0.0486272 -0.00210852 -0.0678936 -0.0743991 0.0699949 0.062276 -0.0864646 0.242556 0.00260931 -0.121227 -0.0857667 -0.00530193 0.320988 -0.0472949 0.0613512 -0.0235761 -0.000329905 0.00913991 -0.0465767 0.107325 0.00549811 0.149387 -0.0281346 -0.00864675 0.000477761 -0.0417674 -0.0718094 0.054344 -0.0116678 0.06716 -0.0659556 0.032653 -0.0401536 -0.0529934 -0.117928 0.0110237 0.0763289 0.0130969 0.0506112 -0.0251169 0.107453 -0.106158 -0.0667858 -0.078795 -0.0199111 -0.131161 -0.0323799 0.0840206 0.0744303 -0.0423171 0.00102197 0.00302329 0.022672 0.0292349 -0.145995 0.126614 -0.0887648 0.148211 0.054315 -0.0591739 0.0605906 0.132901 -0.0984974 -0.0267297 0.0790844 0.0807622 -0.0728484 -0.0665212 0.0989587 0.145254 0.0295989 -0.0666451 -0.0429652 0.0675352 -0.141341 0.0908291 -0.0278883 0.0490841 
0.0309026 0.0181913 -0.135522 -0.0043693 0.100253 0.169887 0.0647348 -0.0589521 -0.0274683 -0.0176541 0.0686373 0.100106 0.080346 -0.0827932 -0.100876 -0.0445634 -0.158385 0.0565291 -0.0865572 0.112607 0.155567 -0.152009 0.0348374 0.137942 0.0439273 -0.0218239 -0.0406001 -0.190077 0.0664338 0.0944476 0.0437872 -0.0100647 -0.105823 0.00452888 -0.0290563 0.0447236 -0.173098 0.0275156 -0.0476668 -0.0422844 0.0616503 -0.0654635 -0.0732425 0.204172 -0.149847 -0.0753217 0.134577 0.0441367 -0.0951739 0.00197959 -0.0489643 -0.0268205 -0.0713791 -0.0659052 0.0876199 0.0547041 -0.0885258 0.247518 -0.0182782 -0.108414 -0.0693989 0.00380559 0.317673 -0.0349018 0.052013 -0.0482601 -0.00792624 0.00717833 -0.0489835 0.104854 0.00870646 0.146927 -0.0268375 -0.00251277 -0.00563098 -0.0224257 -0.0600844 0.0597256 -0.00762644 0.0692226 -0.0813359 0.0407027 -0.0181477 -0.0434301 -0.123781 0.0188868 0.099107 0.0382697 0.0389089 -0.034425 0.109473 -0.112883 -0.059225 -0.0633128 -0.0258331 -0.128125 -0.0469141 0.0629393 0.0664156 -0.0415486 0.00507049 -0.00900565 0.00647662 0.0398854 -0.121196 0.122445 -0.0927566 0.142458 0.0232633 -0.0561683 0.0545717 0.130766 -0.0871019 -0.0127888 0.0708452 0.0955052 -0.0734314 -0.0536675 0.0845206 0.156657 0.0147041 -0.0500264 -0.0571945 0.0518005 -0.154059 0.104752 -0.0430485 0.0434227 
0.0491574 -0.0282695 -0.105634 -0.00321057 0.125753 0.174149 0.0713573 -0.0292522 -0.00678653 -0.0647958 0.0475597 0.12402 0.0766655 -0.0959748 -0.110118 -0.0769312 -0.132017 0.0788063 -0.128307 0.125976 0.164824 -0.130816 0.0355883 0.200784 0.0251736 -0.0669658 -0.0487474 -0.180195 0.0338604 0.0677562 0.0527161 -0.0309976 -0.122204 0.0451744 -0.0361258 0.0360162 -0.168943 -0.00293589 -0.0871116 -0.0406854 0.088219 -0.0393925 -0.0818814 0.189079 -0.147185 -0.109288 0.106414 0.0605536 -0.0618281 0.0471177 -0.0454135 -0.0648222 -0.0614322 -0.0681123 0.0841137 0.0473433 -0.0872972 0.249304 -0.0144586 -0.111204 -0.0544227 0.05051 0.27468 -0.0276037 0.0118956 -0.0822238 0.000256993 -0.000631441 -0.0582809 0.107227 0.00645506 0.126628 -0.0151914 0.00134081 -0.0316696 -0.0120391 -0.0539329 0.0586668 0.0104451 0.0654584 -0.0856101 0.0616878 -0.00549115 -0.0470464 -0.102022 0.0276894 0.11607 0.0554582 0.00895245 -0.0231558 0.13198 -0.11641 -0.0433185 -0.0630157 -0.0294502 -0.110538 -0.0711756 0.0406331 0.0313229 -0.0368694 0.0253271 -0.010586 -0.00522885 0.0622671 -0.0996627 0.094894 -0.112882 0.111512 -0.012893 -0.0345056 0.0689553 0.134131 -0.0759562 0.00453544 0.0349516 0.107702 -0.07142 -0.0542158 0.0566781 0.164691 -0.000360897 -0.0261964 -0.0871187 0.0470603 -0.172004 0.0892438 -0.0807025 0.0164688 
0.0541427 -0.0231942 -0.14035 -0.00164489 0.136265 0.144706 0.0491646 -0.0418622 -0.0169201 -0.0638535 0.0543038 0.133378 0.0802066 -0.076135 -0.138005 -0.047463 -0.105254 0.0664348 -0.12566 0.15802 0.163959 -0.143874 0.0622574 0.166316 0.0266082 -0.0349576 -0.0223765 -0.174942 0.0387115 0.0719556 0.0343535 -0.0069797 -0.0924444 0.0363325 -0.0642752 0.0320943 -0.166597 0.0514123 -0.0826821 -0.0466576 0.0650733 -0.0239394 -0.0780701 0.189012 -0.153047 -0.0863538 0.122221 0.0468761 -0.061151 0.0427826 -0.0412536 -0.0403326 -0.0757792 -0.0589888 0.0961941 0.0270245 -0.0677148 0.237836 -0.00804419 -0.116385 -0.0590238 0.0172074 0.28793 -0.0189758 0.0193472 -0.0890753 -0.0165471 0.038543 -0.0369105 0.109952 0.0181927 0.127253 -0.0156039 0.000826731 -0.019083 -0.00727036 -0.0503934 0.072656 -0.0118752 0.0592523 -0.0938991 0.0678186 -0.00662445 -0.0500675 -0.10425 0.0218387 0.110684 0.0776978 0.0251318 -0.0431452 0.109434 -0.115555 -0.060942 -0.0539005 -0.00674793 -0.119553 -0.0553605 0.0544795 0.0333619 -0.0623421 0.00640112 -0.0163503 0.0023901 0.0869463 -0.117275 0.0942241 -0.124914 0.126362 0.0186819 -0.0664298 0.0608447 0.154749 -0.0828749 0.0322851 0.0481792 0.0931497 -0.0895759 -0.0730302 0.0629243 0.162487 -0.0173497 0.010272 -0.0699492 0.04407 -0.159438 0.0840704 -0.0673686 0.0157705 
0.043594 -0.0329213 -0.136803 -0.0065245 0.131502 0.142049 0.0330517 -0.0435686 0.00833775 -0.0888434 0.0509191 0.136923 0.0635016 -0.0640187 -0.137552 -0.0456937 -0.114567 0.0446458 -0.128532 0.148637 0.157878 -0.133932 0.0668312 0.155742 0.0332473 -0.0242257 0.000346792 -0.171393 0.0214541 0.0565747 0.0537058 -0.0152445 -0.0828084 0.0338182 -0.0680273 0.0482993 -0.165505 0.0654477 -0.0870889 -0.0360537 0.0705113 -0.00862179 -0.0862335 0.186623 -0.140996 -0.0793241 0.115344 0.0338364 -0.0552818 0.039247 -0.0622274 -0.0449241 -0.0649359 -0.0570799 0.100866 0.0327257 -0.0771394 0.247667 -0.0156635 -0.120515 -0.0671345 0.0110649 0.292791 -0.0184055 0.0222958 -0.0820945 -0.0108805 0.0601054 -0.0240654 0.124323 0.0283548 0.125161 -0.0126758 -0.0088008 -0.00991233 -0.00363932 -0.0620291 0.0619771 -0.0263565 0.0587116 -0.0997037 0.0801561 -0.00832987 -0.0591701 -0.116047 0.0153653 0.114117 0.0844139 0.0159974 -0.048627 0.110367 -0.1228 -0.054905 -0.0528031 0.00831266 -0.10593 -0.056397 0.040583 0.0397254 -0.06092 -0.0131941 -0.0351669 -0.00909791 0.0752659 -0.125399 0.0927453 -0.135106 0.108032 0.0041321 -0.0757844 0.0640689 0.161966 -0.0833862 0.0379505 0.0568601 0.0913771 -0.10447 -0.0796285 0.0699516 0.1565 -0.00576751 0.0265001 -0.0656342 0.0459231 -0.148805 0.0805112 -0.0635717 0.0174187 
0.0459601 -0.0267728 -0.139887 -0.00530635 0.134001 0.141152 0.0277063 -0.0461441 0.00220646 -0.0843676 0.0555564 0.134967 0.0664412 -0.0663375 -0.133804 -0.0415046 -0.104475 0.0451719 -0.1275 0.159905 0.154092 -0.130043 0.0638539 0.158962 0.0321457 -0.0230138 0.000527854 -0.170085 0.0225751 0.0580194 0.053726 -0.0151634 -0.082519 0.035315 -0.0673705 0.0563913 -0.160121 0.0614582 -0.0894595 -0.0369774 0.0694678 -0.0101071 -0.0814078 0.189416 -0.140339 -0.0715466 0.123868 0.0413109 -0.0599546 0.0423555 -0.0575069 -0.0444594 -0.0728633 -0.059592 0.104564 0.0304047 -0.0858553 0.242689 -0.0095227 -0.119393 -0.0701314 0.00879657 0.290851 -0.0232461 0.0219192 -0.0890911 -0.00945102 0.0597758 -0.0248709 0.120682 0.0311241 0.126274 -0.0115354 -0.00997123 -0.00940838 -0.00469594 -0.0611984 0.0772186 -0.024979 0.0592418 -0.0934046 0.0825043 -0.0128425 -0.0601985 -0.115968 0.0193792 0.110315 0.0823429 0.0169013 -0.0435266 0.108397 -0.120153 -0.0588354 -0.0506697 0.00691795 -0.106099 -0.0536411 0.0384052 0.0353203 -0.0708596 -0.0170295 -0.032171 -0.00885833 0.072987 -0.13144 0.0963185 -0.13595 0.109878 0.0070947 -0.0702111 0.0635803 0.161696 -0.0843039 0.0412222 0.0525837 0.0843615 -0.10608 -0.087676 0.0618548 0.155784 -0.00751624 0.0307873 -0.0607185 0.0558636 -0.149727 0.0775772 -0.0612613 0.0126335 
0.0462302 -0.0176227 -0.147733 -0.000483507 0.114643 0.145852 0.0237538 -0.0343327 0.0237016 -0.103799 0.0727274 0.133302 0.054835 -0.0789653 -0.157509 -0.0382954 -0.100008 0.0343622 -0.137124 0.151225 0.160544 -0.124756 0.0569454 0.150945 0.0263498 -0.0194945 0.0232777 -0.164846 0.0335635 0.0479823 0.0512606 -0.00512724 -0.0637472 0.0453497 -0.0812543 0.0461932 -0.139719 0.079143 -0.0908732 -0.0354267 0.0787638 -0.0177764 -0.0824633 0.180654 -0.133695 -0.0854473 0.121021 0.0218632 -0.0715401 0.0349172 -0.0712328 -0.0285003 -0.0661047 -0.0435843 0.100485 0.0366779 -0.0777772 0.226571 -0.0257923 -0.13035 -0.0838378 -0.00259652 0.303785 -0.0347855 0.0162574 -0.0692092 -0.00188641 0.0507116 -0.0211359 0.124363 0.0135337 0.0980175 -0.0180188 0.00278152 0.0138133 -0.0176757 -0.0520509 0.0801671 -0.0449686 0.0462875 -0.107196 0.0907214 -0.00541019 -0.0708458 -0.106799 0.0391757 0.106366 0.0817592 0.0133587 -0.0390304 0.122414 -0.144512 -0.0707242 -0.0465602 0.0276724 -0.101068 -0.052481 0.0348956 0.0380538 -0.0631782 -0.0218927 -0.0415019 -0.0097357 0.0883863 -0.124154 0.096759 -0.121771 0.111599 -0.00675875 -0.0958883 0.0560037 0.167984 -0.079788 0.0409854 0.0662848 0.0685995 -0.111188 -0.0986743 0.0918925 0.150099 -0.00120438 0.0332116 -0.0500118 0.0525535 -0.129121 0.0770937 -0.0477391 0.00958045 
0.0464364 -0.0222035 -0.148945 -0.0031931 0.116821 0.13317 0.0290146 -0.0394728 -0.0434822 -0.0512483 0.0484992 0.135447 0.0686489 -0.110368 -0.139479 -0.0265715 -0.125058 0.0551456 -0.10033 0.16375 0.153421 -0.132656 0.0618917 0.155131 0.0225015 0.004274 0.0029966 -0.205511 0.0335749 0.0666524 0.0172621 -0.0116061 -0.0911365 0.0248627 -0.0610298 0.0233482 -0.168634 0.0519305 -0.076863 -0.0316402 0.0562833 -0.039051 -0.0760226 0.217203 -0.149501 -0.0607253 0.156467 0.0352353 -0.0833935 0.0421549 -0.0181301 -0.0515576 -0.079068 -0.0580968 0.100493 0.016731 -0.0551994 0.223023 0.0110401 -0.120257 -0.0444935 -0.00278106 0.290225 0.003019 0.0324516 -0.119083 -0.016487 0.0277849 -0.00911266 0.0960987 0.00234361 0.13205 -0.0103902 0.00350869 -0.0154315 -0.0202831 -0.0698141 0.0962936 -0.0188609 0.0798725 -0.0770583 0.0655714 -0.0187218 -0.053962 -0.114778 0.0190157 0.11051 0.071145 0.0263866 -0.0585921 0.0886854 -0.0901604 -0.0809275 -0.0559276 -0.0168837 -0.101341 -0.0333611 0.0603312 0.0424663 -0.0802825 -0.0132592 -0.0231243 0.00702469 0.083454 -0.124348 0.0748568 -0.126401 0.147124 0.00636546 -0.0637787 0.0675444 0.167384 -0.0799048 0.0084693 0.0412339 0.0851074 -0.0978675 -0.090578 0.0527382 0.14064 -0.0167039 0.0214331 -0.0444354 0.0378532 -0.155176 0.0769115 -0.0655566 0.0115556 
0.0477061 -0.0329648 -0.127132 -0.00791541 0.130098 0.143773 0.0403591 -0.0414427 -0.0047231 -0.0831944 0.0463888 0.131508 0.0647743 -0.0862238 -0.125995 -0.0527773 -0.127763 0.0462024 -0.134255 0.154256 0.149512 -0.119288 0.0528506 0.164763 0.0215912 -0.0256269 -0.0134273 -0.178273 0.0198198 0.052435 0.0453893 -0.0271074 -0.103244 0.0357602 -0.0537761 0.0475184 -0.170448 0.0434227 -0.0978292 -0.0310743 0.0752638 -0.01574 -0.0913073 0.203783 -0.143653 -0.0638314 0.121177 0.0504645 -0.0630037 0.0497834 -0.053143 -0.057586 -0.075006 -0.065068 0.10018 0.0234699 -0.0927799 0.247559 -0.0054356 -0.114039 -0.0587922 0.0226474 0.285775 -0.00362639 0.0206665 -0.103515 -0.00261949 0.0437727 -0.0227875 0.109753 0.0286198 0.128749 0.00447226 -0.00244213 -0.0207413 -0.00900165 -0.0728393 0.0696748 -0.0137129 0.0694864 -0.0728186 0.0724829 -0.0205731 -0.0611732 -0.11668 0.0138137 0.117046 0.0725071 0.00885347 -0.0391643 0.11621 -0.11051 -0.060342 -0.0613178 -0.0145956 -0.10104 -0.050042 0.0276965 0.0398882 -0.0646189 -0.011768 -0.0251951 -0.00311291 0.0611997 -0.132143 0.0883152 -0.13613 0.121889 -0.00110611 -0.0519834 0.085735 0.160287 -0.0864318 0.027085 0.0401438 0.0940273 -0.101924 -0.0754237 0.0520969 0.146912 -0.0108915 0.0223857 -0.0623248 0.0550058 -0.150806 0.0739113 -0.0702969 0.00520994 
0.0271978 -0.00351602 -0.130054 -0.0287227 0.104309 0.153754 0.0236996 -0.0313485 -0.0339739 -0.0380799 0.0501199 0.109449 0.0718079 -0.103427 -0.0990265 -0.0543374 -0.152851 0.0410569 -0.0914289 0.143434 0.131621 -0.116209 0.0619427 0.145932 0.0213063 -0.000200905 0.000279635 -0.196566 0.0459922 0.0444356 0.0486194 -0.0482155 -0.0944903 0.0139242 -0.0413642 0.0464729 -0.165561 0.0466542 -0.0792548 -0.013006 0.0676241 -0.0468987 -0.100582 0.231242 -0.168443 -0.0589324 0.143416 0.0549192 -0.0791295 0.0409815 -0.0425551 -0.0401386 -0.0829491 -0.0623794 0.0865602 0.0282797 -0.070175 0.233465 0.0081656 -0.125516 -0.0680913 0.00356838 0.296811 0.0023633 0.035755 -0.109857 0.00705973 0.0249424 -0.00777485 0.11049 0.0128332 0.139702 -0.00405618 0.00625936 0.000426672 -0.031594 -0.0995653 0.0897533 -0.00192857 0.0860978 -0.0731975 0.0565935 -0.0121782 -0.0415877 -0.109975 0.00719595 0.116336 0.0701767 0.0323787 -0.0518739 0.103618 -0.0891654 -0.0583175 -0.0695025 -0.0255924 -0.129815 -0.0393322 0.063617 0.0393435 -0.0766474 -0.0179315 -0.0100827 0.00864193 0.0478664 -0.129294 0.09112 -0.120881 0.134257 0.0192106 -0.0491174 0.0834957 0.161076 -0.0852689 0.00940098 0.0348141 0.0881444 -0.0883445 -0.0916223 0.0577324 0.142292 0.00801608 -0.0101449 -0.0559743 0.0477987 -0.160691 0.0713421 -0.0602653 0.0405238 
0.0465634 0.00671362 -0.0969319 -0.0237236 0.088972 0.185028 0.0526019 -0.0081554 -0.0649942 -0.0566405 0.0394351 0.109606 0.0710979 -0.15356 -0.0938823 -0.0749283 -0.154652 0.0538401 -0.113368 0.129478 0.136443 -0.0959463 0.040937 0.179001 0.00446781 -0.0342179 -0.0245813 -0.205377 0.0430367 0.0460208 0.0297031 -0.0525695 -0.121618 0.0489068 -0.0294605 0.0121939 -0.161023 0.00920049 -0.0899137 -0.00969983 0.0808129 -0.0777006 -0.082477 0.225885 -0.16031 -0.0645267 0.148647 0.0517441 -0.123516 0.0691993 -0.0123214 -0.0638176 -0.0723028 -0.0604908 0.0706365 0.0301596 -0.0728302 0.22771 0.010581 -0.120561 -0.0567327 0.041354 0.272052 -0.0172944 0.0295504 -0.120483 0.0119491 -0.0261457 -0.0551715 0.0918827 -0.0146675 0.107443 -0.0108391 0.0220297 -0.00864256 -0.0324763 -0.0875861 0.0712857 0.0219475 0.107565 -0.063128 0.0287894 -0.00967102 -0.0495333 -0.105304 0.0235931 0.113726 0.0301244 0.00615058 -0.0127996 0.11598 -0.106446 -0.0667492 -0.0645106 -0.0525036 -0.0960002 -0.0341328 0.0539432 0.0265899 -0.0589834 0.000505565 0.0171433 -0.00534413 0.0784716 -0.115903 0.071361 -0.113488 0.160292 -0.0174896 -0.0446981 0.0982006 0.152994 -0.080996 -0.0143114 0.0165905 0.0944299 -0.08598 -0.0728593 0.0584106 0.15399 0.00436534 -0.0378326 -0.0625296 0.043511 -0.136543 0.0645094 -0.0650907 0.00114001 
0.0580597 -0.0128747 -0.127301 -0.0119384 0.100996 0.167403 0.0134824 -0.0363176 -0.0565296 -0.0813095 0.0409431 0.132261 0.0478052 -0.142061 -0.118867 -0.0345315 -0.127804 0.0591546 -0.096269 0.144759 0.144231 -0.0660596 0.0635255 0.175855 0.00728633 0.00910079 0.0264462 -0.224306 0.0275922 0.0593887 0.0194711 -0.0230053 -0.0943676 0.0473052 -0.0322874 0.0189482 -0.140009 0.0388561 -0.0771212 -0.0109194 0.0577865 -0.0448267 -0.0779513 0.232399 -0.15323 -0.0474538 0.176756 0.028627 -0.117199 0.0687481 0.00373595 -0.0663241 -0.0620965 -0.0483911 0.0942123 0.0198316 -0.0447049 0.222916 0.0172674 -0.128554 -0.0513724 0.00820513 0.288997 -0.0172749 0.0374526 -0.148494 0.00401484 0.000150036 -0.021381 0.118163 -0.0167009 0.101692 -0.0139161 0.00774417 -0.0149718 -0.0459195 -0.0897816 0.0936754 -0.0144299 0.0944509 -0.0511235 0.0806103 -0.0234987 -0.0760008 -0.10312 0.00526368 0.103839 0.042427 -0.0076214 -0.0217043 0.10709 -0.0955041 -0.0969021 -0.0549511 -0.0170157 -0.0692062 -0.0234156 0.0659811 0.0358789 -0.0745523 -0.0197657 -0.00422659 -0.00826208 0.090305 -0.127265 0.0497271 -0.127035 0.129064 -0.0257669 -0.0555137 0.094865 0.174129 -0.0742367 -0.00596299 0.0271014 0.0786046 -0.10159 -0.120424 0.0486992 0.133676 0.0117255 0.0145424 -0.026849 0.0292075 -0.128132 0.0577347 -0.0472665 -0.00861075 
0.0485845 -0.0354825 -0.126129 -0.0125676 0.112825 0.141126 0.00691479 -0.0454712 -0.0184124 -0.109896 0.0413327 0.143626 0.0571343 -0.104498 -0.14833 -0.0243635 -0.138473 0.0373879 -0.140469 0.1613 0.158442 -0.103856 0.0733757 0.152323 0.00840099 0.00617909 0.0210613 -0.194814 0.00172603 0.0501189 0.0223141 -0.00665609 -0.0838092 0.0545795 -0.0662765 0.030875 -0.158258 0.0739712 -0.0901171 -0.018043 0.0601665 -0.0300368 -0.0784576 0.197309 -0.129915 -0.0579503 0.145477 0.0248949 -0.0909918 0.0694535 -0.0303723 -0.0704491 -0.0664361 -0.0388464 0.106935 0.0129226 -0.0612272 0.22696 -0.00524219 -0.12736 -0.04745 0.0124338 0.285271 0.00248999 0.029039 -0.116274 -0.0121116 0.0504883 -0.0151885 0.116561 0.00275032 0.0994833 -0.00519395 0.00231596 -0.00467903 -0.0169061 -0.0724963 0.059746 -0.0301938 0.0836264 -0.064013 0.0728644 -0.0191847 -0.0716485 -0.133374 0.0192838 0.114011 0.0706674 -0.00157157 -0.0303205 0.104146 -0.123617 -0.0764048 -0.0431687 -0.0164314 -0.0649578 -0.0461249 0.0460448 0.0472284 -0.0688625 -0.0173881 -0.0342168 -0.0236704 0.0955781 -0.111911 0.0618931 -0.147658 0.136364 -0.0283098 -0.0827268 0.0745111 0.180875 -0.0841806 0.0267113 0.0396148 0.0893978 -0.118438 -0.0856499 0.0603314 0.144056 -0.0025603 0.0433057 -0.0357543 0.0343453 -0.124677 0.0658452 -0.057305 -0.00887807 
0.060114 -0.0474257 -0.130954 -0.00288 0.125276 0.138906 0.0087037 -0.0540233 -0.0253723 -0.120904 0.0233362 0.141357 0.0558661 -0.109343 -0.14833 -0.0201869 -0.130749 0.0371603 -0.142098 0.174128 0.160077 -0.107922 0.0828793 0.145102 0.00852157 0.0037004 0.0024347 -0.206358 -0.0139725 0.049291 0.0218905 0.00946998 -0.0940826 0.0622875 -0.0561145 0.0303116 -0.149816 0.080175 -0.0868364 -0.040016 0.0601937 -0.0249653 -0.0667556 0.189512 -0.129249 -0.050452 0.147977 0.0321617 -0.0833942 0.081668 -0.0285313 -0.0843686 -0.0575258 -0.0341757 0.11667 -0.00527791 -0.0513012 0.216866 0.00308086 -0.134931 -0.03474 0.0225836 0.273992 -0.00348822 0.0339613 -0.12396 -0.0157902 0.0549216 -0.0114765 0.10882 0.000276049 0.10345 -0.00205406 0.006478 -0.0219704 -0.0175693 -0.0663152 0.0568176 -0.0230743 0.0888635 -0.0558749 0.0737492 -0.0284513 -0.0777925 -0.127212 0.0121702 0.105663 0.080038 -0.00191576 -0.0291228 0.113459 -0.116696 -0.0758176 -0.0496563 -0.0232644 -0.0572043 -0.0364593 0.052208 0.0408748 -0.0693624 -0.0133873 -0.0326497 -0.0247513 0.101234 -0.10839 0.0493871 -0.151149 0.142594 -0.0254993 -0.0628459 0.0718363 0.182079 -0.0882216 0.0303117 0.0361633 0.086623 -0.117631 -0.087387 0.0478402 0.139462 -0.0102368 0.0625874 -0.0225935 0.0361851 -0.124808 0.0499799 -0.0601593 -0.0217368 
