{
  "descriptor": [
    -0.15088199079036713,
    0.017612392082810402,
    0.06003666669130325,
    0.040426090359687805,
    0.008379794657230377,
    -0.1150720939040184,
    0.09719736874103546,
    -0.1855899542570114,
    0.12507200241088867,
    0.017957545816898346,
    0.28439605236053467,
    -0.036602940410375595,
    -0.09544495493173599,
    -0.20840705931186676,
    0.04604903981089592,
    0.10733577609062195,
    -0.17023739218711853,
    -0.14701609313488007,
    -0.09164074808359146,
    -0.1231234073638916,
    0.028189662843942642,
    -0.022267378866672516,
    0.04048064723610878,
    0.08558941632509232,
    -0.11436082422733307,
    -0.23947983980178833,
    -0.0909641906619072,
    -0.22489677369594574,
    0.13669586181640625,
    -0.05061629042029381,
    0.09916660189628601,
    0.059209391474723816,
    -0.09917929023504257,
    -0.038617391139268875,
    0.0044242218136787415,
    -0.007242688909173012,
    0.10939750075340271,
    -0.08974910527467728,
    0.23370446264743805,
    -0.05054907500743866,
    -0.12902919948101044,
    -0.00863321591168642,
    0.02912542223930359,
    0.2734111249446869,
    0.18031689524650574,
    -0.04452531039714813,
    0.04415787756443024,
    0.06589207053184509,
    0.06743329763412476,
    -0.16733814775943756,
    -0.005075969733297825,
    0.05626867711544037,
    0.19585713744163513,
    -0.05584070459008217,
    0.114119753241539,
    -0.13175632059574127,
    -0.02852909453213215,
    0.05147406831383705,
    -0.21489395201206207,
    0.09023863077163696,
    0.031835392117500305,
    -0.041453905403614044,
    -0.03176115080714226,
    -0.01765538565814495,
    0.1694643646478653,
    0.09928584098815918,
    -0.07867224514484406,
    -0.11894384026527405,
    0.14492875337600708,
    -0.15200689435005188,
    -0.04580693319439888,
    0.09768249094486237,
    -0.1559147983789444,
    -0.12161055952310562,
    -0.24401725828647614,
    0.03569719195365906,
    0.4293641149997711,
    0.09131025522947311,
    -0.24501323699951172,
    -0.010218187235295773,
    -0.11890193819999695,
    0.04198525473475456,
    0.051512569189071655,
    -0.020577428862452507,
    -0.06404215097427368,
    -0.04810930788516998,
    -0.18838530778884888,
    -0.09646397829055786,
    0.1317313313484192,
    0.031788475811481476,
    -0.06211785972118378,
    0.1984403133392334,
    -0.03482280299067497,
    -0.10269829630851746,
    -0.015721946954727173,
    -0.06585170328617096,
    -0.01713343895971775,
    0.02528263069689274,
    -0.01893460936844349,
    -0.05034251883625984,
    0.03237214311957359,
    -0.03897492215037346,
    0.06725376099348068,
    0.07075229287147522,
    -0.19539648294448853,
    0.05664195492863655,
    -0.014375895261764526,
    0.015610339120030403,
    -0.0245636235922575,
    0.07676199078559875,
    -0.09981813281774521,
    0.010123767890036106,
    0.15623660385608673,
    -0.2232467383146286,
    0.12042990326881409,
    0.1678488403558731,
    0.001744355191476643,
    0.10178390145301819,
    -0.019989369437098503,
    0.06804842501878738,
    -0.049148812890052795,
    0.03936151787638664,
    -0.06599858403205872,
    -0.0501917339861393,
    -0.005423135589808226,
    -0.06716211885213852,
    0.03202245756983757,
    0.04843224585056305
  ]
}