{
  "descriptor": [
    -0.02921445667743683,
    0.09121833741664886,
    -0.008610610850155354,
    -0.015440156683325768,
    -0.0050182705745100975,
    -0.0759975016117096,
    -0.030560743063688278,
    -0.10480868816375732,
    0.11493843793869019,
    -0.0465451180934906,
    0.18026316165924072,
    -0.018806330859661102,
    -0.23180055618286133,
    -0.09780455380678177,
    0.030425962060689926,
    0.08752661943435669,
    -0.17521056532859802,
    -0.04751040041446686,
    -0.10910388827323914,
    -0.04663534462451935,
    0.02765851467847824,
    0.03446027263998985,
    0.046729546040296555,
    0.005443430505692959,
    -0.07706277072429657,
    -0.26128295063972473,
    -0.1055789440870285,
    -0.09830781817436218,
    0.07260142266750336,
    -0.0635305643081665,
    0.04130515083670616,
    0.06294530630111694,
    -0.18288999795913696,
    -0.06933923065662384,
    -0.005000293720513582,
    0.07390293478965759,
    -0.08402913063764572,
    -0.08260305225849152,
    0.240712970495224,
    0.02077212743461132,
    -0.2039404809474945,
    0.023269962519407272,
    0.030263900756835938,
    0.24920880794525146,
    0.2792700529098511,
    -0.06241576746106148,
    0.00006909482181072235,
    -0.08992937207221985,
    0.1588737666606903,
    -0.23434606194496155,
    0.008821428753435612,
    0.1997934877872467,
    0.09454289823770523,
    0.10546573996543884,
    0.055306918919086456,
    -0.11468512564897537,
    0.030862990766763687,
    0.1350909173488617,
    -0.20546910166740417,
    -0.017618175595998764,
    0.04871845245361328,
    -0.04838204383850098,
    -0.04321832209825516,
    -0.05569891631603241,
    0.07683537900447845,
    0.08260422199964523,
    -0.10021448135375977,
    -0.18700900673866272,
    0.14450180530548096,
    -0.18484973907470703,
    -0.07897308468818665,
    0.14014184474945068,
    -0.13573449850082397,
    -0.18184006214141846,
    -0.3316601514816284,
    0.031219670549035072,
    0.3447946310043335,
    0.11299951374530792,
    -0.0967123806476593,
    0.049898628145456314,
    -0.07821333408355713,
    -0.10428455471992493,
    0.01985321193933487,
    0.07346658408641815,
    -0.04940977320075035,
    -0.02749130129814148,
    -0.05861116573214531,
    0.05546130985021591,
    0.1574329137802124,
    -0.04268711432814598,
    -0.03414127975702286,
    0.17273542284965515,
    -0.029466979205608368,
    0.020726852118968964,
    0.0011151675134897232,
    0.08493070304393768,
    -0.10768219828605652,
    0.009285848587751389,
    -0.16219040751457214,
    -0.04839693009853363,
    0.09239489585161209,
    -0.129289910197258,
    0.01796906441450119,
    0.1424470841884613,
    -0.18670347332954407,
    0.2158500850200653,
    0.025898106396198273,
    -0.004788897931575775,
    0.034761592745780945,
    -0.06928730010986328,
    -0.06440408527851105,
    0.0712287425994873,
    0.188857764005661,
    -0.19996395707130432,
    0.2299615740776062,
    0.14135527610778809,
    -0.005646422505378723,
    0.0797516256570816,
    0.08725554496049881,
    0.08000368624925613,
    -0.08143900334835052,
    -0.0451311320066452,
    -0.22786372900009155,
    -0.08160579204559326,
    -0.006946452893316746,
    0.06098499894142151,
    0.01846534013748169,
    -0.010212956927716732
  ]
}