{
  "descriptor": [
    -0.08905655145645142,
    0.08414636552333832,
    0.1402578204870224,
    -0.07557166367769241,
    -0.16743439435958862,
    0.020062396302819252,
    -0.03621722757816315,
    -0.08671291172504425,
    0.17685213685035706,
    -0.1258581131696701,
    0.16729936003684998,
    -0.02866111509501934,
    -0.21651408076286316,
    0.09512002766132355,
    -0.056697163730859756,
    0.12354587018489838,
    -0.15859228372573853,
    -0.21145744621753693,
    -0.007870434783399105,
    -0.09079541265964508,
    0.011419903486967087,
    0.09741714596748352,
    -0.021189389750361443,
    0.08121318370103836,
    -0.15546560287475586,
    -0.32646656036376953,
    -0.0682566836476326,
    -0.09085526317358017,
    0.012772957794368267,
    -0.11057208478450775,
    -0.04249049350619316,
    0.12606331706047058,
    -0.12314094603061676,
    0.035808347165584564,
    0.024604998528957367,
    0.024351708590984344,
    -0.04523620009422302,
    -0.10936260968446732,
    0.2554394006729126,
    0.09846752136945724,
    -0.24015603959560394,
    -0.042277976870536804,
    0.06539561599493027,
    0.28460243344306946,
    0.13760942220687866,
    -0.06638216972351074,
    0.014840432442724705,
    -0.0343853235244751,
    0.12946797907352448,
    -0.27686747908592224,
    0.022991396486759186,
    0.23293913900852203,
    0.05989399179816246,
    0.10086873918771744,
    0.06274273991584778,
    -0.09480094909667969,
    -0.023239044472575188,
    0.0827852264046669,
    -0.11818592995405197,
    0.08675678819417953,
    0.07655859738588333,
    -0.10782195627689362,
    -0.0017996201058849692,
    -0.11810173094272614,
    0.17328554391860962,
    0.11784476786851883,
    -0.08443597704172134,
    -0.13796812295913696,
    0.10652609914541245,
    -0.14627492427825928,
    -0.20176200568675995,
    0.06542649865150452,
    -0.14238464832305908,
    -0.12956786155700684,
    -0.23123472929000854,
    0.03881823271512985,
    0.39205506443977356,
    0.13254718482494354,
    -0.1214204728603363,
    0.055167581886053085,
    -0.016509514302015305,
    -0.07915909588336945,
    0.012369674630463123,
    0.1406889110803604,
    -0.11877788603305817,
    0.062464840710163116,
    -0.0022415530402213335,
    0.05758505314588547,
    0.24290047585964203,
    0.02395770512521267,
    -0.023236477747559547,
    0.21928367018699646,
    -0.013954167254269123,
    0.0739184021949768,
    0.06285698711872101,
    0.07945846766233444,
    -0.0663735419511795,
    -0.036518394947052,
    -0.13691987097263336,
    0.0010898287873715162,
    -0.0080111064016819,
    -0.05383816733956337,
    -0.00284480769187212,
    0.14954739809036255,
    -0.22460585832595825,
    0.14447958767414093,
    -0.04126228392124176,
    -0.06635534018278122,
    -0.03550206869840622,
    0.05869822949171066,
    -0.08084095269441605,
    -0.02574962191283703,
    0.13840864598751068,
    -0.21048025786876678,
    0.11277127265930176,
    0.15865179896354675,
    0.04892037808895111,
    0.10344482958316803,
    0.0621677041053772,
    0.0013570630690082908,
    -0.011938578449189663,
    -0.0334995836019516,
    -0.1075528934597969,
    -0.08970747143030167,
    0.11403068155050278,
    -0.018494682386517525,
    -0.024375082924962044,
    0.013076631352305412
  ]
}