{
  "descriptor": [
    -0.14441563189029694,
    0.06931759417057037,
    0.05514785647392273,
    -0.07641545683145523,
    -0.09007859230041504,
    -0.025142300873994827,
    -0.0685209259390831,
    -0.14098049700260162,
    0.16086266934871674,
    -0.13760170340538025,
    0.2921217978000641,
    -0.021049363538622856,
    -0.1978377103805542,
    -0.06512996554374695,
    -0.029712701216340065,
    0.16850148141384125,
    -0.24998173117637634,
    -0.13864775002002716,
    -0.03443187102675438,
    0.018421653658151627,
    0.08061341941356659,
    0.029427610337734222,
    0.013547827489674091,
    0.04916868358850479,
    -0.11729800701141357,
    -0.34288787841796875,
    -0.11464057117700577,
    -0.10313938558101654,
    0.05273396894335747,
    -0.03255263715982437,
    -0.01603136770427227,
    -0.006931782234460115,
    -0.22966186702251434,
    -0.07094605267047882,
    0.006296866573393345,
    0.035195957869291306,
    -0.004461575765162706,
    -0.08203932642936707,
    0.18196995556354523,
    0.013067546300590038,
    -0.23469409346580505,
    -0.014098821207880974,
    0.03190719336271286,
    0.24056927859783173,
    0.1255333125591278,
    0.03243444114923477,
    0.010653827339410782,
    -0.1113961786031723,
    0.07121887803077698,
    -0.1968965083360672,
    0.03980361297726631,
    0.14624515175819397,
    0.09253281354904175,
    0.07218138128519058,
    -0.008553586900234222,
    -0.12643523514270782,
    0.0578988753259182,
    0.10953036695718765,
    -0.16479463875293732,
    0.03141476958990097,
    0.08012154698371887,
    -0.03515675291419029,
    0.017484311014413834,
    -0.04997710511088371,
    0.23608197271823883,
    0.06495588272809982,
    -0.10639319568872452,
    -0.17426691949367523,
    0.11386611312627792,
    -0.09912233799695969,
    -0.11877671629190445,
    0.062252335250377655,
    -0.1724168062210083,
    -0.20320944488048553,
    -0.3300551176071167,
    0.006399459671229124,
    0.40894562005996704,
    0.09061732143163681,
    -0.18080797791481018,
    0.05452350899577141,
    -0.07581781595945358,
    -0.04662158340215683,
    0.09863078594207764,
    0.13883477449417114,
    0.0073003158904612064,
    0.03941645100712776,
    -0.05592023953795433,
    0.022641506046056747,
    0.23088815808296204,
    -0.044767268002033234,
    -0.031146852299571037,
    0.2512319087982178,
    -0.009488210082054138,
    0.02491173706948757,
    0.0373813770711422,
    0.04811316356062889,
    -0.021832413971424103,
    0.022203955799341202,
    -0.1123061329126358,
    0.004377966281026602,
    0.03328162059187889,
    0.010615121573209763,
    -0.01779930479824543,
    0.12582358717918396,
    -0.19052498042583466,
    0.1275998204946518,
    0.02687244489789009,
    -0.014951677992939949,
    0.02182495780289173,
    0.00006546016811626032,
    -0.10938405990600586,
    -0.08790280669927597,
    0.129341721534729,
    -0.2288323938846588,
    0.21992428600788116,
    0.2152981460094452,
    0.0873294472694397,
    0.13101929426193237,
    0.0864553153514862,
    0.039706986397504807,
    -0.015807349234819412,
    0.0022071311250329018,
    -0.20387820899486542,
    -0.04815306514501572,
    0.10583366453647614,
    -0.048541560769081116,
    0.06830467283725739,
    0.006671801209449768
  ]
}