0.0293972 0.0598589 -0.0529664 -0.0662689 0.114176 0.121815 0.061633 -0.125393 -0.156005 0.0441786 -0.0242112 0.0615352 0.128797 0.0565934 0.04668 -0.0510214 -0.00952139 0.0463748 0.000288104 0.124376 0.0282719 -0.00816353 0.0865909 0.0524354 -0.0545707 0.110741 -0.128799 -0.163788 0.124567 0.0789477 -0.0255862 0.155075 -0.0724075 0.0127186 0.0616819 0.0585678 0.0105808 0.241268 0.0342961 -0.0465517 0.0369046 0.0163612 -0.0761422 0.0159022 -0.219529 0.101093 0.149927 0.069552 -0.124138 -0.0438849 -0.0375075 0.0413067 -0.0142288 0.0135537 0.112944 -0.00359225 0.0574629 0.207057 -0.0444473 -0.0901399 -0.0759372 0.0498241 0.202506 -0.118157 0.141464 0.0187784 0.0392131 0.076848 -0.05649 0.0745843 0.021151 0.0996854 -0.0245675 0.095465 0.0353294 0.00273688 -0.111233 0.0112244 0.112126 -0.0305314 -0.0227849 0.12561 -0.0243618 -0.0458468 -0.00800106 -0.131465 0.0733666 0.0712573 0.00881412 0.0118257 0.121636 -0.0397337 0.0850986 -0.0314551 -0.0437907 -0.176205 0.0798881 0.158842 0.0814895 -0.0548603 0.0127817 0.0765841 -0.0120327 0.126303 -0.154588 0.0707044 -0.0629296 0.0662039 0.135208 -0.0111165 0.0674727 0.139102 -0.10001 0.0116487 0.0309763 0.0433824 -0.128147 -0.184116 -0.0364881 0.0934945 0.0431361 -0.0335575 0.00297544 0.0242594 -0.102758 0.0885124 -0.0622626 -0.0174266 
0.0537353 0.0105502 -0.092631 -0.0398491 0.143225 0.121106 0.0734527 -0.097404 -0.171659 0.0356474 -0.0393017 0.0871646 0.122752 0.0431615 -0.00776276 -0.0373049 0.0149889 0.0682695 0.0176636 0.136283 0.0775794 -0.0464998 0.0820206 0.0427423 -0.0337307 0.112511 -0.115741 -0.192837 0.109338 0.0890277 -0.0346677 0.158269 -0.0896913 0.00124723 0.0456753 0.0313826 -0.030286 0.224093 0.0276927 -0.0914959 0.0324388 0.0397613 -0.0705319 0.0514851 -0.222604 0.0682522 0.147127 0.0390341 -0.113183 -0.0605698 -0.00933177 0.0168013 -0.0198608 -0.00159051 0.118837 -0.00724142 0.0643315 0.21751 -0.0206747 -0.103905 -0.0343835 0.0249868 0.214931 -0.109441 0.163417 -0.0245509 0.00842421 0.0776424 -0.0300663 0.0819755 0.0196956 0.123736 -0.0223727 0.0571756 -0.0375803 0.0106452 -0.0761804 0.0383688 0.0855814 -0.0382217 -0.0615436 0.115778 -0.0181442 -0.0502172 -0.00966348 -0.154452 0.0936353 0.0994309 0.0278852 -0.0269307 0.102307 -0.0265261 0.0403821 -0.0359789 -0.0263352 -0.159566 0.0997788 0.156415 0.0579094 -0.0376335 0.0152669 0.0814626 -0.00827457 0.132675 -0.157379 0.0484603 -0.0671073 0.0657507 0.121367 -0.0173915 0.0523457 0.130467 -0.110243 0.0146799 0.0595717 0.0378525 -0.122274 -0.188433 -0.0416056 0.0867161 -0.00376629 -0.00559268 0.00647616 -0.00303186 -0.0893182 0.0829082 -0.0677341 -0.0289813 
0.0827223 -0.0106349 -0.106798 -0.0551182 0.170608 0.120525 0.0774572 -0.0953703 -0.138378 -0.0037216 -0.0443291 0.112232 0.122209 0.0117884 -0.0340897 -0.040652 -0.0382501 0.0762151 -0.0686315 0.167437 0.105253 -0.0493165 0.114275 0.06298 -0.035844 0.0577531 -0.108032 -0.194121 0.0503147 0.102235 -0.0640997 0.117817 -0.105566 0.028571 0.0189768 0.00903189 -0.076614 0.209049 -0.00595392 -0.0727941 0.0193958 0.0394007 -0.0633076 0.0830316 -0.225922 0.0442394 0.134908 0.0514934 -0.0900113 0.0260713 0.0132681 -0.0264985 -0.0503974 0.0162347 0.12702 -0.0453407 0.0432601 0.218527 -0.0080744 -0.116947 -0.0158753 0.0271711 0.212574 -0.0626138 0.110025 -0.0873553 -0.0138159 0.110017 -0.0309927 0.074033 0.0463496 0.140068 0.00709647 0.0369999 -0.0549996 0.0332902 -0.0915195 -0.00415969 0.0744599 0.0094137 -0.030753 0.107588 -0.0176742 -0.0400937 -0.0378553 -0.119863 0.101159 0.100776 0.0338348 -0.017067 0.0837893 -0.074344 0.0127766 -0.0517307 -0.0674709 -0.147887 0.0489156 0.130848 0.057952 -0.0515523 0.029963 0.0590542 -0.00436989 0.146768 -0.160502 0.0195851 -0.132802 0.111411 0.082526 -0.0135514 0.0886214 0.157363 -0.113606 0.0489635 0.0229786 0.0796495 -0.129325 -0.133171 -0.0558274 0.105247 -0.015047 0.0268032 0.00200738 0.0135707 -0.0994338 0.0490918 -0.0898923 -0.0365877 
0.0839086 0.0126546 -0.114966 -0.0663286 0.162151 0.13234 0.0580683 -0.0925432 -0.174679 0.0354896 -0.0287765 0.100713 0.119309 0.0204026 -0.00507235 -0.0238406 -0.0133733 0.0894574 -0.0176103 0.147518 0.0913991 -0.0199144 0.112497 0.0509648 -0.033297 0.0853531 -0.0878367 -0.20307 0.0708923 0.10639 -0.072665 0.10598 -0.0970022 0.0148885 0.0320515 0.0194619 -0.0635727 0.194824 0.019531 -0.0502293 -0.00202022 0.0411553 -0.0613119 0.0920428 -0.232615 0.0698205 0.156498 0.0433512 -0.124125 0.0107514 0.0342225 -0.00940701 -0.070187 0.016263 0.11168 -0.032134 0.0605929 0.222737 -0.00343457 -0.0915584 -0.0181444 0.0103023 0.225697 -0.0853298 0.136936 -0.104205 -0.0189568 0.108357 -0.0213657 0.0966204 0.0514204 0.151058 -0.00752879 0.030713 -0.0539217 0.0212986 -0.0990392 0.0273806 0.068439 -0.0144842 -0.0339785 0.11797 -0.0195428 -0.0341764 -0.0487152 -0.122867 0.0928774 0.0745248 0.0362759 -0.013248 0.06895 -0.0603923 -0.00197016 -0.0483482 -0.0400325 -0.148025 0.063779 0.147058 0.0486424 -0.0512673 0.0110806 0.0758728 -0.000214886 0.131896 -0.165912 0.026341 -0.120451 0.0919518 0.0862539 -0.0192357 0.0871595 0.137739 -0.0942416 0.0360042 0.0296746 0.061428 -0.116761 -0.167887 -0.0584189 0.0937733 0.00383215 0.00372695 0.0185761 0.0163801 -0.0882128 0.0500944 -0.0723254 -0.0247036 
0.0851675 -0.0256224 -0.0885292 -0.056194 0.157705 0.0931575 0.0332341 -0.0999549 -0.136808 -0.0168483 -0.0346047 0.081636 0.102309 0.0501649 0.00390377 -0.0090479 -0.0288782 0.0781016 -0.00688577 0.149093 0.12426 -0.0102579 0.127549 0.0725635 -0.0130297 0.0832114 -0.0745541 -0.213278 0.0520454 0.108653 -0.0454501 0.0713409 -0.0782114 0.0110422 0.058273 0.0432702 -0.0533748 0.21033 0.00641212 -0.0714532 -0.0280643 0.0830288 -0.0558429 0.10761 -0.202469 0.0771534 0.154284 0.04494 -0.0806711 0.0257013 -0.00151216 -0.0293117 -0.0415007 0.0229355 0.155387 -0.0380039 0.0655495 0.220699 0.00296804 -0.118759 -0.00412581 0.000273647 0.210014 -0.0520782 0.11543 -0.107854 -0.0151952 0.115527 0.0199761 0.103306 0.0564101 0.152489 -0.0118346 0.00505692 -0.0647614 -0.00207056 -0.111934 0.0361694 0.0736167 0.00845705 -0.00301502 0.140891 -0.0461848 -0.0654963 -0.0418066 -0.131444 0.0722309 0.0938377 0.0363384 -0.0167361 0.0993742 -0.0350835 -0.00733095 -0.0685814 -0.0348102 -0.125521 0.0406867 0.159602 0.0683659 -0.0648224 0.00898033 0.0526862 0.0161736 0.0859229 -0.179304 0.0164051 -0.125302 0.0511998 0.113653 -0.014729 0.0904503 0.149083 -0.113711 0.0198124 0.0471734 0.0929487 -0.0905846 -0.192562 -0.0868739 0.082937 0.00593513 0.0578405 0.0245538 0.030985 -0.124589 0.0409284 -0.0355087 -0.0107742 
0.0804191 -0.0211764 -0.10185 -0.067806 0.151513 0.102672 0.0368319 -0.101699 -0.135111 0.00421393 -0.0250371 0.0823491 0.110114 0.056042 0.0143999 -0.0158548 -0.0358795 0.0861831 0.0114555 0.135002 0.112633 0.00218515 0.121935 0.0708022 -0.022979 0.0898743 -0.0607895 -0.215557 0.0584072 0.120479 -0.0530058 0.0607229 -0.0684163 -0.00186857 0.0698864 0.0433208 -0.0399571 0.197785 0.0116123 -0.0663164 -0.029689 0.0781211 -0.0579233 0.120337 -0.224599 0.0734238 0.159391 0.0486841 -0.0832042 0.0165349 -0.00203587 -0.034122 -0.0416737 0.0255682 0.152223 -0.0214733 0.0618953 0.227199 -0.00631319 -0.111632 -0.0167636 -0.00729557 0.227882 -0.0557532 0.118952 -0.0982707 -0.0151248 0.108972 0.0186683 0.0931397 0.0568624 0.149917 -0.0160227 -0.00727102 -0.0576894 0.00357054 -0.120893 0.0297623 0.0759933 -0.0022379 0.00325033 0.142124 -0.0473683 -0.0560662 -0.0423 -0.125757 0.07296 0.0807102 0.0395954 -0.0107091 0.097354 -0.0386378 -0.0125563 -0.0718639 -0.0339461 -0.136859 0.0340663 0.165514 0.0731741 -0.0629211 0.0157148 0.0528081 0.0298352 0.0651616 -0.186264 0.0251929 -0.120933 0.0414846 0.101554 -0.00678592 0.100539 0.134133 -0.101121 0.00762093 0.0383612 0.092974 -0.0845349 -0.193701 -0.0884882 0.0771761 0.0218683 0.0272624 0.0235614 0.0288987 -0.125873 0.0494281 -0.0377923 0.00414076 
0.0661324 -0.0190805 -0.111146 -0.0727252 0.13651 0.120523 0.029014 -0.111112 -0.156882 0.0215196 -0.042169 0.0895299 0.12137 0.0407079 0.013407 -0.0125178 -0.0580428 0.0797578 0.0262847 0.130567 0.0976648 0.0012455 0.100039 0.103765 -0.0289182 0.0983028 -0.0635084 -0.224511 0.0419227 0.138692 -0.0713256 0.0609362 -0.0818932 -0.00135281 0.0639871 0.0447817 -0.0374151 0.146507 0.0140413 -0.0550183 -0.0216123 0.046359 -0.0279626 0.121215 -0.205238 0.0661234 0.187348 0.060039 -0.101307 0.0204748 0.0222897 -0.0835847 -0.0135824 0.0273119 0.167629 -0.00466642 0.0566187 0.231583 0.0179217 -0.124904 -0.0051449 0.0287457 0.221908 -0.0549084 0.10296 -0.0693738 -0.0108015 0.0954594 0.0165162 0.0529832 0.0283418 0.147667 -0.0187469 -0.00871567 -0.0347759 0.0218878 -0.117589 0.0197306 0.0921336 0.00151436 0.0395997 0.141394 -0.0547758 -0.0571878 -0.0599903 -0.0950012 0.0727539 0.0590248 0.0364791 0.00180887 0.0879711 -0.0330013 -0.00477779 -0.0637269 -0.0662525 -0.0999717 0.0259209 0.167054 0.0902155 -0.0603141 0.034897 0.0387586 0.0347618 0.0554514 -0.198485 0.0248165 -0.15145 0.0432894 0.0325082 0.0149185 0.120622 0.131574 -0.0779505 -0.0314892 0.00199718 0.103434 -0.0989843 -0.168696 -0.107432 0.0599676 0.0316821 -0.00518231 0.0397788 0.00820992 -0.167551 0.0747753 -0.0773866 -0.00714422 
0.0431415 -0.0177851 -0.0875956 -0.0812599 0.149045 0.113005 0.0246727 -0.114518 -0.143029 0.0228975 -0.0509484 0.091904 0.105944 0.0466678 0.0338125 -0.0155844 -0.063743 0.0858911 0.0450694 0.119968 0.092995 0.0158455 0.0993862 0.0896662 -0.0219297 0.104786 -0.0727607 -0.22549 0.048758 0.134327 -0.0480078 0.0429521 -0.0639457 -0.0194661 0.0897886 0.0513244 -0.027999 0.149274 0.0241732 -0.0542531 -0.0154689 0.0691463 -0.0233178 0.113481 -0.210563 0.0677526 0.18773 0.048131 -0.0887279 0.00421504 0.00175834 -0.0925387 -0.0045874 0.0208774 0.165635 0.00843789 0.0570929 0.23758 -0.00701637 -0.114224 -0.0108654 0.0232483 0.21834 -0.0580858 0.126889 -0.0660954 -0.0131829 0.0886022 0.0154578 0.0543823 0.0470142 0.158206 -0.0185996 -0.0131545 -0.0347739 0.0288613 -0.135692 0.0164564 0.0979884 -0.0157385 0.0338619 0.16193 -0.0489147 -0.0323367 -0.0474223 -0.11388 0.0748883 0.0772102 0.0380893 -0.00370318 0.0850293 -0.0182066 0.00453265 -0.0621083 -0.0499445 -0.107919 0.0225676 0.175758 0.0797718 -0.0489716 0.0203707 0.0267825 0.032711 0.0268118 -0.202386 0.0334346 -0.131737 0.0112061 0.0474954 0.0263653 0.118176 0.110737 -0.0786264 -0.0346384 0.0079206 0.102352 -0.100221 -0.169931 -0.121555 0.0546184 0.0431174 0.00156458 0.0282174 -0.003037 -0.170694 0.0865398 -0.0720153 0.00146992 
0.0585765 -0.0423403 -0.0901085 -0.0604 0.170939 0.1078 0.021277 -0.124047 -0.0999935 -0.0568421 -0.0364373 0.107688 0.0934383 0.0696993 0.00197318 -0.0223614 -0.0800685 0.0566522 0.00648703 0.141958 0.128791 -0.000147246 0.12328 0.0799683 0.00229769 0.0687257 -0.0646907 -0.200478 0.0362032 0.136435 -0.032418 0.0333923 -0.054235 -0.00842804 0.0669601 0.0716669 -0.0518858 0.156061 -0.0014663 -0.0741415 -0.00427085 0.0838628 -0.0275571 0.111176 -0.21817 0.0613077 0.167567 0.0395503 -0.0546699 0.0279979 -0.0381236 -0.0642075 -0.00806701 0.0265934 0.184492 -0.00756784 0.0328779 0.245592 -0.034842 -0.111472 -0.0213654 0.0234878 0.236132 -0.0461327 0.110034 -0.0645849 -0.0173268 0.103141 0.010585 0.088978 0.0603818 0.159905 -0.0153533 -0.0201005 -0.0311191 0.039888 -0.118048 -0.0147768 0.0734224 0.0171779 0.0245909 0.150198 -0.0351133 -0.0380389 -0.0486909 -0.105497 0.0716032 0.10065 0.019474 0.00438905 0.117206 -0.0517467 -0.010203 -0.0519513 -0.0488845 -0.128658 0.000483504 0.161964 0.0899397 -0.0570215 0.0124106 0.0180569 0.0285747 0.0245176 -0.204955 0.0588899 -0.126753 0.0379088 0.0652675 0.00225412 0.113218 0.115752 -0.104567 0.00387823 0.0237674 0.115567 -0.0866091 -0.148106 -0.0913029 0.100175 0.0301867 0.0320411 0.0108186 0.00850965 -0.158722 0.0861836 -0.033491 0.0160022 
0.0692252 -0.0424735 -0.109055 -0.0658451 0.157478 0.113629 -0.00615558 -0.120083 -0.116329 -0.054135 -0.0201902 0.0928831 0.0996259 0.0950883 -0.01995 0.00489949 -0.0500198 0.053912 0.0324111 0.124748 0.156927 -0.00640648 0.118406 0.103344 0.0243699 0.0711096 -0.0296471 -0.188669 0.0593047 0.146902 -0.027331 0.00147527 -0.0609241 -0.0263503 0.0456882 0.0718709 -0.0784969 0.131277 0.0175238 -0.0599963 -0.0504514 0.10081 -0.0335115 0.116993 -0.175025 0.0453746 0.169056 0.0355112 -0.0603875 0.00729043 -0.02615 -0.0543858 0.00117089 0.0126082 0.160895 -0.000621049 0.0507852 0.269919 -0.014612 -0.121741 -0.00620921 0.03069 0.2535 -0.0406514 0.0881857 -0.0530882 -0.0187108 0.114757 0.0265746 0.0861639 0.0534545 0.169355 -0.0323184 -0.0457777 -0.0344757 0.0304003 -0.0960652 -0.00103428 0.0638478 0.0290158 0.031622 0.140793 -0.0326431 -0.0574816 -0.054129 -0.100417 0.0560373 0.087468 0.0214851 -0.0244251 0.100714 -0.0349069 -0.018553 -0.0259445 -0.0144134 -0.119042 -0.0044425 0.173918 0.079338 -0.0544246 0.016023 0.0126083 0.0191905 0.0254065 -0.219527 0.0726079 -0.126929 0.00782381 0.0592623 -0.0267724 0.119048 0.112123 -0.0831684 0.00828877 0.0316436 0.134596 -0.101473 -0.122443 -0.102599 0.0866054 -0.0018308 0.0173651 0.00642986 -0.01394 -0.184992 0.110605 -0.0520507 0.0175636 
0.0538759 -0.100239 -0.0859798 -0.0317285 0.134082 0.0904108 0.00487685 -0.167068 -0.150707 0.0202693 0.00904833 0.130251 0.0840206 0.0684041 -0.0052859 0.0108253 -0.0660363 0.0872652 0.13039 0.108918 0.121892 -0.00462715 0.068416 0.0957306 0.0203079 0.186644 -0.0322589 -0.226782 0.0565228 0.15557 -0.0648145 0.0399972 -0.0549528 -0.0389652 0.0910216 0.0410138 -0.0605656 0.096726 0.112427 -0.0976369 -0.031867 0.0508518 -0.0234368 0.0887793 -0.171621 -0.00394638 0.164312 0.0155205 -0.0441382 -0.0694423 -0.00852235 -0.0910171 0.0450028 0.0259288 0.167602 0.016149 0.0819274 0.237237 -0.0557434 -0.0645086 0.0323982 -0.00190872 0.254689 -0.0131171 0.128283 0.0118417 -0.0219303 0.0652708 0.0564197 0.0187706 -0.00704332 0.163114 -0.0386094 -0.0301101 -0.0408822 -0.0142042 -0.0805247 -0.00705307 0.0766212 0.0227673 0.051206 0.147249 -0.0173974 -0.0566282 -0.0432004 -0.133811 0.0788379 0.086956 0.0354109 -0.0407131 0.0994667 0.0361233 0.0108159 0.0280076 -0.0656151 -0.109234 -0.00937901 0.151533 0.121232 -0.0453547 0.0493506 0.000242038 0.0177815 -0.025968 -0.121962 0.0619194 -0.0338013 -0.0209536 0.0360896 0.0252529 0.0870288 0.0850591 -0.0375959 -0.0551825 0.0475211 0.115084 -0.0937614 -0.105121 -0.141237 0.0152959 0.0151823 -0.0320905 0.0290883 -0.0726871 -0.196947 0.171716 -0.047912 0.0387972 
-0.000238537 -0.0507702 -0.0442345 -0.0167626 0.109165 0.0760437 0.0512602 -0.187415 -0.0956298 0.0207954 -0.0127097 0.0759312 0.0705753 0.0624448 0.0244613 -0.035017 -0.10312 0.0529033 0.1066 0.0835893 0.07856 -0.0370518 0.015927 0.0734441 0.0224748 0.162034 -0.130641 -0.187558 0.0779233 0.13106 -0.0228263 0.0527573 -0.0616918 -0.0646342 0.131291 0.0505927 -0.0326456 0.112282 0.0833734 -0.135461 0.0254535 0.03305 -0.00165399 0.0706436 -0.163034 0.0107653 0.143019 0.0444968 -0.0245449 -0.105912 -0.0838556 -0.0826968 0.0839161 0.00944591 0.187667 0.0269228 0.0282462 0.21395 -0.0571925 -0.104395 -0.00201307 0.0381772 0.228245 -0.00494983 0.115289 0.115274 0.0153705 0.0194182 0.0307592 -0.0299818 0.0050187 0.141157 -3.59752e-05 0.012161 0.0123111 -0.00755411 -0.113143 -0.0471802 0.116801 0.00834352 0.067911 0.150517 -0.0204593 -0.0410759 -0.00451444 -0.13057 0.0715749 0.102077 0.048988 -0.0175572 0.135606 0.0430493 0.0720822 -0.0283866 -0.100604 -0.145596 0.00223912 0.140386 0.129048 -0.0444586 0.0631079 0.00955508 0.0549217 -0.0797024 -0.152367 0.0932646 0.0086496 -0.00211992 0.0718971 0.0733326 0.112723 0.0643635 -0.0719777 -0.0820172 0.0374186 0.10036 -0.0986195 -0.0807136 -0.125182 -0.0145209 0.0279308 -0.0552987 0.0154023 -0.0537463 -0.214158 0.18226 -0.0417007 0.0498126 
0.0558178 -0.0865494 -0.0899079 -0.0161374 0.12972 0.112239 0.0381439 -0.164362 -0.0975995 -0.0315201 0.00164576 0.107412 0.0974537 0.0911134 -0.0108653 -0.0305794 -0.0775786 0.0845455 0.0643553 0.111082 0.128305 -0.0394685 0.0898381 0.0968922 0.00702838 0.118635 -0.0894687 -0.218851 0.0452468 0.146865 -0.0186726 0.0761838 -0.0548033 -0.0330906 0.0856268 0.0617429 -0.0630647 0.148192 0.0467008 -0.11433 -0.00608127 0.0675536 -0.0471484 0.0880478 -0.198058 -0.0219268 0.14287 0.0274402 -0.0282901 -0.0479942 -0.0662916 -0.0815737 0.0678738 0.0287438 0.166796 0.0162633 0.0600665 0.244979 -0.046524 -0.114769 -0.0213449 0.0405555 0.262537 -0.0472647 0.108668 0.0574404 0.013409 0.0584601 0.0143735 0.0418215 0.015043 0.143301 -0.0165148 -0.000322622 -0.0347752 -0.0105423 -0.0902874 -0.0710385 0.0736879 0.0113968 0.0306276 0.145003 -0.0445793 -0.0860106 -0.0233564 -0.112215 0.064929 0.0847078 0.0315017 -0.0225105 0.144081 -0.00783441 0.0346227 -0.0296271 -0.0459029 -0.130179 -0.0192787 0.172402 0.11644 -0.0248961 0.0596365 0.00234648 0.0401316 -0.0145178 -0.156087 0.0834062 -0.044363 -0.0111539 0.0638566 0.0192197 0.084115 0.108086 -0.0674721 -0.055553 0.0514898 0.118846 -0.0785042 -0.112511 -0.0802424 0.0449184 0.0216215 -0.0407047 0.0165219 -0.0361666 -0.191923 0.149256 -0.0325768 0.0510695 
0.0752752 -0.101116 -0.0971172 -0.0192521 0.141873 0.0928693 0.0205955 -0.142386 -0.115601 -0.0604248 -0.0207695 0.122564 0.103563 0.0695563 -0.0375255 -0.0223029 -0.0467641 0.0805698 0.0386807 0.145596 0.145911 -0.0384115 0.1071 0.124794 -0.00136705 0.110687 -0.0614835 -0.233814 0.0165419 0.142703 -0.0361995 0.068719 -0.0619547 -0.00512629 0.0698499 0.0391716 -0.0515703 0.162859 0.0304201 -0.111082 -0.0149161 0.0793142 -0.0368923 0.101866 -0.186666 -0.00175375 0.165669 0.0230691 -0.0410181 -0.00501484 -0.0374037 -0.11188 0.0540943 0.0342978 0.178212 -0.00830616 0.0658784 0.239226 -0.0189805 -0.141386 0.01519 0.035516 0.236814 -0.0386605 0.0958285 -0.0127841 0.00359755 0.0760137 0.0314633 0.0367613 0.00760715 0.127753 -0.0198904 -0.0189063 -0.0544476 -0.00460667 -0.086124 -0.0273411 0.0794887 0.0318719 0.0127757 0.15371 -0.0549611 -0.0995019 -0.029128 -0.110854 0.0709864 0.0907278 0.0252696 -0.0336636 0.127836 -0.0182826 0.0191993 -0.0363676 -0.0492463 -0.108442 -0.00573147 0.168725 0.096504 -0.0495451 0.0428359 0.00237301 0.0270151 0.0421257 -0.154462 0.0433278 -0.0880638 0.0156969 0.0348075 0.00688918 0.0845097 0.126121 -0.0816927 -0.0287528 0.0290636 0.116316 -0.106055 -0.146446 -0.102496 0.0476428 -0.00459012 0.0221966 0.0125798 -0.0236867 -0.182401 0.108061 -0.0568328 0.00831749 
0.0172326 -0.0981883 -0.0359574 -0.0698662 0.160219 0.0662347 0.0274723 -0.157943 -0.112352 -0.00392735 -0.0396991 0.103127 0.0860243 0.0695061 0.0604808 -0.0235989 -0.0869289 0.0412296 0.0934016 0.112209 0.0851974 0.0127647 0.0763637 0.0499602 0.010237 0.16946 -0.0876475 -0.205183 0.0464561 0.111621 -0.0159972 0.0327632 -0.0306314 -0.0252008 0.137348 0.048877 -0.00690776 0.139611 0.0837381 -0.134022 0.021751 0.0520437 0.00342094 0.0795212 -0.198594 0.0388715 0.138402 0.0514472 -0.0224207 -0.0500668 -0.0884863 -0.136018 0.0635933 0.0267833 0.179985 -0.00139632 0.0330588 0.215616 -0.0895535 -0.08018 0.00825732 0.015393 0.207074 -0.00299605 0.143206 0.0450851 -0.0235311 0.0784125 0.0428432 -0.0249978 0.0100473 0.141165 -0.0232288 -0.0241698 -0.0169478 0.00812143 -0.116505 -0.0435445 0.127244 0.0226495 0.06022 0.139248 -0.0174044 -0.0216998 -0.0154695 -0.167736 0.0898798 0.129156 0.0399889 -0.00704403 0.140908 0.0369505 0.0456036 -0.00901014 -0.0956167 -0.123865 -0.0130234 0.156385 0.0998072 -0.0567414 0.0403498 -0.0110264 0.0282334 -0.0664779 -0.1391 0.0555989 -0.0365834 -0.00499806 0.0760119 0.059533 0.10712 0.0704678 -0.085389 -0.0403286 0.0380336 0.101599 -0.100768 -0.104572 -0.156281 0.0328068 0.0428669 -0.0049582 0.0107017 -0.0250505 -0.199866 0.126511 -0.0395754 0.0327479 
0.0172326 -0.0981883 -0.0359574 -0.0698662 0.160219 0.0662347 0.0274723 -0.157943 -0.112352 -0.00392735 -0.0396991 0.103127 0.0860243 0.0695061 0.0604808 -0.0235989 -0.0869289 0.0412296 0.0934016 0.112209 0.0851974 0.0127647 0.0763637 0.0499602 0.010237 0.16946 -0.0876475 -0.205183 0.0464561 0.111621 -0.0159972 0.0327632 -0.0306314 -0.0252008 0.137348 0.048877 -0.00690776 0.139611 0.0837381 -0.134022 0.021751 0.0520437 0.00342094 0.0795212 -0.198594 0.0388715 0.138402 0.0514472 -0.0224207 -0.0500668 -0.0884863 -0.136018 0.0635933 0.0267833 0.179985 -0.00139632 0.0330588 0.215616 -0.0895535 -0.08018 0.00825732 0.015393 0.207074 -0.00299605 0.143206 0.0450851 -0.0235311 0.0784125 0.0428432 -0.0249978 0.0100473 0.141165 -0.0232288 -0.0241698 -0.0169478 0.00812143 -0.116505 -0.0435445 0.127244 0.0226495 0.06022 0.139248 -0.0174044 -0.0216998 -0.0154695 -0.167736 0.0898798 0.129156 0.0399889 -0.00704403 0.140908 0.0369505 0.0456036 -0.00901014 -0.0956167 -0.123865 -0.0130234 0.156385 0.0998072 -0.0567414 0.0403498 -0.0110264 0.0282334 -0.0664779 -0.1391 0.0555989 -0.0365834 -0.00499806 0.0760119 0.059533 0.10712 0.0704678 -0.085389 -0.0403286 0.0380336 0.101599 -0.100768 -0.104572 -0.156281 0.0328068 0.0428669 -0.0049582 0.0107017 -0.0250505 -0.199866 0.126511 -0.0395754 0.0327479 
-0.0245685 -0.0500357 -0.0359655 -0.0259397 0.100785 0.0240866 0.0234039 -0.203492 -0.0880905 0.0173956 -0.0214965 0.0694764 0.0725535 0.080827 0.0430261 -0.0235278 -0.0776903 0.0153281 0.122332 0.11112 0.0384451 -0.0260115 0.0190413 0.0393317 0.00553648 0.192178 -0.143014 -0.175699 0.0720818 0.114446 -0.0126631 0.0577979 -0.0234022 -0.0755149 0.137606 0.0719734 0.00668377 0.148233 0.0986981 -0.126936 0.00824161 0.0548887 -0.0024627 0.0285198 -0.138517 0.0550184 0.147843 0.0462594 -0.00826555 -0.104264 -0.129569 -0.0984219 0.0987196 0.0151009 0.172903 0.0140679 0.0230448 0.187055 -0.0746781 -0.0836072 0.0024973 0.0396162 0.197572 -0.00562317 0.113215 0.123821 0.026547 0.0351484 0.0481893 -0.0855 0.0120212 0.114908 -0.00312969 0.0253909 0.0333062 -0.00209394 -0.124968 -0.0500528 0.134296 0.006164 0.0679169 0.155635 -0.0429378 -0.0311895 0.00902272 -0.130357 0.0533807 0.101478 0.0418333 -0.0343898 0.127424 0.0639079 0.116789 -0.0116899 -0.0886018 -0.148533 0.00837001 0.13183 0.11947 -0.0549633 0.0251817 -0.013191 0.0384343 -0.0916135 -0.148695 0.101611 0.0313263 -0.0148865 0.0860212 0.10142 0.0990791 0.038018 -0.0715884 -0.0732258 0.00906753 0.0870095 -0.110387 -0.0932721 -0.151807 -0.0345264 0.0156114 -0.0202419 0.00942064 -0.0314153 -0.22047 0.163467 -0.0534275 0.0368503 
-0.0342943 -0.0222887 -0.0367292 -0.0410386 0.118609 0.0334579 0.00555145 -0.227727 -0.087339 0.0086389 -0.0268027 0.0607864 0.063718 0.0791669 0.0721993 -0.0100071 -0.0694374 0.00115504 0.122107 0.097956 0.0178411 0.0102794 0.0246258 0.00819926 0.0136245 0.190921 -0.156158 -0.159791 0.0893193 0.109857 0.0142877 0.0813947 -0.0150754 -0.0713866 0.137204 0.0938103 0.0208161 0.119011 0.129762 -0.101587 0.0207304 0.0499677 0.00237719 0.00162596 -0.131613 0.0958713 0.149614 0.059556 -0.0169344 -0.111937 -0.148665 -0.0717745 0.105323 0.00498434 0.137027 0.00940615 0.0270481 0.179571 -0.0999695 -0.0441217 -0.0148504 0.0672862 0.188619 -0.0136201 0.103841 0.127714 0.0293861 0.0527527 0.0443868 -0.0787721 0.0211606 0.111365 -0.0213234 0.0369236 0.0578974 0.00635297 -0.136901 -0.06442 0.115367 0.00798243 0.0842332 0.173364 -0.035283 -0.00521214 0.01029 -0.108677 0.0446861 0.0831376 0.00241037 -0.0258762 0.142874 0.0714274 0.111159 0.0148025 -0.0789129 -0.143851 -0.00325535 0.133154 0.103584 -0.0561124 0.0112976 -0.026958 0.027387 -0.0844116 -0.150918 0.118504 0.0345321 -0.00594571 0.0967412 0.116808 0.104566 0.0142908 -0.0814942 -0.0629957 -0.0035309 0.0743529 -0.119978 -0.0905514 -0.138472 -0.01267 0.0435224 -0.0180746 0.00711526 -0.0229462 -0.225743 0.155015 -0.0540499 0.0392267 
0.00581642 -0.0546867 -0.0400337 -0.074827 0.170208 0.0456426 0.0262538 -0.190066 -0.114184 0.00550605 -0.0549143 0.084855 0.102752 0.0986301 0.0655416 -0.0123866 -0.0555703 0.0278879 0.0641592 0.139259 0.0509202 0.00383346 0.0840407 0.013262 -0.00551847 0.157279 -0.146459 -0.159319 0.0735393 0.107549 -0.00633958 0.109645 -0.0339714 -0.0259656 0.118572 0.0719486 0.00657042 0.167388 0.101379 -0.125998 0.00444568 0.0571753 -0.00181456 0.0122375 -0.173304 0.0772891 0.12999 0.0908115 -0.0165793 -0.0452093 -0.120047 -0.0791979 0.0587144 0.0191824 0.146746 -0.0291926 0.0389808 0.19712 -0.105345 -0.0644968 -0.00336438 0.0619847 0.19086 -0.0223694 0.109119 0.0827255 -0.0114806 0.0982699 0.0150599 -0.0407747 0.0203612 0.133218 -0.024035 0.0398341 -0.00227595 0.0148876 -0.103577 -0.0744804 0.139501 0.00698675 0.0739301 0.145668 -0.0374989 -0.0157723 0.00552599 -0.157479 0.0535562 0.126234 0.0455423 -0.00476091 0.155149 0.0479105 0.089527 0.0153681 -0.0729015 -0.140177 -0.00416327 0.161633 0.0855698 -0.0643125 0.0402758 -0.0213136 0.00668257 -0.0277037 -0.141853 0.0873676 -0.0292155 0.00689593 0.129657 0.0812215 0.091616 0.0731683 -0.102458 -0.00454991 0.0164875 0.0786334 -0.104275 -0.0934132 -0.135528 0.0455466 0.0318635 0.0098198 0.0147973 -0.00469202 -0.222481 0.112124 -0.057754 0.00658696 
0.0893469 -0.0915924 -0.0552537 -0.0604321 0.174317 0.100669 0.051544 -0.12695 -0.117354 -0.0439476 -0.0488459 0.116516 0.11539 0.0635747 0.00821375 -0.0255267 -0.0565452 0.0481205 -0.00889961 0.153887 0.136576 -0.012955 0.101896 0.0601848 -0.0205142 0.112127 -0.118443 -0.205008 0.0298608 0.115872 -0.0385464 0.112047 -0.0889172 0.024345 0.0800601 0.0411313 -0.0444956 0.188522 0.0510355 -0.13083 -0.00172514 0.0623116 -0.0482225 0.0545115 -0.187864 0.0416654 0.118306 0.0591277 -0.0516924 0.00219592 -0.0508891 -0.0670137 0.0169111 0.0408554 0.170305 -0.049876 0.0443844 0.219775 -0.079129 -0.10737 0.02068 0.0365987 0.21077 -0.0388546 0.107659 -0.014076 -0.0108955 0.126587 0.0150597 0.0392512 0.0240551 0.139854 -0.0232906 0.00569277 -0.0688708 0.014598 -0.0838703 -0.0555032 0.115772 0.0473955 0.0305215 0.126904 -0.0337113 -0.0681837 -0.014053 -0.160519 0.0934274 0.125256 0.040444 0.0066483 0.149707 -0.0230398 0.0279415 0.00708555 -0.0840787 -0.125966 0.0215335 0.133101 0.0845052 -0.049687 0.0638416 0.0125389 -0.0174769 0.0460956 -0.142286 0.0420897 -0.0899455 0.0454327 0.0891551 0.0137927 0.0830221 0.129199 -0.129143 0.00514121 0.0692205 0.101417 -0.121353 -0.128208 -0.10301 0.0816057 0.00827278 0.0394815 0.027879 0.00728993 -0.142928 0.079423 -0.0320468 -0.0189398 
