{
  "descriptor": [
    -0.06521125882863998,
    0.033284742385149,
    0.1247158944606781,
    -0.11503779143095016,
    -0.1453048586845398,
    0.030723774805665016,
    -0.03671683371067047,
    -0.05408262461423874,
    0.2149326354265213,
    -0.15857259929180145,
    0.21609750390052795,
    -0.03045850805938244,
    -0.21571806073188782,
    0.0781889334321022,
    -0.07187593728303909,
    0.1562902331352234,
    -0.14335809648036957,
    -0.2068130075931549,
    -0.034125521779060364,
    -0.08565228432416916,
    0.0229612085968256,
    0.10888304561376572,
    -0.01770959421992302,
    0.0937739685177803,
    -0.1722467541694641,
    -0.3604600131511688,
    -0.06252613663673401,
    -0.11262419074773788,
    0.004576149396598339,
    -0.149552121758461,
    -0.052064310759305954,
    0.0900125578045845,
    -0.1666712760925293,
    0.023536404594779015,
    0.038543637841939926,
    0.07549044489860535,
    -0.05849381908774376,
    -0.12185563147068024,
    0.2359892874956131,
    0.11091694980859756,
    -0.26765719056129456,
    -0.016942225396633148,
    0.10093533992767334,
    0.25742244720458984,
    0.12465478479862213,
    -0.05332528054714203,
    0.012310788035392761,
    -0.03850711137056351,
    0.11439484357833862,
    -0.2755095362663269,
    0.026366261765360832,
    0.1990828812122345,
    0.03538571298122406,
    0.11465143412351608,
    0.06596348434686661,
    -0.12276145815849304,
    -0.010121801868081093,
    0.08546648919582367,
    -0.1223922148346901,
    0.07005913555622101,
    0.06600341945886612,
    -0.07936856895685196,
    -0.017543720081448555,
    -0.0582297183573246,
    0.18180081248283386,
    0.1086064800620079,
    -0.10078238695859909,
    -0.12570033967494965,
    0.12642106413841248,
    -0.15642370283603668,
    -0.14853902161121368,
    0.0725892186164856,
    -0.14838671684265137,
    -0.13260965049266815,
    -0.2238263636827469,
    0.018328208476305008,
    0.4330691397190094,
    0.10401403903961182,
    -0.11479388177394867,
    0.08081939071416855,
    -0.03655023127794266,
    -0.04594127833843231,
    0.01349762361496687,
    0.1239631399512291,
    -0.07827350497245789,
    0.10509975254535675,
    -0.008451043628156185,
    0.08163616806268692,
    0.2384534329175949,
    0.036578547209501266,
    -0.0010155095951631665,
    0.2122056633234024,
    -0.023887699469923973,
    0.07538055628538132,
    0.0949276015162468,
    0.0907077044248581,
    -0.08614402264356613,
    -0.07650662213563919,
    -0.1586349755525589,
    -0.018336327746510506,
    -0.0340956375002861,
    -0.0471736304461956,
    -0.02299194410443306,
    0.11983343213796616,
    -0.23773865401744843,
    0.14557458460330963,
    -0.012539786286652088,
    -0.0962701067328453,
    -0.027835030108690262,
    0.11147402226924896,
    -0.070399709045887,
    -0.04290980473160744,
    0.12374041229486465,
    -0.22200502455234528,
    0.13592496514320374,
    0.17338719964027405,
    0.06792541593313217,
    0.12348897755146027,
    0.08357543498277664,
    -0.0010248596081510186,
    -0.017492812126874924,
    -0.04536464810371399,
    -0.1245700865983963,
    -0.0954715833067894,
    0.05470346286892891,
    -0.007103634066879749,
    0.013215133920311928,
    -0.002487393794581294
  ]
}