{
  "descriptor": [
    -0.09451497346162796,
    0.06687317788600922,
    0.045725610107183456,
    -0.030158646404743195,
    -0.10607796907424927,
    -0.025651840493083,
    -0.044066011905670166,
    -0.10932648926973343,
    0.14127202332019806,
    -0.1040177047252655,
    0.1565854400396347,
    -0.058840882033109665,
    -0.2075173705816269,
    0.013343689031898975,
    -0.049987200647592545,
    0.11152716726064682,
    -0.12677495181560516,
    -0.1387321501970291,
    -0.0687650814652443,
    -0.0517926923930645,
    0.03073502890765667,
    0.03183606266975403,
    0.059277892112731934,
    0.06662025302648544,
    -0.10874546319246292,
    -0.30957090854644775,
    -0.07370148599147797,
    -0.09685934334993362,
    0.03614204376935959,
    -0.09722153097391129,
    -0.019505217671394348,
    0.09071164578199387,
    -0.17925715446472168,
    -0.01213829591870308,
    -0.014590398408472538,
    0.08567259460687637,
    -0.04067664593458176,
    -0.09087643027305603,
    0.21937257051467896,
    0.05315408110618591,
    -0.23943312466144562,
    0.007252819836139679,
    0.0388038270175457,
    0.28177034854888916,
    0.181158646941185,
    -0.021579071879386902,
    0.010715152136981487,
    -0.05418793484568596,
    0.10456738620996475,
    -0.25744619965553284,
    0.04606875777244568,
    0.18589229881763458,
    0.10287059098482132,
    0.08907929807901382,
    0.06236399710178375,
    -0.11223048716783524,
    0.049368541687726974,
    0.08318167179822922,
    -0.1339263767004013,
    0.041247595101594925,
    0.09954986721277237,
    -0.029491804540157318,
    0.007343977689743042,
    -0.08513332158327103,
    0.21467573940753937,
    0.11286356300115585,
    -0.07796798646450043,
    -0.12001415342092514,
    0.14216451346874237,
    -0.14164873957633972,
    -0.09981415420770645,
    0.10150282829999924,
    -0.13873106241226196,
    -0.18151642382144928,
    -0.22017218172550201,
    0.06761612743139267,
    0.34780624508857727,
    0.17509424686431885,
    -0.12493269890546799,
    0.05807733163237572,
    -0.07309935241937637,
    -0.019994331523776054,
    0.018214931711554527,
    0.10238540917634964,
    -0.0694865807890892,
    0.04238622263073921,
    -0.04363182559609413,
    0.03324585407972336,
    0.1929355412721634,
    -0.025288743898272514,
    -0.02997763641178608,
    0.22371149063110352,
    0.013835381716489792,
    -0.006059197708964348,
    0.036122072488069534,
    0.032332953065633774,
    -0.08257243782281876,
    0.009995806962251663,
    -0.14788608253002167,
    -0.017336592078208923,
    0.04664629325270653,
    -0.07575235515832901,
    0.01080987136811018,
    0.10903181880712509,
    -0.21542668342590332,
    0.15311424434185028,
    -0.040920522063970566,
    -0.04535587131977081,
    0.017467694357037544,
    0.02388075552880764,
    -0.06804273277521133,
    -0.00963791087269783,
    0.13180063664913177,
    -0.24658548831939697,
    0.18201594054698944,
    0.15916402637958527,
    0.056323111057281494,
    0.12031199783086777,
    0.07297820597887039,
    0.08530821651220322,
    0.0052238949574530125,
    -0.007046716753393412,
    -0.13300789892673492,
    -0.08311458677053452,
    0.0900612398982048,
    -0.00028011141694150865,
    -0.015301496721804142,
    0.03711188584566116
  ]
}