0.0968475 0.0187286 -0.181309 -0.00526269 0.0755729 0.117373 0.0335604 -0.0625358 -0.117538 -0.0284884 0.056023 0.124466 0.111 -0.0410618 -0.156198 0.018659 -0.0628105 0.00510052 -0.114302 0.17621 0.10549 -0.133607 0.0976993 0.107465 -0.0166268 0.0402745 0.00838224 -0.14722 0.0442181 0.0787477 -0.0714167 0.0917318 -0.10699 0.0406783 -0.137644 -0.0109859 -0.161127 0.14628 -0.0345243 0.0178507 -0.0155665 -0.0444046 -0.0743229 0.113061 -0.125886 -0.0226255 0.146191 0.014665 -0.114609 0.084764 0.0477464 0.0198097 -0.104723 0.00188977 0.0778932 -0.0345342 0.00667306 0.226047 0.0429428 -0.0925059 -0.0400145 0.0186613 0.275194 -0.0465079 0.00882559 -0.0750881 -0.0177837 0.0733749 -0.0507831 0.0832937 -0.0181104 0.11919 -0.0136275 0.100975 0.0162143 -0.0221383 -0.00144031 0.0173207 -0.0244632 0.0771966 -0.0418445 6.94716e-05 -0.0132542 -0.0946207 -0.116532 0.00881645 0.0671774 0.0149083 0.0364963 -0.0661994 0.0473871 -0.125477 -0.0525089 -0.0215883 0.00786155 -0.0803093 0.0244493 0.0825846 0.0730281 -0.0700431 -0.0219036 0.0160486 -0.0150096 0.203451 -0.134401 0.0643381 -0.152429 0.191872 0.015142 -0.129897 0.0572619 0.207485 -0.0507712 0.0506778 0.0352558 0.0691035 -0.0841089 -0.0521485 0.0733106 0.144739 -0.0475557 0.00287828 0.0140896 0.0231186 -0.113057 0.0631391 -0.0778357 -0.0162644 
0.103092 0.01656 -0.195166 -0.00673017 0.0841174 0.139042 0.0333505 -0.0594856 -0.118312 -0.0268051 0.0629668 0.126266 0.108675 -0.045409 -0.153364 0.0144295 -0.0564894 0.0224952 -0.103794 0.167518 0.111075 -0.122957 0.0964291 0.109852 -0.012111 0.0324509 0.0126732 -0.153514 0.0493489 0.0840536 -0.0626285 0.0893294 -0.107708 0.0403828 -0.128336 -0.0059148 -0.160008 0.121294 -0.026593 0.0127001 -0.011861 -0.0438408 -0.0771661 0.124374 -0.13924 -0.0344895 0.146216 0.020131 -0.115963 0.0823412 0.0461744 0.0239658 -0.103327 -0.00334251 0.0672171 -0.0276593 0.00791368 0.22932 0.0365534 -0.0900563 -0.0479289 0.0210729 0.290727 -0.0611741 0.00648696 -0.078969 -0.0163111 0.0689302 -0.0519129 0.0956528 -0.017873 0.122536 -0.0216946 0.0913095 0.00466241 -0.0282754 -0.00230486 0.0204457 -0.0310654 0.0719304 -0.0442924 0.0107241 -0.00985434 -0.0946413 -0.111603 0.0136158 0.0667041 0.00945421 0.0351025 -0.0603015 0.0602882 -0.126119 -0.0657357 -0.0200124 0.0178309 -0.0864549 0.017846 0.0880045 0.061446 -0.0685202 -0.0153671 0.0182776 -0.0126385 0.194403 -0.133785 0.071279 -0.144699 0.180096 0.0103804 -0.119845 0.0594725 0.197261 -0.0438529 0.0497768 0.038342 0.0655902 -0.0756643 -0.0607818 0.0823805 0.147521 -0.0362794 -0.0133501 0.0153153 0.0215046 -0.116587 0.0618087 -0.0716747 -0.0104533 
0.105772 0.0104817 -0.184783 -0.0119696 0.0965234 0.146818 0.0400073 -0.05124 -0.118954 -0.0288542 0.0547089 0.130828 0.108854 -0.0611092 -0.147275 0.0053459 -0.0593271 0.0232749 -0.12568 0.178059 0.100776 -0.115149 0.0946884 0.116644 -0.0215892 0.0209295 0.00147957 -0.149276 0.0398378 0.0698445 -0.060326 0.0779726 -0.121399 0.0489652 -0.126728 -0.0035175 -0.164835 0.110216 -0.0414351 0.0144322 0.0020341 -0.0417641 -0.0814028 0.126045 -0.144923 -0.0355913 0.13708 0.0359083 -0.110823 0.101911 0.0469955 0.00775649 -0.115038 -0.0111494 0.0654857 -0.0357622 -0.00928901 0.233261 0.0365629 -0.0823694 -0.049041 0.0346257 0.282059 -0.0571089 0.00507322 -0.0943414 -0.0190943 0.0696095 -0.0630322 0.0902312 -0.0098796 0.126413 -0.0061073 0.0950935 -0.00466341 -0.0207175 -0.00581584 0.021011 -0.0195848 0.0728896 -0.0354577 0.00507743 -0.00841287 -0.0865363 -0.114841 0.011706 0.0749777 0.0164952 0.0316433 -0.0510661 0.0640289 -0.127759 -0.0639934 -0.0196368 0.00831912 -0.0826987 0.0169229 0.0691577 0.0464842 -0.067407 -0.0138439 0.0222364 -0.0199509 0.18812 -0.132432 0.0677297 -0.151557 0.179574 0.0056519 -0.102259 0.0730099 0.200471 -0.0380628 0.0630456 0.0236725 0.0648858 -0.0798119 -0.0459071 0.0681817 0.14938 -0.0422858 -0.0137838 0.0105423 0.027065 -0.115758 0.0556814 -0.0858462 -0.0244582 
0.0988943 0.0417315 -0.180726 -0.0102295 0.0725338 0.145059 0.049047 -0.0657241 -0.122904 -0.0107328 0.0756979 0.1109 0.122456 -0.0575346 -0.144255 0.0071074 -0.0737414 0.0317119 -0.120551 0.162717 0.112847 -0.121099 0.073579 0.122964 -0.0207283 0.0145669 -0.010415 -0.150546 0.0637409 0.0999923 -0.0711494 0.083986 -0.123486 0.0420237 -0.111013 -0.0040406 -0.161724 0.100411 -0.029901 0.0162261 -0.00974159 -0.066004 -0.0737341 0.129216 -0.132927 -0.0238387 0.148 0.0405983 -0.138472 0.0767883 0.0465221 0.0224995 -0.110675 -0.0108876 0.0606853 -0.0200809 -0.0162183 0.226925 0.0325606 -0.0817267 -0.0483154 0.0305008 0.290274 -0.0568651 0.00534901 -0.0770371 -0.0131446 0.0517925 -0.0715839 0.0807699 -0.0192218 0.114751 -0.0180062 0.0872129 0.00814636 -0.0273726 -0.00511747 0.0223172 -0.0172747 0.0766073 -0.0247712 -0.00532708 -0.0225641 -0.0902503 -0.123562 0.0339194 0.0623711 -0.014525 0.0292022 -0.0346981 0.0666488 -0.13431 -0.0648711 -0.0196779 -0.0104992 -0.0850676 0.00648343 0.0763425 0.0704592 -0.0661988 0.00444332 0.0316955 -0.0134934 0.184904 -0.130201 0.0796038 -0.137088 0.199881 0.00941714 -0.106858 0.0648125 0.186806 -0.0485095 0.037127 0.0269812 0.0751972 -0.0806221 -0.039772 0.0761994 0.149239 -0.0375549 -0.0383275 0.00854133 0.0368484 -0.119415 0.0719092 -0.0790714 -0.0214319 
0.121566 0.0713098 -0.206773 -0.000514198 0.0621881 0.176565 0.0504973 -0.0595337 -0.076552 -0.0798134 0.0800254 0.0987152 0.0769741 -0.139437 -0.160906 -0.016374 -0.106894 0.00458066 -0.120446 0.141151 0.121953 -0.0825851 0.0650955 0.0922613 -0.0106902 -0.0299199 0.0170144 -0.16975 0.0357783 0.107638 -0.0613488 0.0357919 -0.10015 0.0689749 -0.0814759 -0.0326637 -0.107666 0.0467829 -0.0334745 0.00878293 0.0169675 -0.10318 -0.0394788 0.164118 -0.141052 -0.0079794 0.156529 0.0330858 -0.150481 0.116728 0.0359367 0.0354706 -0.0913458 0.00957066 0.0528701 -0.0280657 -0.0133834 0.165369 0.00980623 -0.0876998 -0.0537675 0.0180095 0.297491 -0.0637418 -0.0156098 -0.121649 -0.000348735 0.00748143 -0.0517185 0.0856107 -0.0386662 0.0685078 -0.0377624 0.0699078 0.0190719 -0.030968 -0.0209324 0.026042 -0.0538562 0.126772 -0.0213277 0.000683316 -0.0142551 -0.0652932 -0.101069 0.0891199 0.0435136 -0.0414077 -0.00144145 0.00208483 0.0994961 -0.165847 -0.117914 -0.0362839 -0.0251191 -0.0936841 -0.00524943 0.0669734 0.0635942 -0.0765897 0.003602 0.0389622 0.0105957 0.171473 -0.119571 0.048264 -0.110536 0.254566 -0.0434479 -0.074216 0.0885403 0.145076 -0.060332 0.0203498 0.00505493 0.0692387 -0.0742086 -0.0420747 0.109031 0.147916 -0.00859665 -0.0177941 0.0165317 0.0561726 -0.0728943 0.0217541 -0.0263872 -0.0157523 
0.124974 0.0597944 -0.208947 -0.0213866 0.0800483 0.178156 0.0571079 -0.0422179 -0.0915936 -0.0607054 0.0804467 0.104818 0.09029 -0.117412 -0.15202 -0.0198663 -0.0837323 0.0049295 -0.12431 0.137377 0.109705 -0.0721322 0.0442673 0.109569 -0.01293 -0.0244173 0.0238669 -0.147332 0.0511143 0.100973 -0.0630219 0.0298549 -0.121529 0.0584744 -0.10103 -0.0259367 -0.134373 0.0213903 -0.0384896 0.0261428 0.0238053 -0.0847308 -0.0526409 0.175953 -0.136443 -0.00421913 0.142446 0.0453636 -0.147394 0.0989415 0.0408574 0.0279902 -0.10917 -0.0157154 0.0380739 -0.0201066 -0.0434432 0.203104 0.0219845 -0.0691873 -0.054768 0.0292662 0.294154 -0.0522669 -0.0305436 -0.123378 -0.000470904 0.0222964 -0.0504636 0.0712991 -0.0239696 0.0829472 -0.0234215 0.0564878 0.00813068 -0.0171176 -0.019845 0.0339573 -0.0457759 0.114823 -0.0103322 -0.00057078 -0.00962633 -0.0650367 -0.106198 0.0757206 0.0650097 -0.0446254 -0.00283761 -0.00707492 0.0894437 -0.153854 -0.118846 -0.0269125 -0.0162245 -0.0871448 0.000668735 0.0418612 0.0526367 -0.0775599 -0.00383525 0.0399152 0.0082451 0.168835 -0.149003 0.0578006 -0.132728 0.238315 -0.0472844 -0.0794486 0.115784 0.144209 -0.0588409 0.0308093 -0.00372713 0.0666262 -0.0893339 -0.0346959 0.0922069 0.141423 -0.0221288 -0.0325235 0.00335838 0.056789 -0.0904316 0.0286714 -0.0647101 -0.0287923 
0.133518 0.0371482 -0.213431 -0.0226868 0.0969411 0.166969 0.0391887 -0.036583 -0.0948169 -0.0550647 0.0884108 0.118234 0.094947 -0.115548 -0.167745 0.00595786 -0.0637751 0.0131564 -0.134566 0.1607 0.118172 -0.0684826 0.0611926 0.0972174 -0.0207959 -0.00672237 0.034067 -0.142209 0.0493459 0.0876541 -0.0705156 0.0372172 -0.116509 0.0606152 -0.120397 -0.0249279 -0.142067 0.0383358 -0.0267266 0.0292361 0.0104352 -0.065729 -0.0588511 0.165201 -0.136134 -0.0273643 0.13473 0.0458796 -0.128184 0.108551 0.0510306 0.027772 -0.12986 -0.00671035 0.0344134 -0.0422506 -0.0257836 0.191162 0.0162863 -0.0626255 -0.0493493 0.0157205 0.295976 -0.0434523 -0.0305887 -0.143009 -0.0111379 0.0494415 -0.0324083 0.0734967 -0.0131054 0.0967341 -0.0151765 0.0616207 -0.00585886 -0.0206853 -0.0103357 0.0460542 -0.0582688 0.105982 -0.00560303 0.00929381 0.00449569 -0.0582494 -0.109251 0.076319 0.0727312 -0.0154063 0.00856602 -0.0264149 0.0802254 -0.14712 -0.13028 -0.00125888 -0.00350822 -0.0880207 -0.00307963 0.0411964 0.0308401 -0.0811183 -0.00753808 0.0269763 -0.00613744 0.179339 -0.128339 0.054472 -0.132089 0.225712 -0.0283919 -0.0859645 0.0946922 0.158963 -0.0478326 0.0646042 0.00320843 0.0587813 -0.094154 -0.0303325 0.0746051 0.13457 -0.0402709 -0.00808815 0.0174563 0.0465031 -0.0930002 0.0266045 -0.0686945 -0.0268678 
0.127385 0.0466805 -0.192914 -0.0368934 0.0801577 0.188608 0.0508418 -0.0147997 -0.0983258 -0.0584645 0.0805782 0.110584 0.0929345 -0.140319 -0.146768 -0.0261158 -0.083438 0.00797829 -0.136812 0.146495 0.104803 -0.0468056 0.0369631 0.11273 -0.0340843 -0.0151729 0.0335598 -0.14439 0.0470572 0.0790485 -0.0678361 0.0113973 -0.121792 0.0720535 -0.104542 -0.0282991 -0.132039 0.0119806 -0.0504633 0.035589 0.0322119 -0.0874634 -0.0584289 0.18737 -0.142693 -0.0210854 0.13913 0.0509356 -0.151067 0.115527 0.049791 0.00887119 -0.126107 -0.0121462 0.0335302 -0.0252508 -0.0545526 0.194199 0.0196779 -0.0696964 -0.0531643 0.027099 0.288556 -0.0416298 -0.0323878 -0.147646 0.00461113 0.017726 -0.0478185 0.0649148 -0.0236267 0.0737822 -0.0110908 0.0567679 0.000127506 -0.0194887 -0.0258758 0.0438453 -0.0376216 0.113017 -0.00175526 0.000159042 0.00233458 -0.0565122 -0.102578 0.0721844 0.0827701 -0.0336912 0.00108768 0.00517349 0.0896151 -0.155911 -0.127874 -0.0121555 -0.0264095 -0.0790984 -0.00038963 0.0279723 0.0317166 -0.0780789 -0.00491305 0.0475706 -0.00409923 0.162207 -0.141332 0.0513318 -0.134167 0.225777 -0.0581507 -0.0741336 0.122467 0.146772 -0.0556219 0.0413389 -0.0132094 0.0583874 -0.0904571 -0.0389055 0.0739653 0.132739 -0.0228199 -0.0334609 0.0095013 0.0541144 -0.0804261 0.020675 -0.0651202 -0.0360107 
0.129441 0.0334266 -0.214682 -0.0137359 0.099222 0.159906 0.0372869 -0.0394549 -0.0843647 -0.0584953 0.0889849 0.119133 0.0905479 -0.118621 -0.169651 0.00457287 -0.06219 0.0163477 -0.13783 0.166313 0.117197 -0.0798263 0.0651383 0.109537 -0.0163091 -0.0149723 0.0354546 -0.147062 0.0464732 0.0834189 -0.0645532 0.0353197 -0.111913 0.0579253 -0.12099 -0.020443 -0.14722 0.0396509 -0.0426449 0.0219449 0.0142582 -0.0648488 -0.0662959 0.169559 -0.135108 -0.0221887 0.13296 0.0477745 -0.126834 0.105963 0.0442923 0.0243591 -0.125028 -0.0188933 0.0355429 -0.0385369 -0.0319449 0.191425 0.0222235 -0.0641393 -0.0500254 0.0167453 0.29255 -0.0402448 -0.0294554 -0.14136 -0.014197 0.0472723 -0.0352651 0.0753356 -0.0167203 0.0937355 -0.0142439 0.0553676 -0.00540931 -0.0202759 -0.0135179 0.0540984 -0.0587026 0.105075 -0.0165857 0.0108059 -0.00833459 -0.0666987 -0.109695 0.0760785 0.0693896 -0.0155223 0.00198035 -0.0271141 0.0805515 -0.140703 -0.127599 -0.0106926 0.000904285 -0.0863995 -0.00566012 0.0359592 0.034512 -0.0857753 -0.00630471 0.0188028 -0.00272406 0.170959 -0.128928 0.0541341 -0.131867 0.223129 -0.0252689 -0.0851305 0.0945859 0.163244 -0.0435752 0.0576653 0.0040185 0.0582213 -0.10017 -0.0361577 0.0789893 0.139044 -0.0429524 -0.00341023 0.00572304 0.0541343 -0.0942155 0.029076 -0.0713395 -0.0311671 
0.12863 0.0392929 -0.208382 -0.015359 0.0954657 0.17099 0.0413965 -0.0321211 -0.0988305 -0.0520695 0.0841682 0.111171 0.0935271 -0.128149 -0.15306 0.00430966 -0.064372 0.0174624 -0.134625 0.165017 0.114021 -0.0772193 0.0670727 0.111576 -0.018958 -0.0178875 0.0222476 -0.155988 0.0473478 0.0781811 -0.0608866 0.0385647 -0.116211 0.0664493 -0.117174 -0.0186949 -0.139556 0.0336824 -0.0410289 0.0244637 0.0195648 -0.0724524 -0.057961 0.169038 -0.13911 -0.0245958 0.143063 0.0481886 -0.136336 0.11394 0.0488057 0.0102403 -0.128728 -0.0152409 0.0335704 -0.0367115 -0.0291303 0.190396 0.0297952 -0.0662937 -0.0530406 0.0258108 0.285243 -0.0531083 -0.0236734 -0.138748 -0.0111268 0.0343711 -0.0429407 0.0722685 -0.0236095 0.0961791 -0.0160511 0.0658399 -0.00247569 -0.0276282 -0.0129325 0.0561283 -0.0509239 0.103468 -0.0138121 0.00565441 -0.00961745 -0.0657456 -0.107896 0.0809427 0.0672493 -0.0229745 0.00077496 -0.0213411 0.0863811 -0.141849 -0.128188 -0.0169833 -0.00368965 -0.0792494 -0.00339206 0.04594 0.0264725 -0.0778474 -0.0114435 0.0222723 -0.00237833 0.175418 -0.128977 0.0553313 -0.133296 0.225399 -0.0293652 -0.08112 0.0900955 0.163451 -0.0407183 0.0487211 0.00194555 0.0550175 -0.088778 -0.0414756 0.0774404 0.141342 -0.0341659 -0.0112881 0.0126688 0.0582743 -0.0966792 0.0230562 -0.0717868 -0.0317146 
0.120629 0.0280643 -0.186756 -0.0283261 0.0980949 0.16604 0.043701 -0.0254525 -0.109222 -0.0421893 0.074976 0.114937 0.105222 -0.108198 -0.141728 -0.00381062 -0.0670407 0.0206677 -0.147771 0.173892 0.106428 -0.0783424 0.0668418 0.112336 -0.0334097 -0.00409947 0.00639497 -0.147803 0.0478096 0.0641302 -0.0623001 0.0438853 -0.12629 0.0665209 -0.119662 -0.00832145 -0.153071 0.0585856 -0.0491308 0.027644 0.0194062 -0.059311 -0.076533 0.159457 -0.144434 -0.0255133 0.135359 0.0511488 -0.136907 0.114453 0.0396649 0.00159938 -0.140102 -0.0142844 0.0391037 -0.0387234 -0.0377046 0.210484 0.0290196 -0.0685447 -0.050898 0.034171 0.284259 -0.0466472 -0.0152921 -0.130185 -0.0100148 0.0504391 -0.0505921 0.0749771 -0.00772245 0.103911 0.000243035 0.0775336 -0.00743077 -0.0250666 -0.0179155 0.0433008 -0.0322933 0.0860351 -0.0160448 0.00505984 -0.0111197 -0.0716715 -0.114072 0.0566042 0.0809062 -0.00869358 0.0131552 -0.0218924 0.0860823 -0.141671 -0.105187 -0.0169498 -0.0066034 -0.0802702 0.000898564 0.0412381 0.0249856 -0.0714198 -0.0153437 0.0262506 -0.0158751 0.172825 -0.134721 0.0643089 -0.144471 0.209419 -0.0170454 -0.0868489 0.09431 0.175892 -0.0464871 0.0590947 0.00510574 0.0563575 -0.0885591 -0.0447693 0.0677954 0.138873 -0.0387076 -0.0154748 0.0113649 0.0582347 -0.100138 0.0288934 -0.0812234 -0.0362667 
0.124536 0.0327734 -0.210729 -0.0170266 0.100894 0.164938 0.0304299 -0.0494138 -0.0957319 -0.0579379 0.0812311 0.109169 0.0963982 -0.109252 -0.164844 0.00722388 -0.0726473 0.024033 -0.130152 0.169023 0.12742 -0.0851407 0.0833066 0.0951836 -0.0155454 -0.0137039 0.0225474 -0.156053 0.0451639 0.0850376 -0.0598201 0.0356738 -0.112926 0.0569913 -0.105756 -0.0130432 -0.143906 0.0513744 -0.0317961 0.0106749 0.00539127 -0.0627857 -0.0613204 0.167603 -0.145713 -0.0252091 0.141424 0.0523972 -0.126099 0.110833 0.036864 0.0192442 -0.121615 -0.00712932 0.0412794 -0.0449404 -0.0117021 0.18856 0.0215019 -0.0779358 -0.0460878 0.0237932 0.299352 -0.0435809 -0.0151985 -0.13726 -0.0169108 0.0526996 -0.0297353 0.0867725 -0.015011 0.102911 -0.0158503 0.0583868 -0.0105783 -0.0289537 -0.0152488 0.0492853 -0.0509298 0.10103 -0.0137346 0.0111813 -0.00826825 -0.0643407 -0.113361 0.0722117 0.0629327 -0.00324804 0.0108348 -0.0276176 0.0932551 -0.140743 -0.11947 -0.0154498 -0.00524781 -0.0948191 -0.0107968 0.064892 0.0318375 -0.0821854 -0.00174589 0.0232863 -0.00507879 0.169102 -0.117618 0.0589137 -0.129158 0.222854 -0.0122075 -0.0787569 0.0814309 0.164874 -0.047178 0.0623265 0.00718241 0.0649243 -0.0869861 -0.0370962 0.0754683 0.139562 -0.0410739 -0.00388698 0.0142348 0.0482056 -0.104701 0.0281674 -0.0646885 -0.0198203 
0.119476 0.0296591 -0.206491 -0.033417 0.105329 0.164765 0.0224694 -0.0378038 -0.109576 -0.0499865 0.0724247 0.112447 0.0937682 -0.108403 -0.156801 0.00392075 -0.0732723 0.0215418 -0.121993 0.165699 0.116827 -0.0694608 0.0757738 0.0950276 -0.0180231 0.00568161 0.0369718 -0.149235 0.0461527 0.0745328 -0.0653223 0.0230032 -0.117195 0.0537671 -0.108059 -0.0116221 -0.146252 0.0430481 -0.032829 0.019622 0.0127523 -0.0586851 -0.0584953 0.182742 -0.14996 -0.0181895 0.147956 0.0529056 -0.129964 0.108389 0.0428317 0.0093833 -0.13168 -0.00883793 0.0458378 -0.0440981 -0.0209809 0.196369 0.028914 -0.0818345 -0.0410014 0.0212057 0.296985 -0.0277244 -0.0170189 -0.146739 -0.016273 0.0579491 -0.0157081 0.0860257 -0.0104608 0.108378 -0.00517002 0.0542178 -0.0109589 -0.0267775 -0.027175 0.0609921 -0.045354 0.0923276 -0.00631034 0.0230704 -0.000782539 -0.0605505 -0.114791 0.0568553 0.0762921 0.00688194 0.0184222 -0.0268266 0.086186 -0.131505 -0.123478 -0.0172918 -0.00658316 -0.0915697 -0.00200623 0.0609394 0.0272586 -0.090349 -0.0138101 0.026617 -0.00119459 0.161971 -0.132935 0.0556598 -0.14291 0.21571 -0.0210641 -0.0793575 0.1017 0.166392 -0.0503127 0.0658698 2.13763e-05 0.0558852 -0.0915942 -0.0497285 0.062274 0.126317 -0.0372773 -0.00189215 0.0192537 0.0428709 -0.10885 0.0232605 -0.0727265 -0.0215278 
0.110653 0.00662162 -0.20532 -0.0333357 0.122138 0.142909 0.0125671 -0.0347505 -0.122549 -0.0458025 0.0532486 0.123726 0.0932917 -0.0911095 -0.160428 0.0178009 -0.0578241 0.033796 -0.121929 0.175795 0.114548 -0.0822836 0.0879046 0.0934689 -0.0150093 0.0192721 0.0377428 -0.147956 0.0324039 0.0629683 -0.0713237 0.0360974 -0.116284 0.0479065 -0.120543 -0.0089612 -0.161059 0.0530973 -0.0408818 0.0146804 0.00987725 -0.0337525 -0.0525294 0.179217 -0.145792 -0.0159438 0.151964 0.043214 -0.121758 0.104052 0.0487999 -0.0182489 -0.135121 -0.0145783 0.0504587 -0.0487109 -0.016097 0.20413 0.0457821 -0.0833815 -0.0235308 0.0264802 0.279074 -0.0134154 -0.00846246 -0.148062 -0.0329832 0.0774009 -0.0067034 0.0830417 -0.00301569 0.119828 0.00885297 0.0459407 -0.0243325 -0.0160907 -0.0266029 0.063252 -0.0468472 0.0692715 -0.0149616 0.0366624 -0.00900763 -0.0652488 -0.126434 0.0430309 0.0808533 0.0244434 0.0206465 -0.0438608 0.0668544 -0.114258 -0.120254 -0.0224539 0.00525784 -0.072429 0.00210233 0.0637325 0.0182712 -0.0891533 -0.0272442 0.00940898 -0.00224649 0.167079 -0.135596 0.0481398 -0.16275 0.202514 -0.021821 -0.0871538 0.0976664 0.177013 -0.0423802 0.0726464 -0.00106488 0.0480551 -0.101726 -0.056729 0.0482107 0.116842 -0.0498894 0.0195547 0.0180098 0.0319916 -0.11599 0.0214135 -0.0959694 -0.0339599 
0.109895 0.00783245 -0.202534 -0.0283484 0.116096 0.149964 0.014117 -0.0364678 -0.111987 -0.0576661 0.0540566 0.118775 0.0903709 -0.104421 -0.16593 0.0260372 -0.0738765 0.0298597 -0.124073 0.164175 0.133345 -0.0867399 0.0971573 0.0821354 -0.011047 0.0158465 0.0303008 -0.16517 0.0342685 0.0620472 -0.0591993 0.0446036 -0.113371 0.0515417 -0.11558 -0.0185792 -0.155096 0.0624669 -0.0262453 0.0145394 0.0145998 -0.0418293 -0.0508354 0.173693 -0.144529 -0.0290517 0.151019 0.0319824 -0.118872 0.0973939 0.0430914 -0.0140527 -0.125183 -0.00434082 0.0444277 -0.0482218 0.011586 0.192789 0.0375267 -0.0891426 -0.0246716 0.0224617 0.281324 -0.0169667 -0.00397364 -0.144828 -0.0304707 0.0716094 0.00394905 0.089098 -0.0130001 0.119392 -0.00338587 0.0523777 -0.0174435 -0.0255557 -0.0311072 0.0581313 -0.057342 0.0806853 -0.0211784 0.0354342 0.000279767 -0.0590234 -0.12602 0.0579188 0.0831128 0.0256377 0.0100622 -0.0553236 0.0769687 -0.118839 -0.124796 -0.0272036 0.00231348 -0.0748242 -0.00448613 0.0818769 0.0206046 -0.0769556 -0.0235112 0.000901426 -0.00154488 0.180592 -0.114232 0.0382538 -0.152969 0.216212 -0.0176031 -0.0928549 0.0764847 0.174797 -0.0506456 0.0640665 0.0109759 0.0559838 -0.0995684 -0.0548827 0.0592125 0.122066 -0.0402276 0.0269124 0.0193246 0.0285656 -0.117111 0.017765 -0.0902651 -0.0166312 
0.109038 -0.00355938 -0.204609 -0.0196101 0.119959 0.133251 0.008363 -0.0454717 -0.118876 -0.0649637 0.0378777 0.127221 0.0862207 -0.104283 -0.172048 0.0229724 -0.0679518 0.0294063 -0.121956 0.184433 0.119798 -0.0929791 0.106334 0.0800033 -0.0160539 0.0217587 0.0286794 -0.168367 0.0137815 0.0600966 -0.070422 0.0474826 -0.110449 0.0503057 -0.11293 -0.018878 -0.156601 0.0775659 -0.0400711 0.00195397 0.00642578 -0.0330985 -0.0499024 0.170643 -0.14592 -0.0127436 0.15552 0.0310264 -0.114092 0.114303 0.0480353 -0.0264566 -0.116678 -0.00502832 0.0568871 -0.0628222 0.0103806 0.186926 0.0453814 -0.0925179 -0.0133181 0.0268015 0.272489 -0.0115102 0.00492317 -0.156677 -0.0354122 0.0754067 -0.00144136 0.0803023 -0.00910969 0.11513 0.00663809 0.0545217 -0.0279205 -0.0176874 -0.0286243 0.0503438 -0.0493112 0.0820417 -0.0221357 0.0334883 -0.0136314 -0.0657092 -0.12402 0.040008 0.0743198 0.0334823 0.0151523 -0.0546364 0.0661319 -0.110835 -0.115073 -0.0290693 0.000293202 -0.0672521 0.00730082 0.0772347 0.0212502 -0.0845411 -0.0256758 0.0041958 -0.00534504 0.17874 -0.119279 0.0296396 -0.155796 0.213125 -0.019352 -0.0805291 0.0845922 0.181142 -0.0458465 0.0690864 -0.00228064 0.0538035 -0.103809 -0.0561165 0.0489342 0.116762 -0.0562595 0.0403071 0.0232296 0.0225778 -0.107523 0.0140868 -0.0915559 -0.0347766 
0.106417 0.01747 -0.212087 -0.0236722 0.1191 0.146135 0.0123907 -0.0480078 -0.131331 -0.0291021 0.0535188 0.123638 0.0921955 -0.108001 -0.161713 0.0291513 -0.0665047 0.0472451 -0.103874 0.163125 0.126211 -0.0929878 0.0924992 0.0866144 -0.00346024 0.0203949 0.0330507 -0.171014 0.0350057 0.0823525 -0.0745004 0.0437031 -0.113005 0.0390397 -0.10417 -0.0225339 -0.162781 0.044373 -0.0189531 0.00736706 0.00067618 -0.0479817 -0.0425816 0.183978 -0.147155 -0.0134802 0.164263 0.0341144 -0.130793 0.0906235 0.0668888 -0.0151776 -0.125787 -0.0178849 0.0441188 -0.0448503 0.00595149 0.189689 0.0463491 -0.0824493 -0.0135028 0.0145977 0.279783 -0.014789 0.00726624 -0.157259 -0.0438973 0.0684974 -0.00711532 0.0837889 -0.0122003 0.124935 -0.00669934 0.0319874 -0.0317646 -0.0178264 -0.0295431 0.0649196 -0.0524548 0.081379 -0.0217628 0.0315898 -0.00812825 -0.0537987 -0.130223 0.0462765 0.0757638 0.0138177 0.0204361 -0.0502068 0.0512906 -0.107575 -0.128016 -0.0214132 -0.00316744 -0.0735345 0.0010002 0.08267 0.0222264 -0.0864114 -0.0175344 0.0114649 0.00162109 0.173086 -0.118515 0.0375928 -0.148953 0.216185 -0.0186567 -0.0814062 0.081618 0.164955 -0.0429464 0.0571399 0.0041772 0.0538074 -0.104547 -0.0527278 0.0509434 0.119785 -0.0441097 0.0146672 0.0183585 0.0223946 -0.112982 0.0254559 -0.0891069 -0.0250827 
0.111802 0.00582996 -0.206751 -0.0229915 0.117963 0.149863 0.0203699 -0.0394622 -0.122392 -0.0500383 0.0510084 0.121905 0.0934128 -0.10985 -0.167927 0.022246 -0.0741524 0.0420666 -0.117536 0.166021 0.135538 -0.0955522 0.0906487 0.0939164 -0.00870002 0.00503713 0.0268506 -0.169986 0.0306186 0.0787834 -0.0734147 0.0385865 -0.117031 0.0486367 -0.107276 -0.0242379 -0.163603 0.0409686 -0.0307844 0.00320388 0.00641681 -0.0498594 -0.0427466 0.178345 -0.141215 -0.0220244 0.15587 0.0361745 -0.128324 0.100759 0.0519905 -0.0259583 -0.11697 -0.0138807 0.0448893 -0.0447144 0.00226234 0.192378 0.0392857 -0.0851222 -0.0122835 0.0297654 0.279804 -0.0154314 -0.0022348 -0.149049 -0.0414123 0.0616239 -0.0115714 0.0768265 -0.0178375 0.115486 -0.00800638 0.0360688 -0.0301683 -0.0156946 -0.0213964 0.0530773 -0.0490034 0.0851927 -0.0193487 0.0243354 -0.0113471 -0.059013 -0.129969 0.0598583 0.0746639 0.0134478 0.0134315 -0.0434587 0.0708887 -0.11635 -0.127712 -0.0219612 -0.00614835 -0.065561 -0.00784142 0.0791771 0.024888 -0.0785926 -0.00893116 0.00594219 -0.00161833 0.171435 -0.11506 0.0394615 -0.149308 0.218289 -0.0296427 -0.0827167 0.0823877 0.165055 -0.04295 0.0535239 0.00294067 0.0649193 -0.0991156 -0.0412478 0.0543167 0.125225 -0.0497736 0.0124689 0.0143825 0.0254402 -0.118594 0.0268535 -0.0930462 -0.0298031 
0.119361 0.0174686 -0.210854 -0.0223824 0.117291 0.154494 0.0309274 -0.0431259 -0.109765 -0.0492695 0.0651736 0.112919 0.0978443 -0.097964 -0.164293 0.0274078 -0.0663053 0.0276814 -0.125378 0.163768 0.139823 -0.0962479 0.0835581 0.0822883 -0.00423508 0.00571993 0.0163324 -0.160121 0.0474997 0.0803887 -0.061204 0.0586496 -0.120036 0.0520094 -0.113713 -0.0189877 -0.150528 0.0578747 -0.0133225 0.00372792 0.0128577 -0.0493473 -0.0443087 0.162373 -0.137715 -0.0304404 0.145695 0.0388431 -0.122377 0.086672 0.0385726 -0.000703494 -0.124598 -0.0059442 0.0447364 -0.0459367 -0.000995175 0.196106 0.0258361 -0.0835903 -0.0296143 0.0199492 0.28933 -0.0321435 -0.00896862 -0.12371 -0.0315392 0.069566 -0.00860535 0.0778877 -0.0146142 0.120687 -0.0137327 0.0516755 -0.0167611 -0.023488 -0.0138482 0.0531997 -0.0548988 0.0833135 -0.0173241 0.0276621 -0.00160887 -0.0626019 -0.121269 0.0650247 0.0757122 0.0168685 0.0162184 -0.048849 0.084201 -0.128527 -0.126463 -0.0172138 -0.00168745 -0.0811744 -0.00478606 0.0759504 0.0264268 -0.0750302 -0.0129375 0.00249403 -0.00221196 0.183041 -0.120298 0.0532032 -0.145435 0.224626 -0.0109582 -0.0929832 0.0721557 0.168302 -0.0563932 0.0630553 0.0213948 0.0574776 -0.0981011 -0.0423309 0.0641556 0.128339 -0.0420558 0.0158819 0.0231865 0.0392697 -0.116014 0.0253223 -0.0844245 -0.0210029 
0.114926 0.0204 -0.207774 -0.0273596 0.114198 0.167339 0.029541 -0.0371885 -0.114806 -0.0427653 0.0658236 0.111006 0.0960459 -0.108858 -0.158336 0.0154854 -0.0782129 0.0378387 -0.118059 0.156326 0.136154 -0.0906181 0.0824519 0.0880499 -0.0069647 0.00155417 0.018158 -0.164851 0.0482548 0.0761185 -0.0583999 0.0418991 -0.122995 0.0507637 -0.10474 -0.0167997 -0.153038 0.0390664 -0.0156534 0.00665364 0.0185295 -0.0579443 -0.0488754 0.174605 -0.148715 -0.0341884 0.149484 0.0443085 -0.128567 0.0916798 0.0375458 -0.00454176 -0.126208 -0.00851978 0.0391205 -0.0388409 -0.000224176 0.196433 0.0274212 -0.0843116 -0.0299311 0.0269589 0.294738 -0.0311511 -0.00768421 -0.130826 -0.0288678 0.0592456 -0.010797 0.0859004 -0.0182644 0.121635 -0.0134528 0.0499545 -0.0188816 -0.0287756 -0.0226048 0.057466 -0.0492256 0.0809285 -0.0201089 0.0273594 -0.000287256 -0.0572969 -0.122943 0.0672276 0.0786267 0.0135028 0.0185826 -0.0417137 0.0909857 -0.126453 -0.1257 -0.0229903 -0.0049333 -0.0853235 -0.0101289 0.0803116 0.022825 -0.0742081 -0.00989672 0.00968532 0.000355428 0.170775 -0.114545 0.0554737 -0.140689 0.220731 -0.0192634 -0.0828973 0.0787854 0.162833 -0.0487737 0.0553015 0.0148504 0.0588919 -0.0886088 -0.0457897 0.0669828 0.127941 -0.0335667 -0.00110472 0.0190466 0.0368867 -0.12193 0.0258731 -0.0837032 -0.0144736 
0.112029 0.0366599 -0.204712 -0.0378405 0.105409 0.178577 0.0336228 -0.0422683 -0.119111 -0.0411704 0.0686842 0.100546 0.098417 -0.0952386 -0.147313 0.00503969 -0.0877217 0.0244155 -0.109342 0.144852 0.130383 -0.0843724 0.0737161 0.0780089 -0.00320008 0.00509396 0.0141799 -0.154031 0.0594492 0.081032 -0.0532354 0.0355497 -0.128416 0.0460755 -0.0973656 -0.00884573 -0.149756 0.0416112 -0.00533974 0.0105721 0.0166552 -0.0628287 -0.0490338 0.172267 -0.14873 -0.0271322 0.15005 0.048244 -0.137095 0.0858726 0.0262723 0.0129179 -0.123556 -0.00362724 0.0415403 -0.0346656 -0.00982416 0.210341 0.016718 -0.0885122 -0.0405137 0.0310996 0.308946 -0.0399006 -0.00829049 -0.110553 -0.0194444 0.0598471 -0.0166887 0.0885751 -0.012168 0.124612 -0.0173255 0.0574773 -0.00717163 -0.0309595 -0.0255155 0.0434039 -0.0410378 0.0844832 -0.0146042 0.0220161 0.00578894 -0.0578295 -0.123386 0.0597621 0.0761387 0.00903103 0.02632 -0.0345607 0.100608 -0.134247 -0.115401 -0.0200741 -0.00704034 -0.0971082 -0.00461072 0.0838822 0.02953 -0.0731513 -0.0122603 0.0217285 -0.00165921 0.164655 -0.129827 0.0726288 -0.138368 0.222165 -0.0144311 -0.0849349 0.0893575 0.158469 -0.0586188 0.0575545 0.0203164 0.062306 -0.0829904 -0.042291 0.0756169 0.130576 -0.0249884 -0.018862 0.0239185 0.0373354 -0.122285 0.0313522 -0.0722869 -0.00721165 
0.104693 0.0506946 -0.204717 -0.0390283 0.101595 0.175684 0.033763 -0.0392219 -0.123304 -0.0207797 0.0739484 0.103743 0.103823 -0.0968681 -0.142851 0.00316971 -0.0751052 0.0368769 -0.104429 0.144978 0.126003 -0.0853066 0.0634024 0.0978538 -0.00464257 0.00425844 0.0192745 -0.153192 0.071558 0.0922761 -0.0592376 0.0345334 -0.119288 0.0442681 -0.0984232 -0.010135 -0.148265 0.0358012 -0.0138966 0.0134251 0.0134826 -0.0698083 -0.0466552 0.179188 -0.149332 -0.0223922 0.158569 0.0480369 -0.148491 0.0765931 0.0408574 0.0157542 -0.128264 -0.0146796 0.0418053 -0.0197406 -0.0204393 0.210337 0.0246457 -0.087016 -0.0439604 0.0226804 0.303453 -0.0430588 -0.00532473 -0.117235 -0.0225478 0.049651 -0.0308296 0.0857482 -0.0148815 0.116942 -0.0233999 0.0470745 -0.00401169 -0.0255025 -0.0245047 0.0607188 -0.0355916 0.0766888 -0.0220755 0.0232874 0.00288517 -0.054677 -0.118213 0.056266 0.0765405 -0.000686699 0.0306883 -0.0256598 0.0820678 -0.134631 -0.11518 -0.0186582 -0.00634205 -0.0964096 -0.00350713 0.0809985 0.0309681 -0.0788501 -0.00899655 0.0294224 0.000438081 0.166073 -0.137687 0.0742335 -0.139704 0.214655 -0.0148057 -0.0889506 0.0901726 0.154989 -0.0572644 0.051001 0.0149083 0.0571459 -0.0872579 -0.053487 0.073485 0.13507 -0.023164 -0.0292317 0.0134557 0.0390333 -0.121879 0.0398627 -0.075339 -0.0138812 
0.112213 0.0220542 -0.202589 -0.0283559 0.111285 0.157806 0.0255662 -0.0360672 -0.123768 -0.040286 0.05978 0.114166 0.0985149 -0.10682 -0.156629 0.0153219 -0.0705959 0.0391296 -0.119313 0.16582 0.127732 -0.0869788 0.0814073 0.098098 -0.0133264 0.00680099 0.0216615 -0.161979 0.0465997 0.0781493 -0.069034 0.0400352 -0.119584 0.0516519 -0.107917 -0.0173382 -0.155174 0.0454284 -0.0298296 0.00956687 0.00945159 -0.055179 -0.0471018 0.178987 -0.146095 -0.0229932 0.15745 0.0424264 -0.135161 0.0991603 0.0498401 -0.0113442 -0.128037 -0.0123381 0.0454195 -0.0399114 -0.00880914 0.19876 0.0397053 -0.0868249 -0.0270711 0.026637 0.285576 -0.0261375 -0.00574811 -0.140695 -0.0305197 0.0544978 -0.0198104 0.0799286 -0.0166736 0.11468 -0.00760686 0.0483864 -0.0204855 -0.0240275 -0.0229201 0.0599492 -0.0421157 0.080487 -0.0152929 0.0249149 -0.00765788 -0.0620265 -0.120897 0.0555757 0.0754423 0.00989579 0.0203943 -0.0353525 0.0773399 -0.122865 -0.12408 -0.0226801 -0.00570013 -0.0757713 -0.00311563 0.0768198 0.0233228 -0.0798901 -0.0138757 0.0166798 -0.00172727 0.172795 -0.127171 0.0522499 -0.148353 0.21558 -0.0195233 -0.085372 0.0870496 0.168276 -0.048627 0.0555818 0.00556248 0.056942 -0.0918865 -0.0513899 0.0581841 0.126283 -0.0409371 0.00124674 0.0177191 0.0345234 -0.117121 0.0266968 -0.0850814 -0.0275385 
0.114128 0.00742568 -0.210384 -0.0228546 0.124902 0.137872 0.0186593 -0.0450235 -0.105259 -0.0493171 0.0493541 0.126373 0.0887789 -0.117954 -0.166809 0.0317268 -0.0640037 0.0298868 -0.136928 0.185686 0.118517 -0.0892628 0.0967681 0.0776769 -0.0227905 0.0184641 0.0221345 -0.169333 0.0238575 0.0651742 -0.067968 0.0586406 -0.11069 0.0547121 -0.109471 -0.0186297 -0.149337 0.0781035 -0.0341764 0.00329164 0.0071001 -0.0415765 -0.0551411 0.168071 -0.140755 -0.0125677 0.147623 0.0425957 -0.119387 0.109814 0.0482764 -0.019035 -0.129472 -0.0121726 0.0502698 -0.0617607 -0.00635832 0.183261 0.0321671 -0.0800871 -0.0226314 0.012441 0.277367 -0.0217828 0.00839094 -0.160491 -0.0394809 0.0801375 -0.0114482 0.0760115 -0.00672693 0.113129 0.00159844 0.0515754 -0.0318027 -0.0181582 -0.022837 0.0602083 -0.0526989 0.0797643 -0.0163685 0.0320382 -0.0180155 -0.0613079 -0.123415 0.0428846 0.0751206 0.0271653 0.0181869 -0.04481 0.0648506 -0.11981 -0.126726 -0.0185366 0.00104874 -0.0663782 0.00503195 0.0587543 0.0178166 -0.081191 -0.0192998 -0.00106805 -0.0160689 0.176214 -0.11741 0.032026 -0.151798 0.213362 -0.0117277 -0.0768843 0.0798816 0.180739 -0.046275 0.0732932 0.00680382 0.0494691 -0.111993 -0.0509332 0.0484329 0.120604 -0.0509544 0.039057 0.0285271 0.0402339 -0.0961865 0.0121897 -0.0892596 -0.0445305 
0.0990012 -0.000596349 -0.202776 -0.0196628 0.123007 0.122634 -0.000199025 -0.0445145 -0.122538 -0.0333532 0.0441151 0.135113 0.0861569 -0.10653 -0.172386 0.0318797 -0.0627102 0.0440662 -0.114683 0.186982 0.116721 -0.102315 0.103123 0.0905342 -0.0122978 0.0331214 0.0392088 -0.164268 0.0198263 0.0636126 -0.0772791 0.0386656 -0.107048 0.0408721 -0.114526 -0.0186944 -0.170413 0.0723461 -0.0389941 0.00258943 -0.0048731 -0.0350938 -0.0546455 0.17857 -0.140827 -0.0157161 0.156234 0.0346237 -0.114292 0.106756 0.0647464 -0.0221884 -0.132202 -0.0202057 0.057148 -0.0564536 -0.000250675 0.186854 0.0488828 -0.0837362 -0.00630255 0.00799853 0.272349 0.000691795 0.0124495 -0.170068 -0.0519468 0.0807394 -0.00615914 0.086026 -0.0062546 0.123855 0.00685673 0.0401084 -0.0383774 -0.0163998 -0.0251018 0.0714421 -0.0458785 0.0752777 -0.0294746 0.0327354 -0.0127462 -0.0590007 -0.129951 0.0225403 0.0783115 0.0406042 0.0336738 -0.0561202 0.0396367 -0.0993802 -0.115923 -0.0176777 0.00415384 -0.0691841 0.00646015 0.0676023 0.0189742 -0.0939745 -0.0236564 0.00577416 -0.0124956 0.167603 -0.111493 0.0325135 -0.153574 0.198847 -0.00706795 -0.0833257 0.0797793 0.183773 -0.0371969 0.0737938 0.003855 0.049118 -0.105956 -0.0558654 0.0410182 0.116513 -0.0609112 0.038017 0.0153118 0.0197308 -0.10839 0.0264848 -0.0892992 -0.0362843 
0.103992 0.001352 -0.210754 -0.0193347 0.117384 0.130465 0.00525088 -0.0484981 -0.114435 -0.0482576 0.0467657 0.125619 0.0903119 -0.0978244 -0.174013 0.0256045 -0.0686529 0.0380963 -0.115049 0.182546 0.123693 -0.10429 0.108444 0.0886529 -0.0132857 0.0208966 0.0347067 -0.167283 0.0221057 0.0690911 -0.0724008 0.0432829 -0.104282 0.0437892 -0.115048 -0.0150175 -0.161831 0.0751436 -0.0392647 0.000335029 -0.00252595 -0.03881 -0.0541017 0.172495 -0.145096 -0.018229 0.155641 0.0361179 -0.113084 0.108229 0.048019 -0.0172827 -0.119106 -0.00986352 0.0572945 -0.0534677 0.011566 0.186742 0.0459586 -0.091692 -0.0141657 0.0197144 0.279978 -0.00986688 0.00368686 -0.153071 -0.0420375 0.07645 -0.00320046 0.0874992 -0.013661 0.117614 -0.00155407 0.0477141 -0.0273113 -0.0196792 -0.0235785 0.0604017 -0.0496449 0.0755072 -0.028578 0.0328022 -0.0158488 -0.0650026 -0.126339 0.0413044 0.0707653 0.0333142 0.0264424 -0.0539974 0.0620547 -0.108617 -0.112587 -0.0276119 0.00501994 -0.0738689 -0.00109266 0.0820462 0.028701 -0.0890036 -0.017014 0.00287277 -0.00424169 0.170626 -0.114149 0.0370862 -0.153099 0.204966 -0.0116644 -0.083643 0.0770283 0.182002 -0.039044 0.0658587 0.00360087 0.0578772 -0.0966275 -0.0572355 0.0531615 0.121621 -0.0539377 0.0310942 0.0177931 0.0237099 -0.120053 0.0246912 -0.0887657 -0.0257539 
0.0934463 -0.0139247 -0.204346 -0.0103364 0.116618 0.106602 -0.00774076 -0.0447848 -0.117451 -0.0400043 0.0358204 0.137292 0.0863126 -0.108372 -0.183551 0.0334854 -0.0644196 0.0388619 -0.115277 0.19842 0.114804 -0.11743 0.116929 0.0855201 -0.0167624 0.0351788 0.0402247 -0.171902 0.00491131 0.0550351 -0.0800273 0.0432312 -0.0971749 0.0391237 -0.121395 -0.0226043 -0.173118 0.0889515 -0.0513636 -0.00387306 -0.0094031 -0.035794 -0.060402 0.174662 -0.140209 -0.0157792 0.153261 0.0300398 -0.102473 0.112834 0.0647379 -0.0286705 -0.121385 -0.016773 0.0588976 -0.0653917 0.0139803 0.168592 0.0589724 -0.0900388 0.00191953 0.00785172 0.259512 0.0123279 0.0141053 -0.176151 -0.0518754 0.0824131 0.00365635 0.0793417 -0.010995 0.117242 0.0106575 0.0413354 -0.0384169 -0.0142234 -0.0261029 0.0686784 -0.0477028 0.0831909 -0.036659 0.0245013 -0.0187153 -0.0600488 -0.128045 0.024487 0.0754093 0.0491013 0.0329037 -0.0692315 0.0315576 -0.0909268 -0.108646 -0.0231466 -0.00052813 -0.0672802 0.00812271 0.0713837 0.0226238 -0.0971066 -0.0195765 0.000707612 -0.0097429 0.169678 -0.0990297 0.0178795 -0.152496 0.202768 -0.00607842 -0.0816873 0.0689401 0.190467 -0.0343911 0.0695719 -0.00274439 0.0518539 -0.108922 -0.0549734 0.0388412 0.114185 -0.0742575 0.0502446 0.0125725 0.0143211 -0.106626 0.0228907 -0.0940515 -0.0335223 
0.100034 -0.0178094 -0.193507 -0.0102848 0.127283 0.106321 -0.00389304 -0.0412708 -0.112033 -0.0576531 0.0324743 0.141201 0.081634 -0.10728 -0.178353 0.0305042 -0.0592723 0.0324834 -0.136128 0.204709 0.108345 -0.103086 0.113514 0.086838 -0.0207694 0.027454 0.0316417 -0.159101 -0.000370413 0.0445949 -0.074052 0.0477578 -0.104289 0.0491311 -0.127477 -0.0182901 -0.171935 0.0892631 -0.0606652 0.00424232 0.00326421 -0.0223439 -0.0606533 0.166852 -0.137901 -0.0153772 0.144865 0.032472 -0.0960823 0.124119 0.0604899 -0.0353042 -0.128493 -0.0179793 0.0584998 -0.0718228 -0.00047874 0.176157 0.056526 -0.0830763 -0.00551574 0.0181755 0.249414 0.00962497 0.00653558 -0.175817 -0.0447452 0.0855038 -0.00287271 0.0782005 0.000124827 0.117383 0.0246603 0.0523351 -0.0382984 -0.0103031 -0.0270597 0.0595863 -0.0490739 0.0816263 -0.0262919 0.0300881 -0.0180799 -0.0624729 -0.125824 0.0253715 0.0793235 0.0507399 0.0199013 -0.0640471 0.0389805 -0.0958722 -0.109958 -0.0231737 0.000658063 -0.0603071 0.00863077 0.05448 0.0133824 -0.0931218 -0.0298457 -0.00339132 -0.0127117 0.174299 -0.108408 0.018637 -0.161873 0.202195 -0.00705599 -0.0805235 0.0795034 0.195306 -0.0389452 0.0825102 -0.00927226 0.0463601 -0.113361 -0.0503376 0.0341083 0.114356 -0.0751602 0.0618985 0.0110148 0.0216388 -0.0994923 0.0138053 -0.0995163 -0.0452127 
0.103365 -0.00542705 -0.202302 -0.0151723 0.127467 0.113215 -0.00157766 -0.0417986 -0.116556 -0.051699 0.0333465 0.135227 0.0822982 -0.108592 -0.172892 0.0339806 -0.051005 0.0302519 -0.134547 0.200211 0.0994786 -0.0946264 0.111909 0.0806504 -0.0234897 0.0279384 0.03358 -0.156773 0.00410705 0.0442791 -0.0737268 0.0534814 -0.105313 0.049959 -0.126442 -0.0178961 -0.161645 0.0867006 -0.0568155 0.0086024 0.00467886 -0.0241878 -0.055093 0.168581 -0.140638 -0.00665641 0.148993 0.0368793 -0.103981 0.123174 0.0656709 -0.0324746 -0.13255 -0.0178291 0.0541798 -0.072021 -0.000828682 0.175876 0.0623712 -0.0821946 -0.0119049 0.0185344 0.249617 -0.00140257 0.00751135 -0.175488 -0.0431056 0.0861684 -0.00427919 0.0783433 -0.000821567 0.116629 0.0241894 0.0547079 -0.0352241 -0.0116731 -0.0278625 0.065766 -0.0516766 0.0756509 -0.0198608 0.0322207 -0.0189895 -0.0621099 -0.123883 0.0274073 0.0754927 0.0427182 0.0186741 -0.0590232 0.0385449 -0.0984275 -0.115848 -0.027086 0.00547776 -0.0580325 0.0151817 0.0564968 0.00862049 -0.0931613 -0.0335429 0.000264156 -0.00970177 0.178945 -0.116614 0.0171598 -0.164845 0.204927 -0.0101525 -0.0777571 0.0842643 0.194382 -0.0367483 0.083999 -0.0126462 0.0373444 -0.115705 -0.0548575 0.0352896 0.111199 -0.068909 0.0590183 0.0199873 0.0265128 -0.0956009 0.0053625 -0.102608 -0.0494259 
0.0995951 -0.01657 -0.195823 -0.0168602 0.121482 0.109411 -0.00941143 -0.0388758 -0.120464 -0.0490393 0.0304451 0.137237 0.0830956 -0.100003 -0.174214 0.0326496 -0.0528567 0.0302771 -0.127994 0.197391 0.0995466 -0.0956513 0.11545 0.0818086 -0.023698 0.0409727 0.0400207 -0.158935 -0.00114612 0.0379841 -0.0746454 0.0502189 -0.105628 0.0475876 -0.131099 -0.017245 -0.169186 0.0954336 -0.055316 0.0128817 -0.000655753 -0.0189108 -0.0628943 0.168612 -0.138932 -0.013653 0.146929 0.0302604 -0.0978498 0.121074 0.0700049 -0.0329725 -0.129848 -0.0133539 0.0567924 -0.0718073 0.00944523 0.178436 0.0683297 -0.0883262 -0.00512361 0.0167654 0.247733 0.00770616 0.00646598 -0.175475 -0.0400194 0.0922085 0.00635904 0.0833268 -0.000206395 0.12012 0.0269686 0.0563457 -0.0365954 -0.0158912 -0.0324274 0.061776 -0.0494968 0.0762519 -0.0238422 0.0343857 -0.0132294 -0.0661034 -0.125268 0.017117 0.0827461 0.0503651 0.0247241 -0.069644 0.0327733 -0.091836 -0.105644 -0.0262868 0.00589235 -0.0578963 0.017412 0.0603689 0.0108568 -0.0925815 -0.0354182 0.00293432 -0.010516 0.180075 -0.112844 0.0128157 -0.1685 0.193977 -0.00945997 -0.0837798 0.0830993 0.201181 -0.036343 0.08362 -0.0098416 0.0397251 -0.113958 -0.0604516 0.0317744 0.103819 -0.0698603 0.0605875 0.0202541 0.0155807 -0.0995766 0.00811523 -0.103319 -0.041524 
0.107848 -0.0102973 -0.194736 -0.0223884 0.115084 0.129432 0.0041884 -0.0388931 -0.111192 -0.0699561 0.0372416 0.133323 0.0823361 -0.100809 -0.177274 0.0230135 -0.0658516 0.0194419 -0.131657 0.185562 0.114728 -0.0905017 0.109292 0.0764697 -0.0243058 0.0346719 0.0341672 -0.16242 0.00895096 0.0436956 -0.0690844 0.0500442 -0.10618 0.0570617 -0.125916 -0.0204131 -0.158233 0.101004 -0.0460558 0.0104546 0.00652947 -0.026891 -0.0618619 0.161395 -0.140645 -0.0208745 0.145388 0.0237414 -0.108894 0.118485 0.0484616 -0.0218697 -0.1214 -2.11562e-05 0.0588923 -0.0647592 0.0129279 0.188747 0.043453 -0.093044 -0.0159809 0.021782 0.269768 -0.00916993 0.00692007 -0.155824 -0.0324025 0.0834473 0.00100524 0.09067 -0.00619185 0.110548 0.0116317 0.0684359 -0.0233642 -0.0215196 -0.027442 0.0470363 -0.0510976 0.0775847 -0.0291299 0.0343136 -0.00563538 -0.0698936 -0.123077 0.0268301 0.0841288 0.0444529 0.0176919 -0.0594449 0.0626521 -0.113314 -0.107338 -0.0250772 0.00801973 -0.0640304 0.0140116 0.0688092 0.0200261 -0.0792636 -0.0325721 0.00415425 -0.0148189 0.185488 -0.115707 0.024035 -0.159875 0.20178 -0.0156044 -0.0947666 0.0830954 0.194802 -0.044764 0.07769 0.00595723 0.0488035 -0.105342 -0.0598529 0.0509204 0.114894 -0.05675 0.0501965 0.0243131 0.0183184 -0.0975251 0.0130163 -0.0876616 -0.035274 
0.108697 0.00823832 -0.196156 -0.0324789 0.108566 0.149552 0.00579404 -0.0362333 -0.122517 -0.0452132 0.0577155 0.122317 0.0935746 -0.0925951 -0.163541 0.017088 -0.0676445 0.0254447 -0.118707 0.176026 0.113711 -0.0842966 0.0976469 0.086044 -0.0202849 0.0319218 0.0357777 -0.150705 0.0337577 0.0512664 -0.0652598 0.0357726 -0.116625 0.0496065 -0.124352 -0.00892772 -0.160939 0.0756454 -0.0303721 0.0221933 0.0050964 -0.0384766 -0.0658935 0.168571 -0.147072 -0.0318933 0.148154 0.0380188 -0.115995 0.109707 0.0486146 -0.00184451 -0.137822 -0.000728154 0.050667 -0.0531688 0.00438528 0.200731 0.0416649 -0.0878526 -0.0275458 0.023636 0.286281 -0.0167919 -0.00357816 -0.14457 -0.0238679 0.0768789 -0.00280085 0.0980974 -0.00641117 0.123707 0.0070503 0.071191 -0.0151287 -0.0317981 -0.027607 0.0589076 -0.0445874 0.0751971 -0.021008 0.0308245 0.00512197 -0.0645686 -0.123731 0.0350138 0.0860958 0.0352865 0.0286767 -0.0543592 0.0704063 -0.116135 -0.105415 -0.0177358 0.00590845 -0.0852269 0.00671487 0.074599 0.0189877 -0.0826053 -0.0292663 0.0174197 -0.0108859 0.175363 -0.118034 0.048829 -0.152641 0.199015 -0.00905434 -0.0935246 0.0851343 0.187051 -0.0416387 0.0786682 0.00726685 0.0485409 -0.0903508 -0.0577199 0.0544452 0.117754 -0.0464669 0.0173094 0.0233362 0.0223372 -0.115129 0.0241045 -0.0844699 -0.0166637 
0.116271 0.0200118 -0.200724 -0.0214616 0.105761 0.15716 0.02748 -0.0347366 -0.114575 -0.0569385 0.057556 0.115136 0.0965601 -0.103058 -0.166513 0.0160836 -0.0659247 0.0305224 -0.133803 0.169694 0.127488 -0.0926731 0.0957448 0.0885891 -0.019776 0.00205544 0.0169428 -0.158252 0.0376007 0.0653769 -0.0652014 0.0545091 -0.112761 0.0642004 -0.121788 -0.0225742 -0.143877 0.0718795 -0.0343658 0.0111852 0.0132402 -0.050864 -0.0471258 0.15766 -0.146983 -0.0376995 0.150771 0.0328835 -0.127257 0.110721 0.0455414 -0.00989215 -0.125719 0.00414496 0.0463857 -0.0450734 0.00981092 0.191608 0.0389683 -0.093086 -0.0326199 0.0320843 0.279929 -0.0393607 -0.00609613 -0.128659 -0.0258365 0.0563841 -0.0223703 0.0883697 -0.0210917 0.108002 -0.00489531 0.0739136 -0.0109527 -0.0287148 -0.0141542 0.0492673 -0.0497117 0.0709722 -0.0254239 0.0247866 -0.00307531 -0.0669094 -0.115363 0.0625898 0.0733734 0.0168444 0.017466 -0.0411101 0.0861316 -0.135728 -0.115059 -0.028996 0.00406602 -0.0737123 -0.00224981 0.0838647 0.0208346 -0.0671058 -0.0188235 0.0124932 -0.00409977 0.19266 -0.114964 0.046108 -0.149306 0.216342 -0.0192126 -0.0964049 0.0735516 0.180401 -0.0450736 0.0651888 0.00857122 0.0502626 -0.0850915 -0.0512004 0.0683879 0.128104 -0.0407858 0.0147976 0.022169 0.0334569 -0.109358 0.017712 -0.0844219 -0.0256255 
0.114162 0.0344262 -0.199577 -0.0244186 0.0981143 0.162408 0.0281888 -0.0359602 -0.119178 -0.046976 0.0633199 0.110977 0.0956355 -0.101615 -0.152527 0.00523414 -0.0711846 0.0267017 -0.123797 0.166517 0.11487 -0.0865746 0.0861551 0.0987961 -0.0174026 0.000718904 0.0227747 -0.152845 0.0444334 0.0722074 -0.0662247 0.0418738 -0.113709 0.0606301 -0.115573 -0.0152392 -0.143962 0.059103 -0.0389264 0.0167574 0.01246 -0.060974 -0.0484867 0.16904 -0.151103 -0.0256431 0.157404 0.0412883 -0.137122 0.113376 0.0494701 -0.000623024 -0.128821 -0.00351788 0.0505531 -0.0377075 -0.00821617 0.198776 0.0433232 -0.0919645 -0.0410579 0.0308715 0.285504 -0.0411692 -0.0102277 -0.126989 -0.0200023 0.0467835 -0.0321638 0.0918227 -0.0202571 0.108662 -0.00597889 0.0721204 -0.00421499 -0.0315427 -0.0194194 0.0533636 -0.0408384 0.0782598 -0.0189248 0.020056 -0.00701499 -0.0699721 -0.112884 0.0563303 0.0689663 0.00484893 0.0225926 -0.0271193 0.0841699 -0.135078 -0.113219 -0.0319585 -0.00140866 -0.0808895 0.00160635 0.0791756 0.0284117 -0.0788369 -0.0199488 0.025027 0.00122969 0.178875 -0.130601 0.0566098 -0.148749 0.215786 -0.0191799 -0.091902 0.0878828 0.178256 -0.0460867 0.0580584 0.0038205 0.0499707 -0.0781172 -0.0554474 0.0721363 0.132529 -0.0318531 -0.0024428 0.0205907 0.0407623 -0.109903 0.0212867 -0.0727079 -0.0230498 
0.114606 0.0223822 -0.196338 -0.0183061 0.101574 0.154941 0.0247132 -0.0367991 -0.118149 -0.0471418 0.0643459 0.114939 0.0992045 -0.102049 -0.163944 0.0187852 -0.0659652 0.0335015 -0.12978 0.170682 0.127977 -0.0974902 0.0982639 0.0909868 -0.0167641 0.00582133 0.0172132 -0.158407 0.0427474 0.0661378 -0.0657752 0.0537592 -0.111018 0.0618034 -0.123053 -0.022394 -0.147899 0.075403 -0.028662 0.0139175 0.00798114 -0.0543889 -0.0510317 0.156755 -0.148298 -0.0420034 0.150993 0.0320185 -0.126762 0.108069 0.0516124 -0.00226269 -0.130238 0.00388868 0.0442094 -0.0450604 0.0138419 0.189179 0.0403175 -0.0904841 -0.0334126 0.0255745 0.280062 -0.0365703 -0.00447134 -0.128529 -0.0259089 0.0556763 -0.0229832 0.09271 -0.0213527 0.112355 -0.00716904 0.0760192 -0.0083497 -0.0339617 -0.0147971 0.0529884 -0.0488706 0.0753501 -0.0285386 0.0207804 0.000897081 -0.0657542 -0.115769 0.0604933 0.0741598 0.0174737 0.0204172 -0.0459716 0.0802305 -0.131649 -0.111744 -0.0252822 0.00127693 -0.0811594 -0.0034178 0.0875904 0.022564 -0.0703975 -0.018579 0.0155357 -0.0035793 0.193879 -0.107274 0.0479414 -0.144085 0.217093 -0.00755949 -0.101481 0.0655966 0.182792 -0.0443255 0.0651897 0.012307 0.0503752 -0.0828038 -0.0506326 0.0687199 0.131193 -0.0414375 0.0109479 0.0184149 0.0319968 -0.110431 0.0225488 -0.0790527 -0.0174204 
0.111742 0.0113234 -0.194357 -0.0200919 0.0999334 0.157655 0.0169675 -0.0353016 -0.113661 -0.0510963 0.0649322 0.121611 0.094221 -0.100451 -0.168493 0.0179785 -0.0676993 0.0357271 -0.125663 0.16712 0.130559 -0.0938214 0.100034 0.0931018 -0.019068 0.0169419 0.028921 -0.164361 0.0359239 0.059206 -0.0658409 0.047444 -0.10548 0.0605617 -0.121533 -0.0191912 -0.149287 0.0804733 -0.0328818 0.0130511 0.00820456 -0.0483391 -0.0592507 0.159657 -0.149911 -0.044671 0.150835 0.0252035 -0.127464 0.104604 0.0495275 -0.00532212 -0.126398 0.00638998 0.0506203 -0.0406859 0.0186529 0.192327 0.0367535 -0.0951879 -0.0307416 0.0219717 0.286721 -0.0338505 0.00277789 -0.13047 -0.0272496 0.0631696 -0.0151388 0.103812 -0.0203107 0.110014 -0.00692233 0.0692674 -0.00886506 -0.0332267 -0.021015 0.0557793 -0.051269 0.0686712 -0.0370353 0.0292315 0.00304511 -0.0702331 -0.121148 0.0540168 0.0818107 0.0240905 0.0187974 -0.0471564 0.0798514 -0.131944 -0.109732 -0.0242958 0.00596875 -0.0784731 -0.00259857 0.0865361 0.0250901 -0.0692679 -0.0177057 0.013027 -0.00763902 0.186524 -0.103796 0.0450834 -0.144924 0.203341 -0.0164325 -0.106995 0.0661881 0.185907 -0.038677 0.0618284 0.0202237 0.0515532 -0.0879523 -0.0601354 0.0693531 0.127639 -0.0375131 0.0121647 0.020199 0.0252467 -0.106762 0.0286079 -0.0749838 -0.0141141 
0.109945 0.0211832 -0.193065 -0.0191454 0.105439 0.152944 0.0283975 -0.0371184 -0.115899 -0.0468188 0.0620768 0.119261 0.0958852 -0.0963955 -0.162076 0.0179054 -0.0663573 0.0310891 -0.130747 0.170581 0.126277 -0.0985272 0.0948365 0.087362 -0.015773 0.0121289 0.0140317 -0.156177 0.0446035 0.0645484 -0.0648597 0.0602668 -0.110407 0.0617076 -0.123122 -0.0189253 -0.147173 0.0849366 -0.0300945 0.0107088 0.0142579 -0.0489571 -0.0507873 0.152533 -0.149205 -0.0399483 0.151443 0.0277582 -0.126932 0.101832 0.0454465 -0.00146862 -0.131808 0.00371244 0.0526084 -0.0419628 0.0075393 0.197131 0.0328422 -0.0908741 -0.0358877 0.0221851 0.284416 -0.0392481 0.00317563 -0.119087 -0.0286601 0.0599392 -0.0250314 0.0964353 -0.0165982 0.11576 -0.00475603 0.0797295 -0.00596975 -0.0311707 -0.0148317 0.0518751 -0.0472605 0.0641619 -0.0334967 0.0274564 0.00198116 -0.0682911 -0.116982 0.0513051 0.0787586 0.025458 0.0234426 -0.044876 0.0814072 -0.135031 -0.108506 -0.0267119 0.0051279 -0.0813627 0.00170001 0.0828907 0.0265089 -0.0681155 -0.0239785 0.0124577 -0.00679403 0.19209 -0.114081 0.0533065 -0.146398 0.212164 -0.00646402 -0.106052 0.0665988 0.185633 -0.0477685 0.0669997 0.0212921 0.0469142 -0.0839093 -0.0552464 0.0716429 0.131694 -0.0374837 0.0151707 0.0207562 0.0327816 -0.10804 0.0270768 -0.0756697 -0.0203342 
0.110873 0.0120989 -0.187074 -0.0152335 0.106518 0.150191 0.0280846 -0.0303561 -0.121609 -0.0386289 0.062122 0.126867 0.100636 -0.10125 -0.163046 0.0239816 -0.0576364 0.0399099 -0.133774 0.176059 0.129042 -0.103245 0.0991326 0.0933261 -0.0204556 0.0155899 0.0113336 -0.161997 0.040089 0.060781 -0.0697011 0.0680721 -0.106223 0.0675198 -0.129952 -0.0261446 -0.148684 0.088252 -0.0308626 0.0110696 0.0120064 -0.0497521 -0.0501611 0.147525 -0.149806 -0.0522086 0.150553 0.0215526 -0.125294 0.104567 0.0604479 -0.0138462 -0.136649 0.00569824 0.0503929 -0.0417906 0.0149658 0.190158 0.0386464 -0.0872713 -0.0296217 0.018507 0.271726 -0.0386141 0.00837831 -0.125964 -0.0341555 0.0578652 -0.0281842 0.0940204 -0.0210244 0.114342 -0.00522201 0.0798011 -0.0110132 -0.0305499 -0.00909295 0.0551377 -0.0471661 0.0611814 -0.0397936 0.0236604 0.00574651 -0.0654899 -0.116184 0.0512925 0.0848846 0.0269348 0.0239036 -0.0491946 0.0702965 -0.132844 -0.109445 -0.0218677 0.00293216 -0.0741089 -0.000341282 0.0848657 0.0183003 -0.0622812 -0.0214193 0.0115238 -0.00965692 0.201192 -0.0996822 0.0448637 -0.146208 0.207871 -0.0068251 -0.11233 0.0526891 0.18845 -0.0425088 0.0657698 0.0213448 0.043313 -0.0836277 -0.0557243 0.0648194 0.133494 -0.0409618 0.0181785 0.0182566 0.0284592 -0.104023 0.0269621 -0.0797896 -0.0210657 
