-0.00846329 0.0444908 0.0208174 -0.0458337 0.122562 0.14328 0.00325595 -0.108249 -0.139233 -0.015983 -0.019722 0.0765691 0.0415512 0.019591 0.0351811 -0.0460702 -0.0401259 0.0716409 0.0203339 0.119665 0.0486233 0.0270295 0.136229 0.030489 -0.0554134 0.0990492 -0.0927826 -0.149825 0.159052 0.0125385 0.0200001 0.0956566 -0.029664 0.0109764 0.0835028 0.0825178 -0.000486941 0.214418 0.0075369 -0.0392773 0.0407172 0.0285766 -0.114758 -0.0141433 -0.238172 0.0794854 0.146231 0.0297024 -0.11502 -0.0139548 -0.0855178 0.0823132 -0.0227878 0.0263921 0.0847376 0.0095385 0.116043 0.167632 -0.1007 -0.0382631 -0.0990994 0.0549368 0.221364 -0.131114 0.199973 -0.0321193 0.0283619 0.0120065 -0.0833924 0.18693 0.0190987 0.0800392 -0.0413205 0.112299 0.0444901 -0.0279748 -0.100163 0.040899 0.0706083 -0.0708394 -0.0694633 0.125978 0.0148271 0.00262378 0.0058206 -0.12434 0.0584377 0.120165 -0.0323969 0.0363217 0.169408 -0.0205907 0.055723 0.00305161 0.0209641 -0.179138 0.0555358 0.19533 0.0558068 -0.00953044 -0.0163389 0.0605057 -0.0721046 0.0973983 -0.0596148 0.0955286 0.0275981 0.0139888 0.155842 -0.0226158 -0.0117866 0.124084 -0.0448226 0.028948 0.0769562 0.0392194 -0.0523395 -0.18996 0.0123556 0.130378 0.0481689 -0.0416369 -0.00737717 -0.0307681 -0.0837554 0.123987 0.0115331 0.0183895 
0.0177245 0.0470505 0.0227786 -0.0222665 0.130281 0.142221 0.0172729 -0.13152 -0.133571 -0.00241584 0.00535436 0.101047 0.048965 0.0325581 0.0323412 -0.0362664 -0.00913151 0.118455 0.0175069 0.109825 0.069661 0.0362408 0.124057 0.0878538 -0.0383503 0.0811775 -0.07421 -0.160238 0.151731 0.0696267 -0.00464917 0.114375 -0.0271477 0.023808 0.081026 0.0715987 0.00154137 0.187827 0.00311292 -0.0333576 0.029184 0.0252077 -0.0919559 -0.00450008 -0.234352 0.0699461 0.162639 0.0137662 -0.118327 -0.0177912 -0.0192823 0.0711891 -0.0327838 0.0181562 0.107928 0.0293596 0.106492 0.176835 -0.0860669 -0.0224831 -0.0894061 0.0244079 0.209445 -0.147438 0.212339 -0.0622203 0.0195778 -0.0064893 -0.107951 0.220628 0.0140218 0.0890514 -0.0582746 0.0865866 0.0223279 -0.0243811 -0.0774285 0.0670842 0.0495719 -0.0857868 -0.0647285 0.153655 0.00460373 -0.00771587 -0.00148554 -0.123059 0.0578119 0.0818797 -0.0486773 0.0543294 0.135411 -0.0375318 0.0335254 -0.00242415 0.0195306 -0.152755 0.0376364 0.185138 0.0834067 -0.007148 -0.000921265 0.069634 -0.0614651 0.115219 -0.0590593 0.0769419 0.00922815 -0.00242836 0.132732 -0.0364094 -0.0283415 0.120753 -0.0351372 0.0125498 0.0804634 0.0488371 -0.0424452 -0.20134 -0.00230367 0.14664 0.057007 -0.0356484 -0.0124411 -0.0250955 -0.0787977 0.14157 0.0176941 0.00713453 
0.040041 0.0448716 -0.0120219 -0.0497885 0.142987 0.152926 0.00786751 -0.102634 -0.172483 0.0236862 0.00184858 0.10702 0.077951 0.0218723 0.0231609 -0.0171589 -0.0152629 0.128216 0.0185179 0.132465 0.0912942 0.013033 0.134185 0.0810556 -0.0304734 0.0893788 -0.0594644 -0.174349 0.140325 0.0790801 -0.026994 0.0908536 -0.0334358 0.0234593 0.0587851 0.0563225 -0.0250016 0.176863 0.0231092 -0.0405631 0.00764082 0.0193647 -0.0666443 0.0287805 -0.242016 0.0443453 0.183518 0.0173061 -0.141729 0.0029822 0.00811528 0.0393631 -0.0615713 0.0256228 0.11185 0.0144981 0.103192 0.192339 -0.0677057 -0.0515638 -0.0772668 0.0136085 0.228781 -0.133848 0.194522 -0.0657081 -0.0139558 0.0234651 -0.104045 0.183553 0.0209355 0.114834 -0.0578568 0.0576202 0.00948506 -0.0171288 -0.0748228 0.0655465 0.0654251 -0.0631713 -0.0628815 0.131749 0.015066 0.000444427 -0.0276166 -0.109843 0.0670709 0.0926124 0.0042025 0.0412769 0.106626 -0.0466187 0.00432027 0.00597956 0.00663456 -0.154884 0.0348502 0.200914 0.0497548 -0.0227735 8.23742e-05 0.0666174 -0.0551597 0.119671 -0.0804759 0.0850827 -0.0238587 0.0231367 0.125305 -0.0599909 -0.0152644 0.129079 -0.0377933 0.0294471 0.0821568 0.0500238 -0.0565492 -0.186179 -0.014801 0.148483 0.0497185 -0.0503208 0.00303847 -0.0317437 -0.0856862 0.127871 0.00877302 0.0083406 
-0.0248834 0.0724532 -0.0195196 -0.0453892 0.123841 0.154146 -0.0409577 -0.133665 -0.121064 -0.00499931 0.00687169 0.0686205 0.0357675 0.00418565 0.0285858 -0.0252241 -0.0319224 0.0911714 0.0501415 0.127831 0.0555187 0.0317597 0.121319 0.0431628 -0.0375028 0.0915756 -0.0726812 -0.151466 0.165908 0.0398229 0.0453155 0.0617816 0.00478995 -0.0121905 0.111201 0.120747 0.0114154 0.139102 0.0140553 -0.0454854 0.0336472 0.0215802 -0.0781147 0.0300897 -0.235949 0.0823904 0.185376 0.0459841 -0.119918 -0.0145499 -0.0919202 0.0697909 -0.0220144 0.00523148 0.0866558 0.0376077 0.0847607 0.155563 -0.0997012 -0.0357646 -0.12283 0.0503668 0.250174 -0.136627 0.198873 -0.0463348 0.00949386 -0.0153451 -0.0866736 0.188053 0.0271082 0.0695179 -0.0587562 0.0655414 0.0543373 -0.0223777 -0.106238 0.082008 0.0534376 -0.0833543 -0.0554285 0.148171 0.00163518 0.0235065 -0.0054989 -0.0771014 0.0321986 0.101016 -0.0342753 0.0547766 0.165177 -0.0197917 0.0200451 0.00428641 0.0453485 -0.176424 0.0217345 0.21329 0.0304944 -0.0271469 -0.0198331 0.056899 -0.0551226 0.0388805 -0.0701602 0.133828 0.0417189 -0.00459117 0.143183 0.00546541 -0.0148565 0.0775517 -0.0309723 0.0207472 0.0566679 0.0296836 -0.0396908 -0.196143 0.0144887 0.136269 0.0688617 -0.0695702 -0.0044269 -0.0210785 -0.11021 0.139641 0.0345451 0.0408262 
-0.0797955 0.163499 -0.0469414 0.0414739 0.0577119 0.11287 -0.03725 -0.21095 -0.0804294 0.0495066 -0.00625736 0.00763191 0.0293154 0.08377 0.0169039 -0.025548 0.0683478 0.133137 0.117131 0.0548345 0.0124653 -0.0115649 0.0333891 0.0875739 -0.00212305 0.0042355 -0.154415 -0.0712375 0.167731 0.136689 0.0670899 0.124528 0.0233455 -0.103561 0.131153 0.145914 -0.00124509 0.0322592 -0.0281867 -0.0616994 -0.028965 0.0416372 -0.0201717 -0.00494142 -0.12151 0.136049 0.188735 0.0570327 -0.103665 -0.0990116 -0.0211745 0.123633 0.0781347 -0.0900877 0.0628195 0.0999652 0.0490779 0.0919317 0.0172423 -0.0268884 -0.111536 0.123937 0.141905 -0.159725 0.156424 -0.00253614 0.0485008 -0.0998191 -0.155652 0.155448 0.0453533 0.0301192 -0.0559186 0.0200699 0.0261013 0.0322671 -0.0683443 0.0570419 0.0254959 -0.120114 -0.0288117 0.161956 -0.0825381 0.0194872 0.0462243 -0.0474606 -0.0761025 -0.0363238 -0.0532538 0.0593315 0.0505825 0.0470239 0.0634248 -0.0250427 0.0906862 -0.118093 0.0417251 0.198653 0.0273891 -0.0126238 0.0452248 0.11025 0.0152536 -0.0272062 -0.143814 0.150746 0.0739996 -0.0723621 0.138099 0.094394 -0.00491817 -0.0265111 -0.0130282 -0.0911666 -0.0267727 0.0114506 -0.0195536 -0.16296 0.0152267 0.0978578 0.0337992 -0.114928 -0.0334511 -0.0593461 -0.126086 0.190553 0.0301485 0.0222615 
