{
  "descriptor": [
    -0.06746064126491547,
    0.06708897650241852,
    0.1354036033153534,
    -0.03654255345463753,
    -0.13954676687717438,
    0.06253321468830109,
    -0.10710088163614273,
    -0.03961203992366791,
    0.1426125168800354,
    -0.16528427600860596,
    0.19209861755371094,
    -0.0011442098766565323,
    -0.2291092872619629,
    0.10532797873020172,
    -0.05783713981509209,
    0.18645432591438293,
    -0.1833437979221344,
    -0.17522943019866943,
    -0.05888352915644646,
    -0.050707899034023285,
    -0.04307275265455246,
    0.1110692024230957,
    -0.029154665768146515,
    0.04082950949668884,
    -0.13145773112773895,
    -0.40166017413139343,
    -0.08074875175952911,
    -0.07672137767076492,
    0.03469990938901901,
    -0.07068998366594315,
    -0.1143210381269455,
    0.049147915095090866,
    -0.09767421334981918,
    0.04107237234711647,
    0.11522237956523895,
    0.08165370672941208,
    -0.06918042153120041,
    -0.15188127756118774,
    0.21874479949474335,
    0.08319099992513657,
    -0.24525101482868195,
    -0.014810673892498016,
    0.09369810670614243,
    0.260468989610672,
    0.21436858177185059,
    -0.01473337784409523,
    0.06026161462068558,
    -0.09067337214946747,
    0.16156825423240662,
    -0.290597140789032,
    0.015154737047851086,
    0.21267041563987732,
    0.05936204269528389,
    0.10537923127412796,
    0.09251537919044495,
    -0.14605525135993958,
    -0.016678892076015472,
    0.11654246598482132,
    -0.10290230065584183,
    0.044196806848049164,
    0.07613550871610641,
    -0.08183692395687103,
    0.01922471448779106,
    -0.06101648882031441,
    0.1954033374786377,
    0.07082267105579376,
    -0.14335551857948303,
    -0.14316439628601074,
    0.22425256669521332,
    -0.14871619641780853,
    -0.0876656323671341,
    0.026047509163618088,
    -0.13821247220039368,
    -0.2074861377477646,
    -0.2216678261756897,
    0.04712683707475662,
    0.37687069177627563,
    0.17284031212329865,
    -0.1313825249671936,
    0.07213963568210602,
    0.003918635658919811,
    -0.04534167796373367,
    0.020306352525949478,
    0.18685564398765564,
    -0.06490995734930038,
    0.00279527110978961,
    -0.043370623141527176,
    0.03309191018342972,
    0.2784235179424286,
    0.003941019531339407,
    0.04437991604208946,
    0.19549697637557983,
    -0.01955731213092804,
    0.018938254565000534,
    0.09237176924943924,
    0.12884876132011414,
    -0.15589317679405212,
    -0.07134070247411728,
    -0.2058270424604416,
    -0.015964575111865997,
    -0.02888735570013523,
    -0.03194038197398186,
    -0.011442958377301693,
    0.16530731320381165,
    -0.16837440431118011,
    0.1458706557750702,
    -0.08722762763500214,
    -0.0981069803237915,
    -0.03148648515343666,
    -0.015278585255146027,
    -0.06434585899114609,
    -0.02669905684888363,
    0.148624986410141,
    -0.1893823742866516,
    0.10843001306056976,
    0.16034503281116486,
    0.07669035345315933,
    0.15144063532352448,
    0.1093764454126358,
    0.029182136058807373,
    0.011118545196950436,
    -0.06657858192920685,
    -0.18372893333435059,
    -0.13539594411849976,
    0.022811222821474075,
    -0.029719507321715355,
    -0.03465289622545242,
    -0.017164545133709908
  ]
}