{
  "descriptor": [
    -0.08343596756458282,
    0.12579505145549774,
    -0.06253655254840851,
    0.02251068316400051,
    -0.1180267482995987,
    -0.012252232991158962,
    0.05065370351076126,
    -0.13641837239265442,
    0.08445864915847778,
    0.012134184129536152,
    0.2025516778230667,
    -0.12496861070394516,
    -0.2827349007129669,
    -0.09761612862348557,
    0.0057015432976186275,
    0.10541459172964096,
    -0.08999251574277878,
    -0.11516211181879044,
    -0.24864518642425537,
    -0.04645295441150665,
    0.007026214152574539,
    -0.014890920370817184,
    0.06010007858276367,
    0.053425755351781845,
    -0.0853218212723732,
    -0.3300965428352356,
    -0.05311806499958038,
    -0.08007197827100754,
    0.06454471498727798,
    -0.07599257677793503,
    0.004532470367848873,
    0.07452746480703354,
    -0.148835226893425,
    -0.12412196397781372,
    0.07822280377149582,
    0.020569026470184326,
    -0.06269320100545883,
    -0.054473694413900375,
    0.263736754655838,
    -0.0368478000164032,
    -0.14788153767585754,
    -0.007286163978278637,
    0.09535378217697144,
    0.22304552793502808,
    0.24306215345859528,
    0.05507799610495567,
    -0.016924265772104263,
    -0.10229919105768204,
    0.08818331360816956,
    -0.2547791600227356,
    0.009272214025259018,
    0.18206456303596497,
    0.08553210645914078,
    0.12015040963888168,
    0.05661191791296005,
    -0.12944699823856354,
    -0.016870643943548203,
    0.15021948516368866,
    -0.2307279258966446,
    0.005231483839452267,
    0.024869702756404877,
    -0.094310462474823,
    -0.11938896775245667,
    -0.15741786360740662,
    0.1813967525959015,
    0.14577457308769226,
    -0.14386068284511566,
    -0.13954176008701324,
    0.1784861832857132,
    -0.16479019820690155,
    -0.05582979694008827,
    0.03146309405565262,
    -0.07494660466909409,
    -0.15785926580429077,
    -0.25573500990867615,
    0.044577885419130325,
    0.4100677967071533,
    0.14629939198493958,
    -0.23208272457122803,
    -0.08622291684150696,
    -0.06938306242227554,
    -0.0727040246129036,
    0.0010061088250949979,
    0.002654271898791194,
    -0.0868038684129715,
    -0.15857350826263428,
    -0.06112322211265564,
    -0.029996108263731003,
    0.14366839826107025,
    -0.027413146570324898,
    -0.010623137466609478,
    0.19374434649944305,
    0.004811496939510107,
    0.0054786959663033485,
    0.041294969618320465,
    0.090601347386837,
    -0.15880973637104034,
    0.014712827280163765,
    -0.1462523192167282,
    0.009033862501382828,
    0.025186700746417046,
    -0.13272897899150848,
    0.06059921905398369,
    0.0765429437160492,
    -0.09446242451667786,
    0.1904655396938324,
    -0.003003629157319665,
    -0.008523071184754372,
    0.0031949742697179317,
    -0.059920333325862885,
    -0.0753268152475357,
    0.012035424821078777,
    0.17383435368537903,
    -0.23066198825836182,
    0.24625298380851746,
    0.12433823198080063,
    0.006633554119616747,
    0.13037946820259094,
    0.07554842531681061,
    0.12797316908836365,
    0.0037417628336697817,
    0.04493412375450134,
    -0.1683388501405716,
    -0.134794682264328,
    0.04967090114951134,
    -0.026595404371619225,
    -0.0036622583866119385,
    0.01744767837226391
  ]
}