{
  "descriptor": [
    -0.2160668969154358,
    0.05251369625329971,
    0.09067736566066742,
    -0.06552661210298538,
    -0.19003936648368835,
    -0.012090235017240047,
    -0.05500728264451027,
    -0.09469471126794815,
    0.1571158617734909,
    -0.09375812858343124,
    0.1548037827014923,
    -0.0015571929980069399,
    -0.24382182955741882,
    0.025570476427674294,
    -0.07980504631996155,
    0.20954151451587677,
    -0.1510637253522873,
    -0.16080674529075623,
    -0.0844523087143898,
    -0.05973494425415993,
    0.040783174335956573,
    0.05764622241258621,
    -0.006569513585418463,
    0.09038350731134415,
    -0.10962802171707153,
    -0.35034018754959106,
    -0.04464080557227135,
    -0.05363443121314049,
    -0.035622116178274155,
    -0.06455888599157333,
    -0.052944473922252655,
    0.03275391459465027,
    -0.14824062585830688,
    -0.024850575253367424,
    0.06020572781562805,
    0.12067736685276031,
    -0.06677139550447464,
    -0.09875793009996414,
    0.1989516317844391,
    0.047293853014707565,
    -0.26627516746520996,
    0.006233743857592344,
    0.1196310967206955,
    0.2550555467605591,
    0.18869945406913757,
    0.05704205483198166,
    0.018542563542723656,
    -0.10186367481946945,
    0.15422841906547546,
    -0.34390875697135925,
    0.0580110065639019,
    0.18972046673297882,
    0.026705611497163773,
    0.016447609290480614,
    0.12689897418022156,
    -0.16884908080101013,
    0.008205294609069824,
    0.11151406168937683,
    -0.19064638018608093,
    0.039443887770175934,
    0.06434320658445358,
    -0.062299977988004684,
    -0.08262822031974792,
    -0.12402801215648651,
    0.16956202685832977,
    0.1580994427204132,
    -0.10944957286119461,
    -0.14438672363758087,
    0.2288437783718109,
    -0.15683843195438385,
    -0.09593293815851212,
    0.05663789436221123,
    -0.10812260955572128,
    -0.22694624960422516,
    -0.2750827372074127,
    0.02783379890024662,
    0.40330663323402405,
    0.17114891111850739,
    -0.13101394474506378,
    0.052931271493434906,
    -0.02037292905151844,
    -0.013294951990246773,
    0.015495546162128448,
    0.09875035285949707,
    -0.057761408388614655,
    0.006120755802839994,
    -0.06847530603408813,
    0.0068426881916821,
    0.18638558685779572,
    0.0168196652084589,
    0.05074891820549965,
    0.27678126096725464,
    0.07490289211273193,
    -0.041725654155015945,
    0.05331245809793472,
    0.12352140992879868,
    -0.12975269556045532,
    -0.037566255778074265,
    -0.19940541684627533,
    -0.06648559868335724,
    0.07845576107501984,
    -0.048209547996520996,
    0.053805869072675705,
    0.1086650863289833,
    -0.24560710787773132,
    0.12658551335334778,
    -0.06618057936429977,
    -0.05483097583055496,
    -0.026283377781510353,
    -0.0337221696972847,
    -0.09124670922756195,
    -0.007482291664928198,
    0.1307523548603058,
    -0.21001268923282623,
    0.15380217134952545,
    0.19115705788135529,
    0.03960469365119934,
    0.13882417976856232,
    0.09238992631435394,
    0.022894853726029396,
    0.021423589438199997,
    -0.05186526104807854,
    -0.15448416769504547,
    -0.11026687920093536,
    0.048758383840322495,
    -0.061645202338695526,
    -0.02066093124449253,
    0.07330271601676941
  ]
}