0.0834816 0.0409453 -0.114183 0.0237577 0.116395 0.163489 0.0394706 -0.051558 -0.049467 -0.10176 0.0899459 0.156155 0.0759896 -0.122307 -0.167144 -0.000639713 -0.037508 0.0829319 -0.138843 0.131697 0.220501 -0.065546 0.0105335 0.188885 0.0374072 -0.027606 0.000301724 -0.172612 0.077973 0.151832 -0.00960793 0.0401722 -0.067267 0.0829419 -0.0513674 -0.0333958 -0.0988391 0.0315776 -0.0184743 -0.0292085 0.05107 -0.0415808 0.00497262 0.157788 -0.106703 -0.0877132 0.176355 -0.0207566 -0.135248 0.0135243 0.0542651 -0.0111495 -0.066612 -0.0209573 0.0893823 0.037025 -0.0500981 0.191189 -0.0270692 -0.109581 -0.0572695 -0.0250777 0.254932 -0.0703393 0.0210375 -0.121609 -0.0181595 -0.0225934 -0.0805753 0.08435 -0.0191812 0.0529124 -0.0638706 -0.026971 -9.71393e-05 0.00356088 -0.0196145 0.0915287 -0.047879 0.0992579 -0.0728406 0.0873596 0.0451917 -0.0364706 -0.0755315 0.0538375 0.0969392 0.00823832 -0.0319802 -0.000758431 0.0663358 -0.172 -0.127147 0.0181986 -0.020953 -0.0737557 -0.0446911 0.0586169 0.0183794 -0.0515846 0.0040473 0.0199626 -0.0212791 0.195192 -0.106116 0.0578484 -0.0929745 0.172802 -0.0226849 -0.116694 0.0259424 0.103739 -0.125711 0.0393673 0.0462087 0.067508 -0.137195 -0.0823459 0.0475422 0.165296 -0.00747844 0.0277069 -0.054182 0.00770132 -0.0751357 0.0868668 -0.0280114 -0.0323377 
0.0901112 0.0235622 -0.132405 0.0228231 0.111159 0.150967 0.032082 -0.0311262 -0.0471255 -0.116035 0.0754663 0.148272 0.0773843 -0.145374 -0.184926 0.0118631 -0.0402421 0.063868 -0.153264 0.153536 0.214907 -0.0845145 0.0400478 0.156213 0.0188986 -0.0209061 0.00792894 -0.188777 0.0521472 0.11495 -0.0147242 0.055435 -0.0582837 0.0962517 -0.0707386 -0.0497136 -0.0889141 0.0712992 -0.0281739 -0.0398322 0.0544593 -0.0528502 0.000730776 0.152857 -0.10703 -0.0875012 0.16924 -0.0249599 -0.138019 0.0378323 0.0417983 -0.0288996 -0.0666509 -0.00417501 0.0844591 0.00903488 -0.0227764 0.158869 -0.0188839 -0.125395 -0.0454912 -0.0253209 0.245676 -0.0644848 0.0208744 -0.127017 -0.0254715 -0.00367755 -0.0564976 0.0684018 -0.03533 0.0412736 -0.0613551 -0.00748069 -0.000352155 -0.00854246 -0.0137738 0.0918891 -0.0541777 0.103457 -0.0879844 0.0708338 0.0336185 -0.0466589 -0.0808425 0.0681174 0.0958155 0.0258909 -0.0234495 -0.0173531 0.0745802 -0.173728 -0.132332 0.00751236 -0.0157192 -0.0601069 -0.033118 0.0675217 0.00442693 -0.0555102 -0.00121872 -5.71601e-05 -0.0276362 0.213924 -0.0832415 0.032738 -0.0995879 0.196426 -0.0251115 -0.124201 0.00870812 0.125881 -0.117105 0.0443139 0.0493632 0.0540461 -0.142781 -0.0914687 0.058782 0.158358 -0.0183318 0.0597392 -0.0354106 0.0199895 -0.0634862 0.0533111 -0.0350215 -0.0400274 
0.0863687 0.0308614 -0.131166 0.0301949 0.113773 0.151738 0.0350382 -0.0409958 -0.040783 -0.104771 0.0893712 0.149573 0.0783349 -0.133813 -0.176575 0.009921 -0.0362627 0.0759616 -0.146309 0.148789 0.219611 -0.0838969 0.0295938 0.172816 0.0306464 -0.0295445 0.00382055 -0.183805 0.0637957 0.133105 -0.0121477 0.0514712 -0.0547165 0.0894177 -0.064194 -0.038022 -0.0918113 0.0542744 -0.0276485 -0.040913 0.0539733 -0.0496865 0.00319312 0.155582 -0.110113 -0.0894582 0.171536 -0.0219443 -0.13251 0.0241402 0.0432886 -0.0182545 -0.0685535 -0.0116569 0.0892395 0.0232615 -0.0354375 0.164229 -0.0214074 -0.118412 -0.0550325 -0.0317711 0.249536 -0.0679443 0.0186608 -0.120604 -0.0229073 -0.010452 -0.063557 0.0762102 -0.0269848 0.0484858 -0.0655966 -0.0198347 0.00316576 -0.00336985 -0.0160399 0.0988987 -0.0556767 0.0994401 -0.0867193 0.0798327 0.0355845 -0.0434249 -0.0778905 0.0727592 0.093521 0.0183022 -0.0253014 -0.0111813 0.0716996 -0.17357 -0.132489 0.00745944 -0.0180889 -0.0725705 -0.0440251 0.0636623 0.0130025 -0.0604583 0.00337296 0.003869 -0.0176167 0.200203 -0.090964 0.0471886 -0.0936055 0.187466 -0.0188331 -0.120428 0.00747988 0.11519 -0.118939 0.0368672 0.052308 0.0582395 -0.138405 -0.0928885 0.0573522 0.16428 -0.0110674 0.0476101 -0.0452585 0.0241001 -0.071992 0.0698363 -0.0273361 -0.0293214 
0.0829712 0.0270514 -0.1237 0.0265837 0.117586 0.150681 0.045 -0.0381889 -0.047804 -0.114023 0.0714848 0.145977 0.0729029 -0.147027 -0.179639 0.0127541 -0.0556698 0.0700429 -0.14217 0.149929 0.229311 -0.0921916 0.0278638 0.161383 0.0273252 -0.0320351 -0.0116535 -0.195073 0.064031 0.13342 -0.0210931 0.0440809 -0.0626317 0.0893527 -0.0485721 -0.0459835 -0.0872457 0.0497771 -0.0252259 -0.0540748 0.0567599 -0.0562232 0.0191388 0.150922 -0.103486 -0.0763327 0.180442 -0.0256974 -0.143321 0.0279327 0.0292662 -0.0371056 -0.0624836 -0.00616955 0.0969771 0.0195805 -0.0310826 0.162151 -0.0342094 -0.117886 -0.0341843 -0.0183238 0.249554 -0.0641045 0.0340149 -0.120044 -0.0329556 -0.0196182 -0.0622352 0.064154 -0.0358149 0.0493486 -0.0694728 -0.0187786 -0.00140819 0.00370805 -0.00989587 0.0969058 -0.0425277 0.0960058 -0.0838048 0.0746703 0.0263205 -0.0368178 -0.0829162 0.0751807 0.0877472 0.0261658 -0.0268273 -0.00417821 0.0861663 -0.170813 -0.135491 0.00503863 -0.0283404 -0.0634658 -0.0398005 0.0723605 0.017915 -0.0501509 0.00762678 -0.00324615 -0.0243922 0.19171 -0.0858676 0.0467738 -0.0869827 0.201969 -0.031207 -0.112042 0.00712192 0.105597 -0.119287 0.0259977 0.0515478 0.0671593 -0.137061 -0.0814846 0.0498746 0.162368 -0.0195784 0.0515041 -0.0398696 0.0207063 -0.076182 0.0732309 -0.0325115 -0.0413714 
0.0711022 0.0511619 -0.111287 0.0117283 0.0898647 0.174503 0.0365364 -0.0378656 -0.0701093 -0.0647243 0.0911158 0.136913 0.0854339 -0.147488 -0.150103 -0.0127811 -0.0484011 0.0907158 -0.111019 0.123108 0.209444 -0.0698375 0.00278035 0.204743 0.0255368 -0.0106041 0.000232196 -0.195631 0.0964971 0.140875 -0.00534199 0.0262633 -0.0742723 0.0757142 -0.0362946 -0.0307332 -0.0980377 0.0185611 -0.0163882 -0.0256047 0.0519089 -0.0771773 -0.0101489 0.181531 -0.112689 -0.0885076 0.190027 -0.00523226 -0.156947 0.00361141 0.0592016 -0.0110642 -0.0676226 -0.0286746 0.0773809 0.047803 -0.0382829 0.180991 -0.00950521 -0.118064 -0.0522221 -0.0230283 0.25699 -0.0638136 0.0282883 -0.13359 -0.00403604 -0.0519959 -0.0756155 0.0787765 -0.048294 0.0494791 -0.0725807 -0.0200798 0.00379928 -0.0240595 -0.0348847 0.122209 -0.0252992 0.106713 -0.0782533 0.0769512 0.0376776 -0.0368368 -0.0694368 0.0469569 0.0990044 -0.002068 -0.0192163 -0.00330733 0.0660401 -0.146747 -0.118294 0.0054494 -0.0345737 -0.0792574 -0.0340996 0.0744525 0.0177341 -0.0599995 0.0103304 0.0361957 -0.0176511 0.183972 -0.0952436 0.0534197 -0.081708 0.174515 -0.0195853 -0.102293 0.0252743 0.105999 -0.119423 0.00569271 0.0384629 0.0655327 -0.125995 -0.107612 0.0483334 0.15924 0.000438982 -0.00466773 -0.0541752 0.00969064 -0.0962767 0.0858751 -0.0374032 -0.0202729 
0.0472158 0.0789537 -0.113724 0.00179285 0.0948973 0.199735 0.0139658 -0.0796913 -0.0920771 -0.0206855 0.0888191 0.11154 0.0873669 -0.103309 -0.0992628 -0.0169931 -0.0568924 0.121433 -0.0493902 0.0831719 0.20098 -0.0685863 0.02432 0.172888 0.0523167 -0.00795903 -0.0068287 -0.205005 0.10619 0.159424 0.0189235 0.0147333 -0.0603106 0.0407238 0.0126153 0.0147293 -0.0989091 -0.00477132 0.00920332 -0.035561 0.0370296 -0.0760784 -0.00500026 0.189285 -0.152333 -0.0575971 0.207565 0.00456746 -0.169074 -0.0321165 0.0636791 0.00725474 -0.0594743 -0.0351637 0.0733655 0.0748103 -0.0135154 0.183001 -0.00517795 -0.108883 -0.0652884 -0.0216069 0.267587 -0.0876298 0.0831173 -0.124097 -0.0116812 -0.037984 -0.0789413 0.13923 -0.025668 0.0783136 -0.0903879 -0.0632219 0.00469148 -0.016145 -0.0642268 0.123716 -0.0273659 0.0791533 -0.0857226 0.0872883 0.0331099 -0.00948307 -0.0891726 0.0345764 0.0879251 -0.0135106 -0.0196268 0.00993045 0.0560543 -0.130385 -0.103423 -0.0164755 -0.0357732 -0.108158 -0.0398954 0.125826 0.0252252 -0.0512728 0.0180489 0.0593832 -0.000695523 0.132869 -0.0878494 0.0749509 -0.0709844 0.148058 0.00415609 -0.0812466 0.00689534 0.0710622 -0.109887 -0.0148302 0.048942 0.0696497 -0.106347 -0.120435 0.0519976 0.16771 0.0378723 -0.0544685 -0.0524716 0.000734532 -0.0976586 0.104057 -0.00833404 0.0307051 
0.0398741 0.0906962 -0.110524 0.00525369 0.0930266 0.20369 0.00997799 -0.081688 -0.0886656 -0.00850127 0.0895137 0.0966899 0.0862034 -0.0995 -0.0913936 -0.0010783 -0.0519397 0.127406 -0.0456791 0.07203 0.207537 -0.0788961 0.0296535 0.173079 0.0611286 -0.0135251 -0.0172327 -0.20371 0.118112 0.158277 0.0328255 0.0276843 -0.056549 0.0396153 0.0141203 0.0205172 -0.0988938 -0.00409894 0.0176833 -0.0410948 0.0308485 -0.0803187 0.00211131 0.177615 -0.136578 -0.0658195 0.208598 0.0080585 -0.174304 -0.0420466 0.0593127 0.00942247 -0.0522234 -0.0424568 0.0657631 0.0848795 -0.00667353 0.180424 -0.00293066 -0.114763 -0.0725439 -0.0164806 0.265007 -0.101388 0.0879511 -0.0997406 -0.0184219 -0.0407747 -0.0900852 0.144479 -0.0342547 0.0809603 -0.101787 -0.0617408 0.00572461 -0.024825 -0.053396 0.123615 -0.0280527 0.0682193 -0.0895264 0.0890316 0.0275553 -0.0119669 -0.0899365 0.0369566 0.0754591 -0.0162407 -0.0145921 0.0120857 0.0601785 -0.123876 -0.104477 -0.0145122 -0.0192324 -0.0968902 -0.0437068 0.141277 0.0195941 -0.0426 0.0232772 0.0493223 -0.00724863 0.131126 -0.0806431 0.0838852 -0.0646724 0.134817 0.0175472 -0.0865812 -0.00942962 0.0744131 -0.102757 -0.0203907 0.0655177 0.0665798 -0.100361 -0.118241 0.061052 0.172755 0.0444869 -0.0606969 -0.0481807 0.000699581 -0.106553 0.110617 -0.00375933 0.031843 
0.0694592 0.0595361 -0.103541 0.00179843 0.100078 0.17466 0.0422169 -0.0473225 -0.0668144 -0.0739877 0.0848728 0.133824 0.084915 -0.132774 -0.145051 -0.0135438 -0.0503587 0.0937081 -0.117194 0.111904 0.215682 -0.0546841 -0.00872241 0.199501 0.0260772 -0.0117083 -0.00798119 -0.185949 0.100092 0.153121 -0.00313332 0.0293971 -0.0822699 0.0779248 -0.0228544 -0.0241725 -0.092181 0.0137819 -0.0110909 -0.0274355 0.0537665 -0.0661269 0.00576225 0.183973 -0.104972 -0.0760837 0.192882 -0.00180516 -0.161418 -0.00425189 0.0499786 -0.0186502 -0.0690177 -0.0298458 0.0840334 0.0526479 -0.0559543 0.195801 -0.0176611 -0.117896 -0.0501006 -0.01873 0.257876 -0.0643876 0.0325794 -0.13117 -0.00491902 -0.0476355 -0.0761854 0.0832782 -0.0381303 0.0490141 -0.0682355 -0.0294293 -0.00369062 -0.0198918 -0.0372718 0.117638 -0.0247512 0.0910324 -0.0629529 0.0939205 0.0316593 -0.0348324 -0.0765062 0.0378756 0.0991771 -0.004817 -0.0224045 0.0124125 0.0771777 -0.152818 -0.123189 0.00133294 -0.0326203 -0.0695156 -0.0365301 0.0730369 0.0202921 -0.0518703 0.00581511 0.0367255 -0.0196583 0.179354 -0.10979 0.0563945 -0.0915942 0.170373 -0.0243319 -0.0977423 0.0358863 0.0969607 -0.13369 0.01181 0.0384836 0.0680654 -0.124046 -0.110134 0.0411439 0.153136 0.00707028 0.00307992 -0.049842 0.0142792 -0.0990042 0.0822487 -0.0396983 -0.0309691 
0.0378092 0.0488058 -0.0628943 -0.0336354 0.133566 0.162997 0.0717686 -0.0433956 -0.019084 -0.0562916 0.045762 0.0874942 0.111839 -0.107357 -0.0813228 -0.0396805 -0.112652 0.0981199 -0.16256 0.139301 0.213054 -0.0822549 0.0119311 0.17962 0.00635853 -0.0476317 -0.103727 -0.183353 0.111387 0.128711 0.0309981 0.0270787 -0.0922791 0.0763431 0.0266506 0.0182934 -0.0846832 0.0552427 -0.0336125 -0.0743766 0.0843057 -0.0641365 -0.0145284 0.159413 -0.136628 -0.0665086 0.156123 0.0708093 -0.125953 0.00694939 -0.0423008 -0.0512935 -0.0607151 -0.0386967 0.107965 0.0459961 -0.0799635 0.185426 -0.0490813 -0.153838 -0.058225 0.0126393 0.242585 -0.0355885 0.0313288 -0.0690011 -0.00925085 -0.00664013 -0.0766092 0.0595738 -0.00539309 0.0725507 -0.0505417 -0.0292003 -0.00511057 -0.00990967 -0.0729337 0.0823405 0.0466951 0.0654465 -0.0421352 0.109432 -0.00208271 -0.0176903 -0.0660114 0.0316316 0.10097 0.0638947 0.0220563 0.0420215 0.137852 -0.141849 -0.0734294 -0.0309421 -0.082538 -0.112102 -0.0754802 0.0855758 0.0179546 -0.0597348 0.0562855 0.00719511 -0.0152328 0.103553 -0.11573 0.0865106 -0.09685 0.150669 0.0417224 -0.0379497 0.0454887 0.109124 -0.162307 0.0151907 0.0349127 0.096154 -0.124905 -0.0952066 0.00564029 0.157888 0.022343 0.00654597 -0.0602108 0.0672597 -0.154501 0.077301 -0.0484404 -0.0212379 
0.0565886 0.0938359 -0.0774184 -0.0474791 0.103395 0.251165 0.124008 -0.0331751 -0.0533089 0.0331928 0.0263981 -0.00981498 0.135467 -0.0482332 0.0509756 -0.0983757 -0.0962326 0.0790766 -0.0901004 0.0651992 0.120561 -0.0713384 -0.00673528 0.164702 0.0354592 -0.141981 -0.190916 -0.149523 0.0986822 0.113857 0.0692589 -0.0109983 -0.158996 0.0501233 0.0505256 0.0655077 -0.0806983 -0.0451849 -0.0169823 -0.0522444 0.0771565 -0.0725164 -0.0350832 0.0961264 -0.152506 -0.0623188 0.0890058 0.132403 -0.0896328 0.0240961 -0.0530349 -0.0456296 -0.0222834 -0.04688 0.0405169 0.0592484 -0.0917325 0.211267 -0.0113802 -0.112728 -0.0981493 0.119611 0.200462 -0.145008 -0.000273027 0.0436897 0.0475286 -0.0167404 -0.134938 0.0118577 0.027149 0.153895 -0.0482042 0.00394128 -0.00203933 0.0116389 -0.0581032 -0.0175561 0.111174 0.0729797 -0.00361069 0.0254417 -0.0124548 -0.0100791 -0.0416382 0.0554658 0.0582996 -0.0197235 0.040795 0.038132 0.150627 -0.116679 0.0211158 -0.0463897 -0.0957411 -0.144468 -0.0595674 0.0704191 0.00379844 -0.0159318 0.0902388 0.0455705 0.0108237 0.027411 -0.16661 0.13987 -0.0768031 0.0867723 0.0143134 0.0576594 0.0918333 0.0651926 -0.0850666 -0.0352366 -0.00616386 0.113092 -0.0666098 0.0025154 -0.00894577 0.148319 0.0321147 -0.138619 -0.0542136 0.0931846 -0.179307 0.0908791 -0.082622 0.00192564 
0.0236872 0.146084 -0.0783857 -0.0623139 0.0703992 0.279377 0.0188867 -0.0562053 -0.144387 0.158248 0.0529699 0.013047 0.132473 -0.08492 0.0526209 -0.00910934 -0.0511053 0.145917 0.00940046 0.011918 0.107026 -0.0164441 0.00339172 0.15321 0.0369466 -0.0445452 -0.121624 -0.154105 0.147826 0.139471 0.0546911 -0.0123869 -0.138501 -0.00917401 0.0559004 0.058498 -0.112146 -0.116532 0.0886908 0.0321063 -0.00559719 -0.090225 -0.0293507 0.110339 -0.136902 -0.0722546 0.149585 0.104181 -0.134134 -0.0238744 0.106546 0.0217935 -0.0643712 -0.065918 -0.0215709 0.0764861 0.00642443 0.171403 0.0213754 -0.0643835 -0.100854 0.0770849 0.202817 -0.146449 0.0405094 -0.0579768 0.0216437 -0.0194384 -0.139746 0.0682531 0.0285353 0.184779 -0.0931562 -0.0405172 -0.0069673 0.00199643 -0.0820232 0.0569597 0.0702527 0.0786718 0.0214025 0.0313222 0.058967 0.0668345 -0.06576 0.0347218 0.0597221 -0.0511603 0.0459275 0.00707768 -0.0054898 -0.0508694 -0.016496 0.0487289 -0.0724298 -0.136738 -0.035198 0.129326 -0.0466436 -0.00991062 0.0787902 0.0948327 -0.0218007 0.0587067 -0.104122 0.124007 -0.0517411 0.0440447 0.0316539 0.0423227 0.0337624 0.0296634 -0.0288421 -0.0305621 -0.0049097 0.093491 -0.0757229 0.00311867 -0.0368658 0.138054 0.050403 -0.212501 -0.0266203 -0.0308455 -0.152759 0.142894 -0.0772154 0.0500432 
-0.0207941 0.20488 -0.0954584 -0.0761507 0.0509207 0.257085 -0.0399306 -0.0413596 -0.142253 0.177888 0.0499929 -0.0350359 0.12071 -0.0447192 0.0536866 0.0243152 -5.19585e-05 0.157646 0.0257325 -0.00553109 0.0973159 -0.0492765 0.0649169 0.0795446 0.0482648 -0.0326825 -0.0824216 -0.133054 0.193599 0.0962434 0.086882 0.0311169 -0.0639387 -0.0331799 0.0448004 0.0715765 -0.0934792 -0.0315322 0.0718225 0.0143725 -0.0426973 -0.0794004 -0.0267464 0.117019 -0.135175 -0.0456027 0.175242 0.0764224 -0.194943 -0.0600312 0.0791027 0.0602056 -0.0679739 -0.0816507 -0.0721374 0.09385 0.040475 0.145509 0.042013 -0.0988684 -0.13354 0.0501403 0.207446 -0.164539 0.0932006 -0.0201027 -0.00597283 -0.00295092 -0.144872 0.133623 0.0133269 0.141957 -0.107879 -0.0494634 0.0123604 -0.0370826 -0.0807205 0.0806385 0.0268728 -0.00334183 -0.0503392 0.0427305 0.0215806 0.0438622 -0.0659768 0.0225781 0.0128129 -0.0501321 0.0610966 0.00865136 -0.00875505 -0.0519103 -0.0467223 0.018509 0.0409154 -0.11367 -0.0195932 0.207609 -0.0905785 -0.00273864 0.0315858 0.0723567 -0.0264394 0.0751009 -0.101137 0.138406 -0.0447923 0.025716 0.107501 -0.0398532 -0.0213891 0.0534403 -0.0317413 -0.014142 0.0475027 0.0235404 -0.0764482 -0.0735242 0.0552417 0.14167 0.071355 -0.193879 -0.013965 -0.0239006 -0.10266 0.104912 -0.0285972 0.053006 
0.0207333 0.150674 -0.141395 -0.022428 0.088189 0.223625 0.0251358 -0.126042 -0.11406 0.113432 0.0238116 -0.0030069 0.139815 -0.0219772 0.0268158 0.0308104 0.00587831 0.154642 -0.0108456 0.0231813 0.115589 -0.0406747 0.0372115 0.145157 0.0380971 -0.0337661 -0.138751 -0.203161 0.147448 0.167613 0.0734558 0.141343 -0.11201 -0.0240175 0.0542865 0.0645826 -0.0678889 -0.0221731 0.0544222 -0.00855818 -0.00871706 -0.0568717 -0.0166221 0.12873 -0.12508 0.00540664 0.187878 0.0949275 -0.147922 -0.0906594 0.0807779 0.00637988 -0.00357383 -0.0939229 -0.00946126 0.0890097 0.043619 0.182654 0.106799 -0.10258 -0.100873 0.0801141 0.171795 -0.158889 0.0579746 -0.0425334 0.0331765 -0.00659351 -0.0916507 0.0844397 -0.00341666 0.135635 -0.0830535 -0.0497741 -0.0230727 -0.022676 -0.0992504 0.0797207 0.00802503 0.0258767 0.0195112 0.103957 -0.0497004 -0.0149535 -0.0488685 0.0375823 0.0213591 -0.0931949 -0.0279522 -0.00931138 0.0283241 -0.0326289 -0.0401686 -0.0516818 -0.0177716 -0.0738194 -0.0164163 0.189545 -0.00806586 -0.0175313 0.072325 0.0547989 0.0294765 0.122287 -0.151064 0.0699261 -0.0904742 0.0671948 0.0600563 0.0339673 0.00896195 0.0617557 -0.0736197 -0.075697 -0.0113311 0.0580821 -0.11752 -0.117827 -0.00994322 0.109087 0.0642252 -0.118441 -0.0209807 0.0198186 -0.177124 0.0859472 -0.116689 0.0177836 
0.0225278 0.147427 -0.164027 -0.0347367 0.103388 0.187091 0.00897361 -0.135037 -0.128733 0.0816046 0.021788 0.00128865 0.147741 -0.0159897 -0.00771766 0.0502417 0.00386984 0.113166 -0.0166329 0.0736888 0.125999 -0.0692743 0.0605724 0.124007 0.0335918 -0.0120508 -0.124483 -0.200396 0.151861 0.160092 0.0643103 0.114472 -0.10335 -0.0394749 0.0412549 0.0619271 -0.0743367 0.0334663 0.0545101 -0.0214066 -0.0305374 -0.0322982 -0.00743352 0.139572 -0.11722 0.0300046 0.207361 0.0977926 -0.147946 -0.0696618 0.0396226 -0.000715625 -0.0157824 -0.0848594 0.00568557 0.0550944 0.0335377 0.198724 0.0952895 -0.12603 -0.0915412 0.0706285 0.204662 -0.134319 0.0552765 -0.0443904 0.0165261 0.02122 -0.0677476 0.0415894 0.00532088 0.136249 -0.0710353 -0.0397267 -0.00890057 -0.0243285 -0.0962526 0.0851712 0.0233988 0.050774 0.0195227 0.0873037 -0.062692 -0.0215669 -0.057927 0.0281955 0.00844189 -0.0605472 -0.0051732 -0.0357032 0.0342454 -0.0326323 -0.0398204 -0.0463257 -0.00454706 -0.0953042 -0.00493372 0.205315 -0.014772 -0.0410511 0.0425301 0.0394658 0.0238523 0.130188 -0.175856 0.0888012 -0.0968233 0.106855 0.0903836 0.0151019 0.0246547 0.0780808 -0.0886563 -0.0348348 -0.0130748 0.0691664 -0.144212 -0.106408 -0.0198736 0.107829 0.0173825 -0.0798552 -0.0192602 0.0288991 -0.196264 0.0776754 -0.131505 0.00703436 
0.0141514 0.132853 -0.169017 -0.0157003 0.118685 0.189908 0.0230297 -0.156521 -0.106503 0.080793 0.0121614 0.0111829 0.141862 0.0188681 -0.0107975 0.0321787 0.00572302 0.13392 -0.00705837 0.057118 0.121052 -0.0709625 0.0403664 0.120306 0.0461102 -0.0300637 -0.154444 -0.184588 0.138597 0.18227 0.0739518 0.129555 -0.116874 -0.0619302 0.0512122 0.082971 -0.0899966 -0.00647451 0.0482823 -0.03093 -0.0203128 -0.00690447 -0.0065954 0.1304 -0.119699 0.0162543 0.187463 0.0987611 -0.107998 -0.0908636 0.0334873 0.00509559 0.000940291 -0.0982094 0.0135274 0.0704321 0.0228306 0.208188 0.0995049 -0.1039 -0.0942902 0.0922715 0.193417 -0.139462 0.0524109 -0.032313 0.0237404 0.0142952 -0.0728397 0.0544419 0.0307475 0.155116 -0.0541652 -0.0535769 -0.0337761 0.0015662 -0.0966457 0.056552 0.0121634 0.0247837 0.0292142 0.106154 -0.0597708 -0.00676405 -0.0532247 0.0286203 0.00975545 -0.0636218 -0.0133116 -0.0416458 0.0304568 -0.0178536 -0.022486 -0.0565941 -0.00539722 -0.100442 -0.0163253 0.195888 -0.0112828 -0.0242821 0.0611029 0.0459665 0.041905 0.0976608 -0.182806 0.101251 -0.087662 0.074179 0.0800776 0.0542521 0.0219898 0.0446199 -0.0872402 -0.0466426 -0.0260574 0.0763003 -0.119864 -0.0914553 -0.0258888 0.0985447 0.0208443 -0.0954798 -0.027626 0.0115311 -0.209036 0.100314 -0.132228 0.0261461 
0.0274413 0.140577 -0.154678 -0.035066 0.113237 0.192685 0.0246588 -0.133537 -0.109881 0.0697501 0.0414162 0.0254217 0.146916 0.00823926 -0.0189485 0.0183619 8.92565e-05 0.140588 -0.0537085 0.0653074 0.122966 -0.0539063 0.0414522 0.145563 0.0268125 -0.032626 -0.113075 -0.170226 0.142961 0.16406 0.054911 0.108413 -0.118405 -0.0323305 0.028749 0.0698294 -0.0965085 0.0096305 0.0272383 -0.00238259 -0.00970809 -0.0148298 -0.0237507 0.154949 -0.135418 0.00907477 0.186607 0.0963339 -0.139839 -0.0682521 0.0452787 0.00377486 -0.0463972 -0.0895291 0.00438891 0.0722892 -0.00305097 0.231449 0.0918019 -0.103487 -0.100932 0.0763575 0.214365 -0.12472 0.0443161 -0.0554542 0.0231775 0.0178617 -0.0818673 0.0794312 0.02945 0.137821 -0.0406706 -0.0422167 -0.022608 -0.0176823 -0.0979596 0.0729823 0.0020075 0.0151434 0.0184579 0.1041 -0.0557685 -0.0273898 -0.0773958 0.0340388 0.0305645 -0.0710522 -0.0186857 -0.0251837 0.0394683 -0.0589666 -0.0386446 -0.0620171 0.000693684 -0.0986483 -0.0277509 0.172961 -0.00562189 -0.0292171 0.0367877 0.0494506 0.0335484 0.13123 -0.178523 0.0971328 -0.111943 0.0958486 0.0680589 0.00464173 0.0385083 0.0761304 -0.0900257 -0.0146748 -0.0224749 0.0642583 -0.128134 -0.104248 -0.0029842 0.110898 0.0245176 -0.0895066 -0.044925 0.0338618 -0.186758 0.082087 -0.135554 0.00887507 
0.100011 -0.0310149 -0.101315 -0.0180016 0.115642 0.179838 0.10139 0.0167661 -0.134245 -0.0662158 -0.0519347 0.0629652 0.147204 -0.0986382 -0.0472807 -0.0301195 0.00281898 0.0844074 -0.11362 0.16007 0.146002 -0.0478586 0.0512993 0.200245 -0.0555737 -0.0684674 -0.124066 -0.231437 0.0336773 0.0849899 -0.00288625 0.0749135 -0.143152 0.0708722 0.00228329 -0.0145303 -0.0526507 0.0361212 -0.0938204 -0.0514054 0.0612832 -0.0184901 -0.00589565 0.139285 -0.148566 -0.0381809 0.158326 0.0604568 -0.0942776 0.0679528 0.0564651 -0.170676 -0.0132951 -0.0204274 0.0708309 -0.00464543 0.00746887 0.177647 0.110366 -0.149366 -0.0202596 0.117467 0.118015 -0.118585 0.0242194 -0.130652 0.0177755 -0.0629712 -0.0866663 -0.0586754 -0.0488393 0.0696662 -0.0038764 -0.00802606 -0.0678835 0.0199876 -0.0348684 0.0611124 0.0832838 0.0858637 0.0211502 0.0183821 -0.0470014 -0.0596994 -0.0175623 0.0278705 0.0759999 -0.0056871 -0.0470708 -0.00912603 0.0916176 -0.0699823 -0.0595743 -0.0722903 -0.0791335 -0.00854052 0.0218792 0.129333 -0.0380117 0.000371873 0.0532812 0.0508269 0.0113197 0.192567 -0.153686 -0.014853 -0.143124 0.129326 -0.0445845 0.0268803 0.0503983 0.10891 -0.0863693 -0.0360668 -0.0828625 0.0955187 -0.0966771 -0.0901197 -0.0960025 0.109847 -0.0595864 -0.0161624 -0.024062 0.0339264 -0.149403 0.0108484 -0.17567 -0.0929371 
0.0880054 0.0271894 -0.101992 0.00682506 0.107761 0.232471 0.0975988 -0.0339044 -0.139643 -0.0284051 -0.0268433 0.039734 0.136577 -0.0722825 -0.0117479 -0.0587749 0.00492223 0.116139 -0.0574326 0.112571 0.143166 -0.0602177 0.0302687 0.211634 0.00226839 -0.0960668 -0.158746 -0.219567 0.0697741 0.115148 0.0397026 0.07965 -0.157255 0.0420634 0.038793 0.0165594 -0.0643538 -0.0232775 -0.0523263 -0.0708189 0.0621825 -0.0386508 -0.00838769 0.127659 -0.162653 -0.0399863 0.166447 0.0769406 -0.118597 0.0237658 0.0466496 -0.0973732 0.0185219 -0.0471303 0.0521391 0.0309888 0.00237372 0.194797 0.0989733 -0.148226 -0.0521288 0.146596 0.151695 -0.164107 0.0283185 -0.0633445 0.0434633 -0.0851423 -0.126487 0.0046849 -0.0410806 0.0962258 -0.0378638 -0.00686972 -0.0537368 0.00364584 -0.0422183 0.0378558 0.0840428 0.0853471 -0.00321593 0.0426721 -0.0375997 -0.0605252 0.000504232 0.0249778 0.0473425 -0.0418831 -0.0435355 0.00903762 0.113505 -0.056755 -0.0304777 -0.0707324 -0.0684958 -0.0609768 0.0162186 0.158366 -0.0284463 -0.00842915 0.0747233 0.0784912 0.0293195 0.147658 -0.168766 0.0447898 -0.0938202 0.109116 -0.0178746 0.0483121 0.0532387 0.0803059 -0.0833462 -0.0697016 -0.0547692 0.0849447 -0.0816736 -0.0961337 -0.045594 0.131551 -0.0200129 -0.0883688 -0.0420568 0.0226484 -0.166002 0.0565434 -0.121344 -0.0476458 
