0.104399 0.00840154 -0.171154 -0.00769087 0.120336 0.171228 0.0383168 -0.0516825 -0.102119 -0.0128012 0.0639616 0.109782 0.11551 -0.139672 -0.126709 0.00721889 -0.0857315 0.0983637 -0.111809 0.139039 0.179859 -0.0865298 0.0345363 0.144119 0.0079718 -0.0413923 -0.0203632 -0.216821 0.014262 0.15205 -0.0617997 0.0264939 -0.112606 0.0522943 -0.028233 -0.0116461 -0.156063 -0.0515529 -0.0320191 -0.0439799 0.00569554 -0.094677 -0.0269915 0.204245 -0.128081 -0.00324125 0.153874 0.0622352 -0.154233 0.0477572 0.0837177 -0.0496426 -0.0818415 -0.0487376 0.0580456 -0.00574561 -0.0484006 0.149913 0.0340607 -0.0729865 0.009469 0.0110598 0.233791 -0.0145375 0.0161294 -0.182719 -0.0486565 0.043997 -0.0356421 0.0545618 -0.0071991 0.0925702 -0.0427603 -0.0965211 -0.0695671 0.0316195 -0.0396928 0.079055 -0.0228641 0.134255 -0.00922366 0.0156118 -0.0288613 -0.0224785 -0.132356 0.0793562 0.0838027 -0.0351335 -0.0152348 0.0194958 0.0399564 -0.11059 -0.143356 0.00333497 -0.105567 -0.0566295 -0.0487494 0.0418144 0.0348036 -0.0849984 0.0789819 0.0358569 -0.00385906 0.105915 -0.0922782 0.0253076 -0.131237 0.207507 -0.0570839 -0.0227921 0.0637956 0.0931449 -0.0760615 -0.0181818 0.00274523 0.104961 -0.137543 -0.0381807 0.00354354 0.137854 -0.0251681 -0.0271269 -0.0187583 0.0438039 -0.0868431 0.062173 -0.0679522 -0.0383041 
0.0925009 -0.0047195 -0.173667 6.98583e-05 0.0999898 0.132316 0.0458002 -0.0417584 -0.104242 0.00184532 0.0732764 0.129799 0.122915 -0.110957 -0.149167 -0.0119607 -0.0783116 0.0897563 -0.112064 0.169079 0.156909 -0.121091 0.0327135 0.162251 -0.01116 -0.019318 -0.0147793 -0.194304 0.0201497 0.13918 -0.0867324 0.0319061 -0.109096 0.0433621 -0.0777608 -0.0069399 -0.185708 -0.0121469 -0.0674098 -0.0301918 -0.00105186 -0.0875489 -0.0576577 0.19693 -0.130591 -0.0116828 0.148392 0.0522131 -0.139892 0.0519968 0.0711822 -0.0270591 -0.102352 -0.0484389 0.0721148 -0.00440013 -0.0607575 0.171316 0.0422129 -0.0647305 0.0102497 0.00892675 0.245461 0.00426042 0.00204901 -0.168035 -0.0402349 0.0431136 -0.0386401 0.051773 -0.00362446 0.0954139 -0.023676 -0.0472527 -0.0523995 0.0265586 -0.0262136 0.0832639 -0.0173478 0.107971 -0.0383866 0.00777546 -0.0398003 -0.0484745 -0.135457 0.0688662 0.092331 -0.0234593 0.0115742 -0.00684614 0.0322686 -0.10686 -0.112048 -0.00769548 -0.0842821 -0.0736899 -0.0363641 0.021849 0.0600085 -0.0971226 0.0589104 0.0350505 0.00138099 0.113717 -0.105905 0.044449 -0.139711 0.204264 -0.0412704 -0.0492389 0.0679954 0.126514 -0.0657866 -0.0174915 0.00181578 0.0972706 -0.113294 -0.0541326 0.0256301 0.138644 -0.0520176 -0.0261565 -0.0318477 0.0478028 -0.11047 0.0818432 -0.0792831 -0.037695 
0.0995617 0.00458028 -0.17939 -0.00434514 0.126773 0.163846 0.0368031 -0.0530703 -0.102126 -0.00714747 0.0597672 0.103402 0.116355 -0.126712 -0.124168 0.00854449 -0.0832099 0.0972547 -0.100889 0.139131 0.181077 -0.102781 0.0419127 0.14524 0.02272 -0.0461136 -0.0225342 -0.217616 0.0184647 0.150483 -0.0521566 0.0245124 -0.113117 0.0427164 -0.0315188 -0.00540629 -0.164078 -0.0551659 -0.03283 -0.0529639 0.00414397 -0.0891159 -0.0255162 0.209028 -0.12838 -0.00209198 0.15501 0.0671531 -0.143223 0.0389946 0.0749748 -0.047182 -0.0742498 -0.0590998 0.0579891 -0.00386888 -0.0436442 0.154657 0.045792 -0.0798168 0.00978668 0.0153682 0.2318 -0.00888719 0.0107568 -0.170354 -0.0515567 0.0502183 -0.0258737 0.0538449 -0.00654236 0.105731 -0.0448414 -0.102786 -0.0694591 0.0310164 -0.0407127 0.0830828 -0.0218872 0.135135 -0.0150727 0.0167649 -0.0321809 -0.0242454 -0.129712 0.0806619 0.0793943 -0.0276518 -0.0108553 0.00542222 0.0430972 -0.095693 -0.140784 -0.00541264 -0.100184 -0.0631096 -0.0502306 0.0527144 0.0346695 -0.0922728 0.0783568 0.0282528 0.00825103 0.0994121 -0.100335 0.030863 -0.133426 0.206393 -0.0436721 -0.0218889 0.0625596 0.0974466 -0.0760024 -0.0219137 0.00613864 0.107909 -0.13517 -0.0403949 0.00596779 0.139106 -0.0289046 -0.0258455 -0.0243375 0.0439835 -0.106808 0.0638624 -0.0736682 -0.0295315 
0.113598 0.012123 -0.183937 -0.00125817 0.133018 0.168784 0.0396509 -0.067546 -0.108154 -0.0232813 0.0529918 0.0982648 0.112624 -0.126398 -0.128367 0.0140249 -0.0762818 0.0790723 -0.0954322 0.133677 0.185603 -0.0908173 0.0421983 0.130229 0.0341816 -0.0426903 -0.0206599 -0.215695 0.0248847 0.161387 -0.0560807 0.0208516 -0.115533 0.0367964 -0.0194462 -0.0216969 -0.150595 -0.0427685 -0.0162942 -0.0632509 -0.00291297 -0.0776779 -0.0134833 0.203122 -0.125643 0.0129179 0.15699 0.0620193 -0.139456 0.034859 0.0815049 -0.0333459 -0.0573975 -0.0524496 0.0668371 -0.0193709 -0.0310568 0.154526 0.0432732 -0.0912941 0.0102974 0.00992902 0.233269 -0.0128463 0.0117255 -0.164717 -0.0484879 0.055898 -0.0217805 0.0450426 -0.00483131 0.104949 -0.0487101 -0.109129 -0.0654392 0.0362159 -0.0426443 0.07201 -0.020009 0.157921 0.000949843 0.0178308 -0.0194769 -0.0219999 -0.111871 0.0641028 0.0702406 -0.0209416 -0.0172629 0.00656899 0.0416881 -0.0945767 -0.147447 0.0044107 -0.108618 -0.0735511 -0.0322299 0.0620195 0.0386715 -0.096467 0.0830286 0.0410886 0.0141551 0.109673 -0.118451 0.0239149 -0.123967 0.215839 -0.035052 -0.0206287 0.0778452 0.0927975 -0.0868223 -0.0114358 0.00870484 0.113765 -0.155215 -0.0282687 -0.00839498 0.132716 -0.0374928 -0.0188039 -0.0160096 0.0281138 -0.0909598 0.065053 -0.062453 -0.0341406 
0.109806 0.0133313 -0.198648 -0.0209282 0.141757 0.159096 0.0257188 -0.0555556 -0.0947556 -0.0396337 0.0595176 0.113388 0.108638 -0.117583 -0.151606 0.00966862 -0.0613335 0.077013 -0.121082 0.150347 0.16563 -0.0770833 0.05557 0.124266 0.0126581 -0.0257266 0.0125202 -0.187174 0.032187 0.126722 -0.0493901 0.0200889 -0.107796 0.0423319 -0.053365 -0.019275 -0.150212 -0.0135445 -0.0325363 -0.0330844 0.0116472 -0.0569685 -0.0305276 0.218653 -0.143788 -0.00724996 0.15129 0.064911 -0.12485 0.0516583 0.0657331 -0.0288595 -0.0894348 -0.0469813 0.0514967 -0.0274013 -0.0371716 0.171935 0.0432897 -0.0953661 -0.0132173 0.00413838 0.25325 -0.00343473 -0.00489259 -0.177423 -0.0388162 0.0642774 -0.0120776 0.0572225 0.00237988 0.0977232 -0.0225395 -0.072946 -0.0559998 0.0181458 -0.0517238 0.0819066 -0.0380633 0.125116 -0.00652997 0.0419979 -0.01113 -0.0282326 -0.113065 0.0601439 0.0837997 0.00136038 -0.0100169 -0.0122582 0.0472404 -0.108288 -0.147822 -0.00982503 -0.0643904 -0.0827758 -0.0335734 0.0577894 0.0177228 -0.102514 0.0443706 0.0294913 0.0125775 0.138403 -0.125594 0.0256217 -0.141841 0.210666 -0.0272121 -0.0422713 0.0917684 0.119554 -0.0809286 0.0348338 -0.00899983 0.0859089 -0.153024 -0.0484046 0.00907168 0.124571 -0.0416051 0.00511659 -0.0196206 0.0351389 -0.101832 0.04018 -0.0863704 -0.0355972 
0.108893 0.00352009 -0.197899 -0.0081638 0.160207 0.13897 -0.00212577 -0.0726762 -0.111448 -0.0267417 0.0608111 0.116355 0.110912 -0.0739835 -0.149319 0.0325617 -0.0254801 0.122468 -0.104281 0.160384 0.180149 -0.0803437 0.0721256 0.135112 0.0276005 -0.0297337 0.00875731 -0.180828 0.0236425 0.146748 -0.0598174 0.0299269 -0.0970551 0.0306212 -0.0495828 0.0013832 -0.159947 -0.0284514 -0.0251442 -0.0443058 -0.0171774 -0.022515 -0.0128422 0.212493 -0.144241 -0.00766078 0.164643 0.0596268 -0.116378 0.0538548 0.085446 -0.0380809 -0.0972858 -0.0469135 0.0568882 -0.0261719 -0.0147113 0.164182 0.0674843 -0.092666 0.00186612 0.00818031 0.235518 -0.00677508 -0.00509514 -0.186015 -0.0603586 0.0789748 -0.0074576 0.0767471 0.0229176 0.115196 -0.0142621 -0.0982132 -0.0824774 0.0206202 -0.0443297 0.0954554 -0.0441592 0.0920888 -0.00418102 0.0664344 -0.022328 -0.031421 -0.118853 0.0660818 0.0671702 -0.000138652 -0.00276302 -0.0173681 0.0288003 -0.0904716 -0.148909 -0.0145866 -0.0426904 -0.0743576 -0.0505124 0.0858285 0.000130176 -0.104212 0.0442917 0.0260282 0.0245352 0.131813 -0.118776 0.0326973 -0.147009 0.181948 -0.0152308 -0.0381086 0.0673369 0.107709 -0.0659448 0.0429242 -0.00970249 0.0791417 -0.132492 -0.063848 -0.00764904 0.117333 -0.0478115 0.0152292 -0.0171812 0.0252616 -0.121323 0.0428637 -0.0817806 -0.0277845 
0.100362 -0.0134874 -0.173049 0.000988963 0.12976 0.132954 0.0041738 -0.0525718 -0.126566 -0.00784939 0.0633869 0.130796 0.123262 -0.0997023 -0.141941 0.0154765 -0.053142 0.114064 -0.106867 0.187488 0.161593 -0.100539 0.0767445 0.159646 -0.000849752 -0.019853 -0.00330543 -0.194587 0.00645276 0.127412 -0.0794141 0.0168777 -0.0987992 0.0452319 -0.0686098 0.00244475 -0.176113 -0.0151709 -0.0568409 -0.0314878 -0.0190923 -0.0529027 -0.0341694 0.205259 -0.150501 -0.0266138 0.167907 0.0567011 -0.120289 0.0896481 0.0961233 -0.0578207 -0.11173 -0.0381134 0.0712205 -0.0253707 -0.0217206 0.156591 0.0746868 -0.0796588 0.00818995 0.0121511 0.22815 0.00237707 0.00352549 -0.19654 -0.0534765 0.0545627 -0.0263907 0.0680277 0.00624516 0.112172 -0.00780787 -0.0594527 -0.0705122 0.0153393 -0.0376398 0.0951893 -0.0204669 0.102829 -0.0169055 0.0276052 -0.0293528 -0.0345077 -0.129023 0.0657275 0.0790787 -0.0030483 0.0124517 -0.0139165 0.0225935 -0.0894554 -0.123795 -0.0141258 -0.0684589 -0.0690943 -0.0497782 0.0690276 0.0178317 -0.104202 0.0448004 0.0347655 0.0118839 0.119598 -0.0952724 0.0318966 -0.145532 0.184155 -0.0224886 -0.0373635 0.0552052 0.129608 -0.0459589 0.0185113 -0.0174037 0.0876003 -0.102913 -0.0608291 -0.00924476 0.13033 -0.0527336 -0.00274248 -0.0212203 0.029199 -0.125967 0.0583842 -0.0769189 -0.0228596 
0.110595 0.00825013 -0.195581 0.00247559 0.150328 0.14741 0.00848827 -0.0590919 -0.0870941 -0.0487061 0.0653779 0.116078 0.100185 -0.112219 -0.156986 0.0257341 -0.037184 0.120025 -0.116458 0.155717 0.190336 -0.0767267 0.0619991 0.15173 0.020729 -0.0528522 0.00123591 -0.197574 0.0251253 0.146091 -0.0493228 0.0307466 -0.0926345 0.0449052 -0.0474502 -0.00678433 -0.142438 -0.0424461 -0.036786 -0.0375879 0.00232299 -0.0382919 -0.0105701 0.211894 -0.135235 -0.0186581 0.169538 0.0500155 -0.119491 0.0610317 0.0722228 -0.0415227 -0.089229 -0.0440937 0.0506312 -0.015312 -0.0129536 0.148605 0.0570034 -0.0893345 -0.00296812 0.0122642 0.231346 -0.0167761 -0.0145811 -0.198631 -0.0456716 0.0454142 -0.0116359 0.0707224 0.00431188 0.0962529 -0.0271538 -0.0818434 -0.0729667 0.0128781 -0.0455071 0.106859 -0.053915 0.0990254 -0.0140898 0.0720995 -0.0284293 -0.0303038 -0.109226 0.100887 0.0632129 -0.016654 -0.0237365 -0.011809 0.0476618 -0.102554 -0.158956 -0.0270234 -0.0401135 -0.067871 -0.0612258 0.0775301 0.00130111 -0.094482 0.0425608 0.0158917 0.0252707 0.139222 -0.106438 0.0250753 -0.134824 0.194473 -0.0346571 -0.0309265 0.0544366 0.0961862 -0.0690538 0.0214822 -0.0156872 0.0824796 -0.123197 -0.075739 0.00920967 0.125303 -0.0360841 0.0237695 -0.0258086 0.0377766 -0.123309 0.0345737 -0.0821078 -0.0274845 
0.118142 0.000758543 -0.202863 0.00672741 0.153762 0.133933 0.00686664 -0.0668309 -0.0956313 -0.0490498 0.0584759 0.123344 0.101208 -0.103033 -0.160381 0.0391584 -0.0264968 0.110094 -0.123631 0.171869 0.177122 -0.0782377 0.0785619 0.136023 0.0123567 -0.0359141 -0.00010774 -0.196584 0.0176893 0.138311 -0.0548351 0.05375 -0.0960512 0.0437355 -0.0618205 -0.00879403 -0.150199 -0.00577284 -0.0342895 -0.0294393 -0.0129528 -0.0225982 -0.023282 0.199301 -0.133903 -0.010124 0.164825 0.0454266 -0.109299 0.0719809 0.0831219 -0.035236 -0.0958685 -0.0412706 0.0507998 -0.035648 0.000299075 0.152559 0.0681076 -0.0844896 -0.00361282 0.00749209 0.227857 -0.0180038 -0.011621 -0.206233 -0.0456471 0.0633145 -0.00919845 0.0704297 0.0128405 0.106104 -0.0161663 -0.0592751 -0.0799118 0.0083223 -0.0423849 0.0941951 -0.0597627 0.10209 -0.00730935 0.0676555 -0.0333825 -0.0415207 -0.109845 0.0810726 0.0606046 -0.0103539 -0.0203632 -0.0286364 0.035824 -0.0935931 -0.15461 -0.0244587 -0.0281276 -0.0623492 -0.0442026 0.07554 0.000451392 -0.0954571 0.0300987 0.0138308 0.0175729 0.157962 -0.111809 0.0148138 -0.142968 0.193969 -0.0137715 -0.0361326 0.0528182 0.11737 -0.06804 0.0373933 -0.0146914 0.0776941 -0.125806 -0.0759754 0.00391284 0.123535 -0.0487297 0.0424605 -0.0141803 0.0361369 -0.115999 0.0237293 -0.0860135 -0.0352636 
0.125346 0.00738145 -0.207759 -0.00441117 0.146572 0.143423 0.00625479 -0.0543057 -0.097172 -0.0548594 0.0605261 0.114923 0.0975535 -0.117294 -0.157232 0.0291445 -0.028721 0.0949092 -0.125916 0.167466 0.162949 -0.0643289 0.0795948 0.122246 0.00444956 -0.0348703 0.0122938 -0.193021 0.0145533 0.119464 -0.0552529 0.0382807 -0.0977288 0.048181 -0.0650248 -0.014162 -0.143662 -0.00399712 -0.0376585 -0.0185245 -0.00719265 -0.0302755 -0.0315941 0.208683 -0.141206 -0.00125108 0.158467 0.049904 -0.116147 0.0837318 0.0804136 -0.0266306 -0.102656 -0.0362508 0.0396083 -0.0456053 -0.000810793 0.145527 0.067661 -0.0848249 -0.00798322 0.00643713 0.231078 -0.0154892 -0.0175862 -0.218095 -0.0353242 0.0674583 0.0013041 0.0713362 0.0135957 0.0990169 -0.012661 -0.0514687 -0.0735581 0.00165557 -0.0523303 0.0954925 -0.061845 0.112204 -0.00572701 0.0625048 -0.0287307 -0.0413503 -0.107186 0.0834824 0.0641633 -0.012858 -0.0220346 -0.0259944 0.0415687 -0.0988481 -0.16012 -0.0271789 -0.0291965 -0.0692637 -0.0341593 0.0671336 -0.0054326 -0.102654 0.0227503 0.0224218 0.0194879 0.15876 -0.114105 0.00680209 -0.143252 0.205159 -0.019639 -0.0349295 0.0696416 0.121254 -0.0663702 0.0431944 -0.0212149 0.0705086 -0.131898 -0.0795412 0.00978667 0.118719 -0.0482133 0.0413492 -0.00959627 0.0431953 -0.101822 0.0060697 -0.0821533 -0.0355145 
0.125464 0.00391914 -0.209652 -0.000441966 0.152355 0.135418 0.00541152 -0.0634824 -0.0975846 -0.0523413 0.0558812 0.116637 0.097658 -0.104724 -0.155765 0.0209144 -0.0246683 0.098103 -0.11609 0.169984 0.162153 -0.0694972 0.0812881 0.120263 0.0142487 -0.0353923 0.0131872 -0.190992 0.0085686 0.129734 -0.0570319 0.0340068 -0.0935881 0.0399497 -0.0577742 -0.0131309 -0.145912 -0.00190919 -0.0394012 -0.0333136 -0.0127259 -0.0253819 -0.0320818 0.213056 -0.148262 0.00883243 0.155943 0.0526726 -0.107528 0.0795932 0.0837313 -0.0194817 -0.0956678 -0.0404133 0.0499568 -0.0490304 -0.003416 0.144017 0.0695082 -0.0888311 -0.00201432 -0.00112802 0.228335 -0.00758965 -0.0147964 -0.221488 -0.0394152 0.0758416 0.00273773 0.0739595 0.0226133 0.101916 -0.0122958 -0.0674946 -0.0810817 0.0102177 -0.0553047 0.0937734 -0.0562413 0.117866 -0.0109802 0.0627248 -0.0294244 -0.0395271 -0.101233 0.0667839 0.0626564 -0.00590117 -0.0143153 -0.0259517 0.032508 -0.0928387 -0.15374 -0.0288935 -0.0371096 -0.0800408 -0.030431 0.0670369 0.000707672 -0.112773 0.0292987 0.0324326 0.0267066 0.149836 -0.121154 0.00509746 -0.144363 0.20192 -0.0106019 -0.0286532 0.0758513 0.116715 -0.0740226 0.0448715 -0.021288 0.073356 -0.132617 -0.0821112 0.00419681 0.119511 -0.0526968 0.0436347 -0.0143988 0.0402967 -0.0973024 0.00815744 -0.0727912 -0.0326559 
0.123995 0.00515913 -0.202012 -0.00450962 0.143605 0.14327 0.00693094 -0.0563597 -0.102126 -0.0562307 0.0591981 0.113447 0.102051 -0.113382 -0.157244 0.0258361 -0.0328918 0.0969199 -0.130771 0.173227 0.163144 -0.0718432 0.090215 0.120809 0.000158869 -0.0354376 0.00535358 -0.193948 0.0152785 0.113817 -0.0547295 0.0410008 -0.0980483 0.0515355 -0.0679384 -0.014456 -0.147182 0.0106103 -0.039937 -0.0190593 -0.00982684 -0.0321968 -0.0378627 0.202982 -0.145991 -0.00831374 0.157392 0.0509929 -0.115371 0.0901105 0.0759106 -0.0285415 -0.103855 -0.0313345 0.0384287 -0.0480751 0.00715193 0.148997 0.0669028 -0.0870468 -0.00869801 0.0117618 0.233591 -0.0170076 -0.0130782 -0.21187 -0.0352451 0.0656432 -0.00462391 0.0759348 0.0100993 0.099066 -0.0106356 -0.0374453 -0.0719633 -0.00528421 -0.0490857 0.0881502 -0.0569945 0.108468 -0.0106588 0.055668 -0.0304786 -0.0453212 -0.108518 0.0801167 0.0629073 -0.00817679 -0.0186746 -0.0285895 0.0490369 -0.100567 -0.149706 -0.0309334 -0.0285335 -0.0717212 -0.0360093 0.0761021 -0.00347227 -0.0973541 0.0220979 0.0238648 0.0160598 0.164136 -0.105964 0.00911657 -0.142805 0.205991 -0.0107285 -0.0397642 0.0642659 0.130052 -0.064942 0.0462153 -0.0204927 0.0723981 -0.12472 -0.077002 0.0133879 0.12326 -0.0509955 0.0390489 -0.012218 0.0422398 -0.105921 0.00688359 -0.0832029 -0.0336792 
0.12976 0.000837214 -0.205891 -0.000930975 0.146688 0.14439 0.00986206 -0.0648667 -0.0967043 -0.0583386 0.0585085 0.109861 0.102263 -0.110541 -0.151966 0.0200507 -0.0331852 0.0929884 -0.124 0.168691 0.164551 -0.069207 0.0887522 0.119369 0.00640365 -0.0376943 0.00341396 -0.200976 0.00970625 0.121607 -0.0495641 0.040008 -0.0996292 0.0473109 -0.0563912 -0.0125539 -0.143957 0.00823078 -0.0352394 -0.0282515 -0.00994952 -0.0318188 -0.0439768 0.205499 -0.149385 0.00437616 0.150084 0.0574686 -0.107194 0.0824304 0.0753076 -0.0201457 -0.0922166 -0.0350929 0.0415058 -0.052218 0.00804363 0.14469 0.0666457 -0.0873715 -0.00601587 0.00709197 0.23041 -0.0146546 -0.0139359 -0.217469 -0.0308592 0.0744433 0.00297057 0.0742361 0.0143648 0.100341 -0.0157129 -0.0535968 -0.0776392 -0.000109487 -0.0575295 0.0848926 -0.0545761 0.126606 -0.00859896 0.0544632 -0.031132 -0.0444131 -0.103293 0.0726462 0.0642722 -0.0103112 -0.0244652 -0.0289152 0.0484491 -0.0956101 -0.14617 -0.0307214 -0.0420976 -0.081603 -0.0334407 0.0711818 0.00354073 -0.105203 0.0342351 0.031506 0.021147 0.156589 -0.107905 0.00154566 -0.139916 0.207578 -0.00631369 -0.0273992 0.0698776 0.122746 -0.0734117 0.04169 -0.0205735 0.0812646 -0.132715 -0.0786277 0.00624188 0.123468 -0.0499436 0.0395449 -0.0160128 0.0451248 -0.10128 0.0057314 -0.0777758 -0.029459 
0.127574 0.00166493 -0.201955 -0.000488803 0.144795 0.147562 0.00887062 -0.0570779 -0.0954119 -0.0674765 0.0537407 0.108183 0.097277 -0.125423 -0.154226 0.0272108 -0.0438478 0.0931309 -0.128129 0.168497 0.171716 -0.0721238 0.0925545 0.122261 0.00332895 -0.0513089 0.00271498 -0.207704 0.0066076 0.119647 -0.0533114 0.0338659 -0.0955709 0.0530232 -0.0536751 -0.0154723 -0.140683 -0.00511143 -0.0428074 -0.0306947 -0.00766469 -0.0419372 -0.0325688 0.201704 -0.143271 0.00567217 0.156367 0.053102 -0.121755 0.0929956 0.0695353 -0.0392243 -0.0870956 -0.0337731 0.0389377 -0.047559 0.00872839 0.138322 0.0599072 -0.0834585 -0.00180083 0.0195749 0.227834 -0.0182994 -0.00796704 -0.216043 -0.0411137 0.063272 -0.00709544 0.0701256 0.00358394 0.0909783 -0.0223526 -0.0578959 -0.0735454 0.00601106 -0.0486326 0.0848294 -0.0552902 0.12309 -0.00845485 0.0465614 -0.0399754 -0.0412657 -0.111038 0.0928816 0.0557421 -0.0172197 -0.0333126 -0.0166172 0.0571059 -0.102174 -0.156752 -0.0289432 -0.0414857 -0.0636329 -0.0417523 0.0754977 0.0013224 -0.0947859 0.0380644 0.0192086 0.0135336 0.150642 -0.0981508 0.00373266 -0.136495 0.212533 -0.0239832 -0.0299474 0.0624851 0.1172 -0.0610942 0.0303465 -0.0213716 0.0868748 -0.130769 -0.0667781 0.0107256 0.129532 -0.0496654 0.0351445 -0.0149681 0.046174 -0.098749 0.00985332 -0.0793356 -0.0378625 
0.126634 -0.0108472 -0.187665 -0.00962829 0.13809 0.15795 0.0158592 -0.0274153 -0.0707614 -0.0736231 0.0572585 0.10738 0.103076 -0.147037 -0.154273 0.000460811 -0.0572538 0.081692 -0.151158 0.167157 0.171206 -0.0709392 0.0823716 0.120465 -0.00844575 -0.0568851 0.000881442 -0.205921 -0.00232417 0.091129 -0.0305834 0.0136085 -0.0986635 0.0622109 -0.0577155 -0.0190389 -0.143744 0.00180814 -0.0591943 -0.0306116 0.0141827 -0.0528002 -0.0607383 0.215829 -0.151251 -0.0227563 0.124125 0.0661941 -0.105144 0.0948764 0.0570696 -0.0358406 -0.093476 -0.0375803 0.0316801 -0.0499292 -0.00877176 0.130257 0.0508924 -0.0954298 -0.0105141 0.00747897 0.22474 -0.00341428 -0.0170631 -0.228158 -0.0249404 0.0674243 0.00227861 0.0678334 0.00843196 0.0803183 -0.0153851 -0.0622621 -0.0794522 0.0026556 -0.0640582 0.0847368 -0.0459517 0.143397 -0.0230532 0.0335152 -0.0202111 -0.0303435 -0.103181 0.0845703 0.0857158 0.00510316 -0.0232506 -0.019582 0.059945 -0.110993 -0.148641 -0.0236411 -0.0613822 -0.0819486 -0.0443428 0.0468328 -0.0143528 -0.0977538 0.0457042 0.0305933 0.00626572 0.142139 -0.0811895 -0.0062148 -0.133479 0.20917 -0.0182201 -0.0268515 0.0674278 0.121371 -0.0773469 0.0394917 -0.0200334 0.0875446 -0.139026 -0.0653595 0.0106208 0.130172 -0.051275 0.0354385 -0.0309102 0.0564438 -0.0824955 -0.00257017 -0.073876 -0.0272981 
0.140841 -0.00162156 -0.191579 -0.00267437 0.132447 0.158967 0.0454508 -0.0262931 -0.0401942 -0.081623 0.0738809 0.115932 0.09941 -0.144264 -0.149887 -0.0135047 -0.0433467 0.0791688 -0.172025 0.164976 0.161613 -0.0635965 0.067455 0.142012 -0.0225776 -0.0756234 0.00330009 -0.19707 0.00229883 0.103932 -0.0394236 0.0354647 -0.0876667 0.0810271 -0.0685739 -0.0211775 -0.123674 0.0126529 -0.0805798 -0.0250607 0.0269792 -0.0571463 -0.0685312 0.196305 -0.152222 -0.0187381 0.111722 0.0628203 -0.115138 0.0935097 0.0478016 -0.0283998 -0.0902938 -0.0385547 0.0368387 -0.0300119 -0.0329675 0.140356 0.0330398 -0.0801805 -0.0293409 0.00433291 0.230871 -0.032502 -0.0237064 -0.207706 -0.0166348 0.0573104 -0.0263292 0.0729537 0.000788929 0.0578712 -0.0275576 -0.0477218 -0.0670698 0.00759006 -0.0465858 0.076247 -0.0541428 0.120938 -0.0343959 0.0423409 -0.0345489 -0.0517534 -0.0921417 0.0943891 0.0814638 -0.0210914 -0.0361466 0.00690797 0.0787702 -0.139839 -0.147719 -0.0297266 -0.046036 -0.0739844 -0.0484069 0.017639 0.00999076 -0.0910443 0.0503364 0.0232052 0.00384591 0.148364 -0.0976332 -0.00277474 -0.134753 0.199135 -0.0343456 -0.0363505 0.0766018 0.126738 -0.0726068 0.0283815 -0.01292 0.0809317 -0.13864 -0.0774801 0.0306919 0.14357 -0.0346735 0.0330544 -0.0381036 0.0853008 -0.0693927 0.000109348 -0.0708837 -0.047683 
0.14493 -0.0140952 -0.184471 0.000971401 0.138936 0.166126 0.0465794 -0.0185275 -0.0517174 -0.086304 0.0702888 0.111062 0.0971329 -0.145167 -0.143123 -0.0267567 -0.0426225 0.089793 -0.1587 0.152581 0.167327 -0.0609045 0.0668578 0.146326 -0.00791316 -0.0906984 -0.000517688 -0.200891 -0.00283871 0.0990231 -0.0312834 0.0144567 -0.0984188 0.0759082 -0.0611045 -0.0250148 -0.133728 -0.0198956 -0.0780403 -0.0285821 0.034356 -0.052837 -0.0692811 0.20909 -0.160596 -0.0244701 0.104997 0.0644664 -0.103138 0.0911121 0.0517955 -0.0351464 -0.0856105 -0.0448703 0.0222065 -0.0317465 -0.027468 0.139529 0.0413485 -0.0734909 -0.0170107 0.0150678 0.216791 -0.0225146 -0.0296152 -0.219601 -0.0131364 0.0496153 -0.0165925 0.0742904 0.00297374 0.0659203 -0.0225074 -0.0636807 -0.0806255 0.00853521 -0.0546572 0.0771942 -0.0510664 0.133728 -0.0380825 0.036662 -0.028036 -0.0436127 -0.0884888 0.0969823 0.0874619 -0.0234718 -0.0495818 -0.00309055 0.0806028 -0.125971 -0.147705 -0.0367464 -0.0578779 -0.081838 -0.0526291 0.019282 -1.80643e-05 -0.0887114 0.0520625 0.0334238 0.0166168 0.139513 -0.0870604 -0.00955743 -0.128626 0.203184 -0.0397752 -0.0249248 0.0798742 0.109868 -0.0710284 0.0227777 -0.0219705 0.0868699 -0.130872 -0.0708973 0.0246431 0.141444 -0.0414995 0.0245435 -0.055718 0.077984 -0.0728003 -0.00424625 -0.0765369 -0.0367406 
0.132866 -0.0178426 -0.186427 -0.00288843 0.120011 0.156123 0.0309549 -0.0125193 -0.0505329 -0.0920285 0.067545 0.112821 0.0995232 -0.150404 -0.161826 -0.0277475 -0.0595982 0.0663438 -0.16166 0.165497 0.159176 -0.0704091 0.080298 0.131219 -0.0225627 -0.0707449 0.00919767 -0.19776 -0.00599072 0.077948 -0.0356921 0.00498207 -0.0920348 0.0681237 -0.0784508 -0.0249576 -0.143872 0.00917795 -0.08989 -0.0164977 0.0280925 -0.0570788 -0.0905076 0.208901 -0.161617 -0.0285788 0.102154 0.0612729 -0.0940126 0.101689 0.0429901 -0.0215789 -0.0874372 -0.0352497 0.0226075 -0.044381 -0.0124484 0.130034 0.043073 -0.0832465 -0.0219029 0.0128671 0.22606 -0.00259561 -0.0306669 -0.225492 -0.00556491 0.0542561 -0.00231748 0.0713727 0.000424338 0.0594614 -0.0126415 -0.0446775 -0.0649447 0.00607918 -0.0637087 0.0711154 -0.0529599 0.147817 -0.0415786 0.0189492 -0.0203887 -0.0401105 -0.0940168 0.0956883 0.0929825 -0.00546237 -0.041288 -0.0208487 0.0729354 -0.121398 -0.136354 -0.0310216 -0.0618938 -0.0933876 -0.0450304 0.0229843 0.00499535 -0.094986 0.0476606 0.0349222 0.0115117 0.141633 -0.0783986 -0.010945 -0.126606 0.21304 -0.0306919 -0.0340378 0.0796018 0.126002 -0.0689028 0.0284815 -0.0273327 0.0926409 -0.132621 -0.0642762 0.0309165 0.138351 -0.0566976 0.0259867 -0.0523027 0.0673753 -0.0731778 0.0019059 -0.0759181 -0.0242109 
0.146566 -0.0084803 -0.196727 0.00694941 0.120551 0.146271 0.0402209 -0.0116179 -0.0489405 -0.100042 0.0649922 0.102451 0.0990952 -0.164441 -0.164358 -0.0134499 -0.0467222 0.0586406 -0.173482 0.179771 0.157218 -0.0789261 0.0844716 0.112931 -0.0275607 -0.0836142 -0.00368187 -0.200381 -0.00594165 0.0781207 -0.0396363 0.0314202 -0.0866791 0.0791917 -0.0818784 -0.0344712 -0.127693 0.0205738 -0.0875319 -0.0274202 0.0232022 -0.0663774 -0.0757276 0.194334 -0.151448 -0.0155116 0.101476 0.0598882 -0.103973 0.111763 0.0379394 -0.0250119 -0.0870628 -0.0312622 0.0120479 -0.0586603 -0.0106059 0.106853 0.043618 -0.076153 -0.01985 0.0140235 0.212077 -0.0161294 -0.0306689 -0.223096 -0.0111595 0.0477001 -0.0113743 0.052019 -0.00877419 0.0464099 -0.0178309 -0.0324794 -0.0671636 0.000557676 -0.0445321 0.0693143 -0.0601386 0.149496 -0.0391945 0.00736896 -0.0371641 -0.0431673 -0.085628 0.111532 0.0725478 -0.0171344 -0.044866 -0.0151611 0.0804833 -0.125674 -0.151972 -0.0306027 -0.0542103 -0.0788134 -0.0381452 0.0233982 -0.0040344 -0.0908787 0.0437925 0.0246424 0.00871876 0.158001 -0.075238 -0.0176108 -0.118069 0.235065 -0.0242151 -0.0333443 0.0655801 0.125422 -0.0694461 0.0282593 -0.0272621 0.079845 -0.1332 -0.0614379 0.0374633 0.141241 -0.0648739 0.0414583 -0.0407444 0.0842576 -0.0567302 -0.0208207 -0.0718527 -0.0439631 
0.151576 -0.00726761 -0.200869 0.00507171 0.121703 0.154996 0.0402453 -0.0174368 -0.0505676 -0.10038 0.070195 0.112928 0.093933 -0.156982 -0.166129 -0.0123485 -0.0403113 0.0545031 -0.171378 0.178213 0.151114 -0.0647239 0.0803912 0.112081 -0.0296539 -0.0658639 0.00800901 -0.193534 -0.00472225 0.0792371 -0.045255 0.0374392 -0.0872869 0.0819073 -0.0830777 -0.0312912 -0.123252 0.0312513 -0.0832404 -0.0227187 0.0249316 -0.0569611 -0.0765396 0.193719 -0.155948 -0.0165386 0.106973 0.0553767 -0.108837 0.111459 0.0442277 -0.0172377 -0.092834 -0.0249898 0.0266876 -0.057108 -0.0168842 0.121305 0.0373372 -0.0804315 -0.0301276 0.00621889 0.22882 -0.0270327 -0.0255759 -0.215332 -0.0102474 0.0547449 -0.0138644 0.0645693 -0.00428112 0.0498483 -0.0144222 -0.0224521 -0.0626034 -0.00315477 -0.0435091 0.0667087 -0.0627287 0.138499 -0.0346158 0.020723 -0.0299126 -0.0539261 -0.0860391 0.0946442 0.0780033 -0.0117494 -0.0391596 -0.00985789 0.0815535 -0.133306 -0.154529 -0.0261148 -0.0439166 -0.0786055 -0.0268679 0.020117 -0.000538652 -0.0915357 0.0361707 0.0295807 0.00509707 0.16081 -0.0913662 -0.0112443 -0.123735 0.222891 -0.0270758 -0.0410103 0.0777368 0.136416 -0.0683613 0.0375441 -0.0175967 0.0697085 -0.134478 -0.0710584 0.040832 0.137214 -0.0555709 0.041435 -0.024736 0.0799825 -0.0488202 -0.0161601 -0.0608176 -0.0475634 
0.142435 -0.0108697 -0.18302 0.00444677 0.118041 0.156993 0.0365178 -0.0140821 -0.0519244 -0.0934314 0.0717632 0.115523 0.098344 -0.163155 -0.159496 -0.0164274 -0.0518289 0.0616002 -0.177912 0.176885 0.152803 -0.0627021 0.082975 0.118547 -0.0351107 -0.0638773 0.001087 -0.200262 -0.00793009 0.0735307 -0.0415761 0.0292838 -0.088426 0.08248 -0.0795095 -0.0297072 -0.129752 0.0327445 -0.0876789 -0.0152361 0.0273659 -0.0591899 -0.0885786 0.197074 -0.162596 -0.0268039 0.104667 0.0541892 -0.104525 0.113489 0.0501023 -0.024376 -0.0994493 -0.025022 0.0241133 -0.0539338 -0.0147528 0.119355 0.0380515 -0.0780986 -0.0301828 0.00236559 0.222935 -0.0196654 -0.0189631 -0.226905 -0.00698094 0.0519735 -0.0155883 0.0707281 -0.00104535 0.0522543 -0.00810775 -0.0244281 -0.0647371 -0.0043758 -0.0551302 0.0673838 -0.0576257 0.142728 -0.036085 0.0158662 -0.025018 -0.0468828 -0.0920277 0.0915202 0.0897168 -0.00938431 -0.0414319 -0.0110573 0.0738437 -0.132383 -0.146582 -0.02731 -0.0571737 -0.0821173 -0.0348117 0.0184085 -0.00172163 -0.0867583 0.0386562 0.0346677 0.00190945 0.155917 -0.0751579 -0.0149612 -0.122285 0.217364 -0.0230391 -0.0390109 0.0706451 0.137565 -0.0693203 0.0362826 -0.019958 0.076237 -0.132028 -0.0690121 0.0327759 0.138756 -0.0541759 0.0371784 -0.034258 0.0784817 -0.0475202 -0.0105961 -0.0612779 -0.0382361 
0.141506 -0.00631158 -0.179837 0.0100864 0.112021 0.152839 0.0401444 -0.00735775 -0.048582 -0.0885763 0.0774399 0.111402 0.100981 -0.167117 -0.156138 -0.0164533 -0.0487451 0.0661393 -0.177937 0.176422 0.158289 -0.071344 0.0790079 0.126561 -0.0314857 -0.0741383 -0.00324609 -0.203356 -0.00419586 0.0778997 -0.0419655 0.0320399 -0.0821644 0.0856 -0.0832952 -0.0329663 -0.128275 0.0285783 -0.0914102 -0.0163023 0.027878 -0.0682293 -0.0852293 0.19495 -0.158167 -0.0298654 0.105562 0.0500043 -0.109341 0.108566 0.0518277 -0.0238924 -0.0989882 -0.027026 0.0203057 -0.0472876 -0.0156795 0.109887 0.0400861 -0.0767033 -0.0285463 -0.000151351 0.21378 -0.0209266 -0.0227009 -0.22354 -0.006137 0.0437743 -0.0189266 0.0658703 -0.00616967 0.0471841 -0.0158509 -0.0282101 -0.0608048 -0.00406607 -0.0515836 0.0735335 -0.0587758 0.14463 -0.0453234 0.012918 -0.027888 -0.0470823 -0.0891697 0.104966 0.0875409 -0.0181815 -0.0435541 -0.0103347 0.071488 -0.134836 -0.148138 -0.0280005 -0.0604866 -0.0819785 -0.0400374 0.0168436 0.000260192 -0.0879065 0.0413802 0.0314359 0.00581145 0.158645 -0.0709788 -0.0149346 -0.118443 0.223146 -0.0233822 -0.0443411 0.0601117 0.133472 -0.0708616 0.024819 -0.017886 0.0759345 -0.13108 -0.0731942 0.0380545 0.143778 -0.053309 0.0361175 -0.0426055 0.0861327 -0.0470634 -0.00991289 -0.0591698 -0.0369711 
0.149255 -0.0166007 -0.189759 0.00780652 0.118698 0.149368 0.0423065 -0.00104646 -0.0470709 -0.0964915 0.0716011 0.113463 0.0952415 -0.160214 -0.159708 -0.019779 -0.040674 0.0610972 -0.172814 0.175546 0.157544 -0.0758574 0.0810552 0.123822 -0.0259801 -0.0767752 0.00557925 -0.200189 -0.00962281 0.0744138 -0.0423694 0.0287542 -0.0820239 0.0832481 -0.0887304 -0.0362351 -0.134196 0.0280901 -0.093297 -0.0245739 0.025773 -0.061762 -0.086816 0.194926 -0.154343 -0.024265 0.0969347 0.0501501 -0.106717 0.108601 0.0449438 -0.0220721 -0.089377 -0.0332005 0.019236 -0.0500129 -0.017125 0.116768 0.0388932 -0.0782539 -0.0248235 0.00327666 0.216792 -0.0192038 -0.0291484 -0.218531 -0.011686 0.0536124 -0.0152693 0.0631062 -0.00470729 0.0466477 -0.0203363 -0.0349092 -0.0663162 0.00103792 -0.0453932 0.0663677 -0.0595244 0.146272 -0.0533246 0.0125349 -0.0302512 -0.0537495 -0.0864252 0.0983929 0.0851954 -0.0148485 -0.0386857 -0.0135091 0.075948 -0.13086 -0.150797 -0.0256463 -0.0483957 -0.0784417 -0.0344863 0.0117829 -0.00153683 -0.0920407 0.0418658 0.0266122 0.00528277 0.155784 -0.0810928 -0.0163724 -0.122299 0.218353 -0.0257755 -0.0481506 0.0707731 0.134152 -0.0679237 0.0257827 -0.012139 0.0775313 -0.134292 -0.0732679 0.0442596 0.144701 -0.0593506 0.0390478 -0.0436536 0.0846135 -0.046977 -0.0136976 -0.059592 -0.0432543 
0.152272 -0.0292141 -0.184951 0.00601785 0.123131 0.158009 0.0433115 -0.0097228 -0.0611556 -0.0995796 0.0600322 0.108601 0.0989279 -0.154976 -0.151868 -0.0210917 -0.050676 0.0608329 -0.164107 0.173228 0.160111 -0.0717177 0.0863308 0.125218 -0.0256089 -0.0742359 -0.00435371 -0.21013 -0.0126339 0.0766157 -0.0415305 0.0261519 -0.0996615 0.0787868 -0.0758093 -0.0298602 -0.139019 0.0218328 -0.0858086 -0.0284301 0.023797 -0.0576606 -0.0902036 0.193994 -0.15744 -0.0191961 0.0987248 0.0592242 -0.101753 0.108852 0.0448206 -0.0323012 -0.0796407 -0.0316359 0.0233628 -0.0563077 -0.00717312 0.126784 0.042856 -0.0777652 -0.0153769 0.0186219 0.216624 -0.0173547 -0.0231535 -0.219463 -0.00857638 0.0552656 -0.010467 0.0623602 -0.00694489 0.0582662 -0.0170494 -0.0360266 -0.0751439 0.00060195 -0.0489224 0.058311 -0.0480544 0.154851 -0.0376939 0.00783225 -0.0338517 -0.0562975 -0.089396 0.0899265 0.0858782 -0.01093 -0.0471516 -0.0151432 0.0860025 -0.119895 -0.142831 -0.0258394 -0.0630798 -0.077265 -0.0326705 0.0204548 0.00412133 -0.0870277 0.050061 0.0324131 0.00248883 0.149961 -0.0784582 -0.0183475 -0.123889 0.215915 -0.0261213 -0.0338878 0.0758586 0.133304 -0.0674246 0.0218176 -0.0175332 0.0917175 -0.132289 -0.0639453 0.0275679 0.14065 -0.0628871 0.031265 -0.0397805 0.0751663 -0.0590889 -0.0082812 -0.069408 -0.042851 
0.13355 -0.0144369 -0.171162 -0.0076542 0.11503 0.159064 0.0262307 -0.00767081 -0.0565576 -0.0951163 0.0716182 0.113924 0.103218 -0.163037 -0.161229 -0.0165662 -0.0638768 0.0616497 -0.18513 0.174936 0.15761 -0.0573311 0.0788879 0.112957 -0.0392302 -0.0538273 0.00257593 -0.193959 -0.00683904 0.0631949 -0.0387191 0.0226183 -0.0945698 0.0832393 -0.0796324 -0.0267736 -0.134996 0.0305539 -0.0817404 -0.00829235 0.0317074 -0.0597742 -0.091479 0.201326 -0.157778 -0.0380379 0.104731 0.0558238 -0.108145 0.111048 0.0429846 -0.032358 -0.106349 -0.0203245 0.0181928 -0.0541643 -0.0193512 0.122612 0.0327526 -0.0842405 -0.0270492 0.00659327 0.225826 -0.00561155 -0.0212733 -0.224259 -0.00406807 0.0559244 -0.00743332 0.0667635 9.19352e-05 0.0511746 0.000989611 -0.0248015 -0.0623799 -0.00867151 -0.062437 0.0639868 -0.0539048 0.143099 -0.0296821 0.0167734 -0.0181098 -0.0437531 -0.102829 0.0926016 0.0990951 -0.000739344 -0.0390673 -0.0141699 0.0769139 -0.133545 -0.144186 -0.0210336 -0.0643323 -0.0799253 -0.0407606 0.0192772 -0.00878037 -0.0842092 0.0352831 0.0314692 -0.00506531 0.156201 -0.0682627 -0.0100852 -0.126425 0.218258 -0.0279363 -0.0442915 0.0721469 0.138291 -0.0761855 0.0446962 -0.0220599 0.0754045 -0.137844 -0.0633021 0.0293788 0.129674 -0.0547618 0.0345003 -0.0326253 0.0714175 -0.0490631 -0.00989903 -0.0685057 -0.0365061 
0.136741 -0.0217345 -0.172018 -0.00147825 0.12301 0.156479 0.0430058 -0.00539484 -0.0522595 -0.0995806 0.0654577 0.108492 0.103817 -0.158945 -0.151767 -0.029297 -0.0623659 0.0696656 -0.179222 0.169266 0.163051 -0.0712493 0.0758758 0.125141 -0.0270394 -0.0820499 -0.0100956 -0.198251 -0.00803031 0.0720923 -0.0309171 0.0191166 -0.0996673 0.0814504 -0.0750013 -0.0271984 -0.13903 0.00779964 -0.0878827 -0.0216553 0.0403517 -0.0629588 -0.0857952 0.201978 -0.160369 -0.0351926 0.0967182 0.0634607 -0.100373 0.104421 0.0335994 -0.0401433 -0.0921515 -0.0330036 0.0134651 -0.0480695 -0.0233522 0.126135 0.0341767 -0.0771016 -0.0198861 0.0204005 0.214255 -0.0059597 -0.0282567 -0.217097 -0.005436 0.046377 -0.0125074 0.0602786 -0.00301983 0.0543812 -0.0078462 -0.037339 -0.0706917 0.000512223 -0.0572591 0.0619283 -0.0483344 0.145883 -0.0394883 0.0118261 -0.0267357 -0.0417945 -0.0967986 0.103476 0.0943253 -0.00868142 -0.0486591 -0.0141805 0.0882712 -0.128123 -0.139263 -0.031846 -0.0696461 -0.0829179 -0.0506822 0.0170816 -0.00434492 -0.0836774 0.0445127 0.0279777 0.00481345 0.148885 -0.0676375 -0.00961154 -0.124313 0.223306 -0.0306278 -0.0334244 0.0715249 0.123356 -0.0769638 0.0300979 -0.0270688 0.0860773 -0.129748 -0.0581569 0.0313402 0.140165 -0.0564507 0.0288226 -0.0535654 0.0797841 -0.0643782 -0.0110258 -0.0796211 -0.0359036 
0.138244 -0.012067 -0.176175 -0.00627156 0.117953 0.161393 0.0304087 -0.0108733 -0.0688259 -0.0875367 0.0669618 0.109165 0.105324 -0.160562 -0.154533 -0.0166848 -0.0592735 0.0651527 -0.173264 0.173971 0.154887 -0.0596705 0.0785544 0.118313 -0.0329308 -0.0600422 -0.000842751 -0.197065 -0.00388959 0.071516 -0.0401401 0.0196008 -0.101715 0.0780202 -0.0759228 -0.0269466 -0.139164 0.0169992 -0.0786905 -0.0119037 0.0250077 -0.0624274 -0.0850512 0.206603 -0.158133 -0.0302777 0.10915 0.0610587 -0.10901 0.111772 0.0518549 -0.0332135 -0.102954 -0.0266432 0.0174186 -0.0556277 -0.0184045 0.127053 0.0433249 -0.0804548 -0.0219592 0.0130578 0.221837 -0.00813735 -0.0224876 -0.227146 -0.00585802 0.0502803 -0.0119604 0.0628966 -0.00164652 0.0587266 -0.00292277 -0.0289577 -0.0688634 -0.00621975 -0.0587704 0.0664423 -0.0478878 0.149037 -0.0240662 0.0103598 -0.0219996 -0.0425554 -0.099314 0.0903571 0.0918522 -0.00855264 -0.0388643 -0.0137036 0.0739572 -0.125169 -0.144963 -0.0222263 -0.0670105 -0.0793711 -0.0372715 0.0241167 -0.00805464 -0.0865129 0.0379187 0.0387812 -0.00041701 0.154196 -0.0748029 -0.00978774 -0.126531 0.220445 -0.025566 -0.0361547 0.0761991 0.133277 -0.0723486 0.0391669 -0.0280494 0.079592 -0.132122 -0.0594467 0.0233912 0.131801 -0.0578938 0.0264889 -0.0337801 0.0693428 -0.0575926 -0.00983009 -0.0727697 -0.0376228 
0.135882 -0.0158723 -0.17088 -0.00577573 0.121933 0.157218 0.0314324 -0.010974 -0.0587521 -0.0901754 0.0681129 0.111696 0.102112 -0.161663 -0.155754 -0.0142845 -0.0618897 0.0709942 -0.181773 0.171781 0.159741 -0.0573907 0.076809 0.121209 -0.0333859 -0.0585886 -0.002848 -0.197997 -0.00319316 0.0692804 -0.037197 0.0241647 -0.10092 0.0806748 -0.0739564 -0.027373 -0.137745 0.0217079 -0.0788299 -0.0121308 0.0312156 -0.0564068 -0.0871058 0.205459 -0.156144 -0.0355945 0.106922 0.0600339 -0.106255 0.107546 0.0461933 -0.0358632 -0.10385 -0.0268234 0.0188555 -0.0538182 -0.0177353 0.126305 0.0384455 -0.0834369 -0.0213812 0.00872188 0.222039 -0.00250502 -0.0248718 -0.225214 -0.0061549 0.0535683 -0.00679182 0.0659148 3.20073e-05 0.0584294 -4.89395e-05 -0.0280995 -0.0701653 -0.0100456 -0.0640839 0.0680586 -0.0514811 0.141364 -0.0246434 0.024011 -0.0228023 -0.0454856 -0.0991722 0.0907423 0.0959797 -0.00315975 -0.0405459 -0.0148051 0.0781321 -0.124646 -0.146594 -0.0271246 -0.0640509 -0.0781671 -0.042292 0.022154 -0.00790807 -0.0852557 0.0373293 0.0294624 0.000667037 0.153833 -0.0721215 -0.0121358 -0.127811 0.216514 -0.022727 -0.0374545 0.07407 0.136538 -0.0763489 0.039712 -0.0224957 0.0784887 -0.135615 -0.0660101 0.0235198 0.127994 -0.053089 0.0364931 -0.0348983 0.0723392 -0.0605786 -0.0116541 -0.073587 -0.0369051 
0.132754 -0.0122611 -0.177967 -0.000218421 0.11425 0.147145 0.0172954 -0.00985353 -0.0619187 -0.0897478 0.069234 0.117111 0.0990663 -0.164516 -0.165545 -0.00781319 -0.0485765 0.0692172 -0.177777 0.185515 0.152354 -0.0589119 0.0839538 0.120488 -0.0394764 -0.0480794 0.0105317 -0.196114 -0.00821949 0.0646092 -0.0469668 0.0272656 -0.0846494 0.0816299 -0.0843884 -0.0292497 -0.132651 0.034952 -0.0892419 -0.010824 0.022803 -0.0555119 -0.0839143 0.204579 -0.15597 -0.0321286 0.117107 0.0499386 -0.110804 0.117029 0.056466 -0.0343005 -0.106479 -0.0217089 0.0239772 -0.0569404 -0.0122195 0.112669 0.0480742 -0.0889929 -0.0229747 0.00240779 0.218254 -0.00447558 -0.0221305 -0.233313 -0.00845669 0.0513965 -0.00756232 0.0654965 -0.00316908 0.0476669 0.00207257 -0.0226089 -0.0638845 -0.0111309 -0.0601795 0.0775693 -0.0566103 0.136496 -0.0303069 0.0251478 -0.025545 -0.0494048 -0.0953406 0.0907846 0.0893131 -0.00182887 -0.0340001 -0.0156726 0.0641335 -0.124877 -0.150015 -0.0253135 -0.0542931 -0.0724615 -0.034293 0.0261767 -0.0118799 -0.0933345 0.0298678 0.0301171 0.00138791 0.160358 -0.0743141 -0.0151753 -0.127619 0.213802 -0.0251328 -0.0446272 0.0693869 0.144333 -0.0687925 0.0425185 -0.0270441 0.0653946 -0.136377 -0.0782583 0.0262832 0.125255 -0.05901 0.0453067 -0.0271063 0.0685738 -0.0504473 -0.0137622 -0.0666033 -0.0418296 
0.143542 -0.0113321 -0.180793 0.00500432 0.113369 0.153991 0.0311481 -0.00602288 -0.0558348 -0.0931073 0.0744074 0.111872 0.101721 -0.166853 -0.15831 -0.0128665 -0.0456426 0.0648686 -0.182369 0.179899 0.15377 -0.0625492 0.0873054 0.11384 -0.0381696 -0.0661726 -0.00103911 -0.200162 -0.00869443 0.0656228 -0.0404653 0.0348185 -0.0853009 0.0853427 -0.0847191 -0.0317836 -0.129232 0.0341968 -0.0859806 -0.0115668 0.0253439 -0.0599373 -0.0913087 0.194783 -0.160046 -0.0331257 0.1029 0.0517608 -0.106988 0.116891 0.0507588 -0.0260701 -0.103497 -0.022503 0.0105351 -0.0588429 -0.00790381 0.107677 0.0416127 -0.077403 -0.0291697 0.00453371 0.214148 -0.0176822 -0.0246394 -0.229749 -0.00482625 0.0520702 -0.0130429 0.0652022 -0.00310296 0.0469256 -0.00595102 -0.021439 -0.0665228 -0.0110617 -0.055471 0.0666497 -0.0610285 0.146091 -0.0384292 0.0123671 -0.0266986 -0.0476863 -0.0915352 0.101058 0.0881161 -0.012929 -0.0435131 -0.0170808 0.0723283 -0.129575 -0.14977 -0.0246244 -0.0563498 -0.0795514 -0.0369284 0.0214137 -0.0129705 -0.0858093 0.0349732 0.0305377 0.00142056 0.163648 -0.066498 -0.017651 -0.11968 0.222066 -0.0196978 -0.0421742 0.0614198 0.138373 -0.0685341 0.0375096 -0.0225887 0.0700259 -0.132538 -0.0709597 0.035325 0.136475 -0.0581348 0.0392022 -0.0347074 0.0811011 -0.0433316 -0.0202965 -0.0625367 -0.0375937 
0.140821 -0.0191446 -0.174563 -0.00157765 0.11689 0.156287 0.0334701 -0.0064103 -0.0591306 -0.0988182 0.0698843 0.110595 0.104895 -0.155412 -0.156055 -0.0263017 -0.0526034 0.0670351 -0.179839 0.172995 0.155435 -0.0596332 0.079892 0.120842 -0.0338803 -0.0692552 -0.00160084 -0.193102 -0.0101046 0.066987 -0.0384386 0.0221249 -0.0968788 0.081376 -0.0810934 -0.0279954 -0.138358 0.0201188 -0.0874019 -0.0109282 0.0315691 -0.0558026 -0.0929569 0.202321 -0.162116 -0.0337053 0.0989993 0.0585875 -0.101315 0.111879 0.0448935 -0.031226 -0.0996275 -0.0258239 0.0114534 -0.0558373 -0.0165279 0.121993 0.042541 -0.0793949 -0.0232977 0.0159186 0.214681 -0.0061366 -0.0319148 -0.226649 0.000394971 0.0516668 -0.00843164 0.0638942 0.000801042 0.0514032 0.000492828 -0.0282023 -0.0693887 -0.00671127 -0.0616647 0.0598889 -0.0530021 0.148019 -0.0333566 0.0135463 -0.0230323 -0.0475326 -0.0950932 0.096149 0.0945856 -0.0111191 -0.0467218 -0.0182549 0.0785588 -0.127173 -0.140379 -0.0285163 -0.0652546 -0.0833364 -0.0418032 0.0187231 -0.00896442 -0.0868312 0.0371018 0.036553 0.00573732 0.157257 -0.0720681 -0.0141124 -0.126525 0.220768 -0.0270281 -0.0374416 0.0755415 0.132154 -0.0745173 0.0385725 -0.0312181 0.0780866 -0.131061 -0.0654778 0.0300826 0.132917 -0.0599902 0.0313908 -0.0444011 0.0750661 -0.0549634 -0.0164398 -0.074176 -0.0353411 
0.13603 -0.0310364 -0.173649 -0.0127816 0.121585 0.159094 0.0279002 -0.00217919 -0.0630899 -0.103178 0.0604196 0.110238 0.1037 -0.157685 -0.15981 -0.024117 -0.0628212 0.0601863 -0.175182 0.174915 0.15798 -0.0592317 0.0799438 0.116679 -0.0357186 -0.057065 0.00081992 -0.195158 -0.00703954 0.0549696 -0.0336044 0.0128978 -0.105186 0.0771332 -0.0788855 -0.0235151 -0.142716 0.0182567 -0.0822718 -0.0140448 0.037637 -0.0537549 -0.0941491 0.205657 -0.157836 -0.036996 0.0998586 0.063479 -0.0985107 0.109066 0.0300587 -0.0400883 -0.0965342 -0.0244683 0.0146699 -0.0588179 -0.0146138 0.131172 0.0365162 -0.0841875 -0.0178212 0.0240385 0.22305 0.00336491 -0.0287458 -0.222731 -0.000899099 0.0549589 0.00376318 0.0580647 -0.00305219 0.0568271 0.0025596 -0.0258249 -0.0676521 -0.00691896 -0.0636465 0.0634661 -0.0457506 0.145844 -0.028312 0.0165684 -0.0197726 -0.044473 -0.0991694 0.0920978 0.100475 0.00673912 -0.0443613 -0.0248857 0.0904426 -0.119224 -0.138383 -0.0244315 -0.0647807 -0.0818362 -0.0400454 0.0222214 -0.0113672 -0.0854113 0.0359146 0.0287907 -0.0022165 0.150829 -0.0708465 -0.00939957 -0.12763 0.217285 -0.0303164 -0.0348982 0.080717 0.133948 -0.0731901 0.0416356 -0.0303612 0.0820371 -0.134935 -0.0616356 0.0234042 0.126212 -0.0632439 0.0311014 -0.0389644 0.0654046 -0.0688057 -0.0113751 -0.0861297 -0.0352045 
0.133688 -0.0213949 -0.166859 -0.012598 0.118828 0.166567 0.0312317 -0.0121389 -0.0607945 -0.0988078 0.0613814 0.104555 0.104079 -0.158318 -0.149591 -0.0297258 -0.0777598 0.0632052 -0.174794 0.166475 0.157899 -0.0561008 0.0764335 0.119299 -0.0310721 -0.0644141 -0.00341111 -0.198557 -0.0103146 0.0673962 -0.0294582 0.00275087 -0.10808 0.0753506 -0.0624573 -0.0198522 -0.142177 0.0110118 -0.0822256 -0.016933 0.0331888 -0.0617881 -0.0920257 0.213792 -0.16011 -0.0308071 0.101906 0.0704779 -0.102075 0.109887 0.03527 -0.0389828 -0.0933821 -0.0284879 0.0208114 -0.0539738 -0.025703 0.133993 0.0364689 -0.0861921 -0.0204914 0.0197504 0.225151 0.00113033 -0.0232741 -0.223918 -0.000508477 0.0523527 -0.00602108 0.0649333 0.00160807 0.0594251 0.000719659 -0.0376283 -0.0710445 -0.00536264 -0.0700216 0.0586997 -0.0392436 0.156201 -0.0203725 0.0102681 -0.0224696 -0.0417261 -0.103307 0.085128 0.097281 -0.00156298 -0.0427286 -0.0103859 0.0877212 -0.123443 -0.135934 -0.0280911 -0.0777082 -0.0842594 -0.0439775 0.0217025 -0.00300308 -0.0864142 0.0448445 0.0398165 -0.000665457 0.136649 -0.0725322 -0.00834273 -0.126883 0.215772 -0.0286104 -0.0261688 0.0859222 0.128005 -0.0786205 0.0367641 -0.0296019 0.0912651 -0.132473 -0.0548722 0.0193344 0.130334 -0.0536898 0.0208496 -0.0412356 0.0684623 -0.0636946 -0.00812258 -0.073766 -0.031536 
0.140851 -0.0273574 -0.179699 -0.00138457 0.121124 0.15474 0.0383405 -0.00503877 -0.0625505 -0.096355 0.0599086 0.108737 0.103184 -0.154768 -0.153967 -0.0286557 -0.0571617 0.0656733 -0.166713 0.169639 0.157937 -0.0725902 0.0829139 0.121102 -0.0261188 -0.0735384 -0.00349855 -0.202768 -0.0128577 0.0700805 -0.0376381 0.0163349 -0.0997974 0.0744824 -0.0770304 -0.0297384 -0.145505 0.014002 -0.0879548 -0.0226245 0.0293655 -0.0595862 -0.0916094 0.205187 -0.161471 -0.0253085 0.0975768 0.0608 -0.100013 0.105974 0.0414391 -0.0347676 -0.0871213 -0.0336954 0.0143766 -0.0549178 -0.0130754 0.126045 0.0440163 -0.0785466 -0.0139909 0.0198063 0.213827 -0.00236913 -0.026596 -0.22477 -0.00614296 0.0541214 -0.00543826 0.0610741 -0.00263808 0.0575173 -0.00826907 -0.0394305 -0.0749421 0.00133052 -0.0596375 0.0594809 -0.0470921 0.153517 -0.0412018 0.00691598 -0.0283448 -0.0463845 -0.0963514 0.091816 0.0931152 -0.00851609 -0.0453177 -0.0219505 0.0796555 -0.118129 -0.138207 -0.0305087 -0.0679585 -0.0834338 -0.0387041 0.0209152 -0.00270291 -0.0890341 0.0447579 0.0347353 0.00684574 0.147741 -0.0727448 -0.016643 -0.126432 0.221896 -0.0283468 -0.0338157 0.077294 0.127088 -0.0718141 0.0262655 -0.0269471 0.0885336 -0.13195 -0.0622029 0.0298623 0.137425 -0.0636725 0.0271094 -0.0500231 0.0718798 -0.0622203 -0.0114491 -0.0778365 -0.0349368 
0.142082 -0.0310674 -0.184788 -0.00236799 0.128711 0.156823 0.0346038 -0.0114321 -0.0604073 -0.100142 0.0565789 0.108022 0.100939 -0.150792 -0.153486 -0.0235604 -0.0570368 0.0660206 -0.163085 0.17172 0.161424 -0.0745273 0.0892276 0.123722 -0.021677 -0.0757283 -0.000469706 -0.205739 -0.0132783 0.0719973 -0.0341583 0.0153534 -0.0994107 0.0741353 -0.0726661 -0.0244112 -0.142144 0.0120214 -0.0840026 -0.0295752 0.0287027 -0.0572498 -0.0868204 0.20114 -0.160379 -0.0230368 0.0997353 0.0657895 -0.0975904 0.106759 0.0356708 -0.0396815 -0.080768 -0.0341757 0.0198126 -0.0536808 -0.00958661 0.130668 0.0408704 -0.0801958 -0.0133363 0.0248723 0.218711 -0.00817835 -0.0230186 -0.219911 -0.0118767 0.0589048 -0.00529017 0.0634786 -0.00525754 0.0614307 -0.0144096 -0.0436433 -0.0746339 0.0031363 -0.0541081 0.0626471 -0.0459559 0.150144 -0.0390444 0.011148 -0.0309764 -0.0469287 -0.0967493 0.0928643 0.0880897 -0.00281125 -0.0456029 -0.0192178 0.0877104 -0.117831 -0.137447 -0.0290185 -0.0632836 -0.0811843 -0.0425667 0.0271357 -0.00100548 -0.0893534 0.048397 0.0279216 0.0031646 0.144409 -0.0722562 -0.0134568 -0.126999 0.215697 -0.0295865 -0.0303809 0.0755556 0.128111 -0.0670099 0.0290643 -0.0251994 0.0921857 -0.133178 -0.059606 0.026052 0.140074 -0.061783 0.0292792 -0.0470647 0.0704947 -0.0705138 -0.00778942 -0.08119 -0.0370595 
0.139179 -0.003767 -0.189045 -0.0014671 0.113233 0.158598 0.0244584 -0.0125496 -0.0533977 -0.0876648 0.0748261 0.113049 0.0974293 -0.168833 -0.162011 -0.0159477 -0.0478196 0.0645883 -0.173871 0.176514 0.145457 -0.0498057 0.0787524 0.116117 -0.0396026 -0.0563754 0.0128566 -0.197027 -0.0060803 0.0706491 -0.0431601 0.0236939 -0.0857199 0.0788431 -0.0768284 -0.0278149 -0.124438 0.0253263 -0.0868463 -0.0082191 0.0248118 -0.0600222 -0.0887111 0.208161 -0.16145 -0.0249882 0.110654 0.0578105 -0.108222 0.114654 0.0557026 -0.0204923 -0.103787 -0.0248259 0.0188677 -0.0552621 -0.0168679 0.110462 0.0447464 -0.083164 -0.0313179 -0.00102569 0.223833 -0.0141822 -0.0242646 -0.238432 -0.00141435 0.0518663 -0.00690578 0.0687893 -0.000759718 0.0467467 -0.00268842 -0.0273169 -0.0653056 -0.0101322 -0.063815 0.0776802 -0.0606412 0.141884 -0.0274824 0.0243863 -0.0251221 -0.0451537 -0.0886593 0.0925347 0.0881249 -0.0108272 -0.0380762 -0.0101079 0.0668901 -0.128698 -0.152857 -0.0256706 -0.0556955 -0.0822198 -0.0322516 0.0180893 -0.00922286 -0.0942663 0.0358922 0.0384073 0.00496795 0.153013 -0.0788148 -0.0169537 -0.122027 0.214937 -0.028659 -0.0320279 0.0775137 0.135937 -0.0681151 0.0396144 -0.0298195 0.0661711 -0.137845 -0.0773895 0.0297349 0.126201 -0.0527382 0.0365416 -0.0270622 0.0753556 -0.0440151 -0.0176087 -0.0624288 -0.0385976 
0.13803 -0.00841881 -0.180221 0.00739311 0.110741 0.149853 0.0308655 -0.00631716 -0.0448447 -0.0916946 0.0765118 0.108657 0.097009 -0.176789 -0.16169 -0.0128374 -0.0539082 0.0706574 -0.180863 0.177062 0.157182 -0.0661087 0.0782089 0.127035 -0.034586 -0.0735266 0.00363281 -0.202768 -0.00457733 0.071129 -0.0409632 0.0263752 -0.0827974 0.0846248 -0.0792106 -0.0322045 -0.129268 0.0179611 -0.0916707 -0.0150954 0.0281419 -0.0704697 -0.0858769 0.202225 -0.152314 -0.0307002 0.10535 0.0560368 -0.10987 0.112138 0.0467755 -0.0296809 -0.0981286 -0.030316 0.0115545 -0.0501397 -0.016304 0.102479 0.0408327 -0.076629 -0.0243223 0.00387844 0.21312 -0.00858704 -0.0294288 -0.230629 -0.00728957 0.0402555 -0.0124139 0.0612795 -0.011577 0.0407287 -0.0110323 -0.0311465 -0.0638951 -0.0103928 -0.0558674 0.0777678 -0.0611626 0.145308 -0.0366655 0.0161124 -0.0332965 -0.0463132 -0.0911344 0.110667 0.0833059 -0.0174565 -0.046542 -0.00931451 0.0749495 -0.127863 -0.154178 -0.0272346 -0.0591674 -0.0752494 -0.0462599 0.0158887 -0.00508745 -0.0903251 0.0424187 0.0245866 0.00435207 0.152286 -0.0635318 -0.0178337 -0.115166 0.223675 -0.0281677 -0.0373223 0.0628689 0.131897 -0.0663184 0.0258384 -0.0253973 0.0734882 -0.134682 -0.0703961 0.0363246 0.135761 -0.0549475 0.0378546 -0.0422555 0.0836357 -0.0500797 -0.0154026 -0.0646322 -0.0400963 
0.149373 -0.00189723 -0.194602 0.00230541 0.112655 0.155705 0.0405819 -0.0056244 -0.0448449 -0.0985274 0.0787096 0.110977 0.0969876 -0.163535 -0.164118 -0.01177 -0.0416825 0.0502527 -0.181345 0.176357 0.151906 -0.0641181 0.0751 0.112264 -0.0350699 -0.0658815 0.00853725 -0.190948 -0.00218138 0.0723035 -0.0429095 0.0401393 -0.0816669 0.0905069 -0.0922924 -0.0342611 -0.119245 0.0355667 -0.0847262 -0.0131329 0.0292966 -0.0664697 -0.0789838 0.190581 -0.150636 -0.0259274 0.102916 0.0499778 -0.113742 0.112313 0.0425982 -0.0162657 -0.101208 -0.0206269 0.0203462 -0.0516016 -0.0211802 0.114371 0.0333337 -0.0787266 -0.0360287 -0.000452443 0.225749 -0.0294002 -0.0304891 -0.212859 -0.00621719 0.0515778 -0.0153156 0.0627249 -0.00848456 0.0414021 -0.0176349 -0.0163039 -0.053479 -0.0085146 -0.0424375 0.0684488 -0.0669177 0.138768 -0.0406126 0.0165366 -0.0255149 -0.0531069 -0.0881156 0.104073 0.0840187 -0.0171558 -0.0377322 -0.00804394 0.0810017 -0.142963 -0.155841 -0.0237621 -0.0429107 -0.0756226 -0.0308035 0.014163 -0.00335908 -0.0876319 0.0324248 0.0264249 0.00152738 0.167128 -0.0842582 -0.0115528 -0.122767 0.22591 -0.0296347 -0.0520444 0.0687463 0.138447 -0.0712606 0.0360779 -0.0124661 0.0644325 -0.132784 -0.0751824 0.0494365 0.139967 -0.0499189 0.0407792 -0.026526 0.088768 -0.0419732 -0.0203016 -0.056535 -0.0439589 
