0.0861265 -0.00143227 -0.118728 -0.02675 0.169485 0.16526 0.0417774 -0.116866 -0.148389 -0.0151969 -0.0297315 0.116012 0.110158 -0.00873568 -0.073568 -0.0127796 0.022644 0.152971 -0.0261418 0.145928 0.147075 -0.00725165 0.0558276 0.184707 -0.0312902 0.026049 -0.0761688 -0.196051 0.0551671 0.166074 -0.065967 0.0806869 -0.101446 0.029994 0.0665383 0.0180031 -0.0543853 0.0571107 -0.0240447 -0.0964151 -0.00512047 0.0461775 0.0168701 0.112391 -0.165242 0.032086 0.199198 0.0646713 -0.124483 0.0251907 0.066636 -0.089712 -0.00151609 -0.0180151 0.151787 0.0162478 0.0275927 0.218916 0.0391264 -0.138651 0.00516196 0.0821084 0.211009 -0.100594 0.0933302 -0.102919 -0.0386129 0.0295098 -0.072953 0.0691848 0.0097716 0.0924352 -0.0251873 -0.0383407 -0.0834631 0.0427815 -0.0425104 0.0630164 0.0765069 -0.0334729 0.0178014 0.152249 -0.0457724 -0.0548934 -0.0319925 -0.0666775 0.0558489 0.0373251 0.00316659 0.0516405 0.0873731 -0.0564375 -0.0408571 -0.0262895 -0.025918 -0.0517667 0.0149332 0.158251 0.0309682 -0.0417998 0.0863585 0.0757192 0.00390511 0.109891 -0.174195 0.0326562 -0.124617 0.028603 -0.0179774 0.0243901 0.0951204 0.0992854 -0.0519586 -0.00727964 -0.0139178 0.0881113 -0.117968 -0.140767 -0.0978061 0.0897697 -0.0114346 -0.0144257 0.0179342 -0.0280015 -0.156729 0.105667 -0.0924029 -0.0829178 
0.0826648 0.0230071 -0.119556 -0.0248172 0.166023 0.159005 0.0396164 -0.119048 -0.158459 0.0149384 -0.0189877 0.110966 0.115405 -0.0116577 -0.0577463 -0.00291302 0.0375826 0.154068 -0.0236859 0.151831 0.138676 -0.00600651 0.0517639 0.172488 -0.0304692 0.0403194 -0.0839766 -0.190156 0.0798737 0.170264 -0.0661379 0.111307 -0.0909524 0.0375189 0.0612032 0.0221204 -0.0422607 0.0719701 -0.0102848 -0.0959886 -0.0056276 0.0309655 0.0242083 0.108465 -0.168721 0.0344733 0.210592 0.0685037 -0.133273 0.0195159 0.0765594 -0.0594796 -0.0221354 -0.0174463 0.152818 0.0174996 0.0249862 0.20269 0.0376626 -0.135633 -0.013263 0.0594678 0.210255 -0.108781 0.0958479 -0.0957315 -0.0357749 0.0242907 -0.081799 0.0797672 0.00439274 0.0921601 -0.0333978 -0.0185565 -0.0719709 0.026998 -0.0401304 0.0783489 0.0746598 -0.0400535 0.0131633 0.160287 -0.0398367 -0.0519355 -0.0236352 -0.0719964 0.0514457 0.0358537 0.0192665 0.0599474 0.0831227 -0.0578477 -0.0473869 -0.0250861 -0.0220966 -0.061632 0.0239093 0.164717 0.027725 -0.0546028 0.0779413 0.0839588 0.00782931 0.123284 -0.176518 0.0415671 -0.119804 0.0369302 0.0170769 0.0154706 0.078913 0.109188 -0.0668734 -0.000930428 0.00109609 0.0659814 -0.101779 -0.167729 -0.0815255 0.09712 0.00855449 -0.014167 0.0318448 -0.0165465 -0.152747 0.0973131 -0.0666789 -0.0764701 
0.0551765 0.035989 -0.102323 -0.041922 0.153026 0.175884 0.0173885 -0.143462 -0.160978 0.00422308 -0.0317231 0.104416 0.107318 -0.00268792 -0.0493291 -0.0182905 -0.007654 0.139467 -0.0143402 0.135497 0.116297 -0.00699367 0.0796289 0.140637 -0.0315798 0.0611601 -0.0901142 -0.195375 0.0775748 0.143481 -0.0405244 0.101617 -0.0948269 0.0201984 0.0771519 0.039313 -0.0518055 0.100223 0.00451398 -0.0794832 -0.0039654 0.0289573 -0.00521272 0.100107 -0.182842 0.0397952 0.21356 0.0682224 -0.140324 0.0192006 0.0466399 -0.0486402 -0.00676073 -0.0127412 0.132081 0.0164252 0.0435698 0.223395 0.0190653 -0.141205 -0.0255383 0.0834742 0.231809 -0.108882 0.119588 -0.0746551 -0.0196422 0.033667 -0.0820283 0.104444 0.00989873 0.100133 -0.0223798 0.00603023 -0.0534903 0.0143062 -0.0762624 0.0387599 0.0822136 -0.0323646 0.0102526 0.157537 -0.0368696 -0.0515699 -0.0418764 -0.0931328 0.051878 0.0490033 0.00944422 0.0483777 0.097986 -0.0515484 -0.00615209 -0.0250764 -0.0234053 -0.0833472 0.0287659 0.190589 0.0364117 -0.0435202 0.0614831 0.0806425 -0.0102677 0.116125 -0.159337 0.0530547 -0.107475 0.0379421 0.0310033 0.0194872 0.0845992 0.122377 -0.063354 0.00942099 -0.00310446 0.0718113 -0.117855 -0.154482 -0.0633081 0.0977787 0.0192514 -0.0329587 0.024253 -0.0377853 -0.148118 0.10416 -0.0683932 -0.0554002 
0.0234334 0.0262973 -0.0807094 -0.0610118 0.155061 0.167678 0.00536232 -0.141806 -0.157976 0.00944386 -0.0400282 0.0842024 0.101597 0.0115093 -0.00218644 -0.0293573 -0.0668667 0.116868 0.018373 0.115488 0.114494 -0.0217952 0.100412 0.103531 0.00616372 0.0678693 -0.10117 -0.199532 0.0800711 0.118594 -0.00246776 0.0455665 -0.0891286 -0.0109368 0.0984309 0.0669818 -0.0743738 0.0966237 0.0238856 -0.084909 0.00472992 0.030613 -0.0107727 0.119944 -0.203507 0.0409756 0.200539 0.0724932 -0.115924 0.0023646 -0.00506541 -0.0528087 -0.00154323 -0.0153588 0.128056 0.0131019 0.0345053 0.234618 -0.00421373 -0.137664 -0.0332774 0.0763654 0.240677 -0.0742758 0.130108 -0.0438571 -0.0198889 0.0494375 -0.0521627 0.106049 0.0297727 0.143016 -0.0236395 -0.00946352 -0.0325097 0.011004 -0.119283 0.0110237 0.0990139 0.00291485 0.00673998 0.138772 -0.020706 -0.0276679 -0.0579519 -0.108315 0.0599116 0.0797364 0.0260103 0.0232851 0.111941 -0.0232927 0.0122827 -0.0388016 -0.0467093 -0.12355 0.0138452 0.207284 0.0441983 -0.0539542 0.0386707 0.06036 0.00630318 0.0461423 -0.162847 0.0784991 -0.0934365 0.0465277 0.0766931 0.0259262 0.0972737 0.114301 -0.0838464 -0.00408499 0.0165399 0.0909292 -0.10816 -0.135751 -0.0623427 0.104419 0.0379057 -0.0478329 0.00303225 -0.0347498 -0.173292 0.111205 -0.0490783 -0.000832679 
0.0153183 -0.0344479 -0.0891167 -0.0418247 0.145261 0.0859812 0.0187783 -0.141142 -0.123034 -0.018997 -0.0563185 0.119772 0.0932606 0.0441917 -0.000158644 -0.0324994 -0.086551 0.0597968 0.0398758 0.149233 0.0904981 -0.0487452 0.129717 0.0937666 0.0026647 0.101777 -0.0703558 -0.225709 0.0335321 0.117516 -0.0182952 0.0554019 -0.0500569 -0.0206041 0.0641503 0.0545785 -0.0524577 0.181212 0.0011967 -0.0736207 0.0041572 0.0555227 -0.0283822 0.111733 -0.222101 0.0493701 0.190646 0.0258348 -0.0514744 0.00923893 -0.0240777 -0.0826501 0.0128106 0.0118545 0.177993 -0.00115866 0.050411 0.237875 -0.0132317 -0.118247 -0.0231584 0.0217599 0.223604 -0.0513503 0.138343 -0.0523206 -0.00757847 0.067788 -0.0060675 0.0645605 0.0292786 0.158477 -0.0193462 0.0140704 -0.0105219 0.0234021 -0.122147 -0.00142338 0.0842188 0.0249148 -0.0135218 0.127626 -0.0382334 -0.0356625 -0.0497177 -0.126964 0.075692 0.102399 0.0298347 -0.0366585 0.0839578 -0.0193014 0.0366915 -0.0685969 -0.0511884 -0.130892 0.0202292 0.182494 0.0969808 -0.060958 -0.00308258 0.0111022 0.0241418 0.0499914 -0.176555 0.0442578 -0.110683 0.0502637 0.0736959 0.00889227 0.0840595 0.135749 -0.0920613 -0.0216128 0.0119429 0.106261 -0.0924178 -0.153309 -0.0767336 0.102575 0.0231072 0.0225605 -0.0120352 -0.0101001 -0.17765 0.0967546 -0.0631673 0.0196181 
0.0167189 -0.0267274 -0.105177 -0.0032214 0.139163 0.0885854 -0.00585092 -0.156166 -0.132883 -0.0180542 -0.0438757 0.0832992 0.0871326 0.0661585 0.00162299 -0.00500783 -0.0362051 0.0675073 0.0860195 0.14967 0.0995681 -0.0682944 0.136705 0.117828 0.0260309 0.0845108 -0.0930416 -0.227785 0.0476502 0.120499 0.00472213 0.0688794 -0.0435637 -0.0383475 0.0648717 0.0816835 -0.0400322 0.143007 0.00687951 -0.0855373 -0.0072632 0.0707083 -0.0114411 0.0877344 -0.193498 0.0552284 0.215646 0.0336204 -0.042132 -0.00977299 -0.0335598 -0.0763929 0.0484281 0.00368266 0.17288 0.00563024 0.0855555 0.212873 0.0367143 -0.129914 -0.0232316 0.0597005 0.201417 -0.0834333 0.119042 -0.0158554 0.00696771 0.044194 0.00927226 0.0611007 0.0130853 0.162523 -0.035685 0.0172876 0.000281736 0.00241448 -0.104048 0.0373686 0.0750439 0.0103777 -0.00439107 0.148389 -0.0594366 -0.0547033 -0.0225318 -0.0768466 0.0324675 0.0746304 0.0110453 -0.0535064 0.0968742 0.020523 0.0385259 -0.0844211 -0.0192304 -0.126275 0.0180486 0.225147 0.080003 -0.0672034 0.00870941 0.0109992 0.0517053 0.0368968 -0.177952 0.0697657 -0.0801054 0.0263465 0.0790585 0.0344281 0.0525401 0.111897 -0.0577428 -0.0590999 0.00335911 0.100133 -0.0754534 -0.175053 -0.0877587 0.0785236 0.0138347 0.0200287 -0.00217848 -0.0119283 -0.227277 0.115768 -0.061872 0.0391272 
0.00918919 -0.0390034 -0.0546023 -0.00485361 0.101921 0.09656 -0.0201862 -0.138299 -0.168842 0.0300678 -0.025814 0.0524674 0.0965603 0.0551155 0.0640748 -0.0333589 -0.0279311 0.0439141 0.148525 0.140521 0.0643026 -0.0709737 0.122536 0.125625 0.018245 0.117665 -0.109423 -0.230354 0.0642205 0.0708575 0.0143799 0.0243944 -0.0512536 -0.0464947 0.0827523 0.0919284 -0.0171252 0.12752 0.0468529 -0.0769806 0.0054263 0.0432045 -0.0546363 0.0409388 -0.195775 0.0376802 0.193189 0.0510213 -0.0367572 -0.0440259 -0.048338 -0.0713701 0.0753241 0.0117737 0.147528 0.005665 0.103599 0.185465 0.0238789 -0.112613 -0.0196038 0.0784172 0.175811 -0.083805 0.117909 0.0396037 0.0465433 0.0278157 0.0259628 0.00880362 -0.0135104 0.161566 -0.0426288 0.0307568 0.0398194 -0.0184561 -0.124328 0.0397928 0.130187 0.0508317 -0.0119155 0.118209 -0.0290064 -0.0484148 0.00297086 -0.0821897 0.0469043 0.0821967 0.0133773 -0.0714704 0.109685 0.0700879 0.105043 -0.0450527 -0.0678407 -0.177204 0.028355 0.207084 0.0701907 -0.074414 0.0247099 0.0246378 0.0418245 -0.00748343 -0.129327 0.0880416 -0.0148065 -0.000598786 0.0955901 0.0630227 0.0514929 0.0916074 -0.0302879 -0.0905238 -0.000650773 0.102579 -0.100635 -0.162445 -0.126624 0.0476187 0.00586209 -0.0447775 -0.0253127 -0.0251119 -0.228415 0.151707 -0.0691102 0.0716778 
0.00797749 -0.0193922 -0.0872798 -0.0235797 0.0997775 0.100579 0.00184442 -0.164215 -0.18015 0.052942 -0.0527644 0.044237 0.0774806 0.0754224 0.0963955 -0.0287703 -0.0260746 0.00698261 0.21241 0.075971 0.00809709 -0.0211477 0.0775858 0.0377555 0.034717 0.14968 -0.11574 -0.199815 0.0708057 0.101802 -0.00169093 0.0536943 -0.0455086 -0.0873297 0.113722 0.0719932 -0.0023897 0.0673316 0.109781 -0.0932178 -0.00152641 0.0332377 -0.014819 0.0185487 -0.174455 0.0897946 0.168834 0.048579 -0.0469842 -0.0886973 -0.0542005 -0.0477337 0.130436 -0.0026654 0.128654 0.015312 0.0973455 0.189927 -0.00922251 -0.0702174 -0.0193555 0.0900535 0.181594 -0.0843179 0.119647 0.108368 0.0277683 0.0383608 0.0191576 -0.0445246 -0.0188476 0.153159 -0.0604465 0.0209743 0.0385584 0.0167021 -0.113196 -0.046392 0.129263 0.0489302 0.0382124 0.0984305 -0.0221365 -0.0196722 0.0231376 -0.113222 0.0242363 0.0478303 0.0164456 -0.0466587 0.101934 0.0997164 0.08785 0.00124381 -0.0643243 -0.147628 0.0595246 0.190793 0.0821927 -0.0657482 0.0373804 0.0300529 0.0535184 -0.0569392 -0.181851 0.0931584 0.012538 -0.0100531 0.0713555 0.102709 0.108602 0.0264447 -0.0250801 -0.120833 0.000380393 0.0882949 -0.0983284 -0.108552 -0.114542 0.0204851 0.0401389 -0.0951919 0.0170264 -0.0600023 -0.20859 0.155904 -0.0510298 0.061274 
-0.00197156 -0.0416836 -0.103466 -0.0205807 0.0925141 0.101944 0.000774234 -0.159579 -0.152227 0.028554 -0.0439924 0.0611362 0.08697 0.0567313 0.0463008 -0.0453201 -0.0492417 0.0161814 0.18241 0.105542 0.0347346 -0.0504876 0.0589282 0.0544812 0.0109551 0.14837 -0.11949 -0.224236 0.0395824 0.107371 -0.00577877 0.0307481 -0.0425988 -0.0875334 0.127478 0.0782303 -0.0110461 0.078142 0.0741067 -0.116558 0.0017783 0.035412 -0.022033 0.0509217 -0.165243 0.067764 0.175697 0.0510861 -0.0489931 -0.085923 -0.0842451 -0.0977303 0.130683 0.00157426 0.14375 0.0243534 0.0567284 0.193426 -0.0180243 -0.099384 -0.00513512 0.0900832 0.205122 -0.0755972 0.134971 0.0860282 0.0276495 0.0256053 0.0290948 -0.0749425 -0.0108994 0.125786 -0.0369363 -0.0187373 0.0224557 0.0277259 -0.121924 -0.034436 0.136584 0.045935 0.0169885 0.0994661 -0.0490307 -0.0275358 -0.00300699 -0.0908355 0.0379442 0.0568127 0.0267289 -0.0497906 0.108817 0.0719004 0.094614 -0.0154137 -0.0784267 -0.143648 0.0519002 0.169024 0.0804775 -0.0514769 0.0473585 0.0265555 0.0431579 -0.0792221 -0.169688 0.0986522 0.0113004 -0.0059045 0.0215694 0.111959 0.100987 0.0193881 -0.0318171 -0.126975 -0.0125496 0.101562 -0.125483 -0.109919 -0.122506 0.00141537 0.00982262 -0.0918904 0.00742908 -0.051924 -0.200705 0.163371 -0.0733054 0.0457092 
