0.0193408 0.0261005 -0.0203461 0.0122273 0.0763626 0.180459 0.0443089 -0.0123455 -0.0538809 0.017213 0.00033838 0.0525302 0.110444 -0.225447 -0.0674459 0.0731729 -0.165424 0.13665 -0.153057 0.0938766 0.239723 -0.110351 0.0882824 0.117624 -0.0286476 -0.0733589 -0.150583 -0.301399 0.0185442 0.104444 0.0297699 0.0682821 -0.0891741 0.0796241 0.0733135 -0.0302621 -0.0668119 0.0345471 0.0118018 -0.0625729 0.00670403 -0.134374 -0.00817158 0.0945023 -0.0766934 -0.102932 0.148277 0.0424324 -0.141008 0.0454805 0.0801655 -0.144168 -0.0419195 -0.00636338 0.0553312 0.0189844 0.0756939 0.0378326 0.00603134 -0.113968 0.00977245 0.0071276 0.113789 -0.0741226 0.11874 -0.161211 -0.0620142 -0.0194761 -0.0768284 0.0344823 -0.0640072 0.0860403 -0.0830044 -0.0627221 -0.0706546 -0.0165149 -0.0417689 0.0999608 0.0367388 0.123809 -0.0135157 -0.0201426 -0.0252277 0.0329412 -0.119612 0.0852981 0.073672 0.0240267 -0.00341407 0.0176144 0.0344199 -0.100066 -0.0915932 -0.00834325 -0.146955 0.00862926 -0.0872517 0.131426 -0.0262129 0.039527 0.134326 -0.0149585 -0.0900682 0.11627 0.106891 -0.0244521 -0.0570557 0.144559 0.00586664 0.00525966 -0.127764 0.0818599 -0.0729705 -0.0566841 0.0445727 0.138065 -0.0962417 0.00430258 -0.0524617 0.149008 0.0131472 0.00168136 -0.00473232 0.019771 -0.069696 0.064125 -0.0573222 -0.0133708 
0.00978733 0.0397694 -0.0251071 0.00989329 0.0721082 0.184015 0.037085 -0.0235395 -0.067825 0.0344161 0.00356291 0.0521371 0.116576 -0.217933 -0.0679276 0.0672583 -0.165275 0.14641 -0.142495 0.0981667 0.227529 -0.122483 0.0973372 0.109108 -0.0261948 -0.065546 -0.150302 -0.296111 0.019493 0.103214 0.0259591 0.0677654 -0.0821724 0.0764749 0.0715133 -0.0295909 -0.0685515 0.0397509 0.0158157 -0.0622418 0.00162896 -0.143505 -0.00405875 0.0946533 -0.0916627 -0.105776 0.158262 0.0436587 -0.148469 0.0489439 0.0856545 -0.140285 -0.0467337 -0.00284906 0.0517114 0.0217958 0.0812764 0.0355991 0.0148457 -0.11842 0.00572678 0.00952624 0.118393 -0.0773133 0.125069 -0.150454 -0.0639623 -0.0195614 -0.0831977 0.0413182 -0.0645384 0.0878277 -0.0825129 -0.0540486 -0.0629546 -0.0209389 -0.046004 0.0958808 0.0399794 0.114501 -0.0242002 -0.0224173 -0.021777 0.0358589 -0.122441 0.0821207 0.0702636 0.023758 0.0109866 0.016292 0.026145 -0.0995708 -0.0781939 -0.0136239 -0.145368 -0.00451356 -0.0899945 0.150512 -0.0272685 0.0334479 0.128802 -0.00661105 -0.0811886 0.118081 0.111885 -0.0160945 -0.055735 0.149348 0.00926425 0.00259703 -0.130694 0.0854356 -0.0665139 -0.0535235 0.0389528 0.127724 -0.090693 0.00114872 -0.0425074 0.15059 0.0174384 -0.0106309 -0.00741831 0.0145113 -0.0733556 0.0644335 -0.0538519 -0.00206169 
0.0175836 0.019743 -0.0285928 0.0166756 0.0824876 0.182501 0.0477675 -0.0105932 -0.0617755 0.0222619 -0.00348265 0.0612595 0.110731 -0.222841 -0.0734004 0.0584294 -0.155555 0.1497 -0.138718 0.0926446 0.237967 -0.116281 0.0859439 0.122242 -0.0224406 -0.0824969 -0.150429 -0.30285 0.0133251 0.110431 0.0275871 0.0604879 -0.0886725 0.0726497 0.0703704 -0.0359114 -0.0726959 0.0130123 0.00643274 -0.065015 0.011023 -0.129971 -0.00252392 0.105246 -0.0903481 -0.109171 0.152514 0.0361669 -0.133463 0.0437361 0.0889937 -0.149438 -0.0422042 -0.0106213 0.0521635 0.0243458 0.0762787 0.041477 0.0165297 -0.109472 0.0151294 0.0121825 0.108666 -0.0740163 0.119475 -0.172819 -0.0630255 -0.0305297 -0.0770913 0.0357761 -0.0605678 0.0894292 -0.0797652 -0.068943 -0.0796719 -0.00910712 -0.042171 0.10427 0.0344994 0.116065 -0.028693 -0.0180739 -0.0216297 0.0411986 -0.113738 0.0878322 0.077821 0.0206866 -0.00521573 0.00901414 0.0249074 -0.0956429 -0.0895264 -0.0183566 -0.143517 -0.000734377 -0.0890865 0.136363 -0.0333299 0.0429351 0.129716 -0.00614856 -0.073903 0.11486 0.103573 -0.0255006 -0.056054 0.144901 -0.0047676 0.0118575 -0.125462 0.0668023 -0.0675429 -0.0626996 0.0313831 0.134528 -0.0859523 0.000447451 -0.0513927 0.14902 0.00873641 -0.0051167 -0.0192717 0.0117584 -0.0745508 0.0620339 -0.0649799 -0.00621845 
0.0305839 -0.00191169 -0.0478126 0.0126316 0.084542 0.170553 0.0354852 -0.00550578 -0.0598342 -0.00725989 -0.0152515 0.0600785 0.105702 -0.213507 -0.0820041 0.0555377 -0.152431 0.136869 -0.135408 0.10098 0.242864 -0.119098 0.109948 0.108596 -0.0237877 -0.0759898 -0.13099 -0.320236 -0.00502889 0.10068 0.0231998 0.0598938 -0.075738 0.0725324 0.0695881 -0.0325281 -0.0794285 0.0387385 -0.00939156 -0.0815128 -0.000481203 -0.119813 -0.0170945 0.122045 -0.0933658 -0.0834654 0.149759 0.0345821 -0.137562 0.052503 0.071501 -0.148999 -0.0213708 -0.0113985 0.054788 0.0104697 0.0877258 0.041229 0.0191948 -0.12464 0.0217827 0.0112581 0.117557 -0.0578675 0.118452 -0.184745 -0.0700231 -0.00595596 -0.0566589 0.0408358 -0.0633912 0.0732362 -0.083088 -0.0858013 -0.0908214 -0.0121918 -0.0502808 0.0902082 0.0293464 0.132479 -0.0396989 -0.0227604 -0.0421166 0.0188387 -0.119412 0.0771912 0.0735309 0.0227606 -0.00809418 0.00523498 0.0379585 -0.0924905 -0.10026 -0.0259308 -0.133436 0.00895423 -0.0800028 0.140522 -0.0311451 0.0305321 0.129711 -0.0082363 -0.0717163 0.108603 0.0917871 -0.0426025 -0.0701978 0.146521 0.000303087 0.000485872 -0.110717 0.0787794 -0.0795178 -0.0661652 0.0401316 0.144297 -0.0933406 -0.0222737 -0.0350563 0.152097 -0.000279728 0.0107464 -0.0148723 0.0176512 -0.0633274 0.0427636 -0.0513991 -0.0115814 
0.0223531 0.0164417 -0.0606455 0.00714163 0.0759588 0.144522 0.0244403 0.0070824 -0.0560386 -0.00423432 -0.00773328 0.0663646 0.10309 -0.243095 -0.107177 0.0604446 -0.16179 0.112969 -0.149079 0.118529 0.234122 -0.124509 0.100178 0.105603 -0.0290991 -0.0599748 -0.10667 -0.307162 0.012805 0.09132 0.0171422 0.0480159 -0.0725311 0.0632055 0.0434032 -0.0484302 -0.0982915 0.0465198 -0.0215236 -0.0635473 -0.00200809 -0.131568 -0.0312197 0.151167 -0.0805305 -0.0715678 0.151287 0.0341231 -0.14515 0.0524982 0.0703842 -0.121561 -0.0425354 -0.0306158 0.0385306 -0.00133477 0.068998 0.0358681 0.0246361 -0.122605 0.0216331 -0.0113291 0.128997 -0.0186066 0.0973503 -0.215502 -0.0676846 -0.0104354 -0.0436466 0.0227552 -0.0651679 0.0623997 -0.0734132 -0.0773094 -0.0803869 -0.0167789 -0.0559398 0.109961 0.0174125 0.158653 -0.0414577 -0.0347769 -0.0394717 0.0285506 -0.117147 0.079103 0.075394 0.0248184 0.00254522 -0.0106992 0.0154684 -0.0851028 -0.120449 -0.0175369 -0.128975 0.000167633 -0.06945 0.119954 -0.032855 0.00461876 0.110723 -0.0122752 -0.07128 0.123963 0.075431 -0.0461876 -0.0725337 0.181038 0.0134202 -0.0123896 -0.0928098 0.0922276 -0.0956653 -0.0530494 0.0301039 0.133484 -0.112715 -0.0238442 -0.0203428 0.148326 -0.0201589 0.0289771 -0.0241043 0.0222908 -0.0567599 0.0341951 -0.0592069 -0.0190106 
0.0278228 -0.000147576 -0.0413445 0.0146396 0.0683763 0.16928 0.0433603 0.00416863 -0.0546147 0.00568323 -0.0129274 0.0473423 0.115912 -0.226992 -0.0701957 0.0620559 -0.158003 0.119557 -0.139813 0.106436 0.234734 -0.121009 0.0918264 0.120976 -0.0321099 -0.0706331 -0.142096 -0.322288 0.00281344 0.0984755 0.0316307 0.0676106 -0.0853278 0.0750968 0.0631868 -0.0303383 -0.0745173 0.0404522 -0.0061268 -0.0706064 0.00150366 -0.137602 -0.0213856 0.11364 -0.0719927 -0.0938539 0.145428 0.0438323 -0.130373 0.0502373 0.0714075 -0.154551 -0.0207632 -0.0121039 0.0562675 0.0102718 0.0769569 0.0338735 0.028299 -0.126007 0.0166888 0.0086202 0.105399 -0.0607211 0.10431 -0.176432 -0.0536501 -0.020806 -0.0580681 0.00748776 -0.075857 0.0731849 -0.0860175 -0.0708097 -0.0793493 -0.0209128 -0.0433548 0.0971546 0.0402923 0.151817 -0.0198198 -0.0374253 -0.042257 0.0172184 -0.111346 0.0841649 0.0734745 0.0182745 -0.00244235 0.000228371 0.0340683 -0.084929 -0.0946649 -0.018215 -0.148507 0.0189145 -0.0760169 0.128315 -0.0266303 0.0310061 0.132208 -0.0149441 -0.0788446 0.113527 0.0910124 -0.0403082 -0.0682033 0.149054 0.00163997 0.0105756 -0.117687 0.0854788 -0.0825456 -0.0782074 0.0333567 0.147227 -0.0921728 -0.0143931 -0.0504044 0.146423 -0.00119577 0.00543349 -0.00464145 0.0261902 -0.073754 0.0452372 -0.064756 -0.0134332 
0.0318607 0.00716041 -0.0464357 0.00925842 0.0856959 0.165178 0.0479661 0.00722616 -0.0573544 0.00371462 -0.00412631 0.0643276 0.11144 -0.222092 -0.0914967 0.0557364 -0.148175 0.137245 -0.151102 0.110751 0.245012 -0.128619 0.0961402 0.112507 -0.0299554 -0.0788615 -0.133241 -0.305782 0.0101053 0.0990008 0.0157168 0.0613766 -0.0758861 0.0778681 0.0534739 -0.0449498 -0.082065 0.0451843 -0.0126617 -0.0787502 0.00318444 -0.126501 -0.0171495 0.117892 -0.0890948 -0.0944681 0.142793 0.0337031 -0.144073 0.0501934 0.070244 -0.142717 -0.0410791 -0.0125069 0.0518163 0.011607 0.0722775 0.0440072 0.0112676 -0.11895 0.0217012 0.00194635 0.121649 -0.0565707 0.112963 -0.179696 -0.0738904 -0.0106124 -0.0657374 0.0321509 -0.0641143 0.0706556 -0.0838368 -0.0736449 -0.0856363 -0.0116368 -0.0367592 0.101035 0.0294008 0.122026 -0.0469447 -0.0272717 -0.0360174 0.02172 -0.113854 0.0832567 0.0773016 0.0288144 0.00550858 0.007415 0.0374758 -0.102356 -0.107047 -0.0178521 -0.128246 0.00368266 -0.0835023 0.126244 -0.0323577 0.0304512 0.126869 -0.0125983 -0.0762854 0.119491 0.0910652 -0.0328426 -0.0660122 0.156331 0.00561369 -0.0127511 -0.1135 0.0837926 -0.0809568 -0.0564742 0.0452638 0.135633 -0.0955733 -0.0160694 -0.0297076 0.155478 -0.00692231 0.0141429 -0.0200624 0.0276412 -0.061181 0.0449415 -0.055878 -0.0203471 
0.0207128 0.00778774 -0.0385153 0.0122344 0.0908459 0.16858 0.0465958 -0.0124366 -0.0557121 0.0176467 -0.0092197 0.0568838 0.1158 -0.205845 -0.0717407 0.0606797 -0.144719 0.152209 -0.140847 0.0948118 0.242165 -0.12235 0.0965028 0.116515 -0.0211619 -0.0805435 -0.148214 -0.31041 0.00719406 0.109866 0.0299459 0.0730541 -0.079627 0.0709533 0.0753005 -0.0324106 -0.0740394 0.0315097 0.00296193 -0.081176 0.00449924 -0.122067 -0.00979797 0.108049 -0.0893546 -0.093159 0.143428 0.0432333 -0.131538 0.031789 0.0767523 -0.151205 -0.0259887 -0.0174002 0.0514993 0.0209579 0.0822942 0.04023 0.0174492 -0.115944 0.0185242 0.00982803 0.104116 -0.0644123 0.119254 -0.170309 -0.0711341 -0.00616855 -0.0669732 0.0307897 -0.0586828 0.0808228 -0.0862605 -0.0912554 -0.0886917 -0.00415809 -0.047784 0.0968919 0.034312 0.11901 -0.0346813 -0.0163375 -0.0361795 0.0315592 -0.118207 0.0806176 0.0772051 0.0238415 -0.00608775 0.00426781 0.0292779 -0.089256 -0.0887276 -0.0218529 -0.141681 0.00663512 -0.0909943 0.138913 -0.0322709 0.035347 0.14084 -0.0108968 -0.0737853 0.111982 0.101679 -0.036344 -0.065616 0.140295 0.00795893 0.00874784 -0.124635 0.0703413 -0.0794042 -0.0640305 0.0371907 0.143647 -0.0988637 -0.0123389 -0.0501584 0.151504 0.00511659 0.00328618 -0.0228511 0.0198105 -0.0748496 0.0551265 -0.068425 -0.0111197 
0.0110958 0.0117207 -0.0173736 0.0254973 0.083521 0.180863 0.047029 -0.0270245 -0.0707161 0.0276539 -0.00590503 0.0717555 0.105861 -0.201991 -0.0749679 0.0639358 -0.150412 0.159512 -0.120495 0.0851706 0.245744 -0.127776 0.0818894 0.110357 -0.0129845 -0.0618136 -0.159336 -0.300364 0.00481939 0.117381 0.0138867 0.0804982 -0.0783809 0.0740766 0.0825498 -0.0330758 -0.0647531 0.0220656 0.0258399 -0.0916564 0.0103889 -0.128627 0.0171146 0.0754523 -0.0873165 -0.107795 0.158759 0.0195534 -0.144328 0.0266671 0.0885067 -0.153528 -0.0262211 0.00400874 0.0756509 0.0319114 0.0865298 0.0363267 -0.00189458 -0.111568 0.0272148 0.0119095 0.107036 -0.0822435 0.140824 -0.134177 -0.0804387 -0.0170384 -0.0837503 0.0460033 -0.0607377 0.0887148 -0.0925147 -0.0748763 -0.0760125 0.00182252 -0.0325419 0.0902365 0.0422988 0.0933028 -0.0426315 -0.00536896 -0.0149848 0.0381715 -0.120978 0.0746257 0.0779127 0.0350938 0.00481906 0.0186669 0.0265615 -0.0945993 -0.0766402 -0.00348382 -0.147972 0.00707984 -0.0859048 0.149038 -0.0214376 0.0460507 0.140203 -0.0063879 -0.0816792 0.105919 0.117754 -0.0153729 -0.0475722 0.13153 -0.0112193 0.00315401 -0.142133 0.0607523 -0.0627472 -0.0724657 0.0576222 0.128873 -0.0867582 -0.00320851 -0.0488206 0.147749 0.0189196 -0.0107507 -0.00613472 -0.00630567 -0.0675875 0.0860065 -0.0420946 -0.00637708 
0.0310855 0.00333485 -0.0150545 0.0360093 0.0826391 0.198377 0.0719677 -0.0309241 -0.0667345 0.00785582 -0.0123536 0.0674979 0.105818 -0.207117 -0.0565577 0.0493023 -0.147574 0.143944 -0.117525 0.0728734 0.235256 -0.1027 0.0711231 0.127351 -0.0203752 -0.0798294 -0.176319 -0.314017 -0.00343058 0.125341 0.0215201 0.0876665 -0.0977115 0.0808394 0.0886757 -0.035992 -0.0452266 0.00877462 0.0245553 -0.0747758 0.028341 -0.121237 0.00969698 0.059886 -0.0910406 -0.104314 0.149758 0.0214448 -0.124189 0.0299594 0.0901348 -0.164575 -0.00454464 0.0097457 0.0762047 0.0322053 0.0920629 0.0442928 0.00266806 -0.0979896 0.020454 0.032533 0.0928501 -0.111072 0.134211 -0.134794 -0.0470331 -0.0364927 -0.0882958 0.0259762 -0.0675714 0.0920417 -0.0874144 -0.0591964 -0.0730337 0.00925103 -0.0349807 0.07335 0.0456316 0.110309 -0.0205415 -0.00673565 -0.0158941 0.0339772 -0.105196 0.0809507 0.0828611 0.0112587 -0.03275 0.016183 0.0421214 -0.0960513 -0.0637118 -0.0101903 -0.162747 0.00819452 -0.0769394 0.132847 -0.00777652 0.0621817 0.144301 -0.000861392 -0.0773641 0.116221 0.102705 -0.0300674 -0.0429868 0.129207 -0.0342396 0.0320716 -0.124439 0.0500657 -0.056599 -0.0913197 0.0344456 0.144077 -0.0907362 0.00665592 -0.0734772 0.141844 0.0235351 -0.0163503 -0.00962237 -0.00143486 -0.070099 0.0862384 -0.066498 -0.0126054 
0.0176302 -0.00502483 -0.0326894 0.00525875 0.080562 0.184368 0.0398986 -0.0349806 -0.0826031 -0.00187237 -0.017391 0.0675575 0.108362 -0.200572 -0.0735463 0.0372156 -0.177407 0.119333 -0.108099 0.0990046 0.235854 -0.118624 0.0826464 0.108836 -0.0216909 -0.0240064 -0.152728 -0.323453 0.00483728 0.102201 0.017974 0.0633804 -0.0967087 0.0643153 0.084781 -0.0194312 -0.0790856 0.0464245 0.0156677 -0.0877475 0.0220236 -0.120078 -0.0170294 0.106959 -0.0960836 -0.0726468 0.170208 0.0333515 -0.147468 0.0231298 0.0487537 -0.143578 -0.00520683 0.0017434 0.089471 0.0173374 0.0814656 0.0681435 0.0026671 -0.137178 0.0270504 0.0302286 0.142845 -0.0545119 0.130581 -0.138501 -0.047125 -0.00126648 -0.0459947 0.0312702 -0.0638514 0.0869513 -0.0784459 -0.0634872 -0.0616207 -0.010757 -0.0729595 0.0753669 0.0563789 0.131764 -0.0333334 0.00355752 -0.0264719 0.0146212 -0.122259 0.0512197 0.0955382 0.0425297 -0.00231719 0.00308716 0.0618231 -0.0778629 -0.0599682 -0.0152884 -0.162176 -0.013486 -0.0625987 0.150744 -0.000188159 0.0206627 0.129183 0.00359862 -0.0739231 0.0985054 0.0670802 -0.0141995 -0.0611045 0.151193 -0.0090502 0.0136509 -0.0847392 0.0839993 -0.0880171 -0.086044 0.0490387 0.14844 -0.116601 -0.0375219 -0.0495509 0.133739 0.0165019 -0.00843775 -0.002674 -0.00426485 -0.0920255 0.0830019 -0.0553674 -0.00312394 
0.0515129 -0.012316 -0.0409089 0.0385039 0.0987994 0.190305 0.0653212 -0.0329603 -0.10564 -0.00246059 -0.0203884 0.0864703 0.086932 -0.200828 -0.0648365 0.0289426 -0.132305 0.161803 -0.0859919 0.0853045 0.22946 -0.0998829 0.0901511 0.113248 -0.0111728 -0.04594 -0.150993 -0.33416 -0.0179592 0.118684 -0.010204 0.0835678 -0.0901378 0.0753463 0.0990586 -0.0510537 -0.0571562 0.0328975 0.0104263 -0.108386 0.0230856 -0.0945879 0.00479634 0.099499 -0.133273 -0.0687197 0.178048 -0.00156534 -0.154117 0.036756 0.0948496 -0.158159 -0.00266981 0.0106958 0.0887311 0.0170803 0.101027 0.0614113 0.0093024 -0.116096 0.0356302 0.0240591 0.125972 -0.0980335 0.152592 -0.149735 -0.0623486 -0.0224182 -0.0701874 0.0542608 -0.0587174 0.0914523 -0.0751374 -0.0613501 -0.0971583 -0.00298564 -0.056037 0.0644955 0.0418611 0.0953106 -0.0530983 0.0190051 -0.0317949 -0.000505298 -0.0981887 0.0414229 0.0802158 0.0158078 -0.018706 0.0159001 0.0557062 -0.0816793 -0.0873368 -0.0355673 -0.136179 -0.00296635 -0.0444255 0.153864 -0.00705129 0.0372505 0.117841 0.0180853 -0.0490416 0.109414 0.0595553 -0.0378857 -0.0508989 0.137406 -0.0295024 0.0179597 -0.081848 0.0678863 -0.061143 -0.0991753 0.0573856 0.121994 -0.0905308 -0.056617 -0.0422231 0.132758 0.0204551 3.88781e-05 5.53362e-05 -0.00796611 -0.0477026 0.0656079 -0.0284641 -0.0203281 
0.0745287 -0.0317768 -0.0592629 0.0538587 0.109223 0.202232 0.0761151 -0.0257535 -0.103573 0.0320545 -0.0277075 0.0811164 0.0869143 -0.201518 -0.0265894 0.0327222 -0.0609433 0.19147 -0.0610722 0.0750007 0.195651 -0.0733039 0.0808443 0.14949 -0.0114395 -0.0506205 -0.147647 -0.347259 -0.027356 0.110981 0.0127286 0.124585 -0.0966839 0.0814799 0.107634 -0.0512538 -0.0154455 0.00427307 0.0230493 -0.112112 0.0396373 -0.0871851 0.00636429 0.0875027 -0.142071 -0.0850001 0.164464 0.0156731 -0.119982 0.0267999 0.125999 -0.184319 0.0170101 0.00197215 0.0728399 0.0238447 0.11546 0.048364 0.0473185 -0.109811 0.0222742 0.0236795 0.0836223 -0.147217 0.136715 -0.149599 -0.0468133 -0.0426089 -0.0708069 0.0375449 -0.0794642 0.0914646 -0.0836863 -0.062168 -0.119765 -0.0177337 -0.0450796 0.0967486 0.0435168 0.0715974 -0.0451741 0.047112 -0.0399428 -0.0159274 -0.0532461 0.0379556 0.0756299 -0.0021172 -0.0339397 0.0102603 0.0512767 -0.0516376 -0.0846984 -0.0475751 -0.117769 0.0174404 -0.0348666 0.148295 -0.0262624 0.0351719 0.125347 0.00987136 -0.0326869 0.12064 0.0600061 -0.0694952 -0.0494846 0.0840793 -0.0395828 0.061198 -0.0925465 0.0671189 -0.0260028 -0.116913 0.0391668 0.0851538 -0.0819528 -0.0923204 -0.0717169 0.109166 0.0444326 -0.00322027 0.0110226 0.0078261 -0.0632158 0.0385725 -0.0573896 -0.0313935 
0.067579 -0.0798531 -0.0438247 0.0237741 0.0988764 0.182169 0.0363955 -0.00794433 -0.121862 0.00223423 -0.0411129 0.0553687 0.0916089 -0.150856 -0.0105558 0.0235484 -0.0878042 0.134022 -0.0207189 0.0933486 0.224502 -0.083622 0.100743 0.160453 0.00623538 0.00245387 -0.133245 -0.361302 0.00186625 0.0844231 0.0266341 0.0753553 -0.104079 0.0526597 0.100694 -0.0157947 -0.0656166 0.0565483 0.0192636 -0.125619 0.0161937 -0.0630061 -0.0457798 0.111613 -0.12811 -0.067288 0.169801 0.0281816 -0.112346 0.00750579 0.0614449 -0.154489 0.055918 -0.00327515 0.109625 0.00430721 0.126781 0.0937832 0.0398826 -0.167268 0.0287848 0.033389 0.12144 -0.0818758 0.113237 -0.109738 -0.0294234 0.00533924 -0.00668488 0.0337459 -0.0795267 0.113347 -0.0945116 -0.066941 -0.0968615 -0.047281 -0.0770611 0.0805878 0.0855778 0.126207 -0.0336698 0.0509073 -0.044762 -0.0640275 -0.048802 -0.00581022 0.0893215 0.0576526 -0.00144331 -0.0224522 0.09608 -0.00266525 -0.0652832 -0.031941 -0.123462 -0.00631585 -0.0187164 0.172782 -0.00847648 -0.0018084 0.128714 0.00423683 -0.0334999 0.0726633 0.0041793 -0.0365068 -0.0678078 0.0612966 0.0222731 0.0326542 -0.0461801 0.111844 -0.0688696 -0.133724 0.080047 0.130855 -0.0979992 -0.127201 -0.0727302 0.103955 0.0197187 -0.00595958 0.0193764 -0.00943094 -0.126446 0.0673653 -0.0345313 0.00144415 
0.0876311 -0.0873918 -0.0414992 0.0243905 0.122076 0.19287 0.0558701 0.0255689 -0.131093 0.0200086 -0.0222206 0.0489516 0.0854569 -0.154918 0.0175417 0.0091393 -0.0636095 0.152009 -0.0217816 0.0968009 0.218587 -0.0949337 0.11197 0.131163 0.0190528 -0.0141384 -0.151064 -0.353628 0.00194658 0.0475794 0.0514761 0.0679958 -0.112142 0.0574904 0.100072 -0.0113178 -0.0747735 0.0679931 0.0353136 -0.134434 0.0279144 -0.0481173 -0.0767703 0.108105 -0.159541 -0.0906171 0.136672 0.0295814 -0.107577 0.0139337 0.0447037 -0.134567 0.0131886 -0.00917791 0.0821048 -0.0123528 0.116527 0.102671 0.0136259 -0.146846 0.0132318 0.016947 0.132109 -0.106129 0.124157 -0.111851 -0.0348313 0.0263534 -0.0164262 0.0624931 -0.0488637 0.147759 -0.0901568 -0.0512181 -0.125364 -0.069172 -0.0716092 0.0838616 0.0829187 0.112625 -0.0814959 0.0430245 -0.0343025 -0.066428 -0.0467145 -0.0224006 0.098542 0.0737381 0.0228129 -0.0410844 0.11278 -0.00388842 -0.0685014 -0.0377507 -0.0930751 -0.0436781 -0.00970973 0.158143 -0.0555213 0.00565411 0.0983644 0.00761366 -0.0375263 0.0655218 0.0213432 -0.0148543 -0.046164 0.0525133 0.0696738 0.0215184 -0.0589012 0.112149 -0.0683068 -0.105013 0.117033 0.107821 -0.0762261 -0.135048 -0.0447788 0.122311 0.0161342 -0.00281362 0.0126071 0.026788 -0.0963641 0.0364433 -0.00558343 0.0117716 
0.0573051 -0.118631 -0.0162275 -0.0204916 0.112686 0.184975 0.0245048 0.0428548 -0.12214 0.00842334 -0.0403986 0.0417766 0.102341 -0.115246 0.0452606 0.00671845 -0.0854129 0.101938 -0.00943453 0.099215 0.21983 -0.0813404 0.11267 0.140484 0.0115127 0.0149868 -0.131821 -0.347505 -0.000579112 0.0249789 0.0768181 0.0198353 -0.108996 0.0394447 0.0909182 0.0280919 -0.0905308 0.0831993 0.0219943 -0.107227 0.0248622 -0.0303398 -0.100905 0.113964 -0.135673 -0.085997 0.126618 0.0429393 -0.0866797 0.00159888 0.00905831 -0.160044 0.0289255 -0.0119656 0.094399 -0.00865551 0.0937136 0.134853 0.0053201 -0.157755 0.00918635 0.0240127 0.131104 -0.0719697 0.116273 -0.0993481 -0.0228591 0.0664464 0.0156418 0.0393002 -0.0350696 0.156671 -0.090031 -0.0802649 -0.0941757 -0.0556068 -0.0985646 0.0775762 0.111126 0.140521 -0.05797 0.0332196 -0.0247788 -0.0623076 -0.0649025 -0.0402255 0.12645 0.103441 0.0273318 -0.0612888 0.107782 0.0110047 -0.0385738 -0.017777 -0.112927 -0.0379749 -0.0144634 0.147204 -0.0520276 -0.000443504 0.0946167 -0.0101825 -0.0568418 0.0261445 -0.0071549 0.0022334 -0.0799137 0.0172024 0.0678658 0.00972033 -0.0427271 0.120206 -0.0855806 -0.108603 0.113821 0.142082 -0.10044 -0.127535 -0.0822672 0.118435 0.011231 -0.0102085 0.00457119 0.0179074 -0.131245 0.0596828 -0.0306726 0.0315238 
0.063781 -0.116297 -0.0169248 -0.00683717 0.131225 0.185497 0.0410966 0.0207093 -0.122839 0.0159391 -0.0472557 0.0569911 0.0985359 -0.10525 0.0379201 0.00389098 -0.0803492 0.136808 -0.0062964 0.0979548 0.222701 -0.0756351 0.11377 0.16785 0.0138616 -0.0137596 -0.144928 -0.335474 0.00297483 0.0625941 0.0554445 0.0316976 -0.108823 0.039867 0.100048 0.0193037 -0.0895954 0.0500944 0.0163274 -0.122076 0.0174704 -0.0265169 -0.0754943 0.103692 -0.147021 -0.0873819 0.130698 0.0512811 -0.075513 0.0159307 0.0289788 -0.160065 0.0386549 -0.0149905 0.108971 0.000152635 0.105763 0.13337 0.00531497 -0.140671 0.0142631 0.0443681 0.123221 -0.0783419 0.110595 -0.0979676 -0.0387849 0.0443617 -0.0158963 0.0461838 -0.0372085 0.160445 -0.0940421 -0.0751492 -0.109208 -0.0342829 -0.0782748 0.0659418 0.115559 0.11723 -0.0422053 0.0417557 -0.0279517 -0.0497147 -0.0509657 -0.0345935 0.108239 0.0943227 0.0215712 -0.036486 0.109428 0.0156037 -0.0404359 -0.0175768 -0.107582 -0.0349366 -0.0353926 0.160683 -0.037921 0.00360248 0.126248 -0.0025374 -0.0470253 0.0218198 -0.00500396 0.000516801 -0.0757539 0.00729328 0.0639682 0.0336375 -0.0384962 0.109164 -0.0660028 -0.1126 0.0973621 0.151649 -0.0734993 -0.107305 -0.0901803 0.131788 0.0158069 -0.0241049 -0.00488203 0.0010823 -0.15814 0.0821445 -0.0332173 0.0264031 
0.0612733 -0.0673563 -0.0374873 0.00033205 0.135122 0.205711 0.0434568 -0.0288543 -0.138855 0.0227499 -0.0527309 0.0682116 0.0859136 -0.128125 0.0200231 0.0177039 -0.0920643 0.149152 -0.00436822 0.0876803 0.203885 -0.0630075 0.0974418 0.14018 0.00978094 0.0105374 -0.149673 -0.334045 0.00914175 0.0815669 0.0358943 0.0773154 -0.120047 0.0406718 0.120725 0.0142975 -0.0669585 0.0262834 0.0354701 -0.126591 0.0334919 -0.0488375 -0.0255155 0.108889 -0.157211 -0.0498805 0.17192 0.0491156 -0.113152 0.0101949 0.0579169 -0.152156 0.0296434 -0.0110264 0.11938 0.00943638 0.107173 0.123834 0.0162128 -0.136656 0.0160972 0.048569 0.139358 -0.0964239 0.139737 -0.0999179 -0.046709 0.0207198 -0.0268243 0.0698831 -0.0477186 0.149185 -0.0874679 -0.060089 -0.101127 -0.0284805 -0.0869643 0.076269 0.0948235 0.0817222 -0.0213752 0.0728405 -0.0334524 -0.0362289 -0.0623884 -0.0263436 0.0977201 0.0743199 0.00256065 -0.000179731 0.107746 0.0034998 -0.0617547 -0.0323202 -0.109703 -0.0201891 -0.0182963 0.179637 -0.0193737 0.00183331 0.117384 0.0114611 -0.0381309 0.0451434 -0.0109881 -0.00626923 -0.0770416 0.0464427 0.0313846 0.0507672 -0.0350166 0.0981995 -0.0607779 -0.116719 0.0883614 0.118743 -0.081862 -0.119536 -0.0757459 0.118029 0.0480191 -0.0240603 0.0274768 -0.00883602 -0.141792 0.0742831 -0.0285161 0.0110003 
0.0547907 -0.0489224 -0.086728 -0.00638377 0.110427 0.178904 0.0273408 -0.0377519 -0.116535 0.00709501 -0.0504276 0.0677132 0.117287 -0.137413 -0.0387856 0.0183932 -0.103568 0.123424 -0.0451264 0.111829 0.205023 -0.084863 0.0830443 0.130378 -0.0110112 0.0094198 -0.121582 -0.334815 -0.0248129 0.115864 0.000416848 0.0706166 -0.104639 0.0375129 0.102121 -0.00323854 -0.0589479 0.0439521 0.00623518 -0.126652 0.015276 -0.0735162 -0.00511536 0.137402 -0.135171 -0.0290722 0.183086 0.0574495 -0.114256 0.0216554 0.0742183 -0.164489 0.0373934 -0.00308795 0.132254 -0.000294963 0.0821066 0.0927334 0.0492325 -0.175792 0.0331186 0.0263226 0.135175 -0.0638693 0.11052 -0.139746 -0.0456198 0.0387153 -0.00360817 0.0108667 -0.0489577 0.101115 -0.0739845 -0.112422 -0.0881312 0.00734016 -0.0925904 0.0777765 0.0818483 0.122387 -0.00299854 0.0458537 -0.0446133 -0.0228553 -0.0842706 0.0112155 0.095371 0.0577636 0.0154769 -0.00367843 0.0516344 -0.036839 -0.0639883 -0.039148 -0.154992 -0.0122071 -0.0198045 0.159918 -0.000711411 -0.0271374 0.136371 0.0269228 -0.0232121 0.074368 -0.022616 -0.0375508 -0.113899 0.101754 -0.0261755 0.0527395 -0.0204268 0.0876144 -0.08635 -0.103658 0.0307829 0.133802 -0.128884 -0.10295 -0.0947318 0.0995352 0.0185529 -0.00902317 0.0290717 -0.00631248 -0.116048 0.0587807 -0.0640426 -0.00826137 
0.0721215 -0.0777546 -0.0798149 0.00285803 0.107475 0.167425 0.0376039 -0.0023256 -0.124237 0.0193109 -0.0257055 0.0603557 0.111639 -0.151132 -0.0231599 0.00106091 -0.0671468 0.151052 -0.0280319 0.116078 0.202531 -0.0850746 0.0951794 0.137944 -0.0196407 0.0201487 -0.114607 -0.354785 0.000144201 0.0746919 0.0171973 0.0769704 -0.0941691 0.0405761 0.108172 -0.0209227 -0.0592218 0.0725293 0.00935163 -0.141792 0.0208291 -0.0611616 -0.0650213 0.154028 -0.163184 -0.0524424 0.157612 0.0549171 -0.11304 0.00690965 0.0508643 -0.147092 0.0320675 -0.0142492 0.092213 -0.00989652 0.10098 0.0860179 0.0406605 -0.170432 0.0266931 0.00797876 0.140426 -0.0601235 0.110614 -0.145204 -0.0301979 0.0208974 0.00998924 0.0200819 -0.0671496 0.0888913 -0.0758055 -0.0879372 -0.115083 -0.052328 -0.0966793 0.0990402 0.0884537 0.116767 -0.0462043 0.0493151 -0.0569416 -0.0604857 -0.042755 -0.0186304 0.0986259 0.0650405 0.0199814 -0.02836 0.0911777 -0.00440874 -0.0719383 -0.0473837 -0.12199 -0.0379579 -0.0117424 0.163579 -0.0269197 -0.0295539 0.126155 0.0239893 -0.0190563 0.0732464 0.00178199 -0.042901 -0.0688525 0.0800775 0.0321856 0.0419445 -0.0313278 0.107373 -0.0804512 -0.109266 0.0615345 0.106673 -0.111853 -0.156696 -0.0640882 0.0905118 0.00753628 -0.00647301 0.0108309 0.0133375 -0.10742 0.0314659 -0.0469007 -0.00322344 
0.0507809 -0.042841 -0.0701741 0.00816619 0.0898786 0.175699 0.0483121 -0.0113701 -0.107308 0.0411694 -0.0219548 0.0624502 0.104915 -0.207074 -0.0256071 0.00978491 -0.0980968 0.144572 -0.0717414 0.111035 0.16656 -0.0708158 0.0682849 0.149608 -0.0457783 0.0111758 -0.109703 -0.350724 -0.0113774 0.0664307 0.00492216 0.097942 -0.101024 0.0644994 0.0937412 -0.0238794 -0.0423271 0.037403 -0.0226363 -0.105041 0.0520074 -0.109997 -0.0549031 0.151655 -0.144717 -0.0268343 0.168278 0.0682101 -0.141539 0.00150806 0.0864565 -0.166433 0.0130743 -0.0291779 0.0841188 0.00815373 0.0703641 0.0559734 0.0694627 -0.145798 0.0274726 0.0123866 0.109424 -0.0491134 0.113852 -0.168562 -0.0216743 -0.000350028 0.00197998 0.0201563 -0.0867881 0.0652736 -0.0578744 -0.076594 -0.0897053 -0.0376343 -0.105367 0.137065 0.0638368 0.100523 -0.018643 0.0494386 -0.0655431 -0.0495252 -0.0612211 0.0176773 0.105123 0.0333355 -0.0188015 0.00960672 0.0681307 -0.0209689 -0.0852997 -0.054394 -0.162365 0.00488228 -0.0171277 0.114886 0.00220811 -0.0301273 0.134357 0.016749 -0.0241745 0.083019 0.0195292 -0.0711228 -0.0861535 0.112062 -0.0268244 0.0596975 -0.0295827 0.118801 -0.0688478 -0.12845 0.0254896 0.0867693 -0.143688 -0.146224 -0.0731888 0.0795213 0.0320771 0.00220498 0.0159422 0.030578 -0.0820325 0.0321937 -0.0832653 -0.0363344 
0.0716446 -0.0237751 -0.0817797 0.0056874 0.0842666 0.190977 0.0587655 -0.016957 -0.116387 0.0321247 -0.00670315 0.0637123 0.1256 -0.19184 -0.0613987 0.0419253 -0.126147 0.139387 -0.0868146 0.100073 0.213425 -0.0935408 0.0995008 0.0995566 -0.0434765 -0.0233613 -0.12516 -0.335733 -0.0134054 0.113291 -0.031484 0.0980432 -0.0947585 0.0742857 0.0760161 -0.0470688 -0.0607999 0.0549222 0.0177579 -0.0958522 -0.00779058 -0.119335 -0.0288027 0.108566 -0.128467 -0.0511523 0.157089 0.0416833 -0.152728 0.0434704 0.0981445 -0.140124 -0.0104642 0.0145729 0.0762817 -0.00532443 0.112218 0.0484538 0.027977 -0.119299 0.040381 0.0104272 0.136386 -0.0759126 0.122108 -0.161314 -0.0599938 0.0211334 -0.0337063 0.0283805 -0.0747437 0.0803465 -0.0830641 -0.0688327 -0.0957804 -0.0125848 -0.0554517 0.0696003 0.0483377 0.118316 -0.0192379 -0.00941905 -0.044894 -0.0152162 -0.102743 0.0490585 0.0828235 0.012362 0.00525302 0.0132819 0.0549613 -0.0738397 -0.0948592 -0.0146612 -0.15521 -0.00430577 -0.0414233 0.141546 0.00713835 0.00934791 0.149365 0.0222365 -0.0519259 0.113569 0.0576574 -0.0559684 -0.0767527 0.146752 -0.0219431 0.0204613 -0.0693977 0.096404 -0.0562618 -0.099168 0.0491315 0.132227 -0.105489 -0.0557976 -0.0570991 0.121703 0.0168326 -0.0182558 0.0307883 0.0107662 -0.0618807 0.0492361 -0.0507078 -0.0201038 
0.0670433 -0.0166688 -0.0907097 0.022968 0.105645 0.202787 0.00157392 -0.0613871 -0.101144 0.0675956 0.0193315 0.0611946 0.101195 -0.144299 -0.0622526 0.086109 -0.0562089 0.21697 -0.0500849 0.0930443 0.215175 -0.0830315 0.112229 0.180485 0.00121255 -0.0274039 -0.0841162 -0.296609 0.0169935 0.126653 0.0102558 0.0925479 -0.0852315 0.0577451 0.0800131 0.000363383 -0.0763245 -0.00175702 0.0479215 -0.100158 -0.0498976 -0.0884342 -0.0130155 0.0977482 -0.101898 -0.107788 0.164701 0.0696031 -0.126563 0.0396763 0.132269 -0.116666 0.00705955 -0.0224827 0.0674379 0.024997 0.137285 0.0699115 0.0572379 -0.131474 0.0106698 0.0261111 0.150301 -0.107909 0.0867209 -0.127812 -0.0801906 0.0150573 -0.0650875 0.090932 -0.074487 0.110145 -0.109605 -0.0827206 -0.11715 -0.0486704 -0.0259158 0.109865 0.0331506 0.0656759 -0.00620243 0.0581132 -0.0412156 -0.0363292 -0.0855429 0.0437374 0.0355845 0.0175292 0.0224056 0.0159742 0.0441191 -0.0331225 -0.0891128 0.00523046 -0.0682906 0.0153067 -0.0775821 0.183414 -0.021083 -0.00709562 0.167246 0.00390152 -0.0584053 0.0956023 0.0709441 -0.0185825 -0.0637983 0.0294098 0.0172436 0.029329 -0.0958603 0.112872 0.00840108 -0.0715768 0.0633032 0.110366 -0.0747166 -0.0637252 -0.0619757 0.12496 0.0369959 -0.0423543 0.0390525 -0.028344 -0.137345 0.0853673 -0.0414921 -0.00361481 
0.0784606 0.026768 -0.139543 -0.00906959 0.0904814 0.198728 -0.0172891 -0.047368 -0.127036 0.0799626 0.0290202 0.0433576 0.132249 -0.116302 -0.073995 0.0993975 -0.0224835 0.168888 -0.0470114 0.0976587 0.204492 -0.090926 0.101837 0.180737 0.0032119 -0.00585125 -0.0419349 -0.270301 0.0457361 0.13538 0.00220296 0.0759115 -0.0876108 0.0428389 0.0326236 0.00460094 -0.0907863 0.0191141 0.0452374 -0.0679374 -0.0810822 -0.0877043 -0.00791556 0.131593 -0.0787278 -0.0731106 0.184703 0.0789369 -0.15479 0.0286651 0.147953 -0.0807138 -0.00764234 -0.0377252 0.0557284 0.0193001 0.113839 0.101627 0.102797 -0.166593 -0.00354013 0.0164865 0.175283 -0.0996725 0.0462054 -0.127308 -0.0673385 0.0492443 -0.0497345 0.0641771 -0.0665884 0.104406 -0.118876 -0.0966962 -0.0851727 -0.0391463 -0.0268773 0.125471 0.0304189 0.0965405 0.00456212 0.0392688 -0.0348369 -0.0443978 -0.0919285 0.0440287 0.0302618 -0.0050027 0.0497813 -0.000337008 0.00399271 -0.0470663 -0.104281 0.0172827 -0.0517037 0.0128178 -0.0481055 0.184013 -0.0266489 -0.0398056 0.141038 0.0246344 -0.0437344 0.138116 -0.0125615 -0.00565077 -0.113189 0.0560709 0.0192532 -0.015942 -0.0505461 0.133065 -0.0169943 -0.0465625 0.0503756 0.111834 -0.113472 -0.0740253 -0.0501235 0.119229 0.0128311 -0.0494513 0.0481652 -0.0225887 -0.145098 0.070768 -0.0665907 -0.0127429 
0.0642561 0.0459712 -0.146209 -0.0173152 0.0940922 0.194574 -0.0381034 -0.0668 -0.153647 0.0626545 0.0372293 0.0520059 0.132157 -0.0982214 -0.0978465 0.101688 -0.0171006 0.158352 -0.0339224 0.0996616 0.207719 -0.104253 0.0960367 0.159105 0.0203201 0.0150199 -0.0356193 -0.240557 0.0709652 0.134182 0.00778345 0.0808582 -0.0970186 0.0279176 0.0100605 0.00790737 -0.111458 0.0127489 0.0751433 -0.0484598 -0.0732606 -0.0795605 0.00707308 0.137605 -0.0747621 -0.075007 0.202477 0.0650861 -0.165384 0.00877997 0.129401 -0.055699 -0.0283559 -0.0370367 0.0366825 0.0156216 0.106603 0.12918 0.0884019 -0.155475 -0.00461254 0.0309511 0.198924 -0.0877771 0.0444118 -0.115435 -0.0630961 0.0451763 -0.0462428 0.0690346 -0.0623922 0.112242 -0.112942 -0.0741063 -0.0627079 -0.0481595 -0.0260802 0.121827 0.0160165 0.0949702 -0.00921725 0.0465135 -0.0140953 -0.0354523 -0.106938 0.0487914 0.0314934 -0.00336749 0.0425615 -0.0273986 0.00479265 -0.046439 -0.097696 0.0271201 -0.0284797 -0.0094459 -0.0440665 0.204586 -0.040596 -0.0442027 0.0986123 0.0235337 -0.0435908 0.16921 -0.0168596 0.026556 -0.106627 0.0966401 0.028723 -0.0435618 -0.0525223 0.120977 -0.0337238 -0.0161003 0.044247 0.0935976 -0.116285 -0.0722256 -0.0202861 0.123477 0.00292554 -0.0492669 0.0326192 -0.0413049 -0.163254 0.0731625 -0.0823355 -0.00037323 
0.0641433 0.0252977 -0.158121 -0.02306 0.0923407 0.215311 -0.026098 -0.0609883 -0.145091 0.0489403 0.0295616 0.0641062 0.131421 -0.119785 -0.0874229 0.0624619 -0.0559691 0.147047 -0.0477115 0.108966 0.174314 -0.0808971 0.101835 0.163811 -0.00529238 0.00430335 -0.0357456 -0.268825 0.034836 0.114746 0.00726865 0.056333 -0.111883 0.0254595 0.0148862 0.0211652 -0.117774 0.00158376 0.0343632 -0.0166313 -0.0387141 -0.0777966 -0.0338364 0.161696 -0.119552 -0.0598384 0.196421 0.075114 -0.152065 0.0334843 0.117336 -0.0782797 -0.0332456 -0.0329909 0.0412972 0.00966657 0.0953934 0.142368 0.0957756 -0.139324 -0.0157744 0.0470994 0.20907 -0.0858412 0.0518909 -0.155679 -0.0362642 0.0442355 -0.0311682 0.0696116 -0.0464169 0.121569 -0.0810347 -0.0630847 -0.0579592 -0.036199 -0.0715386 0.116596 0.0147795 0.104963 0.00207252 0.0398477 -0.0199786 -0.0341927 -0.122725 0.0648091 0.0599305 -0.0108624 0.0127677 -0.0344815 0.0157652 -0.058086 -0.0861889 -0.00493255 -0.0575723 -0.0279535 -0.0414956 0.174461 -0.0250159 -0.0461988 0.0922783 0.0286266 -0.0307352 0.14508 -0.0278266 0.0119397 -0.123401 0.110589 -0.0138054 -0.00533621 -0.0178161 0.122267 -0.0206327 -0.0355701 0.00194723 0.105189 -0.125268 -0.0753466 -0.0307285 0.119799 0.011304 -0.0628574 0.0232922 -0.0235835 -0.164245 0.0653088 -0.109709 0.0100612 
0.0581047 0.0395997 -0.16852 -0.0257011 0.104093 0.185606 -0.0255933 -0.073192 -0.148149 0.0430724 0.0275501 0.048435 0.140118 -0.0990025 -0.0744109 0.052852 -0.0613549 0.124563 -0.0471303 0.134521 0.171519 -0.110679 0.102337 0.145389 0.0148903 -0.0143682 -0.05385 -0.261909 0.034525 0.124627 0.0146605 0.0523661 -0.103264 0.0168726 0.0163253 0.0374761 -0.128411 0.00773991 0.0200343 -0.0409802 -0.0423658 -0.0845305 -0.0269386 0.17939 -0.115494 -0.00839354 0.198899 0.0934493 -0.158568 0.028356 0.0826812 -0.0708209 -0.0344661 -0.0545473 0.0461458 0.0017804 0.0525553 0.143203 0.0975218 -0.136452 -0.0131097 0.0502587 0.205116 -0.0664668 0.048953 -0.148371 -0.0432166 0.0565431 -0.0295864 0.0461449 -0.0310462 0.123128 -0.0794782 -0.0826974 -0.053688 -0.0260457 -0.0728449 0.108888 0.0246771 0.132909 -0.00356142 0.0169421 -0.0511247 -0.0332755 -0.130407 0.0665943 0.0440871 -0.0179682 0.0188526 -0.0309361 0.0226951 -0.0517663 -0.0817492 -0.01713 -0.0695836 -0.0442371 -0.0425685 0.169632 -0.0169503 -0.0738265 0.0824238 0.0288247 -0.0152038 0.122562 -0.0608419 0.0315729 -0.130721 0.149486 0.0172834 -0.00134609 -0.00219087 0.114386 -0.0545967 -0.0331179 -0.00631121 0.109369 -0.133091 -0.0751256 -0.0204038 0.134652 -0.0060507 -0.048799 0.0010565 0.0148812 -0.169056 0.0523397 -0.103074 0.00149999 
0.0445452 0.0417695 -0.168652 -0.0226467 0.0901957 0.168655 -0.0118902 -0.0680243 -0.144752 0.0506581 0.0393511 0.0518179 0.145272 -0.104866 -0.101553 0.0544281 -0.0717307 0.120218 -0.0514671 0.135486 0.181133 -0.141609 0.0812093 0.142176 0.0139763 -0.00277415 -0.0568052 -0.255273 0.0565154 0.125384 0.00582897 0.0617478 -0.105298 0.0116533 -0.00137394 0.0228318 -0.141589 0.0164882 0.0248847 -0.0431866 -0.0354913 -0.100609 -0.0299468 0.175277 -0.0992557 -0.023554 0.195711 0.0827325 -0.167812 -0.000266349 0.0645675 -0.0591258 -0.0382743 -0.0580858 0.0384835 0.0095001 0.0469612 0.145549 0.0837311 -0.132502 -0.00438588 0.0437599 0.216067 -0.0482252 0.0461598 -0.125292 -0.0447321 0.0446014 -0.0260199 0.0266331 -0.0439889 0.114981 -0.0804563 -0.0693097 -0.0402864 -0.0276861 -0.0599069 0.113953 0.0200278 0.126517 -0.0220551 0.00790474 -0.0484562 -0.0316933 -0.136325 0.0761659 0.0516454 -0.0109139 0.0279968 -0.048449 0.0242107 -0.049587 -0.0774213 -0.00870917 -0.0711185 -0.048726 -0.0441373 0.160665 -0.00454478 -0.0700085 0.0815336 0.016644 -0.0181757 0.133398 -0.0500414 0.0424573 -0.117966 0.171821 0.0194942 -0.0232528 -0.0128023 0.116321 -0.0637623 -0.0390692 0.00394448 0.106608 -0.13965 -0.064394 -0.00292403 0.129909 -0.0224633 -0.0530505 -0.011573 0.00887422 -0.176513 0.070719 -0.117941 -0.00171555 
0.0725955 0.0365253 -0.175163 -0.0113736 0.0966285 0.202505 -0.00252716 -0.0615022 -0.144909 0.0400715 0.0438119 0.0623715 0.134514 -0.117604 -0.095583 0.0610591 -0.053696 0.136496 -0.0582551 0.120923 0.180633 -0.104529 0.0806791 0.153366 0.00997425 -0.0128369 -0.0483246 -0.261185 0.0398623 0.13011 -0.00142807 0.0788805 -0.110127 0.0346018 -0.00210688 0.016971 -0.121949 -0.00482362 0.0271655 -0.0330445 -0.0264155 -0.0940086 -0.0163947 0.1677 -0.109211 -0.0398796 0.19931 0.0690291 -0.170639 0.0209366 0.1013 -0.0708669 -0.0445912 -0.0404543 0.0434099 0.0120073 0.059663 0.142406 0.091164 -0.125252 -0.0133019 0.044997 0.211774 -0.0854214 0.0445252 -0.136733 -0.0420167 0.0359991 -0.0390952 0.0539602 -0.0476176 0.115932 -0.0830861 -0.0602308 -0.0531806 -0.0302035 -0.0502777 0.115193 0.000925781 0.107949 -0.0110824 0.026566 -0.0371405 -0.0418127 -0.130852 0.0867279 0.0536664 -0.030939 0.0081343 -0.0286182 0.028814 -0.0712232 -0.103304 -0.0114975 -0.0592029 -0.023954 -0.0393791 0.157087 -0.0114292 -0.0533155 0.0788017 0.0232363 -0.0170065 0.150969 -0.048238 0.0271863 -0.124961 0.154263 -0.0144349 -0.0207972 -0.0178469 0.115884 -0.0439816 -0.0430453 0.00975583 0.0917066 -0.122419 -0.0760415 -0.00270102 0.131836 0.00574657 -0.0537541 0.0155831 0.00741069 -0.156445 0.0579356 -0.102313 -0.00573598 
0.0739655 0.0231207 -0.158766 -0.0179821 0.107196 0.17646 -0.0102821 -0.0512377 -0.140401 0.0347282 0.0332826 0.0505769 0.137589 -0.126567 -0.0906315 0.0652924 -0.0508784 0.135906 -0.0686979 0.135879 0.198269 -0.104823 0.0886793 0.151497 0.0107802 -0.0127802 -0.0535422 -0.269625 0.0457416 0.123356 0.00728372 0.0658192 -0.107805 0.0341466 0.0171984 0.00734703 -0.121213 0.0156052 0.0275082 -0.0585676 -0.041568 -0.0867125 -0.0250177 0.181338 -0.0996488 -0.031836 0.189369 0.0856603 -0.160773 0.0233717 0.0877687 -0.0754184 -0.0383986 -0.0516786 0.0401935 -0.0100321 0.05954 0.127168 0.0891143 -0.144616 0.00339974 0.0300046 0.197144 -0.0511656 0.0368898 -0.158526 -0.0502658 0.045272 -0.0201688 0.0333907 -0.0477874 0.108814 -0.0809898 -0.0833116 -0.0758854 -0.04303 -0.0577728 0.122593 0.0208114 0.1351 -0.001655 0.0243361 -0.0511565 -0.044428 -0.112836 0.0629189 0.047929 -0.00637813 0.0215057 -0.0318238 0.0347714 -0.0472034 -0.109385 -0.00725022 -0.0725503 -0.0276744 -0.0425854 0.159309 -0.0268336 -0.0701856 0.0916476 0.0195629 -0.0206437 0.137924 -0.0441189 0.0113061 -0.120515 0.152519 0.0257608 -0.0115577 -0.0133667 0.121585 -0.068048 -0.0314427 0.0133304 0.102052 -0.135759 -0.0798414 -0.0269676 0.123135 -0.0166805 -0.0239863 0.00947801 0.0150089 -0.156698 0.0403142 -0.0954077 -0.0181948 
0.0684493 0.0374411 -0.1481 -0.00972333 0.0956076 0.191471 0.00437784 -0.0484794 -0.131849 0.0368913 0.036569 0.0510993 0.140683 -0.141131 -0.0911468 0.0677289 -0.0654747 0.142439 -0.0883873 0.124849 0.200246 -0.115775 0.0898061 0.145531 0.0045909 -0.0362165 -0.0715023 -0.268394 0.0417995 0.12467 0.00985938 0.0758316 -0.104629 0.0471818 0.012572 0.0015069 -0.116399 0.00820104 0.0238675 -0.0502575 -0.0320542 -0.106813 -0.0103665 0.166095 -0.10142 -0.053216 0.187675 0.0753747 -0.172058 0.0340199 0.0951475 -0.0866369 -0.0497944 -0.0402948 0.0325271 0.00237251 0.0590676 0.117299 0.0813902 -0.131153 -0.00790557 0.0365749 0.189021 -0.0762362 0.0501349 -0.149498 -0.0551272 0.0254361 -0.0522103 0.0392502 -0.0517201 0.105318 -0.0852194 -0.0691461 -0.0675217 -0.0369451 -0.0441577 0.113388 0.0134909 0.124481 -0.0100206 0.00539109 -0.0442468 -0.0306983 -0.125567 0.0879822 0.046616 -0.0230053 0.0147918 -0.0193243 0.0314704 -0.07519 -0.109149 -0.0117873 -0.0753659 -0.0175524 -0.0550869 0.162419 -0.0293499 -0.0436478 0.092607 0.016634 -0.0285219 0.150546 -0.0168959 0.0158585 -0.115042 0.165777 0.0103586 -0.0192215 -0.0428528 0.113965 -0.0579504 -0.034347 0.0154193 0.0999378 -0.117419 -0.0581586 -0.0104339 0.141926 -0.00498364 -0.0388563 0.00725991 0.0195218 -0.141809 0.042365 -0.0923397 -0.0131803 
0.0742161 0.0443879 -0.164508 -0.0112424 0.0945246 0.206031 -0.0207714 -0.0450114 -0.141347 0.0649297 0.0586869 0.0514849 0.131908 -0.145073 -0.0904995 0.0860324 -0.0292271 0.149796 -0.0618036 0.109822 0.190528 -0.100742 0.0929561 0.12947 0.0122775 -0.00180647 -0.0419095 -0.265641 0.0559356 0.105097 0.0243765 0.084173 -0.102223 0.0360489 0.00551772 0.0056192 -0.116649 0.00764041 0.0604062 -0.0324306 -0.0399036 -0.0984851 -0.0344146 0.165902 -0.100894 -0.0649153 0.18301 0.0729262 -0.16867 0.0109207 0.117233 -0.0450332 -0.0652169 -0.046589 0.00511107 -0.00252565 0.0822144 0.109768 0.0814518 -0.121997 -0.0188591 0.0074901 0.202122 -0.0877126 0.0522275 -0.164666 -0.0481514 0.0493702 -0.0294991 0.0667434 -0.0491598 0.117241 -0.0972083 -0.0702466 -0.0725761 -0.0606588 -0.0514196 0.143074 -0.00838945 0.122425 -0.0265129 0.0229567 -0.0203538 -0.0292149 -0.11899 0.0725615 0.055949 -0.01734 0.0206901 -0.0463636 0.00824269 -0.0575781 -0.119763 0.0126396 -0.0456508 -0.0325893 -0.0356371 0.158937 -0.0537109 -0.0508888 0.0794593 0.0212012 -0.0375357 0.162337 -0.00197121 0.0153834 -0.0995545 0.142958 0.0290636 -0.0289149 -0.0549016 0.116963 -0.0457939 -0.0188263 0.0395669 0.0747636 -0.130668 -0.0822785 -0.000282788 0.130797 0.00214956 -0.041047 0.0208805 0.00524558 -0.123949 0.0370303 -0.0826649 0.00444754 
0.0642233 0.0185768 -0.178016 -0.00721675 0.0989487 0.174581 -0.0193518 -0.0598861 -0.137012 0.0709181 0.0400528 0.047246 0.145906 -0.102642 -0.0883773 0.0749126 -0.0313066 0.155587 -0.0435481 0.136795 0.184587 -0.126162 0.106076 0.158819 0.00662391 -0.0117769 -0.0554426 -0.269541 0.0461649 0.124821 0.00632521 0.0746387 -0.0953293 0.0184337 0.0111264 0.0238494 -0.120023 0.0161403 0.0278961 -0.0577641 -0.0573129 -0.0825296 -0.0304082 0.16551 -0.110453 -0.0505798 0.189579 0.0921912 -0.138669 0.0215981 0.096328 -0.0697186 -0.0366581 -0.0481036 0.0406339 0.00139784 0.0851387 0.117502 0.102928 -0.13861 -0.00745369 0.031438 0.194503 -0.0719315 0.0408899 -0.144632 -0.0529781 0.0473667 -0.0235333 0.0407761 -0.0485724 0.122003 -0.088958 -0.0770575 -0.072096 -0.0451212 -0.0489289 0.133964 0.0214523 0.10814 -0.0116529 0.0253088 -0.0523907 -0.0422437 -0.110448 0.0745513 0.0361608 -0.00524036 0.0381687 -0.0465255 0.0176129 -0.0344383 -0.0880429 -0.0136978 -0.0540603 -0.0407532 -0.0508866 0.179436 -0.0268299 -0.0648253 0.10535 0.0165107 -0.0118693 0.130003 -0.0251452 0.0216604 -0.111388 0.121118 0.0340485 0.00173246 -0.0426144 0.120949 -0.0317595 -0.0396323 0.0105548 0.101813 -0.109196 -0.0830257 -0.0255641 0.124864 -0.0152127 -0.0478028 0.0124789 0.00700315 -0.181857 0.0576203 -0.103441 0.00726747 
0.0715197 0.0064682 -0.150746 0.000146594 0.0886046 0.187347 -0.0204696 -0.0480194 -0.138696 0.058742 0.0372624 0.0465256 0.134598 -0.126721 -0.0740406 0.0667652 -0.046391 0.154085 -0.0367275 0.125973 0.192865 -0.110433 0.110011 0.169456 0.00947188 -0.0108343 -0.0516578 -0.289182 0.0357841 0.116259 0.0135549 0.0568253 -0.0946882 0.0306685 0.0269813 0.0121577 -0.117905 0.0148415 0.0303114 -0.0587768 -0.0540582 -0.0921236 -0.0397628 0.166441 -0.113207 -0.0626064 0.185952 0.0828564 -0.139272 0.0344566 0.109752 -0.074195 -0.0228962 -0.0413925 0.0460406 -0.00113053 0.0978128 0.107649 0.099039 -0.145835 -0.00532516 0.0225099 0.188657 -0.0715219 0.0455911 -0.157302 -0.0460598 0.0321175 -0.0273347 0.0508272 -0.0577439 0.116979 -0.0978827 -0.0783431 -0.0765442 -0.0565839 -0.0551168 0.127686 0.0291791 0.137274 -0.0145303 0.0156682 -0.0395332 -0.0442332 -0.101593 0.0584945 0.0441244 -0.00422018 0.0315724 -0.0393723 0.0212914 -0.0318922 -0.0932667 -0.0102059 -0.070329 -0.0363144 -0.0478419 0.180259 -0.0273725 -0.0615276 0.110593 0.0274798 -0.0207332 0.125454 -0.00826623 0.0065443 -0.0995539 0.112385 0.0323558 -0.000641055 -0.0440848 0.123638 -0.0341543 -0.0542531 0.0248499 0.114496 -0.100622 -0.0864578 -0.0288975 0.131837 -0.00525727 -0.0514022 0.0141791 -0.00151002 -0.162086 0.0574551 -0.0725292 0.0164232 
0.0469808 0.0390068 -0.125379 -0.0130477 0.093887 0.201363 -0.0402063 -0.0489228 -0.128721 0.0678462 0.0366475 0.0356191 0.121827 -0.136994 -0.0727053 0.0898439 -0.0440993 0.170134 -0.036979 0.0993803 0.213471 -0.105081 0.107763 0.146242 0.0216101 -0.00306258 -0.0505279 -0.275271 0.0653893 0.107716 0.0362418 0.0545941 -0.077741 0.0283038 0.0539663 0.0116218 -0.0983161 0.0154686 0.0562526 -0.0763892 -0.0512784 -0.0959484 -0.0125707 0.159684 -0.100067 -0.0734008 0.194748 0.076601 -0.170177 0.00506686 0.0995485 -0.0698705 -0.0186984 -0.0442795 0.0310707 0.0169572 0.104066 0.0932259 0.0745497 -0.165761 -0.0132503 0.0128303 0.19342 -0.0824567 0.0752034 -0.130562 -0.0679201 0.033906 -0.0400332 0.0727777 -0.0608196 0.10284 -0.117821 -0.103182 -0.0693241 -0.058505 -0.0597558 0.14151 0.0282084 0.110976 -0.0283807 0.0382311 -0.0217715 -0.0229054 -0.0997962 0.050169 0.0375113 0.0137397 0.0399374 -0.0170199 0.0233253 -0.0388935 -0.105528 0.0062417 -0.0517123 -0.0287749 -0.0548912 0.207448 -0.0537 -0.0493028 0.115995 0.0194926 -0.0411539 0.117069 0.0136531 0.0175379 -0.0764817 0.0936214 0.0483081 -0.0206885 -0.0679123 0.107782 -0.0394089 -0.0371143 0.0564498 0.0954743 -0.121294 -0.0868805 -0.0200846 0.127553 0.0150691 -0.0532868 0.0176284 -0.0185595 -0.143895 0.0652456 -0.0521436 0.0167358 
0.0341409 0.0299674 -0.0994575 -0.0143763 0.088451 0.184342 -0.0397522 -0.0258719 -0.107454 0.0697882 0.0501843 0.0484287 0.12588 -0.132855 -0.0814319 0.0924491 -0.0386526 0.187798 -0.0645893 0.103704 0.228195 -0.115653 0.110634 0.1798 0.0126103 -0.0119434 -0.0420387 -0.261067 0.0721307 0.0985173 0.03786 0.049085 -0.0561287 0.048205 0.0268583 0.00732334 -0.0963222 0.0281527 0.0383726 -0.0623513 -0.0428862 -0.095799 -0.0149233 0.145905 -0.0973056 -0.11722 0.184421 0.0625022 -0.157959 0.0100269 0.100999 -0.0836029 -0.0372816 -0.0363664 0.0340842 0.0370575 0.105589 0.0895994 0.0660341 -0.161097 -0.0196102 0.000419047 0.175164 -0.0769646 0.0659066 -0.127021 -0.074877 0.0252588 -0.0515211 0.0812407 -0.068251 0.091419 -0.121439 -0.0940934 -0.0561792 -0.0604526 -0.0445898 0.160506 0.0234001 0.0797647 -0.0515795 0.0454289 -0.00726615 -0.018871 -0.100743 0.0655735 0.0511699 0.0266732 0.0438187 -0.0183194 0.0176054 -0.0572367 -0.0989514 0.00610412 -0.0399117 -0.0207741 -0.087005 0.201963 -0.0566311 -0.0360968 0.11179 0.00197576 -0.0481002 0.134815 0.0446234 0.019291 -0.0810372 0.0729528 0.0490059 -0.0526994 -0.0999969 0.118936 -0.0333009 -0.0253556 0.0623652 0.0932847 -0.102223 -0.0920898 -0.0170126 0.142991 0.0174049 -0.0398224 -0.00705032 -0.0152758 -0.154904 0.0741518 -0.059506 0.0228007 
0.000807299 0.061056 -0.0437647 -0.0238085 0.0937819 0.193053 -0.0836426 -0.0508274 -0.114489 0.0994757 0.0273036 0.0221906 0.0874088 -0.141349 -0.00851873 0.109044 -0.0226522 0.188036 -0.0111067 0.078876 0.198998 -0.064844 0.10264 0.167477 0.0305898 0.0260632 -0.0416155 -0.260033 0.0915075 0.0765899 0.0829402 0.0502135 -0.0388742 0.0377325 0.095907 0.0511297 -0.0567007 0.0161158 0.063531 -0.0856631 -0.0460353 -0.0991302 -0.00363452 0.12875 -0.0712809 -0.0565107 0.202664 0.0833713 -0.188879 -0.0240843 0.0980874 -0.0704835 -0.00687971 -0.068537 0.040524 0.0547186 0.0941438 0.069712 0.05523 -0.16455 -0.0305796 -0.00524606 0.154062 -0.0957705 0.118161 -0.115696 -0.0778133 0.020286 -0.0638301 0.121327 -0.0736613 0.0844835 -0.143613 -0.118749 -0.0553104 -0.0765908 -0.0645659 0.195724 0.0492953 0.0649995 -0.0407861 0.0824874 -0.0232537 -0.0145295 -0.0720725 0.00242268 0.0277407 0.0425955 0.0384195 0.0311651 0.0250147 -0.0054154 -0.0949451 0.0297987 -0.0246505 0.00819336 -0.0597308 0.212982 -0.0672974 -0.0497314 0.109949 0.00857006 -0.0859554 0.0758495 0.0444965 0.0246127 -0.0521931 0.00198181 0.0883187 -0.0237431 -0.101381 0.111113 -0.0328271 -0.0399044 0.0940561 0.0640362 -0.118403 -0.136353 -0.036089 0.129115 0.0650781 -0.0383977 0.0188724 -0.0161087 -0.130931 0.082385 -0.00897787 0.00500331 
0.0271579 0.0341175 -0.0842195 -0.00392361 0.099837 0.221517 0.00470054 -0.0492912 -0.0621478 0.0379284 0.021455 0.0815772 0.0847388 -0.19758 -0.0743263 0.072253 -0.135462 0.168474 -0.108654 0.0765015 0.206458 -0.0772348 0.104678 0.148887 -0.00384291 -0.0522314 -0.0695417 -0.288014 0.0143876 0.111977 0.0449052 0.0385091 -0.0807731 0.0595839 0.0638667 0.00479825 -0.0955377 -0.0138186 0.0127078 -0.0376685 -0.00958966 -0.112464 -0.0134485 0.150638 -0.112888 -0.0974745 0.168003 0.0604907 -0.145738 0.0558181 0.113806 -0.11421 -0.0452317 -0.0380849 0.0520786 0.038787 0.0703641 0.0969324 0.0284456 -0.111488 -0.0288105 0.00444778 0.182678 -0.0932005 0.112959 -0.184344 -0.0774388 0.00823149 -0.0799421 0.117214 -0.0417155 0.113393 -0.0918237 -0.0826322 -0.0801106 -0.0247338 -0.0620096 0.117823 0.000143146 0.0916273 -0.0172354 0.0303299 -0.01439 0.0190142 -0.136604 0.0641483 0.0656792 0.00765498 -0.00159475 0.0234678 0.0199166 -0.0964272 -0.114618 -0.0133399 -0.0768918 0.00347533 -0.0908153 0.142983 -0.0281319 0.00495422 0.120058 -0.00115158 -0.0714928 0.0935113 0.0618384 -0.0105117 -0.0905074 0.0901133 -0.0126539 0.00427112 -0.0771492 0.100837 -0.0255616 -0.0390868 0.0453555 0.11731 -0.0913063 -0.0298019 -0.0204199 0.161651 0.056744 -0.0316373 0.00645507 -0.00214442 -0.0998905 0.0701451 -0.0463692 0.0091684 
