{
  "descriptor": [
    -0.12525905668735504,
    0.0981249064207077,
    0.10195427387952805,
    -0.08785275369882584,
    -0.0672849491238594,
    0.03511691465973854,
    0.018134666606783867,
    -0.20050708949565887,
    0.1785631626844406,
    -0.055122606456279755,
    0.1277167797088623,
    -0.10387265682220459,
    -0.3450167775154114,
    0.12326901406049728,
    -0.15496619045734406,
    0.14836592972278595,
    -0.18623819947242737,
    -0.1817139834165573,
    -0.08391236513853073,
    -0.06808651238679886,
    -0.05781744420528412,
    0.06736505031585693,
    -0.028534874320030212,
    0.0533636212348938,
    -0.09768225252628326,
    -0.2760024964809418,
    -0.0181705541908741,
    -0.03807683661580086,
    0.1162923127412796,
    -0.04186279699206352,
    0.0064301807433366776,
    0.1874620020389557,
    -0.16005225479602814,
    0.04226658493280411,
    0.015648895874619484,
    0.15504637360572815,
    -0.08631769567728043,
    -0.1122879609465599,
    0.16312548518180847,
    0.0673787072300911,
    -0.18729425966739655,
    -0.02201741561293602,
    -0.0010868372628465295,
    0.30823656916618347,
    0.19066758453845978,
    -0.034511081874370575,
    -0.019232364371418953,
    -0.19458338618278503,
    0.1436861753463745,
    -0.3020036518573761,
    -0.07011446356773376,
    0.2159205824136734,
    0.009168784134089947,
    0.14883609116077423,
    0.03765306994318962,
    -0.1571357250213623,
    0.0503932349383831,
    0.09438599646091461,
    -0.17181849479675293,
    0.06673436611890793,
    0.08224073052406311,
    -0.09667445719242096,
    0.047482721507549286,
    -0.14974668622016907,
    0.12632465362548828,
    0.048646148294210434,
    -0.1086069867014885,
    -0.060978956520557404,
    0.22525307536125183,
    -0.1349738985300064,
    -0.06976945698261261,
    0.09176930785179138,
    -0.07046496868133545,
    -0.12652349472045898,
    -0.21706223487854004,
    -0.004919050727039576,
    0.37272319197654724,
    0.13648127019405365,
    -0.0655350610613823,
    0.014027749188244343,
    -0.031436219811439514,
    -0.05510788410902023,
    0.02334832400083542,
    0.10002903640270233,
    -0.12904183566570282,
    -0.05983082950115204,
    -0.045980487018823624,
    0.02248322032392025,
    0.23020610213279724,
    0.0025272055063396692,
    0.03826819360256195,
    0.2270294725894928,
    -0.021990392357110977,
    0.012483920902013779,
    0.006422405131161213,
    0.14609551429748535,
    -0.17186695337295532,
    0.024229425936937332,
    -0.1503305286169052,
    -0.07325311005115509,
    0.018931003287434578,
    -0.06360644847154617,
    0.07881166785955429,
    0.16205967962741852,
    -0.14124324917793274,
    0.2130965143442154,
    0.007330205757170916,
    0.016099104657769203,
    0.08986810594797134,
    -0.04261070489883423,
    0.02547440491616726,
    0.007830196060240269,
    0.20426996052265167,
    -0.2195497453212738,
    0.17061400413513184,
    0.1588088423013687,
    0.046597063541412354,
    0.047529809176921844,
    0.018200915306806564,
    0.04954018443822861,
    -0.06341642886400223,
    -0.02602011151611805,
    -0.14337021112442017,
    -0.08135382831096649,
    0.05735152214765549,
    -0.044930435717105865,
    -0.09219992160797119,
    0.015922565013170242
  ]
}