{
  "descriptor": [
    -0.14130589365959167,
    0.09240932762622833,
    0.002486326964572072,
    -0.045422278344631195,
    -0.15185479819774628,
    -0.08082400262355804,
    0.03237069025635719,
    -0.11959590762853622,
    0.09774032980203629,
    0.022977305576205254,
    0.283648818731308,
    -0.05670340731739998,
    -0.2504903972148895,
    -0.10659971088171005,
    -0.026039771735668182,
    0.11560602486133575,
    -0.1425410956144333,
    -0.14149975776672363,
    -0.11021903902292252,
    -0.09595402330160141,
    0.03712096065282822,
    0.09434062987565994,
    0.01978171430528164,
    0.10219618678092957,
    -0.11571100354194641,
    -0.3190671503543854,
    0.0066910963505506516,
    -0.10522015392780304,
    0.07862647622823715,
    -0.09533096849918365,
    0.05568663403391838,
    0.19165728986263275,
    -0.13581553101539612,
    -0.0644855871796608,
    0.07614158093929291,
    0.11093726754188538,
    -0.04271053150296211,
    -0.05192028358578682,
    0.19353659451007843,
    0.0008089100592769682,
    -0.14859648048877716,
    0.05401666462421417,
    0.05879301205277443,
    0.3536941111087799,
    0.14128603041172028,
    -0.010044911876320839,
    0.03355513885617256,
    -0.0796293169260025,
    0.11884354054927826,
    -0.27890968322753906,
    0.025260739028453827,
    0.17879275977611542,
    0.14144489169120789,
    0.04527973383665085,
    0.09757032990455627,
    -0.10363761335611343,
    0.05139191821217537,
    0.12942981719970703,
    -0.25556910037994385,
    0.12584669888019562,
    0.08799923211336136,
    -0.05753529071807861,
    -0.028781361877918243,
    -0.13821938633918762,
    0.13271979987621307,
    0.10050345212221146,
    -0.07618733495473862,
    -0.09999874979257584,
    0.08661406487226486,
    -0.17376212775707245,
    -0.16934479773044586,
    0.13057570159435272,
    -0.10304024815559387,
    -0.1854744702577591,
    -0.22331365942955017,
    0.007588509935885668,
    0.3244641125202179,
    0.1781047284603119,
    -0.22924739122390747,
    -0.018018072471022606,
    0.007119637448340654,
    0.0025777295231819153,
    0.1060718521475792,
    -0.03492356836795807,
    -0.09836924821138382,
    -0.1014849841594696,
    -0.16063566505908966,
    0.001807425869628787,
    0.23974500596523285,
    0.010401945561170578,
    -0.03783030807971954,
    0.299707293510437,
    0.0650126114487648,
    -0.010055843740701675,
    0.04742133244872093,
    0.03336677700281143,
    -0.053978364914655685,
    0.012743577361106873,
    -0.10761269927024841,
    -0.026602953672409058,
    0.062341172248125076,
    -0.1329449862241745,
    0.015047631226480007,
    0.026567107066512108,
    -0.18434076011180878,
    0.16357485949993134,
    -0.018012188374996185,
    0.0631791204214096,
    0.01045952271670103,
    -0.019268857315182686,
    -0.07989924401044846,
    0.04287046194076538,
    0.17087659239768982,
    -0.22243525087833405,
    0.2839231789112091,
    0.16916315257549286,
    0.06833143532276154,
    0.10111375153064728,
    0.036026742309331894,
    -0.014522970654070377,
    -0.03701065108180046,
    -0.0904473066329956,
    -0.07890594750642776,
    -0.12199551612138748,
    0.08831916749477386,
    -0.0789569616317749,
    0.016929741948843002,
    0.01591433212161064
  ]
}