0.0740938 -0.0123714 -0.0962606 0.0105254 0.0720315 0.146257 0.0588369 -0.0405974 -0.0799233 -0.0875292 0.0399101 0.126413 0.0828563 -0.144554 -0.145115 0.0053481 -0.139005 0.0331163 -0.153197 0.200903 0.151736 -0.122517 0.108621 0.0722708 -0.0549338 0.0283527 -0.0694218 -0.214611 0.0126814 0.0498029 -0.0418733 0.092605 -0.0829558 0.107201 -0.0534723 -0.0210226 -0.0924693 0.190369 -0.0304337 -0.0464013 0.0266876 -0.0825999 -0.0584108 0.0810987 -0.138888 -0.0841435 0.14926 -0.00802688 -0.131922 0.126419 -0.0108779 -0.0517808 -0.0827809 0.0549169 0.111813 -0.0387066 0.0206408 0.148836 -0.0529435 -0.111362 -0.0346043 0.00475733 0.267521 -0.0793875 0.0831576 -0.0763161 -0.0239407 0.0154107 -0.0777424 0.0847766 -0.0433398 0.0711036 -0.0304991 0.133201 -0.00791743 -0.0585449 -0.000100589 0.00680557 0.00531615 0.0720704 -0.0721366 0.00600433 -0.014394 -0.0745293 -0.101998 0.0136308 0.0757537 0.0702937 0.0445832 -0.00297761 0.134193 -0.159802 -0.0570724 -0.00907915 -0.028364 -0.0669099 -0.00850458 0.0960193 0.0422332 -0.014301 -0.00865057 -0.00309497 -0.0802413 0.181644 -0.0183317 0.0540824 -0.074695 0.185546 0.0189901 -0.0884693 -0.0222001 0.19196 -0.075296 0.0384305 0.076311 0.0663649 -0.0442416 -0.0701808 0.0765613 0.156486 -0.0119922 0.0400344 0.0368219 0.0390718 -0.0627541 0.0436046 0.0069868 -0.0289587 
0.0928129 -0.0198571 -0.090098 0.0131694 0.117391 0.155882 0.0997783 -0.0378282 -0.0595946 -0.118144 0.0318142 0.126468 0.0951226 -0.136257 -0.123957 -0.00198889 -0.120855 0.0573147 -0.194893 0.19203 0.174975 -0.112624 0.0890253 0.0950264 -0.0514953 -0.0448521 -0.114753 -0.205609 0.00333865 0.0756071 -0.0249513 0.0994744 -0.100839 0.127617 -0.0395136 -0.0174045 -0.0807019 0.132631 -0.0448537 -0.0483135 0.0567705 -0.0587125 -0.0228925 0.0687472 -0.136855 -0.0837922 0.132663 0.00832341 -0.11614 0.12638 -0.019051 -0.107838 -0.0859257 0.0374929 0.101012 -0.0227403 -0.0131411 0.169218 -0.0563353 -0.0818745 -0.0342109 0.0420219 0.233287 -0.10179 0.0724 -0.0806098 -0.0285363 0.00263747 -0.104953 0.0660368 -0.0263673 0.0763758 -0.0240989 0.100734 -0.0328833 -0.023626 0.0131477 -0.00091393 0.00158275 0.050865 -0.0550393 0.0145574 -0.0282193 -0.0575658 -0.109607 0.055963 0.0777397 0.0426332 -0.00237677 0.0209295 0.156003 -0.185555 -0.0727285 -0.0256476 -0.0380137 -0.0413716 -0.0453836 0.0738722 0.023626 0.0182638 0.0023593 -0.0174258 -0.0707825 0.185097 -0.025721 0.051625 -0.0932625 0.191183 -0.00957381 -0.0636612 -0.0210312 0.152927 -0.0838263 0.0402281 0.0492473 0.0848117 -0.0472712 -0.0373306 0.0472029 0.174313 -0.0135676 0.048828 0.0026501 0.0722194 -0.0774065 0.0288469 -0.039117 -0.058694 
0.0923778 -0.0251255 -0.086118 0.0189643 0.116184 0.159388 0.0957822 -0.0407909 -0.0494179 -0.127742 0.0302923 0.126868 0.0876032 -0.138794 -0.125959 -0.00120456 -0.129759 0.0566149 -0.191965 0.184432 0.187874 -0.113082 0.0871541 0.0902941 -0.045205 -0.0435625 -0.114859 -0.215206 -0.00359938 0.0777888 -0.0222756 0.0998733 -0.0990973 0.127746 -0.0288383 -0.0158491 -0.0760014 0.132167 -0.0394584 -0.0573922 0.0600488 -0.058292 -0.0236785 0.0668439 -0.134968 -0.0831358 0.133674 0.00117621 -0.115556 0.11849 -0.0235003 -0.107402 -0.0783398 0.0424142 0.109597 -0.0206971 -0.00753534 0.16113 -0.0663248 -0.0891177 -0.0274912 0.0365516 0.233673 -0.100497 0.0780968 -0.0790495 -0.0270905 0.00894542 -0.093063 0.0759879 -0.0257443 0.0757595 -0.0287649 0.0877466 -0.034455 -0.0225714 0.00731167 -0.00153016 -0.00114641 0.0539428 -0.0583081 0.0243822 -0.0264075 -0.0607911 -0.111491 0.0568334 0.0803664 0.0487189 -0.00642697 0.024103 0.161511 -0.188398 -0.0752738 -0.024303 -0.0461814 -0.0433643 -0.0459976 0.0728228 0.0277279 0.0190601 0.00983177 -0.0220636 -0.0726589 0.17589 -0.0181721 0.0491815 -0.0891843 0.188257 -0.0166972 -0.0618005 -0.0248287 0.147228 -0.0899489 0.0322537 0.06043 0.0883743 -0.0553891 -0.0431831 0.04739 0.170564 -0.00827934 0.0569367 0.00714024 0.0705638 -0.0667935 0.0314036 -0.0268573 -0.0534493 
0.0907682 -0.00864074 -0.084478 0.0192832 0.111672 0.165508 0.0916928 -0.0464083 -0.0413508 -0.123218 0.0433229 0.120791 0.0905897 -0.141986 -0.126695 7.36484e-05 -0.132496 0.0597558 -0.197264 0.17774 0.195597 -0.111777 0.0867448 0.09294 -0.0412263 -0.0529799 -0.1151 -0.212693 0.00601458 0.0844789 -0.0152344 0.0945757 -0.0972609 0.127306 -0.0244774 -0.0142026 -0.0757074 0.128513 -0.0358328 -0.0515096 0.056049 -0.0644645 -0.0281393 0.069912 -0.134 -0.0854877 0.131324 0.00790756 -0.117145 0.11419 -0.0219886 -0.0917274 -0.0839805 0.0384886 0.102464 -0.0178417 -0.00697796 0.153178 -0.0675055 -0.0895724 -0.0340403 0.0303665 0.236569 -0.100537 0.0738657 -0.0851497 -0.0219712 0.00901521 -0.0928818 0.0859553 -0.023353 0.0755462 -0.0335515 0.0825212 -0.0296272 -0.0281516 0.000874189 0.00520366 -0.00553425 0.0632516 -0.0570245 0.0245568 -0.0218905 -0.055889 -0.111314 0.0647491 0.0777413 0.0409256 -0.00917131 0.0265096 0.159691 -0.191832 -0.0756312 -0.0241282 -0.0508795 -0.0558257 -0.0539069 0.0747857 0.0271858 0.0132631 0.0181015 -0.016153 -0.07047 0.173185 -0.0119219 0.049998 -0.083216 0.192966 -0.00673133 -0.0598609 -0.0298826 0.144517 -0.0943234 0.0345085 0.0593983 0.0922055 -0.0593183 -0.041033 0.0501103 0.175492 -0.00463553 0.054473 -0.00126336 0.0757929 -0.0675811 0.0332561 -0.022145 -0.0432708 
0.0687786 -0.00285832 -0.096355 0.0113874 0.0974758 0.126783 0.0649733 -0.0505159 -0.0705478 -0.0926417 0.0342175 0.128956 0.0816625 -0.11545 -0.149209 0.0288883 -0.100756 0.0397881 -0.160502 0.196755 0.170859 -0.132003 0.101012 0.0617141 -0.0468103 0.0270841 -0.0851902 -0.20173 0.0341931 0.0635418 -0.037109 0.124895 -0.0705141 0.101363 -0.0530248 -0.0188829 -0.0807579 0.212351 -0.0212392 -0.0557012 0.0242994 -0.0490231 -0.0350359 0.0556646 -0.118255 -0.0626052 0.154592 -0.0235897 -0.138869 0.0882398 -0.0201837 -0.0501319 -0.0872218 0.046869 0.116742 -0.0308391 0.0195749 0.157646 -0.0625001 -0.109064 -0.0338457 0.000605314 0.255302 -0.0920189 0.10099 -0.061905 -0.0373401 0.0348256 -0.0805404 0.0861271 -0.0252846 0.0723577 -0.0390517 0.114783 -0.0070761 -0.04047 0.0115302 0.0214938 -0.00524734 0.0338579 -0.085726 0.0343763 -0.019282 -0.0735076 -0.102276 0.0147954 0.0720121 0.0772255 0.0356598 -0.00738768 0.12425 -0.165844 -0.0628172 -0.00612468 -0.00420505 -0.0559903 -0.00382307 0.10109 0.0342013 -0.000641308 -0.0186836 -0.0212884 -0.0852799 0.201211 -0.035249 0.0594154 -0.0810539 0.179866 0.0334296 -0.110697 -0.0438125 0.179646 -0.0927853 0.0486143 0.0959918 0.0609058 -0.070127 -0.0794487 0.069522 0.15926 -0.02061 0.0717839 0.0329727 0.0443075 -0.0587214 0.0496089 -0.00937926 -0.0489316 
0.0775227 -0.0166468 -0.101017 0.0120937 0.0925808 0.129219 0.0588009 -0.058711 -0.0656272 -0.108512 0.0360058 0.13248 0.0764406 -0.112534 -0.155743 0.0192611 -0.106565 0.0422009 -0.157048 0.195915 0.170777 -0.114113 0.105118 0.0654767 -0.0563724 0.0339285 -0.0724012 -0.210506 0.0224595 0.065122 -0.046598 0.115075 -0.0673747 0.100201 -0.0414978 -0.0177686 -0.0735196 0.215483 -0.0269459 -0.0566918 0.0209111 -0.0407529 -0.0458349 0.061783 -0.129851 -0.0603325 0.155714 -0.0234005 -0.132323 0.0993329 -0.0246067 -0.0514687 -0.0774012 0.060615 0.126553 -0.0358887 0.0331116 0.155777 -0.0657577 -0.114844 -0.0298116 0.000672325 0.265327 -0.085723 0.0968129 -0.0742065 -0.0275535 0.0361089 -0.065198 0.0946038 -0.0249906 0.063797 -0.0321492 0.113704 -0.0102392 -0.043208 -0.000218324 0.0158481 -0.00732489 0.0338034 -0.075937 0.0465628 -0.0248272 -0.0840613 -0.100659 0.0135442 0.0720692 0.0777221 0.0284206 -0.0032698 0.137001 -0.16684 -0.059923 -0.0135063 -0.0093345 -0.0611999 -0.00500043 0.101472 0.0458709 -0.00488959 -0.0107859 -0.0149335 -0.0797496 0.190729 -0.0339731 0.0503447 -0.0805859 0.171553 0.0208342 -0.0988365 -0.0293784 0.181923 -0.0864246 0.043496 0.0878734 0.0694731 -0.0674996 -0.091241 0.0638071 0.1473 -0.0185547 0.0724202 0.0391889 0.039303 -0.058813 0.0475512 -0.0031832 -0.043375 
0.0824013 -0.0337828 -0.0844088 0.017625 0.119493 0.135243 0.0781858 -0.059495 -0.0184657 -0.145294 0.0328214 0.143437 0.0636842 -0.135625 -0.154523 0.00386358 -0.147594 0.0553062 -0.193995 0.180195 0.200985 -0.0962824 0.0750994 0.0791761 -0.0461428 -0.0135088 -0.0927784 -0.22214 -0.00522088 0.0838898 -0.0380957 0.0912035 -0.0879266 0.104227 -0.0116511 -0.0148259 -0.0809934 0.154292 -0.0425801 -0.0604935 0.0544401 -0.0313006 -0.041994 0.0833641 -0.127681 -0.0522353 0.138502 -0.015176 -0.115333 0.0911891 -0.0427075 -0.0802724 -0.0767672 0.0472256 0.132855 -0.0293299 -0.00265729 0.157674 -0.0884007 -0.0989873 -0.0116855 0.00836041 0.256574 -0.0591743 0.0868517 -0.104844 -0.0237588 0.037715 -0.0451312 0.0961756 0.0007515 0.071225 -0.016814 0.0632 -0.0327547 -0.0123327 -0.0266724 0.0128394 -0.0176612 0.0466521 -0.0539505 0.0685173 -0.0308903 -0.0661428 -0.11752 0.0467842 0.0901875 0.0709099 -0.0132818 0.0166377 0.154888 -0.180596 -0.0803619 -0.0249894 -0.0494745 -0.0602695 -0.0388286 0.0582033 0.0534797 -0.00126007 0.0110042 -0.0312996 -0.0681356 0.149133 -0.0302853 0.0389682 -0.0893026 0.185604 -0.0164889 -0.0624975 -0.00758959 0.144454 -0.105154 0.027515 0.0728982 0.0957921 -0.0936343 -0.0675719 0.0423122 0.140804 -0.00922106 0.0921005 0.0120858 0.0585578 -0.0534191 0.0463732 -0.0155544 -0.0500621 
0.0787935 -0.0263646 -0.0923576 0.0117602 0.102744 0.118638 0.0629136 -0.0527113 -0.0415535 -0.104621 0.0480876 0.142442 0.0799372 -0.110767 -0.161942 0.0242808 -0.113906 0.0541361 -0.17732 0.193691 0.190779 -0.119817 0.0961298 0.0620355 -0.0517529 0.0260208 -0.0731123 -0.202921 0.0195735 0.0718325 -0.0533193 0.112282 -0.0603857 0.101425 -0.0427668 -0.0240772 -0.0819276 0.213641 -0.0222644 -0.0628267 0.0217573 -0.0384187 -0.0504067 0.0581428 -0.127521 -0.0742475 0.135724 -0.0275936 -0.12343 0.0893581 -0.0262388 -0.0485555 -0.0896609 0.0609815 0.127093 -0.0336351 0.0243174 0.145668 -0.0867724 -0.108658 -0.0226682 -0.0210973 0.262996 -0.0673114 0.0912204 -0.077247 -0.0405314 0.0550749 -0.0568343 0.0940854 -0.0103481 0.0634506 -0.0317882 0.0890172 -0.0169602 -0.0294582 -0.000676532 0.0133824 -0.0145058 0.0343173 -0.0819166 0.0508423 -0.0139417 -0.0716652 -0.108305 0.0214644 0.0854869 0.089045 0.0344185 -0.00113863 0.127067 -0.176689 -0.067103 0.000490732 -0.0214641 -0.0704101 -0.0237889 0.0818719 0.0455521 -0.00819988 0.00426763 -0.0262708 -0.0823935 0.179744 -0.0174441 0.0492049 -0.0791913 0.170736 0.0258668 -0.107253 -0.0367618 0.172136 -0.0939399 0.0518339 0.10057 0.0748895 -0.0814165 -0.0771144 0.0600297 0.147978 -0.0195312 0.0830459 0.0257973 0.0440611 -0.0463678 0.0539026 0.00588796 -0.0385966 
0.0715394 -0.0302612 -0.0696048 0.0131458 0.0804226 0.102668 0.0581393 -0.0161934 -0.0230309 -0.0988018 0.0665337 0.149949 0.0402806 -0.139905 -0.145943 -0.00200254 -0.115488 0.0315846 -0.13785 0.181032 0.172366 -0.0869249 0.0610461 0.0746622 -0.0339841 0.0742105 -0.0323011 -0.208726 0.0418311 0.0412864 -0.0333858 0.0818264 -0.0498689 0.0882808 -0.0460538 -0.0359487 -0.077102 0.226103 -0.00832725 -0.0439218 0.0506354 -0.0281595 -0.0851318 0.0901039 -0.129179 -0.0919573 0.132818 -0.061131 -0.114129 0.0612555 -0.0398301 -0.0062308 -0.0940335 0.0601409 0.131175 -0.0287337 0.0128001 0.152152 -0.103351 -0.12103 -0.0392753 -0.0748423 0.282143 -0.0464985 0.0737906 -0.0846289 -0.00368059 0.0266554 -0.0191061 0.0944997 -0.00775182 0.0722309 -0.0302906 0.117056 0.00233234 -0.0706156 -0.0332399 0.0430286 -0.0156951 0.0549861 -0.108126 0.0882766 0.0195348 -0.0799837 -0.0625825 -0.0166119 0.114315 0.110633 0.0522215 -0.0405155 0.126025 -0.15342 -0.0727858 -0.0010729 -0.0019548 -0.105203 0.00770268 0.0558347 0.0443896 -0.0316465 -0.0453282 -0.0291333 -0.0659308 0.170023 -0.0467204 0.0519014 -0.0517036 0.148443 0.0467466 -0.12569 -0.0101334 0.176608 -0.118128 0.0413508 0.127951 0.0477325 -0.0771986 -0.138754 0.0755563 0.121169 0.00182703 0.1016 0.0274973 0.0428774 -0.0362861 0.0443511 0.0427127 -0.0122897 
0.0674099 -0.042467 -0.0565388 -0.00559319 0.101603 0.115461 0.0739731 -0.0413201 0.028114 -0.151092 0.0390504 0.138355 0.0488534 -0.133089 -0.137333 -0.0114348 -0.176761 0.0175621 -0.212175 0.156634 0.187897 -0.0782029 0.0460487 0.0771871 -0.040441 0.0207176 -0.0646839 -0.210344 -0.0112555 0.0548515 -0.01799 0.0714478 -0.0822617 0.102537 -0.0205762 -0.0106516 -0.0871482 0.182452 -0.0443343 -0.0406068 0.0819438 -0.028874 -0.0688157 0.0990718 -0.105266 -0.0506715 0.108836 -0.018913 -0.10673 0.0628232 -0.0686517 -0.0697925 -0.0729833 0.042879 0.142988 -0.0216323 -0.0394796 0.171241 -0.105278 -0.118055 -0.0228341 -0.025863 0.259197 -0.0161534 0.0642805 -0.0856933 -0.00129227 0.0681306 -0.00729213 0.088326 0.015464 0.0646309 -0.00745575 0.0537839 -0.00436624 -0.0165434 -0.0648192 0.00343559 -0.0192357 0.0674207 -0.0523965 0.0874087 -0.0156698 -0.0751932 -0.120313 0.0234491 0.127403 0.0896801 -0.00504198 0.00504085 0.146692 -0.18694 -0.0698295 -0.0255405 -0.063256 -0.0605949 -0.0334333 0.00903794 0.07323 -0.0185671 -0.00378073 -0.0499068 -0.0641195 0.131501 -0.0549809 0.0311945 -0.111747 0.17182 -0.0197236 -0.0917336 0.0248965 0.158734 -0.137624 0.0284561 0.0977068 0.0947703 -0.130822 -0.0832344 0.0472999 0.11777 0.0171894 0.112237 0.0108886 0.0715998 -0.0390951 0.0381947 -0.00918635 -0.0401081 
0.0706779 -0.0869823 -0.0775544 0.00673915 0.118999 0.093363 0.0507856 -0.0389731 0.0114481 -0.127215 0.0375721 0.183802 0.0508435 -0.115302 -0.167164 0.015593 -0.14726 0.0610054 -0.195241 0.177111 0.195471 -0.0982714 0.0807412 0.0940388 -0.052541 0.0278063 -0.0310708 -0.222459 -0.0396983 0.0729409 -0.0696742 0.0838043 -0.044496 0.0964603 -0.0523587 -0.0207135 -0.111883 0.179345 -0.065801 -0.0451556 0.040073 -0.0135624 -0.0682609 0.0785845 -0.11281 -0.0658205 0.115903 -0.0478933 -0.101782 0.0866024 -0.0235739 -0.102624 -0.071473 0.046686 0.145093 -0.00972136 -0.00339968 0.160243 -0.0958815 -0.0859917 0.00441164 -0.0323828 0.245551 -0.0152397 0.0824972 -0.114658 -0.0513012 0.0804546 -0.0218102 0.102608 0.00702442 0.0572113 -0.0139793 0.0285564 -0.0333395 0.0148689 -0.0289877 0.00399913 -0.036119 0.0225714 -0.0790774 0.0852357 -0.0296664 -0.0727852 -0.138391 0.0276567 0.119081 0.089102 0.00332194 0.00251896 0.103327 -0.177829 -0.0779157 -0.00263897 -0.0331398 -0.0235563 -0.0534742 0.0168262 0.0810725 -0.00680211 0.0156064 -0.0695083 -0.0771553 0.129577 -0.0239464 0.0166423 -0.120898 0.125419 -0.0460983 -0.107489 -0.00635228 0.164775 -0.0775157 0.0194473 0.0957207 0.099109 -0.115508 -0.0777298 0.0394202 0.130707 -0.0057248 0.109979 0.00601487 0.0381943 -0.0342191 0.0705119 -0.0170944 -0.0499583 
0.0805171 -0.103546 -0.110336 0.0191135 0.105566 0.0645499 0.0439398 -0.0409297 -0.042054 -0.0715228 0.0274635 0.193597 0.0627334 -0.0899897 -0.167569 0.0176038 -0.0929633 0.0621661 -0.136681 0.203331 0.147452 -0.116857 0.118438 0.0841584 -0.069687 0.0810724 -0.00558539 -0.234808 -0.0436004 0.0625755 -0.108041 0.112548 -0.026686 0.0781558 -0.0761421 -0.039134 -0.104942 0.241433 -0.0664723 -0.0538628 0.00167772 -0.00177074 -0.0898515 0.0730146 -0.150694 -0.0580254 0.123525 -0.0618159 -0.0853605 0.0983749 0.0163437 -0.0851918 -0.0684205 0.061657 0.150859 -0.0321809 0.0505913 0.143075 -0.0507013 -0.0889297 0.0132964 -0.0571455 0.237886 -0.022023 0.0969302 -0.127986 -0.0502764 0.0894873 -0.00652168 0.0973036 -0.00732105 0.0621782 -0.0101748 0.0606222 -0.044807 -0.000298148 -0.0192725 0.0149876 -0.028142 0.004766 -0.101687 0.0758383 -0.0386083 -0.094816 -0.107874 -0.0271693 0.113833 0.0993632 0.0417701 -0.0366953 0.0670382 -0.13801 -0.05657 -0.0119852 -0.00865739 -0.0394494 -0.00557778 0.0423786 0.0863686 -0.0258515 0.00476422 -0.0456437 -0.059061 0.153302 -0.0306444 -0.0104652 -0.116467 0.102349 -0.0171804 -0.1089 -0.011814 0.200416 -0.0416248 0.0135984 0.0893987 0.074954 -0.0945171 -0.121241 0.0295013 0.109511 -0.0310714 0.108247 0.0277627 0.0226907 -0.0345318 0.0605897 -0.0167286 -0.0426253 
0.0788617 -0.0900135 -0.121447 0.00669994 0.118478 0.0495803 0.0463776 -0.0282036 -0.0440038 -0.0491849 0.0279633 0.181689 0.0767523 -0.083447 -0.146838 0.0477484 -0.0697455 0.0496271 -0.133278 0.211191 0.16188 -0.112395 0.102422 0.0628488 -0.0549531 0.0919023 -0.0125184 -0.231929 -0.0206851 0.0802139 -0.100381 0.132733 -0.0194578 0.0730629 -0.0749744 -0.0349273 -0.0880632 0.24933 -0.0465305 -0.061947 0.00361555 0.00256561 -0.063153 0.0812545 -0.136932 -0.0451148 0.132064 -0.0570089 -0.0886359 0.06602 0.0220728 -0.0809147 -0.0841286 0.05347 0.159663 -0.0344141 0.030702 0.131993 -0.0504839 -0.0976168 0.0065183 -0.0908067 0.226463 -0.0250235 0.103231 -0.12848 -0.0570089 0.1069 0.0103673 0.0659555 0.00458902 0.0752144 -0.0195421 0.032539 -0.0430155 0.00874162 -0.0186663 0.0441274 -0.0311546 0.0116531 -0.0903371 0.0842817 -0.0321241 -0.0776966 -0.101787 -0.0242125 0.118544 0.107974 0.0566142 -0.0435236 0.0462752 -0.135625 -0.083939 -0.00151589 -0.0157491 -0.0398829 0.00331662 0.041541 0.0705699 -0.0394561 -0.00573821 -0.0563502 -0.0540324 0.160316 -0.0603932 -0.00542473 -0.12769 0.112656 0.00466488 -0.117372 -0.024937 0.188199 -0.0791837 0.0220132 0.103045 0.0618982 -0.113834 -0.135971 0.00852411 0.104935 -0.0270492 0.131935 0.0458581 0.0434775 -0.031076 0.0497691 -0.0163585 -0.0462212 
0.065646 -0.0513267 -0.0971539 -0.0125061 0.0837359 0.042729 0.0362621 -0.00389661 -0.0758888 -0.0114858 0.0336113 0.145477 0.0785483 -0.0834718 -0.113464 0.0504087 -0.0606951 0.0308683 -0.115634 0.209452 0.135963 -0.10914 0.106541 0.0569779 -0.0587119 0.118843 -0.00168609 -0.224747 0.0128207 0.05206 -0.100722 0.129346 -0.0133461 0.0797696 -0.0855703 -0.0380458 -0.071587 0.29263 -0.0360371 -0.039828 -0.00808852 -0.0241459 -0.0696646 0.0719288 -0.129527 -0.0273171 0.145034 -0.0582046 -0.124272 0.0571662 0.0310634 -0.0483128 -0.0981548 0.0594444 0.147579 -0.0331818 0.0441195 0.12526 -0.0349175 -0.111434 -0.00620648 -0.102753 0.216042 -0.0354239 0.109942 -0.108772 -0.04701 0.0978701 0.00651822 0.068752 -0.0147156 0.0677168 -0.0276171 0.066828 -0.00859359 -0.0273791 -0.0180756 0.0707676 -0.0113923 0.008557 -0.100933 0.0717516 -0.0312662 -0.0867696 -0.091854 -0.0401947 0.110963 0.108262 0.0817013 -0.0440419 0.0378045 -0.127646 -0.0666706 -0.00440209 -0.00970338 -0.0437315 0.0309596 0.0564548 0.0728047 -0.0474493 -0.0291638 -0.0414878 -0.0619524 0.184443 -0.0643013 -0.00421406 -0.125844 0.112706 0.0369796 -0.148189 -0.0273572 0.218303 -0.0844729 0.0235721 0.11345 0.0411669 -0.108619 -0.167071 0.0186874 0.0979107 -0.01786 0.124441 0.0556031 0.0510995 -0.0211183 0.0415348 -0.00424337 -0.0515713 
0.0579767 -0.046639 -0.0824381 -0.0183625 0.0843903 0.0406457 0.0186272 0.000929378 -0.0760969 -0.00974432 0.0215102 0.135718 0.0730624 -0.0988865 -0.102713 0.0583704 -0.0662579 0.0316707 -0.118917 0.215549 0.134046 -0.10027 0.116761 0.0625325 -0.0634371 0.11952 -0.00761694 -0.230018 0.00875819 0.0345474 -0.0895413 0.11775 -0.0132745 0.0844991 -0.0754525 -0.0305989 -0.0633298 0.294349 -0.0410114 -0.0369485 -0.0108379 -0.0223329 -0.0653862 0.0741433 -0.124051 -0.0258543 0.153985 -0.0470669 -0.123742 0.0766171 0.03096 -0.0615461 -0.105083 0.0609876 0.151507 -0.0413533 0.0513057 0.110187 -0.0261509 -0.125294 -0.00331934 -0.0971308 0.19948 -0.0296347 0.108454 -0.124408 -0.0444686 0.0977097 0.0148319 0.0713107 -0.0143465 0.0707716 -0.0219532 0.0727174 -0.0109856 -0.0378064 -0.0304087 0.086299 0.000108874 0.00900451 -0.0884244 0.0844663 -0.0367859 -0.0829687 -0.0899908 -0.0412614 0.104088 0.120779 0.0877557 -0.0380927 0.039863 -0.114824 -0.0672239 -0.00938661 -0.0127776 -0.0368263 0.0283301 0.0657092 0.0548984 -0.0533279 -0.0307304 -0.0488742 -0.0652632 0.174792 -0.0578902 -0.00862987 -0.131518 0.104191 0.0451144 -0.133475 -0.0270319 0.229782 -0.0805296 0.0263809 0.106674 0.0363419 -0.108371 -0.179457 0.00306728 0.0894751 -0.0136852 0.141424 0.0675202 0.0548825 -0.0284815 0.0282378 -0.00350746 -0.053877 
0.0677295 -0.052084 -0.0947621 -0.00978779 0.0952266 0.0431213 0.0250389 -0.0193714 -0.0866873 -0.0110214 0.0243008 0.148398 0.0859254 -0.0820266 -0.114661 0.0629712 -0.0493946 0.0333356 -0.122536 0.230345 0.127539 -0.104631 0.1161 0.0638366 -0.06719 0.12113 -0.0199898 -0.216815 0.00881651 0.0466428 -0.0955467 0.132411 -0.0235163 0.081292 -0.0857677 -0.0257948 -0.0726536 0.292653 -0.0369626 -0.0396058 -0.0195012 -0.0103843 -0.0595284 0.0653895 -0.126078 -0.0357623 0.153107 -0.0410139 -0.111718 0.0833828 0.0384739 -0.0683505 -0.109185 0.0603483 0.152375 -0.0465092 0.0401469 0.127552 -0.021578 -0.112428 -0.00700843 -0.083744 0.206981 -0.0416773 0.108232 -0.116813 -0.0453206 0.0956521 -0.00343058 0.0594271 -0.00802662 0.0787863 -0.0113223 0.0861676 -0.019425 -0.0312496 -0.0122088 0.0697306 -0.000984273 0.00586751 -0.0754114 0.0750158 -0.0386237 -0.0871073 -0.0917565 -0.047071 0.0990086 0.115767 0.0875448 -0.0411887 0.0362056 -0.11589 -0.0590687 -0.000208473 -0.00455695 -0.0372057 0.029428 0.0635627 0.0513348 -0.0472225 -0.0312744 -0.0411546 -0.0681016 0.182042 -0.0658202 0.00207165 -0.13005 0.102352 0.0490839 -0.125673 -0.027429 0.228966 -0.0706177 0.0433981 0.0946632 0.0337897 -0.103177 -0.156926 -0.00552389 0.0921141 -0.0288834 0.132114 0.0674693 0.0468305 -0.0374212 0.037683 -0.0182857 -0.0606416 
0.0706614 -0.0660288 -0.102986 0.00915621 0.106866 0.0532614 0.0375289 -0.050948 -0.0660319 -0.0389081 0.0288411 0.177793 0.0729784 -0.0678452 -0.134249 0.0310909 -0.0765656 0.0426186 -0.113515 0.219994 0.136452 -0.119664 0.125689 0.0804917 -0.0492468 0.0966681 -0.0148767 -0.218004 -0.00589934 0.0744217 -0.100654 0.112125 -0.0213213 0.0674805 -0.0815809 -0.0276716 -0.0961007 0.270031 -0.0451419 -0.0456078 -0.0114371 -0.00255155 -0.0764068 0.0643328 -0.152419 -0.0391676 0.142218 -0.0537022 -0.0907003 0.0871535 0.0301073 -0.0468047 -0.0871309 0.0548514 0.164731 -0.0370722 0.0458212 0.153921 -0.0463086 -0.0903908 -0.00688401 -0.0726831 0.237334 -0.0384846 0.107937 -0.113745 -0.0507596 0.0957451 -0.020103 0.0957109 0.00384108 0.0899003 -0.0191621 0.0784507 -0.0188439 -0.00573847 -0.0136586 0.0347922 -0.0090833 0.0171637 -0.0974564 0.0721907 -0.0247806 -0.0794612 -0.0948531 -0.0511003 0.10415 0.112381 0.0657289 -0.0443497 0.0454332 -0.127862 -0.0429442 -0.00216508 -0.00719916 -0.0694912 0.0155491 0.062163 0.0850981 -0.0460817 -0.0153695 -0.0322005 -0.0579743 0.164072 -0.0642454 0.0130138 -0.116867 0.10656 0.0388599 -0.122967 -0.0136871 0.210648 -0.0600887 0.033721 0.0974638 0.0640801 -0.0901752 -0.129813 0.017111 0.125793 -0.0274216 0.109344 0.0293996 0.0254606 -0.045657 0.0725672 -0.00246483 -0.033779 
0.0667133 -0.0484333 -0.106291 -0.00410162 0.10307 0.0332205 0.0237511 -0.0358357 -0.0885295 -0.0334638 0.0141398 0.150288 0.0776526 -0.0789101 -0.136235 0.0568822 -0.0419278 0.022144 -0.11247 0.234838 0.130397 -0.112317 0.104665 0.0550599 -0.0518768 0.129432 -0.0222832 -0.202108 0.0178986 0.0468924 -0.0908685 0.136011 -0.0368908 0.0741149 -0.0930782 -0.0343876 -0.0795024 0.286424 -0.0226255 -0.0436448 -0.00934033 0.000970368 -0.0479023 0.0668175 -0.115278 -0.0318218 0.155398 -0.0422584 -0.0948203 0.0736268 0.0289966 -0.0512545 -0.10008 0.0548555 0.150268 -0.0598709 0.0421768 0.132329 -0.023618 -0.118545 0.0045118 -0.0737261 0.214711 -0.0248207 0.090885 -0.107943 -0.038534 0.0882562 0.0113842 0.0469124 -0.00792276 0.0825286 -0.00287028 0.100697 -0.014399 -0.0324229 -0.012366 0.0642 -0.00541346 0.0184142 -0.0737561 0.0904735 -0.0239803 -0.0832694 -0.0796426 -0.0549056 0.0989864 0.128638 0.0827488 -0.063104 0.0405105 -0.102821 -0.0520691 -0.00080286 -0.000155977 -0.0578501 0.0418617 0.0654553 0.0495577 -0.0603047 -0.0413306 -0.0396105 -0.0594134 0.198222 -0.0808571 0.00443311 -0.122168 0.123654 0.0536628 -0.119336 -0.00875454 0.221562 -0.0888628 0.0581931 0.0831397 0.0267247 -0.111604 -0.152416 -0.00232396 0.0845162 -0.0446592 0.149108 0.0585507 0.0312717 -0.0541062 0.0366066 -0.0309615 -0.0618841 
0.0654162 -0.0479612 -0.0847533 0.000258901 0.0916973 0.0351346 0.0294049 -0.0222503 -0.0963931 -0.0408983 0.0238461 0.159393 0.073754 -0.105762 -0.155442 0.0365404 -0.0560623 0.01518 -0.113835 0.241202 0.125938 -0.112732 0.0672096 0.0618847 -0.0477224 0.145042 -0.0224152 -0.177058 0.0402617 0.0267996 -0.0859461 0.125498 -0.062757 0.0766442 -0.108018 -0.0492788 -0.0968712 0.255224 -0.00487309 -0.0387057 0.0197049 -0.0192987 -0.0458998 0.0782503 -0.110675 -0.0723064 0.152379 -0.0428481 -0.0893886 0.0696438 0.0208965 -0.042898 -0.115097 0.0530584 0.1393 -0.0652864 0.0150493 0.135456 -0.031656 -0.120117 0.00852372 -0.0726755 0.224863 0.0045166 0.0587081 -0.0930077 -0.0181725 0.0492863 0.0175999 0.0271775 -0.0215718 0.0842815 0.0136701 0.140319 -0.00655884 -0.0595077 -0.00968995 0.0673179 -0.0011811 0.0373132 -0.0672093 0.0899087 0.00662637 -0.0816321 -0.0605859 -0.0581326 0.117684 0.145453 0.0919944 -0.0780386 0.057029 -0.0897065 -0.0548318 0.0154275 -0.0106295 -0.0782541 0.0466153 0.0492452 0.0348979 -0.0685846 -0.0602972 -0.0355423 -0.0546145 0.205111 -0.0743714 0.0234566 -0.0975973 0.150522 0.0570423 -0.121131 0.00522703 0.219345 -0.106777 0.0697021 0.0749494 0.00259811 -0.103689 -0.139392 0.00939075 0.0702646 -0.0568887 0.143906 0.049216 0.0166753 -0.0665603 0.0330485 -0.0309193 -0.0562935 
0.0623225 -0.0246994 -0.104463 0.0112825 0.0727698 0.040405 -0.000986668 -0.033818 -0.103454 -0.0278599 0.0488778 0.151767 0.0577792 -0.107409 -0.148127 0.0598661 -0.0475561 0.038655 -0.0813619 0.226881 0.123881 -0.100351 0.100354 0.070209 -0.0386749 0.142991 0.017533 -0.205314 0.0371707 0.0394106 -0.0872411 0.11061 -0.0208687 0.074947 -0.0964993 -0.0384057 -0.0821439 0.258767 -0.00547947 -0.020881 -0.0155315 -0.0225465 -0.0495888 0.0927709 -0.116676 -0.0469366 0.184434 -0.0644203 -0.121305 0.0790213 0.0386337 -0.0305976 -0.113688 0.0579889 0.128394 -0.0475872 0.0530138 0.119364 -0.0201932 -0.112794 -0.0060132 -0.0892372 0.23488 -0.0237357 0.077975 -0.11766 -0.0304856 0.043995 0.011235 0.0708245 -0.0256505 0.0752755 -0.0136071 0.12144 0.0062691 -0.076252 -0.0178366 0.092329 -0.0233782 0.0256021 -0.0896087 0.0994985 -0.012618 -0.087139 -0.0780336 -0.0384821 0.0861098 0.106329 0.0799944 -0.0695534 0.0423888 -0.0917317 -0.0734463 0.00550339 0.021388 -0.0633525 0.0382417 0.0863814 0.0442607 -0.0695154 -0.0706088 -0.0349181 -0.0480252 0.198435 -0.0642648 0.0197661 -0.0903264 0.131528 0.0541508 -0.136218 -0.0154692 0.221169 -0.072778 0.0455214 0.0809424 0.00460599 -0.0875524 -0.176217 0.0287166 0.0826635 -0.0332734 0.130338 0.0563368 0.0198451 -0.0523552 0.0391276 0.00249855 -0.0399551 
0.0736587 -0.00171925 -0.112673 0.012541 0.0565516 0.0694543 0.00129744 -0.0297856 -0.136713 -0.0243179 0.0504018 0.129539 0.0545712 -0.105607 -0.11643 0.0565486 -0.0324877 0.0176496 -0.0376384 0.197531 0.114612 -0.0882735 0.0995991 0.0366283 -0.0199222 0.152915 0.0252863 -0.21099 0.0391793 0.0359401 -0.0711601 0.120881 -0.0211289 0.0838458 -0.0831468 -0.0375421 -0.0428532 0.250938 0.0395246 -0.0224946 -0.00457278 -0.0429032 -0.0245649 0.0860417 -0.124657 -0.0400581 0.197992 -0.0800384 -0.139785 0.0649042 0.0483555 -0.0163057 -0.107494 0.0793302 0.122784 -0.0477086 0.0706354 0.107631 -0.0190516 -0.117192 -0.015651 -0.097538 0.229227 -0.069098 0.0939491 -0.0948673 -0.0173433 0.0347658 0.0121174 0.0771294 -0.0439305 0.0779184 -0.0397063 0.129131 0.0260298 -0.0953864 -0.0113203 0.0958471 -0.0231466 0.0443232 -0.103141 0.0843806 0.0129891 -0.080373 -0.0655752 -0.0460115 0.0807638 0.0866301 0.0763813 -0.0711764 0.0474563 -0.0974279 -0.0775731 0.00307516 0.0184505 -0.0699266 0.0655212 0.116035 0.0318419 -0.0616377 -0.0919053 -0.00897554 -0.0440054 0.22095 -0.0601178 0.0196928 -0.0762144 0.150274 0.0489334 -0.144329 -0.0317973 0.200917 -0.0814799 0.0407385 0.0957055 -0.0142208 -0.0693331 -0.198833 0.0425136 0.0855019 -0.00508016 0.111207 0.0790137 0.0194389 -0.0274701 0.0168866 0.0300937 -0.0188243 
0.0931597 -0.00699031 -0.105894 0.00625728 0.0976073 0.081499 0.00868555 -0.0564683 -0.136972 -0.0650797 0.0268153 0.126767 0.0757664 -0.0751145 -0.140449 0.0473046 -0.0230354 0.0302032 -0.103769 0.218068 0.133613 -0.0919667 0.122739 0.0375596 -0.0275247 0.101931 -0.0177478 -0.178928 0.0347688 0.0445857 -0.0731712 0.122696 -0.0574513 0.0873199 -0.0863971 -0.0424454 -0.0857098 0.266141 0.00958781 -0.0386671 -0.0253233 -0.00754166 -0.0377839 0.0679245 -0.127299 -0.0341805 0.162783 -0.0388733 -0.122022 0.0998626 0.0471112 -0.00375739 -0.0992097 0.0599922 0.111599 -0.0799028 0.0648815 0.13883 -0.00646459 -0.126484 -0.0116417 -0.0418093 0.225495 -0.0572641 0.0782608 -0.10228 -0.0294707 0.0694948 -0.0255583 0.0832701 -0.00937532 0.0801655 -0.010248 0.122572 -0.0157941 -0.0656539 -0.00582842 0.0355819 -0.00969103 0.0593991 -0.0701332 0.0617656 0.00831466 -0.0878513 -0.0677069 -0.0655928 0.0711031 0.100167 0.0656886 -0.0521695 0.060276 -0.110897 -0.0585615 0.0121768 0.0101782 -0.0763347 0.0543276 0.110319 0.0178907 -0.059297 -0.0522623 0.0192333 -0.0628948 0.238679 -0.0759274 0.0179114 -0.0963516 0.155641 0.0782839 -0.128052 0.00248186 0.216076 -0.0929003 0.0973986 0.0773863 0.0145838 -0.094397 -0.131976 0.0256058 0.106707 -0.0487091 0.112265 0.0561305 0.00392787 -0.0321376 0.0187472 0.00414975 -0.0532325 
0.0957798 -0.00674985 -0.143138 0.007468 0.143677 0.0849401 0.0432247 -0.0749696 -0.0945962 -0.0690219 0.0148587 0.151984 0.0675442 -0.0808807 -0.148965 0.0364163 -0.021082 0.0304254 -0.117639 0.209675 0.140571 -0.0887946 0.0827837 0.0479234 -0.0117436 0.0817011 -0.0208908 -0.180407 0.0291798 0.0815238 -0.0667993 0.134059 -0.0697548 0.07406 -0.0672862 -0.0350701 -0.0804365 0.219062 -0.00963261 -0.0665337 0.0157118 0.001691 -0.0179435 0.0983853 -0.133538 0.00305857 0.162948 -0.0145849 -0.111465 0.0556194 0.0388825 -0.0146249 -0.092314 0.0189817 0.142785 -0.0622725 0.00149535 0.1672 -0.0206521 -0.116404 -0.0139656 -0.0529463 0.241583 -0.0551225 0.0880108 -0.11435 -0.0447878 0.0841825 -0.0221781 0.0789748 0.0112019 0.0938236 -0.0108848 0.0671826 -0.0329172 -0.0115595 -0.0115888 0.0614871 -0.0228634 0.0402391 -0.0621674 0.0935518 -0.00295571 -0.0717811 -0.0709166 -0.0662283 0.0901451 0.103851 0.0442682 -0.0354676 0.0579085 -0.121116 -0.0868162 -0.00454305 0.00126026 -0.0762524 0.0562835 0.0655726 0.0381528 -0.0728929 -0.0374195 0.00683038 -0.0453564 0.208285 -0.128247 0.0158457 -0.122154 0.16563 0.0450948 -0.0985602 0.0398663 0.188157 -0.11329 0.085151 0.0749305 0.0166394 -0.138046 -0.127747 0.0116403 0.1109 -0.0400243 0.128459 0.0444329 0.0274394 -0.0351286 0.0298273 -0.0250281 -0.0799567 
0.0938647 -0.0173699 -0.115426 -0.00645164 0.113156 0.0984989 0.0294896 -0.0570452 -0.100505 -0.115624 0.00888393 0.126018 0.0799752 -0.0973324 -0.150895 0.0181414 -0.0556169 0.00677537 -0.148086 0.223905 0.135521 -0.0855097 0.100502 0.0325083 -0.0372344 0.0744401 -0.0318044 -0.179111 0.0111003 0.040526 -0.0528546 0.108987 -0.0802813 0.0939338 -0.0676714 -0.0357645 -0.0799616 0.241667 -0.021434 -0.0590042 0.0181754 -0.0136714 -0.0299989 0.0976677 -0.129517 -0.0228476 0.153489 -0.00683169 -0.117389 0.103348 0.00395676 -0.0462825 -0.08002 0.0472616 0.123121 -0.0839776 0.00547356 0.155568 -0.0205773 -0.146628 -0.0147655 -0.017943 0.238913 -0.0420344 0.0701475 -0.0975664 -0.0196786 0.0708291 -0.0254493 0.0511541 -0.00533408 0.0640643 0.00828374 0.0984314 -0.0207307 -0.0395105 -0.0231406 0.0161868 -0.00444105 0.0761886 -0.0442565 0.057897 -0.00911905 -0.0880546 -0.0783632 -0.0502451 0.0850342 0.106343 0.0447353 -0.030996 0.0962609 -0.13682 -0.0685873 -0.00584171 -0.0200134 -0.064766 0.0456385 0.0769895 0.0186802 -0.0590704 -0.0430289 0.00844977 -0.0614322 0.215366 -0.103355 0.0172004 -0.118301 0.187161 0.0351652 -0.0979852 0.0418854 0.205295 -0.119423 0.0988777 0.053522 0.025446 -0.127023 -0.105526 0.0213116 0.10352 -0.0534777 0.11898 0.0518518 0.028008 -0.0299056 0.00185028 -0.0253741 -0.0795801 
0.096777 0.00901552 -0.174719 -0.0159683 0.118965 0.10466 0.0195829 -0.0790397 -0.0609779 -0.107892 0.0425315 0.142551 0.0619173 -0.0878417 -0.188875 0.0159465 -0.0417081 -0.000446484 -0.110982 0.188694 0.143052 -0.0642525 0.0577842 0.0269367 -0.0100011 0.0883323 0.0344663 -0.156356 0.0266628 0.0837932 -0.0555171 0.0777383 -0.0650645 0.0565206 -0.0595903 -0.0368686 -0.0770293 0.19157 0.00570136 -0.0542735 0.011865 -0.00475068 -0.0198157 0.144731 -0.12324 -0.00739424 0.159027 -0.0141139 -0.118076 0.0574844 0.000632594 0.00109786 -0.0817283 0.0315468 0.125593 -0.0630783 -0.0309789 0.177436 -0.05088 -0.14096 -0.0206221 -0.0573258 0.300983 -0.0403832 0.0559628 -0.112133 -0.0189304 0.0862275 0.00650955 0.0651142 0.0143777 0.0705229 -0.0150457 0.0473606 -0.0198294 -0.0220294 -0.0250108 0.0443739 -0.0398979 0.0679225 -0.0459267 0.0997134 0.00801945 -0.0710749 -0.0792572 -0.0452356 0.0862202 0.0926102 0.0534163 -0.0364532 0.0794164 -0.152611 -0.104649 0.0141273 0.0154521 -0.0950236 0.0461998 0.0527619 0.0321452 -0.0841126 -0.0487559 0.00667938 -0.0436136 0.18512 -0.144819 0.0371292 -0.109162 0.176105 0.00395835 -0.0974159 0.0764826 0.165721 -0.121412 0.10841 0.0652686 0.0204766 -0.148243 -0.114386 0.0389296 0.0871186 -0.0445305 0.11005 0.0533925 0.0206303 -0.0284746 0.0198617 -0.0153721 -0.0630632 
0.0959322 0.00815442 -0.161811 -0.0169458 0.122897 0.0943048 0.0115034 -0.0498707 -0.0653391 -0.0945598 0.0430342 0.144389 0.0608546 -0.100559 -0.172565 0.0368631 -0.00729204 0.00562096 -0.133494 0.190054 0.134358 -0.0492594 0.0616229 0.0348821 -0.016805 0.0920443 0.0397408 -0.15478 0.020258 0.0578532 -0.0497678 0.0978522 -0.0538744 0.0779011 -0.0842571 -0.0444166 -0.0618187 0.203047 -0.00375189 -0.033731 0.0243719 0.00463963 -0.0152843 0.133911 -0.114819 -0.0181768 0.15707 -0.0246742 -0.118943 0.0594666 0.0308715 -0.0208756 -0.106051 0.0281526 0.109955 -0.0607931 -0.0303028 0.160355 -0.02704 -0.134185 -0.0273519 -0.069156 0.254993 -0.04888 0.0537303 -0.12873 -0.0219406 0.091607 0.00704779 0.0575155 0.0120438 0.0654142 -0.00315653 0.0495591 -0.015771 -0.0271958 -0.0259014 0.068718 -0.0518247 0.0533807 -0.0529261 0.108347 0.0128648 -0.071811 -0.0791718 -0.0409381 0.0981599 0.0881855 0.0426964 -0.0439347 0.0502971 -0.151894 -0.116926 0.00903752 0.0261967 -0.0656959 0.0506996 0.040548 0.00303717 -0.0794868 -0.0682731 -0.00735798 -0.0452462 0.21775 -0.138122 0.0120605 -0.129415 0.165786 0.00214751 -0.116643 0.0619114 0.182598 -0.118063 0.117687 0.0619813 -0.00973814 -0.164595 -0.135849 0.025876 0.0817253 -0.0377284 0.139453 0.0536947 0.0344397 -0.00744962 -0.00633678 -0.0330067 -0.081253 
0.0635123 0.00609772 -0.159382 -0.00829513 0.110015 0.050603 -0.0113943 -0.0575309 -0.0958199 -0.0498746 0.0285127 0.126339 0.079319 -0.038683 -0.164469 0.0392925 0.00812966 0.00642437 -0.0657085 0.19432 0.133836 -0.105214 0.103034 0.0345607 0.00512039 0.119346 0.0420458 -0.15372 0.0461226 0.0609874 -0.0425143 0.097465 -0.0335484 0.0395754 -0.0991508 -0.0417408 -0.0720138 0.249492 0.0108731 -0.0434463 -0.00864307 0.0189058 -0.0237304 0.123177 -0.131118 -0.028537 0.163648 -0.0365068 -0.0774977 0.0263694 0.0352015 0.00439748 -0.095007 0.02871 0.113599 -0.0550977 0.0331678 0.155679 0.0123391 -0.148541 -0.0138298 -0.0837245 0.23637 -0.0364105 0.0663142 -0.107612 -0.0247425 0.0930351 0.0349713 0.0661971 0.000619588 0.0994382 -0.0112903 0.0629191 -0.00638896 -0.0430183 -0.0217467 0.0883202 -0.032874 0.0469443 -0.0906315 0.0918818 0.0286602 -0.0593915 -0.0566277 -0.082055 0.0922574 0.121477 0.081274 -0.104868 0.02054 -0.101121 -0.0635801 -0.00760098 0.0381441 -0.115574 0.0585569 0.107631 0.0155097 -0.0900404 -0.0757083 0.00730391 -0.020777 0.223368 -0.126805 0.014074 -0.111136 0.145876 0.0712826 -0.130253 0.0207203 0.190805 -0.116431 0.114402 0.0663628 -0.00260946 -0.124817 -0.155251 0.0167268 0.0821833 -0.0557966 0.140454 0.0256224 0.00409903 -0.0629004 0.0164992 -0.0425914 -0.0282616 
0.0662824 -0.0149136 -0.12871 0.0193226 0.133565 0.0332406 0.0103261 -0.0679651 -0.0765215 -0.0402769 0.0234771 0.159413 0.0695675 -0.0535751 -0.174863 0.0335015 -0.00134675 0.0595097 -0.0874492 0.194371 0.169 -0.117249 0.0887522 0.0662232 0.02778 0.0899183 0.00955523 -0.161915 0.0346281 0.0997929 -0.053836 0.0963192 -0.0334117 0.0363597 -0.0747365 -0.066378 -0.105998 0.224099 0.00829279 -0.0745845 -0.0172933 0.0296048 -0.0188269 0.128117 -0.128191 -0.0532439 0.150052 -0.0479602 -0.0546105 0.027287 0.0647348 0.000396104 -0.091941 0.00747925 0.126122 -0.0548155 0.0242375 0.147084 0.000825446 -0.142626 0.00993728 -0.105513 0.216998 -0.000517897 0.0606373 -0.135785 -0.0516575 0.0852547 0.0121788 0.0748373 0.0255334 0.11125 -0.0104465 0.0275955 -0.0542782 -0.0231084 -0.022907 0.0720426 -0.0248107 0.0591376 -0.10226 0.105492 0.0313854 -0.0447586 -0.0463487 -0.100189 0.0981241 0.130368 0.0885794 -0.0993422 -0.00777962 -0.0888365 -0.0715907 0.000564372 0.0138747 -0.120508 0.0342486 0.0918411 0.0164919 -0.0951841 -0.0419414 0.0108239 -0.0151409 0.207259 -0.107406 0.000805938 -0.102537 0.13652 0.0941945 -0.118307 0.0133946 0.172862 -0.132842 0.107676 0.0783 0.0191201 -0.118565 -0.132224 0.00255498 0.0971574 -0.064425 0.154912 -0.00571649 -0.00865724 -0.0594217 0.0318282 -0.0111127 -0.03082 
0.0688798 -0.0395793 -0.10733 0.0217506 0.131756 0.0452916 0.00477389 -0.0539184 -0.0459723 -0.0387306 0.0567903 0.173168 0.0591181 -0.0628098 -0.154504 0.0127673 -0.00730572 0.072011 -0.0891323 0.181857 0.172226 -0.0844065 0.0681043 0.122003 0.03531 0.0888854 0.0430772 -0.171993 0.0348806 0.0949797 -0.0370661 0.0538807 -0.0306137 0.0388538 -0.0684374 -0.0486974 -0.1181 0.19431 -0.0109089 -0.0602032 0.00344284 0.0316952 -0.0571176 0.155887 -0.140326 -0.0763383 0.131249 -0.0395923 -0.0342478 0.0133191 0.0701652 0.006212 -0.0929763 -0.0113138 0.13482 -0.034692 -0.00504245 0.159829 -0.0070108 -0.13474 -0.0119354 -0.130178 0.226525 0.0152196 0.0429869 -0.151524 -0.0326847 0.0825138 0.0245196 0.0962712 0.0330257 0.115377 -0.0130261 -0.0031691 -0.0491449 -0.0303185 -0.0504207 0.0978042 -0.0281348 0.083183 -0.101651 0.119617 0.0482933 -0.0531261 -0.0403058 -0.103179 0.12919 0.130634 0.0686577 -0.095746 -0.00473253 -0.0848261 -0.0757273 0.00667541 -0.00186728 -0.13467 0.01484 0.0532971 0.027384 -0.114443 -0.0315114 0.0124445 -0.00800481 0.166581 -0.105633 0.00176818 -0.101327 0.100588 0.0924377 -0.120897 0.0284653 0.179127 -0.132197 0.0931163 0.0896705 0.0337331 -0.127371 -0.14988 -0.00680141 0.103022 -0.0434276 0.1404 -0.0324009 0.00237412 -0.0624276 0.0528172 0.00602547 -0.00506832 
0.0721683 -0.0443104 -0.13267 0.00234589 0.131231 0.0718945 0.00555474 -0.0454153 -0.0580362 -0.042864 0.0498496 0.178342 0.0495146 -0.0763012 -0.162763 -0.00374076 -0.0352728 0.0559962 -0.0745402 0.186973 0.140865 -0.0558815 0.0517044 0.120628 0.0182648 0.103933 0.0698575 -0.163455 0.0313872 0.0832054 -0.0533442 0.021573 -0.0556435 0.0378046 -0.0688969 -0.0341902 -0.115566 0.149697 -0.0216791 -0.0457629 0.0187529 0.0208328 -0.0507515 0.188978 -0.159906 -0.073074 0.147651 -0.0206647 -0.0357992 0.0464176 0.0654972 -0.00707517 -0.10911 -0.00209374 0.149934 -0.0349785 -0.0275151 0.179954 -0.00196114 -0.135538 -0.0155008 -0.111737 0.262763 0.0196674 0.030376 -0.164002 -0.0214038 0.0613714 0.0394828 0.102513 0.0257673 0.124864 0.0118556 0.0197091 -0.0463808 -0.0354038 -0.0557812 0.110004 -0.0215296 0.067898 -0.0606018 0.129762 0.0498138 -0.0526493 -0.0416259 -0.100658 0.130177 0.13588 0.0794811 -0.0749532 0.0210228 -0.0855909 -0.0914977 -0.00439371 1.32095e-05 -0.133723 0.0253141 0.043034 0.0341059 -0.120769 -0.0427803 0.020212 0.00197869 0.138098 -0.134028 0.0172732 -0.114803 0.0982962 0.0451595 -0.0894898 0.0744775 0.181691 -0.106611 0.0927931 0.0607605 0.0194789 -0.100315 -0.14991 -0.00924189 0.0801656 -0.0311972 0.115558 -6.64135e-05 -0.00614746 -0.0818645 0.0477144 -0.00580873 -0.00660653 
0.0509021 -0.082937 -0.109709 0.00911676 0.124534 0.0294108 0.067261 -0.000588664 0.0107045 -0.0380801 0.0738524 0.163651 0.0629704 -0.0652092 -0.133698 -0.0596498 -0.0778623 0.011336 -0.0996578 0.171261 0.133848 -0.117367 -0.00995981 0.119029 0.0501452 0.071619 0.028501 -0.131713 0.0488219 0.0556917 0.00677469 0.00482581 -0.0832099 0.00055629 -0.0880614 -0.0214491 -0.168704 0.111775 -0.0311964 -0.0548068 0.0874307 0.00897224 -0.102698 0.208692 -0.139775 -0.121555 0.059133 0.00689748 0.0300028 -0.0351275 -0.0333891 -0.0136959 -0.0979747 -0.0601159 0.109007 -0.00981129 -0.130472 0.212357 -0.0255633 -0.104505 -0.0315835 -0.126372 0.25211 0.0849149 -0.0183043 -0.0915018 0.0139664 0.0537338 0.0637537 0.0161519 0.0309456 0.140986 0.0366797 -0.00270546 -0.0456436 -0.0334339 -0.0620883 0.0758237 -0.0161088 0.109271 -0.0800798 0.0746591 0.0453288 -0.052689 -0.0306442 -0.0862134 0.17354 0.146999 0.0855848 -0.135106 0.0471227 -0.0630926 -0.0642348 -0.0156961 -0.0385033 -0.167926 0.00265747 -0.0515931 0.0492451 -0.112663 -0.0540525 -0.029156 0.0261911 0.0722683 -0.142187 0.0547726 -0.0891386 0.125167 0.0783007 -0.0844189 0.0823238 0.153874 -0.157605 0.069519 0.0722009 0.0350634 -0.113596 -0.0885803 0.0139816 0.0690726 -0.0578876 0.0919347 -0.0739965 0.0447711 -0.107087 0.0458109 -0.0490919 0.0180655 
0.038585 -0.114787 -0.0826683 -0.00252035 0.159698 0.0361369 0.0270086 -0.0568405 -0.0314327 -0.0677285 -0.0127648 0.230455 0.0384258 -0.0575479 -0.162453 -0.0278078 -0.0640955 0.0840704 -0.0972645 0.215453 0.123985 -0.0667607 0.0702487 0.149341 -0.0285823 0.0911379 0.0321892 -0.166494 -0.0177669 0.0734044 -0.083287 0.0154674 -0.0461485 0.0326608 -0.0375089 -0.0316314 -0.130948 0.167339 -0.0924095 -0.0728667 0.025307 0.0657957 -0.058615 0.151089 -0.15899 -0.0658381 0.12555 -0.0210187 -0.017677 0.0752954 0.039293 -0.107882 -0.076116 -0.0119375 0.184929 -0.0227453 -0.0547714 0.218651 -0.0395362 -0.104973 0.0194492 -0.059909 0.235532 0.0382246 0.092617 -0.16174 -0.0579918 0.0562355 -0.024513 0.0761768 0.0358087 0.109104 0.0456956 0.0158194 -0.0823575 0.0213855 -0.0364107 0.0491607 0.0252865 0.00530506 -0.0636565 0.126883 -0.000678073 -0.0554886 -0.0583415 -0.145083 0.132144 0.163126 0.0658454 -0.03919 0.0180417 -0.0772242 -0.0456095 -0.00597053 -0.00356312 -0.0700815 0.00655359 0.00921198 0.0514325 -0.0639543 -0.0180984 -0.0174281 -0.0361958 0.0888145 -0.118534 0.00838677 -0.123989 0.0338387 -0.00102693 -0.0586784 0.088908 0.181938 -0.0613217 0.0785319 0.0312898 0.0499279 -0.111717 -0.102639 -0.0463795 0.0881354 -0.0620628 0.118079 -0.0250706 -0.0329482 -0.0760302 0.0880539 -0.0600781 -0.0755838 
0.038585 -0.114787 -0.0826683 -0.00252035 0.159698 0.0361369 0.0270086 -0.0568405 -0.0314327 -0.0677285 -0.0127648 0.230455 0.0384258 -0.0575479 -0.162453 -0.0278078 -0.0640955 0.0840704 -0.0972645 0.215453 0.123985 -0.0667607 0.0702487 0.149341 -0.0285823 0.0911379 0.0321892 -0.166494 -0.0177669 0.0734044 -0.083287 0.0154674 -0.0461485 0.0326608 -0.0375089 -0.0316314 -0.130948 0.167339 -0.0924095 -0.0728667 0.025307 0.0657957 -0.058615 0.151089 -0.15899 -0.0658381 0.12555 -0.0210187 -0.017677 0.0752954 0.039293 -0.107882 -0.076116 -0.0119375 0.184929 -0.0227453 -0.0547714 0.218651 -0.0395362 -0.104973 0.0194492 -0.059909 0.235532 0.0382246 0.092617 -0.16174 -0.0579918 0.0562355 -0.024513 0.0761768 0.0358087 0.109104 0.0456956 0.0158194 -0.0823575 0.0213855 -0.0364107 0.0491607 0.0252865 0.00530506 -0.0636565 0.126883 -0.000678073 -0.0554886 -0.0583415 -0.145083 0.132144 0.163126 0.0658454 -0.03919 0.0180417 -0.0772242 -0.0456095 -0.00597053 -0.00356312 -0.0700815 0.00655359 0.00921198 0.0514325 -0.0639543 -0.0180984 -0.0174281 -0.0361958 0.0888145 -0.118534 0.00838677 -0.123989 0.0338387 -0.00102693 -0.0586784 0.088908 0.181938 -0.0613217 0.0785319 0.0312898 0.0499279 -0.111717 -0.102639 -0.0463795 0.0881354 -0.0620628 0.118079 -0.0250706 -0.0329482 -0.0760302 0.0880539 -0.0600781 -0.0755838 
0.038585 -0.114787 -0.0826683 -0.00252035 0.159698 0.0361369 0.0270086 -0.0568405 -0.0314327 -0.0677285 -0.0127648 0.230455 0.0384258 -0.0575479 -0.162453 -0.0278078 -0.0640955 0.0840704 -0.0972645 0.215453 0.123985 -0.0667607 0.0702487 0.149341 -0.0285823 0.0911379 0.0321892 -0.166494 -0.0177669 0.0734044 -0.083287 0.0154674 -0.0461485 0.0326608 -0.0375089 -0.0316314 -0.130948 0.167339 -0.0924095 -0.0728667 0.025307 0.0657957 -0.058615 0.151089 -0.15899 -0.0658381 0.12555 -0.0210187 -0.017677 0.0752954 0.039293 -0.107882 -0.076116 -0.0119375 0.184929 -0.0227453 -0.0547714 0.218651 -0.0395362 -0.104973 0.0194492 -0.059909 0.235532 0.0382246 0.092617 -0.16174 -0.0579918 0.0562355 -0.024513 0.0761768 0.0358087 0.109104 0.0456956 0.0158194 -0.0823575 0.0213855 -0.0364107 0.0491607 0.0252865 0.00530506 -0.0636565 0.126883 -0.000678073 -0.0554886 -0.0583415 -0.145083 0.132144 0.163126 0.0658454 -0.03919 0.0180417 -0.0772242 -0.0456095 -0.00597053 -0.00356312 -0.0700815 0.00655359 0.00921198 0.0514325 -0.0639543 -0.0180984 -0.0174281 -0.0361958 0.0888145 -0.118534 0.00838677 -0.123989 0.0338387 -0.00102693 -0.0586784 0.088908 0.181938 -0.0613217 0.0785319 0.0312898 0.0499279 -0.111717 -0.102639 -0.0463795 0.0881354 -0.0620628 0.118079 -0.0250706 -0.0329482 -0.0760302 0.0880539 -0.0600781 -0.0755838 
0.038585 -0.114787 -0.0826683 -0.00252035 0.159698 0.0361369 0.0270086 -0.0568405 -0.0314327 -0.0677285 -0.0127648 0.230455 0.0384258 -0.0575479 -0.162453 -0.0278078 -0.0640955 0.0840704 -0.0972645 0.215453 0.123985 -0.0667607 0.0702487 0.149341 -0.0285823 0.0911379 0.0321892 -0.166494 -0.0177669 0.0734044 -0.083287 0.0154674 -0.0461485 0.0326608 -0.0375089 -0.0316314 -0.130948 0.167339 -0.0924095 -0.0728667 0.025307 0.0657957 -0.058615 0.151089 -0.15899 -0.0658381 0.12555 -0.0210187 -0.017677 0.0752954 0.039293 -0.107882 -0.076116 -0.0119375 0.184929 -0.0227453 -0.0547714 0.218651 -0.0395362 -0.104973 0.0194492 -0.059909 0.235532 0.0382246 0.092617 -0.16174 -0.0579918 0.0562355 -0.024513 0.0761768 0.0358087 0.109104 0.0456956 0.0158194 -0.0823575 0.0213855 -0.0364107 0.0491607 0.0252865 0.00530506 -0.0636565 0.126883 -0.000678073 -0.0554886 -0.0583415 -0.145083 0.132144 0.163126 0.0658454 -0.03919 0.0180417 -0.0772242 -0.0456095 -0.00597053 -0.00356312 -0.0700815 0.00655359 0.00921198 0.0514325 -0.0639543 -0.0180984 -0.0174281 -0.0361958 0.0888145 -0.118534 0.00838677 -0.123989 0.0338387 -0.00102693 -0.0586784 0.088908 0.181938 -0.0613217 0.0785319 0.0312898 0.0499279 -0.111717 -0.102639 -0.0463795 0.0881354 -0.0620628 0.118079 -0.0250706 -0.0329482 -0.0760302 0.0880539 -0.0600781 -0.0755838 
0.038585 -0.114787 -0.0826683 -0.00252035 0.159698 0.0361369 0.0270086 -0.0568405 -0.0314327 -0.0677285 -0.0127648 0.230455 0.0384258 -0.0575479 -0.162453 -0.0278078 -0.0640955 0.0840704 -0.0972645 0.215453 0.123985 -0.0667607 0.0702487 0.149341 -0.0285823 0.0911379 0.0321892 -0.166494 -0.0177669 0.0734044 -0.083287 0.0154674 -0.0461485 0.0326608 -0.0375089 -0.0316314 -0.130948 0.167339 -0.0924095 -0.0728667 0.025307 0.0657957 -0.058615 0.151089 -0.15899 -0.0658381 0.12555 -0.0210187 -0.017677 0.0752954 0.039293 -0.107882 -0.076116 -0.0119375 0.184929 -0.0227453 -0.0547714 0.218651 -0.0395362 -0.104973 0.0194492 -0.059909 0.235532 0.0382246 0.092617 -0.16174 -0.0579918 0.0562355 -0.024513 0.0761768 0.0358087 0.109104 0.0456956 0.0158194 -0.0823575 0.0213855 -0.0364107 0.0491607 0.0252865 0.00530506 -0.0636565 0.126883 -0.000678073 -0.0554886 -0.0583415 -0.145083 0.132144 0.163126 0.0658454 -0.03919 0.0180417 -0.0772242 -0.0456095 -0.00597053 -0.00356312 -0.0700815 0.00655359 0.00921198 0.0514325 -0.0639543 -0.0180984 -0.0174281 -0.0361958 0.0888145 -0.118534 0.00838677 -0.123989 0.0338387 -0.00102693 -0.0586784 0.088908 0.181938 -0.0613217 0.0785319 0.0312898 0.0499279 -0.111717 -0.102639 -0.0463795 0.0881354 -0.0620628 0.118079 -0.0250706 -0.0329482 -0.0760302 0.0880539 -0.0600781 -0.0755838 
0.038585 -0.114787 -0.0826683 -0.00252035 0.159698 0.0361369 0.0270086 -0.0568405 -0.0314327 -0.0677285 -0.0127648 0.230455 0.0384258 -0.0575479 -0.162453 -0.0278078 -0.0640955 0.0840704 -0.0972645 0.215453 0.123985 -0.0667607 0.0702487 0.149341 -0.0285823 0.0911379 0.0321892 -0.166494 -0.0177669 0.0734044 -0.083287 0.0154674 -0.0461485 0.0326608 -0.0375089 -0.0316314 -0.130948 0.167339 -0.0924095 -0.0728667 0.025307 0.0657957 -0.058615 0.151089 -0.15899 -0.0658381 0.12555 -0.0210187 -0.017677 0.0752954 0.039293 -0.107882 -0.076116 -0.0119375 0.184929 -0.0227453 -0.0547714 0.218651 -0.0395362 -0.104973 0.0194492 -0.059909 0.235532 0.0382246 0.092617 -0.16174 -0.0579918 0.0562355 -0.024513 0.0761768 0.0358087 0.109104 0.0456956 0.0158194 -0.0823575 0.0213855 -0.0364107 0.0491607 0.0252865 0.00530506 -0.0636565 0.126883 -0.000678073 -0.0554886 -0.0583415 -0.145083 0.132144 0.163126 0.0658454 -0.03919 0.0180417 -0.0772242 -0.0456095 -0.00597053 -0.00356312 -0.0700815 0.00655359 0.00921198 0.0514325 -0.0639543 -0.0180984 -0.0174281 -0.0361958 0.0888145 -0.118534 0.00838677 -0.123989 0.0338387 -0.00102693 -0.0586784 0.088908 0.181938 -0.0613217 0.0785319 0.0312898 0.0499279 -0.111717 -0.102639 -0.0463795 0.0881354 -0.0620628 0.118079 -0.0250706 -0.0329482 -0.0760302 0.0880539 -0.0600781 -0.0755838 
0.038585 -0.114787 -0.0826683 -0.00252035 0.159698 0.0361369 0.0270086 -0.0568405 -0.0314327 -0.0677285 -0.0127648 0.230455 0.0384258 -0.0575479 -0.162453 -0.0278078 -0.0640955 0.0840704 -0.0972645 0.215453 0.123985 -0.0667607 0.0702487 0.149341 -0.0285823 0.0911379 0.0321892 -0.166494 -0.0177669 0.0734044 -0.083287 0.0154674 -0.0461485 0.0326608 -0.0375089 -0.0316314 -0.130948 0.167339 -0.0924095 -0.0728667 0.025307 0.0657957 -0.058615 0.151089 -0.15899 -0.0658381 0.12555 -0.0210187 -0.017677 0.0752954 0.039293 -0.107882 -0.076116 -0.0119375 0.184929 -0.0227453 -0.0547714 0.218651 -0.0395362 -0.104973 0.0194492 -0.059909 0.235532 0.0382246 0.092617 -0.16174 -0.0579918 0.0562355 -0.024513 0.0761768 0.0358087 0.109104 0.0456956 0.0158194 -0.0823575 0.0213855 -0.0364107 0.0491607 0.0252865 0.00530506 -0.0636565 0.126883 -0.000678073 -0.0554886 -0.0583415 -0.145083 0.132144 0.163126 0.0658454 -0.03919 0.0180417 -0.0772242 -0.0456095 -0.00597053 -0.00356312 -0.0700815 0.00655359 0.00921198 0.0514325 -0.0639543 -0.0180984 -0.0174281 -0.0361958 0.0888145 -0.118534 0.00838677 -0.123989 0.0338387 -0.00102693 -0.0586784 0.088908 0.181938 -0.0613217 0.0785319 0.0312898 0.0499279 -0.111717 -0.102639 -0.0463795 0.0881354 -0.0620628 0.118079 -0.0250706 -0.0329482 -0.0760302 0.0880539 -0.0600781 -0.0755838 
