-0.00765936 0.131058 -0.20926 -0.0341654 0.0845893 0.139033 0.0424171 -0.144839 -0.0978099 0.0774639 0.0492654 0.065124 0.0880134 -0.0348184 0.00626611 -0.0122043 -0.0597482 -0.00296676 0.0895215 0.0814989 0.0324199 -0.0626494 -0.011591 -0.0058048 0.0219298 0.10859 -0.0910115 -0.210281 0.131499 0.155109 0.0496667 0.124203 -0.0503233 -0.0791469 0.0332032 0.0934475 -0.0393368 0.0527089 0.0868836 0.00645648 0.0492635 -0.0426111 -0.0493133 0.128522 -0.150649 0.11303 0.206498 0.0065004 -0.126126 -0.139309 -0.0602467 0.0584023 -0.0236874 -0.0558372 0.0472958 0.0733943 -0.046873 0.204717 -0.0579209 -0.00868069 -0.102444 -0.01845 0.279776 -0.133687 0.136215 -0.0343758 0.0592177 0.0122922 -0.0089364 0.0209184 0.0325297 0.135557 -0.0791215 0.0195228 0.055748 0.0216459 -0.108569 0.0723758 -0.0229336 0.0341624 -0.0628742 0.0954401 -0.0452395 0.0309998 -0.0551087 -0.0034902 0.0607241 -0.0499741 -0.00865165 -0.0786657 0.0537691 -0.0487603 -0.0257181 -0.0263331 0.00227896 -0.160298 0.0645464 0.0885191 0.0735186 -0.0328136 -0.0668593 0.0162303 0.0133948 0.0501139 -0.208546 0.137833 -0.0337009 0.143924 0.0346452 0.0302767 0.0385239 0.00822468 -0.125537 -0.0800172 0.0276801 0.0385887 -0.118424 -0.171094 0.0565554 0.0953564 0.0667295 -0.0624312 -0.000659905 0.0549429 -0.112781 0.0929859 -0.064566 0.0519234 
-0.0162493 0.118275 -0.237407 -0.0183457 0.0614174 0.12519 0.0615252 -0.156319 -0.0744588 0.0879006 0.0407395 0.0584593 0.0698146 -0.00875626 -0.000980259 -0.0128133 -0.0622696 -0.021584 0.132038 0.0434566 0.004832 -0.0711758 -0.06504 -0.0468511 0.0206161 0.126438 -0.109123 -0.2001 0.109532 0.173558 0.0361401 0.148791 -0.0522589 -0.115982 0.0448248 0.102768 -0.0341972 0.0161067 0.0930206 -0.022204 0.045134 -0.0411671 -0.027893 0.116694 -0.116219 0.124962 0.186598 -0.000631395 -0.112901 -0.18177 -0.0856626 0.049654 0.0192808 -0.0623696 0.0599442 0.0914162 -0.0731405 0.196061 -0.0584018 0.00791016 -0.0882764 -0.0127837 0.276799 -0.129754 0.135719 0.0216148 0.0569761 0.00403221 0.0119478 -0.0204281 0.0315248 0.126635 -0.0668913 0.00576376 0.0411025 0.0390125 -0.0922944 0.0366612 -0.033897 0.00272877 -0.0376774 0.0940311 -0.0737036 0.0149323 -0.0548759 -0.000119443 0.0472352 -0.0656591 0.00385497 -0.0703441 0.0533293 -0.027851 -0.0270379 -0.0276303 0.00498482 -0.12378 0.0821097 0.0530297 0.0961931 -0.00653944 -0.0520616 0.00833598 0.0317591 -0.0185504 -0.234999 0.152624 -0.0185861 0.115536 -0.00560344 0.0670818 0.0559984 -0.0319072 -0.113611 -0.133855 0.0343972 0.0284435 -0.0990853 -0.149686 0.0674993 0.048005 0.0650676 -0.0876409 0.03228 0.043531 -0.101506 0.105886 -0.0562048 0.0475683 
-0.00961675 0.126767 -0.238502 -0.00806909 0.0754816 0.106325 0.0440337 -0.171496 -0.0605401 0.0873219 0.0562208 0.0587846 0.0807788 0.0230945 0.0116818 0.000243979 -0.0252156 -0.00778607 0.12494 0.0621552 0.0207313 -0.068717 -0.00877588 -0.0125715 0.0397807 0.0981298 -0.0831292 -0.200598 0.118787 0.194204 0.0484383 0.136374 -0.0158743 -0.112357 0.0281609 0.107731 -0.0278263 0.0641323 0.0740358 0.000806225 0.01314 -0.00816991 -0.042348 0.118987 -0.142063 0.119622 0.192807 -0.0113786 -0.0813743 -0.163588 -0.0517627 0.0722239 0.00239405 -0.0640472 0.0644903 0.0907298 -0.0462508 0.203568 -0.0389101 0.00611958 -0.111745 -0.0485321 0.264699 -0.148725 0.144265 -0.0215314 0.0544208 0.0189854 -0.00241998 0.0203261 0.0512061 0.143951 -0.0802755 -0.00749118 0.045368 0.0380702 -0.093941 0.0609412 -0.049418 0.00684456 -0.054443 0.100011 -0.0667706 0.0180326 -0.04523 -0.0105439 0.0358699 -0.0690197 -0.00746283 -0.0912487 0.0184354 -0.039331 -0.0262954 -0.0411972 0.0320126 -0.150963 0.0649872 0.0772557 0.0985771 -0.017217 -0.0667205 0.0138139 0.0415358 0.0160327 -0.238842 0.137026 -0.0305718 0.0931282 0.047801 0.0386073 0.0319192 -0.0115345 -0.109518 -0.0997078 0.031203 0.0435688 -0.0915127 -0.168365 0.0498736 0.0846978 0.0608881 -0.056087 0.0033144 0.0575192 -0.103282 0.106966 -0.0492805 0.0653398 
-0.0324721 0.120343 -0.234234 -0.000404822 0.0496006 0.112159 0.0582041 -0.153999 -0.0653195 0.0953599 0.0425932 0.051741 0.0714005 0.0178491 0.00334878 0.000782323 -0.0481495 -0.0236387 0.139976 0.0326098 0.013026 -0.0909882 -0.0551738 -0.0436048 0.0390848 0.115746 -0.108167 -0.198936 0.109216 0.179764 0.0456964 0.151654 -0.034149 -0.127749 0.0306121 0.108047 -0.0396687 0.0320497 0.0755035 -0.0178114 0.0327218 -0.0263442 -0.0236788 0.110335 -0.108846 0.112537 0.187959 -0.0249184 -0.101576 -0.203114 -0.0727751 0.0451433 0.0247512 -0.0697353 0.0633964 0.109534 -0.0669646 0.196252 -0.0323695 0.00297144 -0.0972443 -0.0278001 0.256444 -0.142598 0.150994 0.0352721 0.0559201 0.00173855 0.00806389 -0.0148636 0.036406 0.138285 -0.0664398 -0.00948623 0.0475956 0.046806 -0.0888491 0.0405118 -0.04885 -0.00612091 -0.0521545 0.0866385 -0.0763134 0.00989865 -0.0594342 0.00260698 0.0428409 -0.0718053 -0.000398977 -0.0895687 0.0233365 -0.0245191 -0.0260037 -0.04112 0.019525 -0.112968 0.0809508 0.0603512 0.0990254 0.00697172 -0.0615202 0.00238978 0.0432532 -0.018793 -0.243134 0.151246 -0.0209657 0.0965834 0.00729866 0.0468654 0.0330225 -0.031791 -0.107111 -0.144829 0.0443676 0.0316816 -0.0950656 -0.146096 0.0654161 0.0499265 0.0580054 -0.0821542 0.0213824 0.0402108 -0.0956967 0.120397 -0.0555922 0.0582529 
-0.0452488 0.110984 -0.224475 0.0157139 0.0658672 0.101108 0.0648202 -0.165175 -0.0873091 0.104489 0.00791592 0.0627533 0.0522497 0.0113376 0.0125122 -0.00550714 -0.0486799 -0.0118739 0.162948 0.0382801 -0.013122 -0.108476 -0.0364738 -0.0457494 0.0389342 0.110799 -0.126967 -0.208625 0.0774428 0.167258 0.0333441 0.150388 -0.035223 -0.134412 0.0433791 0.103029 -0.0371934 0.0185755 0.0623764 -0.0329496 0.0416886 -0.0223566 -0.00366486 0.0947292 -0.126727 0.145041 0.200504 -0.0277345 -0.0992987 -0.182534 -0.0646347 0.0214548 0.0376552 -0.0714591 0.0826116 0.101657 -0.0438252 0.182641 -0.0173422 0.0162908 -0.0792549 -0.00262804 0.229823 -0.150364 0.175713 0.0301647 0.0351681 -0.0051081 -0.00174045 -0.010179 0.0395159 0.155542 -0.0618335 0.00395598 0.0426101 0.0710746 -0.0907097 0.0469444 -0.0327112 -0.0273232 -0.0669546 0.0850601 -0.0846473 0.024976 -0.061502 -0.00158521 0.0335569 -0.0630616 -0.00355994 -0.0888423 0.0138317 0.00115699 -0.00290575 -0.0651769 0.0189644 -0.104475 0.0928429 0.0770392 0.0995721 0.00141454 -0.0594303 0.00521947 0.0516394 -0.0302282 -0.231632 0.138129 -0.0186821 0.0968068 -0.00465786 0.0787698 0.0310473 -0.0346722 -0.0752011 -0.163146 0.0290409 0.0287636 -0.0833459 -0.14644 0.0527271 0.0536047 0.0580561 -0.0789376 0.0193873 0.0329372 -0.107974 0.125255 -0.0620778 0.0536618 
-0.0381058 0.134474 -0.167343 -0.00749271 0.0684676 0.107422 0.0758808 -0.150492 -0.123202 0.104684 -0.0218459 0.0340747 0.0574716 -0.0116881 0.0613063 -0.0244079 -0.0546511 -0.0154318 0.135745 0.026759 -0.0241928 -0.0668557 -0.0546092 -0.0288348 0.0307777 0.110917 -0.140556 -0.201305 0.0762646 0.152801 0.0174136 0.158072 -0.0614172 -0.0935024 0.0735573 0.0923674 -0.00659861 0.00399341 0.050965 -0.0480034 0.068768 -0.0604583 0.0249131 0.105157 -0.124196 0.210122 0.216327 0.00945255 -0.148964 -0.174302 -0.0350206 0.0092676 0.0351815 -0.0753261 0.110658 0.0909009 -0.0628175 0.16344 0.0124478 -0.00783608 -0.0616247 0.0137405 0.178159 -0.125041 0.164818 0.0237666 0.0364354 -0.00350062 -0.00405372 -0.00878915 0.0228095 0.129166 -0.0617399 -0.00507251 0.0525081 0.0672485 -0.114128 0.0672008 0.00916827 -0.00887746 -0.0260919 0.0905574 -0.0853044 0.0138726 -0.050901 -0.0174315 0.0450573 -0.0691879 -0.0196409 -0.0244964 0.036939 0.00620794 -0.010521 -0.0859605 -0.041593 -0.0747903 0.112948 0.0760032 0.107458 -0.0300356 -0.0411573 0.0452799 0.0629415 -0.0180423 -0.248656 0.103571 -0.0555016 0.131194 -0.00662624 0.085728 0.0715464 -0.0198253 -0.11712 -0.177657 0.0213004 0.0161177 -0.101276 -0.180427 0.0297035 0.0493479 0.0877604 -0.0681023 0.0289723 0.057574 -0.0906369 0.0924164 -0.0514355 0.0157815 
-0.0351963 0.162912 -0.100516 -0.0143198 0.0346079 0.158752 0.0730716 -0.147364 -0.146312 0.112335 -0.0128646 -0.00243104 0.0539999 -0.0369289 0.0984851 -0.0128479 -0.0685923 0.00440234 0.102436 -0.0239597 -0.0309745 -0.0137896 -0.0685096 -0.00875923 0.020665 0.106338 -0.161709 -0.183961 0.116981 0.120726 0.0309196 0.18979 -0.10202 -0.0652598 0.0819042 0.0880856 -0.0214548 -0.0177543 0.0723749 -0.0146243 0.0731094 -0.0926563 -0.00214298 0.0708654 -0.0930864 0.195658 0.19872 0.0314252 -0.199244 -0.184381 -0.00876744 0.0399305 0.0507517 -0.0901363 0.0557281 0.0932836 -0.0409061 0.15857 0.018641 -0.0124387 -0.079335 0.0635163 0.158881 -0.121782 0.134142 0.0715401 0.0681787 -0.0212721 -0.0360621 0.0211519 -0.00554387 0.107822 -0.0594326 0.0332882 0.0662508 0.0200143 -0.132866 0.0325144 0.0174533 0.00714677 0.026072 0.0968893 -0.0772102 -0.02334 -0.0505019 -0.0185754 0.0418228 -0.100888 -0.0644296 0.022697 0.0738337 0.0194361 -0.0135244 -0.0487271 -0.0617609 -0.0375519 0.111202 0.0734744 0.103647 -0.0205161 -0.0103436 0.0550731 0.0348894 0.00306307 -0.220122 0.0995758 -0.0399378 0.117386 0.0158037 0.0728106 0.0864194 0.0138642 -0.113698 -0.191265 0.0387679 0.0105856 -0.122447 -0.159551 0.0482079 0.0445052 0.11571 -0.11538 0.0397127 0.0387414 -0.0763876 0.103421 -0.0428522 -0.00635068 
-0.0623579 0.131822 -0.121893 -0.0157502 0.0501844 0.124684 0.0371051 -0.158683 -0.118024 0.074241 -0.00912287 0.0497463 0.0411772 -0.0458086 0.0528132 -0.018252 -0.0937586 -0.0108168 0.130191 0.0315181 -0.00266893 -0.0370124 -0.0413908 0.0112756 0.0147891 0.135471 -0.108816 -0.228247 0.0817589 0.132753 0.0313797 0.1123 -0.0448103 -0.0771022 0.0873383 0.106095 0.000466513 0.00799219 0.0455865 -0.0121712 0.0695104 -0.0673747 0.00949056 0.115592 -0.11795 0.198261 0.24908 -0.0110447 -0.170735 -0.15926 -0.0353467 -0.0160482 0.0343305 -0.0616489 0.112594 0.108938 -0.0452805 0.166208 -0.00522376 -0.0150934 -0.0640506 0.0193547 0.195486 -0.115268 0.18196 -0.0147233 0.0533577 -0.0309429 0.000352263 0.0262244 0.00441493 0.108376 -0.069821 -0.00133686 0.0825389 0.0433833 -0.142935 0.0993936 0.009687 0.00413416 -0.0270535 0.114592 -0.0761293 0.0196149 -0.0672753 -0.00943317 0.0568197 -0.0641833 -0.0586553 -0.0134313 0.0515457 -0.00498419 -0.00292445 -0.0683938 -0.0483357 -0.0640631 0.0852893 0.0922671 0.115153 -0.0255447 -0.0550067 0.0339972 0.0277058 -0.0110223 -0.208556 0.102233 -0.0470221 0.116987 -0.0276086 0.0699297 0.0546192 -0.00629019 -0.104707 -0.177822 0.0144348 0.0381367 -0.113312 -0.200372 0.0174397 0.0575169 0.103907 -0.0612372 0.0131782 0.0400437 -0.103042 0.115545 -0.0518939 0.0262467 
-0.0629213 0.153172 -0.177074 -0.0222474 0.0431623 0.0709085 0.0480264 -0.153326 -0.103453 0.115299 0.0173316 0.0334728 0.0639664 0.00825336 0.0402515 0.0269782 -0.0498286 -0.0283276 0.139524 0.0183563 -0.00416688 -0.0613612 -0.058438 -0.0413675 0.0231846 0.150182 -0.0951433 -0.193111 0.121973 0.165772 0.0117645 0.161575 -0.0250294 -0.100477 0.0474625 0.0986029 0.00629061 0.04235 0.0750402 -0.00827348 0.0310297 -0.0549655 0.0187334 0.107932 -0.0873914 0.200595 0.228519 -0.020903 -0.153981 -0.213045 -0.0428814 0.0252264 0.00225089 -0.065171 0.0890666 0.112106 -0.0591582 0.163441 -0.0101042 0.0129902 -0.0624427 -0.0412139 0.197662 -0.10865 0.172296 0.00943304 0.0368509 -0.00217053 0.0283964 -0.00409018 0.008762 0.113895 -0.0748282 -0.00832868 0.0728124 0.0412965 -0.102284 0.10652 -0.0289681 -0.0307511 -0.0271816 0.101968 -0.0915495 0.0143361 -0.0717609 -0.00839609 0.0425086 -0.0759199 -0.0272241 -0.0474125 0.0176863 -0.0088449 -0.0295131 -0.0603134 -0.00593326 -0.0634214 0.0919876 0.0741011 0.12634 -0.0111487 -0.0783391 0.0118362 0.0375729 0.00511123 -0.226681 0.108328 -0.0509289 0.125635 0.0107607 0.0383024 0.0271733 -0.0221937 -0.125017 -0.15585 0.0393452 0.0158295 -0.0961625 -0.197713 0.0359512 0.0400615 0.0806156 -0.0387759 0.0271539 0.0638835 -0.0913519 0.0980029 -0.0629126 0.0233402 
-0.0466676 0.127624 -0.216467 -0.00355853 0.0604416 0.0806684 0.0364604 -0.173897 -0.0818147 0.105741 0.0406142 0.0534315 0.0605104 0.0251277 0.00285914 0.0343443 -0.0342271 -0.00739687 0.160868 0.0302054 0.0304161 -0.082999 -0.0459157 -0.0265965 0.0447159 0.137495 -0.0829905 -0.199646 0.12243 0.197867 0.0199201 0.130083 -0.0119768 -0.127337 0.0451455 0.102388 -0.024157 0.0291539 0.0855885 -0.0239875 -1.96116e-05 -0.0202348 0.0078279 0.115567 -0.0893323 0.147817 0.218609 -0.0317118 -0.114964 -0.209684 -0.0493293 0.034346 0.0173246 -0.0716494 0.0850847 0.117221 -0.047925 0.186016 -0.0277477 0.0106117 -0.0645899 -0.045841 0.243339 -0.120579 0.170902 0.00327852 0.0218836 -0.000415204 0.0219946 0.000915372 0.0261922 0.130104 -0.0818314 -0.0378951 0.0452585 0.0483232 -0.0837112 0.0901566 -0.0445327 -0.0262543 -0.0439373 0.108354 -0.0829472 0.0221381 -0.066632 -0.0101249 0.0281181 -0.0672436 -0.00933608 -0.0738773 0.00615667 -0.0095029 -0.0341515 -0.0346059 0.0259241 -0.0926619 0.0715664 0.0826869 0.113376 -0.00275333 -0.0593774 0.00471009 0.0356041 -0.0204576 -0.226785 0.134114 -0.0214944 0.084914 0.016565 0.0413023 0.0214002 -0.0376606 -0.0957781 -0.139502 0.0459226 0.0415588 -0.0926865 -0.16473 0.0279081 0.0475409 0.0533932 -0.0555908 0.0159463 0.0334785 -0.111803 0.134823 -0.0528557 0.0479383 
-0.0285083 0.129407 -0.228787 -0.00693132 0.0476806 0.0996953 0.0486612 -0.15881 -0.0637099 0.0856574 0.0682458 0.0528715 0.0657245 0.0226194 -0.0152778 0.0131232 -0.0478649 -0.0263759 0.140225 0.0352615 0.0355496 -0.086416 -0.0541522 -0.0210506 0.0447319 0.122146 -0.0729099 -0.185217 0.136779 0.191275 0.0330131 0.112147 -0.0288 -0.132633 0.0212829 0.0989495 -0.047699 0.0377637 0.0850963 -0.00179246 0.00576984 -0.0185474 -0.0264702 0.123787 -0.0949132 0.10575 0.194011 -0.0336602 -0.102085 -0.201995 -0.0698008 0.0627484 0.00584502 -0.0674549 0.0627794 0.110645 -0.0688652 0.216658 -0.0462821 0.00456386 -0.0920334 -0.0465024 0.283973 -0.124098 0.141054 0.019081 0.0491688 -0.0076124 0.0142121 -0.00721349 0.0334555 0.133681 -0.0696198 -0.013692 0.0562856 0.0306629 -0.0772854 0.0637092 -0.0543543 0.00191684 -0.0462823 0.0881191 -0.0688035 0.00832704 -0.0612313 -0.0022997 0.035206 -0.070402 0.0007227 -0.0917135 0.0214733 -0.0353903 -0.0368767 -0.0232137 0.0343456 -0.125417 0.0690491 0.0598136 0.109149 0.00346501 -0.0713974 0.00333854 0.0338752 -0.00902732 -0.241542 0.161047 -0.0107347 0.0952193 0.024198 0.0161749 0.0381557 -0.0239724 -0.104481 -0.116591 0.0497074 0.0473799 -0.0925518 -0.137041 0.0581164 0.0526353 0.0388771 -0.0760102 0.00831476 0.0347513 -0.106674 0.137826 -0.0526433 0.0572476 
-0.0479115 0.106829 -0.216085 0.0129838 0.0697871 0.0795814 0.0555538 -0.177819 -0.0469154 0.0779191 0.042446 0.0687484 0.0592361 0.0274092 -0.0138023 0.00495858 -0.0485144 -0.0109832 0.137491 0.0510574 0.0329158 -0.0937596 -0.0705037 -0.0196199 0.0477952 0.12418 -0.116753 -0.189186 0.113643 0.200292 0.0480189 0.130009 -0.0255468 -0.135857 0.0450895 0.116868 -0.0407242 0.0230658 0.0709963 -0.0368832 0.0311446 -0.00393207 0.00208566 0.1253 -0.0955884 0.104701 0.198796 -0.023531 -0.0684561 -0.208337 -0.0812129 0.024489 0.0196196 -0.0768802 0.0983295 0.113846 -0.0925274 0.205124 -0.0370649 0.00370483 -0.0863655 -0.0410222 0.253427 -0.11347 0.15125 0.0170864 0.0430063 -0.020965 0.012967 -0.0245959 0.049114 0.140578 -0.0489582 -0.0238356 0.0371643 0.0469367 -0.0856555 0.0663992 -0.0426731 -0.0136455 -0.0357664 0.109441 -0.0754627 0.0231229 -0.0523566 -0.0133888 0.0426192 -0.0458571 0.00180727 -0.0893486 0.0177965 -0.0150066 -0.0220259 -0.0450199 0.0164578 -0.116135 0.0616801 0.0579461 0.100573 0.00235064 -0.0677047 0.00111656 0.0455091 -0.0374786 -0.242784 0.161099 -0.0107292 0.082488 0.0241895 0.0607048 0.0282385 -0.0432665 -0.11901 -0.125769 0.0328424 0.0406287 -0.0792487 -0.142766 0.0296362 0.0427952 0.0416181 -0.0540607 0.00585125 0.0338325 -0.125819 0.137655 -0.055118 0.0571495 
-0.0427328 0.113779 -0.208438 0.0238776 0.0593498 0.0717454 0.06701 -0.172415 -0.063669 0.088073 0.0435555 0.0708355 0.0600825 0.0307929 -0.00225616 0.000935468 -0.0277975 -0.0189981 0.148415 0.049821 0.0132347 -0.0937564 -0.0795664 -0.0267733 0.0463695 0.131253 -0.123837 -0.180862 0.116542 0.193977 0.0425889 0.155745 -0.0306178 -0.13296 0.0342283 0.109776 -0.0312265 0.0325929 0.0804567 -0.0315458 0.0372071 -0.00728346 0.00089253 0.103106 -0.0962627 0.111103 0.196271 -0.036022 -0.0755314 -0.219596 -0.0689902 0.0382235 0.0166599 -0.0727464 0.0936615 0.110677 -0.0928973 0.200533 -0.0343705 0.0186908 -0.0892247 -0.0453484 0.238459 -0.130218 0.155764 0.0310539 0.0543294 -0.0290156 0.00480306 -0.0313409 0.0442769 0.140846 -0.0492145 0.00148091 0.0435226 0.0445391 -0.0734936 0.064101 -0.0423536 -0.015558 -0.045824 0.0993142 -0.0720889 0.0157798 -0.0411324 -0.0216096 0.0449378 -0.0559177 -0.00205458 -0.096517 0.0117453 -0.0112015 -0.0127535 -0.0400745 0.0195114 -0.116223 0.0834294 0.0465398 0.10284 0.00419363 -0.0836791 0.00796987 0.0456016 -0.0175448 -0.243769 0.160171 -0.00229556 0.0894406 0.0298595 0.0525788 0.0204883 -0.0429644 -0.121131 -0.128944 0.0380224 0.0210594 -0.0751494 -0.151538 0.0399047 0.039754 0.0402588 -0.0546988 0.0082157 0.0365146 -0.105911 0.133186 -0.0526709 0.0485918 
-0.0328939 0.109014 -0.215501 0.00496706 0.0689186 0.116624 0.064605 -0.157294 -0.0450901 0.0759551 0.0609761 0.0571061 0.0689273 -0.000285239 -0.0211653 -0.00838587 -0.0725095 0.000473801 0.0970184 0.0611996 0.0443562 -0.103234 -0.0511711 -0.00311717 0.0413057 0.0975283 -0.118574 -0.194404 0.12976 0.169936 0.0582787 0.115373 -0.0517778 -0.124761 0.0350758 0.113301 -0.0694252 0.0337952 0.0562042 -0.0266436 0.044498 -0.0181511 -0.0381598 0.137421 -0.119647 0.072784 0.183791 -0.000432382 -0.0819621 -0.180511 -0.0934761 0.0404661 -0.000444621 -0.0810266 0.075427 0.100715 -0.0866503 0.218473 -0.0423769 -0.017939 -0.104804 -0.02302 0.287964 -0.111161 0.131255 0.0224999 0.0545431 -0.0147987 0.00138026 -0.00209449 0.0492828 0.151733 -0.0419877 0.00293631 0.0414852 0.0222225 -0.0972755 0.0626259 -0.0370492 -0.00217346 -0.0448014 0.101558 -0.0709728 0.00640386 -0.0587576 0.00374272 0.0488689 -0.0361193 0.0112267 -0.0909983 0.0516832 -0.0301931 -0.0289625 -0.0521153 0.0165714 -0.14373 0.0528876 0.060433 0.0895465 -0.00432602 -0.0537864 -0.00199867 0.0428496 -0.0266581 -0.233957 0.17241 -0.0113942 0.0972882 0.0413882 0.0458085 0.0417737 -0.0051066 -0.111331 -0.112932 0.0440425 0.0428183 -0.0886655 -0.131367 0.055755 0.0588833 0.0394117 -0.0750843 0.000625999 0.0454874 -0.135218 0.134673 -0.0585381 0.0649003 
0.0205789 0.0929601 -0.17256 -0.0418165 0.118048 0.16264 0.0567148 -0.105793 -0.106147 0.0427725 0.0494937 0.0611371 0.0965454 -0.0106509 0.0173852 -0.0292277 -0.0460756 0.0221069 0.0347019 0.112757 0.0656625 -0.0630284 0.0240969 0.0306041 0.0211187 0.0626239 -0.0981158 -0.191771 0.132917 0.116224 0.057605 0.0869243 -0.066936 -0.0482909 0.0240169 0.108176 -0.0679653 0.0811568 0.0295045 -0.0199679 0.0545838 -0.00316103 -0.0622854 0.13805 -0.184698 0.0725766 0.18745 0.0283711 -0.126248 -0.0852934 -0.0832761 0.0293728 -0.0568286 -0.0530119 0.0677571 0.0572519 -0.0735731 0.247986 -0.0527252 -0.0399737 -0.119711 0.00729319 0.296552 -0.139754 0.133866 -0.023694 0.0426499 0.0261972 -0.0413207 0.0621739 0.0585653 0.151492 -0.0543964 0.0261291 0.0309495 0.00753937 -0.0944459 0.0682197 0.00525917 -0.00044008 -0.0642021 0.0924407 -0.0472479 -0.0108772 -0.0579505 -0.0198824 0.0671415 -0.00962365 0.00972899 -0.0487706 0.107575 -0.0720443 -0.0401972 -0.0446416 0.0276646 -0.161154 0.049019 0.101147 0.0447737 -0.028652 -0.0711445 0.0190357 0.0120529 0.0424771 -0.225496 0.164443 -0.0564733 0.114742 0.0721862 -0.00714162 0.0525283 0.0581815 -0.117505 -0.0375073 0.0583235 0.0389787 -0.0899129 -0.168891 0.0576021 0.12198 0.048527 -0.0608617 -0.00288241 0.0774183 -0.119643 0.0889377 -0.0404898 0.0347213 
0.0173735 0.0994185 -0.16455 -0.0422472 0.101332 0.15254 0.05848 -0.112742 -0.110327 0.0467263 0.0573277 0.0617886 0.0966427 -0.00699087 0.018856 -0.0377676 -0.0525501 0.0125791 0.0467972 0.103109 0.0584873 -0.057318 0.0140556 0.0302754 0.0218221 0.075747 -0.0887882 -0.191684 0.137456 0.124764 0.0496319 0.0817854 -0.0681512 -0.0551143 0.0224309 0.100062 -0.065253 0.0867434 0.0420275 0.00184982 0.052703 -0.00968722 -0.0734924 0.136105 -0.182489 0.0825755 0.188794 0.0144989 -0.125019 -0.100322 -0.0710331 0.0500159 -0.0561713 -0.0472132 0.0656997 0.057862 -0.062499 0.246003 -0.0560416 -0.0292362 -0.114327 -0.0054201 0.291354 -0.128995 0.131343 -0.0336099 0.0587875 0.0213782 -0.0291368 0.0606692 0.0584566 0.151286 -0.0550979 0.0328934 0.0445074 0.00488337 -0.105812 0.0712186 0.000547109 0.0179262 -0.0658593 0.0901944 -0.035888 -0.00538533 -0.0567131 -0.0249782 0.0758851 -0.0204848 -0.00189635 -0.064917 0.0928919 -0.0692769 -0.0257439 -0.0449826 0.0128962 -0.176319 0.0555031 0.0928661 0.0621768 -0.0321113 -0.0771707 0.0314568 0.01506 0.0543963 -0.221188 0.155907 -0.049966 0.127115 0.0711995 -0.0119292 0.0540835 0.050611 -0.12794 -0.0437324 0.0495625 0.0476683 -0.0948035 -0.173766 0.0522315 0.117366 0.0476538 -0.0619234 -0.0155569 0.0710226 -0.114775 0.0936883 -0.0446451 0.0469211 
-0.00285802 0.0970098 -0.205708 -0.0176998 0.0966124 0.13023 0.0517723 -0.142707 -0.0912086 0.0504042 0.0587399 0.0699556 0.0847623 0.00756501 -0.00913757 -0.00796413 -0.0340682 0.00477229 0.0921352 0.0809815 0.0596039 -0.0695904 -0.0349787 0.0060303 0.0364116 0.104103 -0.10211 -0.190154 0.134639 0.163258 0.0591506 0.116182 -0.0600116 -0.0948343 0.0265335 0.114076 -0.0616611 0.0389688 0.0709138 -0.0120234 0.0443553 0.00358514 -0.0345477 0.137058 -0.131106 0.0810187 0.200613 -0.00338834 -0.105003 -0.16242 -0.0804109 0.0317255 -0.0241974 -0.0671059 0.0622541 0.0839059 -0.0848036 0.240943 -0.0505683 -0.00825834 -0.100122 -0.0113232 0.286785 -0.128958 0.134916 -0.00958342 0.060067 0.00131054 -0.00299604 0.0125531 0.0531793 0.146971 -0.0524842 0.00435886 0.0313627 0.0187289 -0.0900348 0.0687536 -0.0330499 0.0021707 -0.0499202 0.110079 -0.0555965 0.00175538 -0.0601266 -0.00823821 0.0629488 -0.0414233 -0.00956623 -0.0876741 0.0671445 -0.0414556 -0.0420857 -0.0299075 0.0305681 -0.140007 0.0592147 0.0756164 0.0625425 -0.00995048 -0.0843383 0.00818805 0.0268516 0.020402 -0.241047 0.170453 -0.0317289 0.109409 0.0382024 0.0188577 0.0411584 -0.00141098 -0.127352 -0.0788973 0.0432756 0.0376921 -0.0987254 -0.161985 0.0479258 0.0755813 0.0369158 -0.0574754 0.00157838 0.0492321 -0.125286 0.111566 -0.0638583 0.0446955 
-0.00185594 0.0957398 -0.22331 -0.00613472 0.0976035 0.118125 0.042208 -0.159177 -0.065855 0.0595583 0.0628858 0.0669044 0.0804282 0.00980093 -0.0151397 0.00118135 -0.0374918 0.0117856 0.100973 0.0925084 0.0612206 -0.0850169 -0.00658651 0.00782972 0.0458903 0.0961948 -0.0860327 -0.205344 0.123716 0.178226 0.0565398 0.106465 -0.0299379 -0.105154 0.0334257 0.111159 -0.0586801 0.0595757 0.0605969 -0.0301626 0.021537 0.00349624 -0.0373878 0.14362 -0.145554 0.0804236 0.20102 -0.000936794 -0.0877715 -0.146548 -0.0766922 0.039278 -0.00898161 -0.0669821 0.0792334 0.0807487 -0.0667022 0.223184 -0.0444002 -0.0238204 -0.105595 -0.0348342 0.295233 -0.130466 0.141344 -0.015687 0.0397485 0.0100405 -0.00772987 0.0213071 0.0525578 0.149718 -0.0644217 -0.0154553 0.028316 0.022627 -0.0881788 0.0701319 -0.0351181 0.00806563 -0.0551526 0.107095 -0.0647321 0.00556725 -0.050513 -0.011781 0.0409841 -0.031172 0.00975997 -0.0864729 0.0521188 -0.0370894 -0.0449988 -0.0376626 0.0354954 -0.151354 0.0505733 0.0926111 0.0743919 -0.0232138 -0.0636464 0.00322284 0.0365415 -0.00209016 -0.23595 0.160876 -0.0244999 0.0925156 0.059419 0.0256448 0.0356193 0.0063605 -0.109974 -0.0826909 0.0477828 0.047616 -0.0939049 -0.158728 0.0418482 0.0862019 0.0387441 -0.0537798 0.00337038 0.0495305 -0.127901 0.117124 -0.0402582 0.0611047 
-0.0382214 0.124532 -0.168638 0.0405148 0.0876437 0.0861547 0.0765809 -0.174218 -0.105653 0.145123 0.0334205 0.0962178 0.0475378 -0.00932948 0.0290113 -0.0120411 -0.000468356 0.0369784 0.16166 0.0594238 -0.0119425 -0.0877855 -0.0512449 0.0282631 0.0472602 0.110427 -0.118886 -0.190501 0.11559 0.181374 0.0258512 0.14772 -0.0289609 -0.105237 0.0451692 0.0912049 -0.0226852 0.0139788 0.0780784 -0.0248536 0.049707 -0.023593 -0.00483362 0.073684 -0.143974 0.127725 0.20671 -0.0315084 -0.0897083 -0.189234 -0.00248151 0.0585241 -0.00234104 -0.0846316 0.10158 0.111492 -0.0445672 0.181312 -0.0337525 0.055138 -0.0898271 -0.0400887 0.209402 -0.162377 0.188339 -0.0142091 0.0295651 -0.0425712 -0.0471306 0.0285082 0.0373398 0.165805 -0.0748423 0.024257 0.0433086 0.0618949 -0.0637057 0.112999 -0.0149732 -0.0436721 -0.0868663 0.10927 -0.0475763 0.045067 -0.0334061 -0.0408885 0.0473508 -0.0469963 -0.00917065 -0.0730261 -0.00766825 0.00761931 0.0097428 -0.030822 0.0138728 -0.133299 0.0873334 0.0572107 0.10357 -0.0186344 -0.0624338 0.0315868 0.0329016 0.00770076 -0.196765 0.134947 0.00881603 0.0699224 0.0487768 0.0676403 0.00494276 -0.0196936 -0.0745687 -0.121438 0.0320728 0.010289 -0.0688108 -0.169543 0.0195264 0.0823821 0.0623337 -0.0675287 -0.0158624 0.0284731 -0.101238 0.158495 -0.0497921 0.036103 
0.0346365 0.113909 -0.17318 -0.0189957 0.108423 0.104321 0.0638838 -0.13764 -0.0764479 0.0905584 0.0867588 0.0717724 0.0916218 0.0264557 0.0203196 -0.00375512 -0.0038176 0.0330504 0.0551 0.0826506 0.0631965 -0.0352293 0.0181705 0.0490884 0.0457811 0.0652162 -0.0576941 -0.171129 0.150672 0.183359 0.0286791 0.0790693 -0.0450821 -0.0705492 0.0141659 0.0815885 -0.0622521 0.108753 0.0627929 0.0332036 -0.00763397 0.0315279 -0.0796206 0.127498 -0.173393 0.0824661 0.166516 -0.000912808 -0.0628484 -0.115243 0.00994456 0.119283 -0.0880537 -0.0600044 0.0721076 0.0578621 -0.0441895 0.239648 -0.0456925 0.0130733 -0.11871 -0.0941119 0.265282 -0.130158 0.126768 -0.0937864 0.0373737 0.0451481 -0.0345808 0.0836853 0.0978616 0.189927 -0.0630431 0.00399231 0.0209204 0.0166698 -0.090036 0.0972222 -0.028516 0.0207222 -0.0522731 0.0954443 -0.0118305 0.0128503 -0.0459422 -0.0570225 0.0680032 -0.029634 0.00684953 -0.0912467 0.00384824 -0.0629115 -0.0346038 -0.0337042 0.0280218 -0.197157 0.0509984 0.0630171 0.0848703 -0.0360549 -0.0737856 0.0519368 0.025896 0.0749033 -0.21922 0.117247 -0.046249 0.0872124 0.130587 -0.0201154 0.0381236 0.0456574 -0.125419 -0.00558328 0.0573084 0.0624659 -0.0786562 -0.157034 0.0103193 0.127315 0.0358775 -0.0293591 -0.028912 0.0674702 -0.0905142 0.106581 -0.0273794 0.055097 
0.0699011 0.0892639 -0.17943 -0.0411608 0.14254 0.118125 0.0566268 -0.121258 -0.125727 0.0404674 0.0615347 0.0973207 0.106464 -0.00442794 -0.0312527 -0.00383689 -0.0090814 0.0343839 0.0180764 0.130527 0.103584 -0.0437797 0.0124381 0.051406 0.0388939 0.0759334 -0.054685 -0.172413 0.126306 0.179158 -0.0075248 0.0749612 -0.077402 -0.0321142 0.00616931 0.0471978 -0.0679011 0.0957331 0.0738716 -0.0107977 0.0116117 0.0165356 -0.0293241 0.143608 -0.168669 0.0822057 0.189989 0.0119204 -0.106076 -0.0697836 0.0120741 0.0695956 -0.099016 -0.0304918 0.0962376 0.0127241 -0.0513782 0.237942 -0.0421197 -0.0369646 -0.0682399 -0.0602729 0.273209 -0.0993201 0.0983757 -0.109927 0.0115732 0.0635518 -0.0133503 0.0544926 0.0813637 0.168128 -0.0540677 -0.00797917 0.00252237 0.0252113 -0.0766364 0.0987503 -0.00366891 0.0503551 -0.04318 0.100089 0.00499511 0.0103694 -0.0554866 -0.0501891 0.0827397 0.00588578 0.0230376 -0.0704725 0.0317777 -0.0823967 -0.0567944 -0.0151701 -0.0123196 -0.186273 0.0558677 0.0838962 0.0548069 -0.0719387 -0.0613754 0.0571163 0.0178585 0.120364 -0.222367 0.108899 -0.0825183 0.155314 0.0803755 -0.0294768 0.064949 0.0556003 -0.155462 0.031229 0.0412952 0.0552174 -0.11536 -0.153464 -0.00789653 0.120572 0.00809835 0.00348269 -0.00605422 0.0530329 -0.101709 0.077674 -0.0439217 0.0169492 
0.0675723 0.0739109 -0.172967 -0.0456069 0.139266 0.134969 0.0587367 -0.0997266 -0.121446 0.0158144 0.048564 0.0881494 0.114062 -0.0289505 -0.0445963 -0.00575304 -0.0499154 0.0202519 -0.0200776 0.138734 0.128887 -0.0708356 0.00834631 0.0485892 0.03999 0.0633329 -0.0765644 -0.177162 0.106879 0.153088 -0.000211298 0.0658022 -0.105589 -0.0157883 0.00147747 0.047506 -0.0930145 0.0883128 0.0577771 -0.0293784 0.0347923 -0.00341554 -0.0200626 0.154071 -0.15455 0.0556272 0.185659 0.0279776 -0.118265 -0.0517608 -0.0113017 0.0330808 -0.102341 -0.0254025 0.106175 0.000123269 -0.0756519 0.238212 -0.0382704 -0.0761422 -0.0579133 -0.0351673 0.279873 -0.0787304 0.0841611 -0.0849885 0.00671996 0.0698099 -0.00558125 0.0342 0.0719967 0.17038 -0.0408273 -0.00412337 0.00170224 0.0204878 -0.0812022 0.0786077 0.00926384 0.0731261 -0.0366462 0.0819564 0.00329138 -0.00541886 -0.0818385 -0.0277882 0.0952225 0.0243663 0.0380343 -0.0647019 0.0550903 -0.0952221 -0.0644867 -0.0233832 -0.0397385 -0.171983 0.0476869 0.0801259 0.0413234 -0.0735153 -0.0512447 0.040187 0.0128952 0.114138 -0.219777 0.118193 -0.104181 0.188651 0.0592083 -0.031076 0.075347 0.0697261 -0.16992 0.0278021 0.0496674 0.0606778 -0.127581 -0.128268 0.0030768 0.11753 0.00165339 0.00655564 0.00679244 0.0612348 -0.110866 0.0665264 -0.0501655 0.0104146 
0.0396643 0.0959348 -0.172867 -0.0629591 0.107701 0.132001 0.0323749 -0.0967476 -0.0879937 0.0489142 0.0718656 0.0443198 0.10532 -0.0289751 0.0129849 -0.00152788 -0.0518727 -0.0146695 0.019908 0.112551 0.0933801 -0.0519471 0.0140823 0.0367391 0.0356653 0.0915133 -0.0509651 -0.19897 0.135503 0.119678 0.0465855 0.0400184 -0.071621 -0.0402646 0.0178857 0.0871302 -0.0614691 0.107402 0.0554173 -0.00388376 0.0307676 -0.00891625 -0.0657982 0.168654 -0.150421 0.083987 0.185904 0.0349455 -0.116364 -0.0916461 -0.0508435 0.0478543 -0.0840971 -0.045509 0.0816123 0.0292972 -0.0748691 0.231925 -0.0404628 -0.0703838 -0.0921911 -0.0576308 0.286255 -0.0864773 0.10535 -0.0701991 0.0393669 0.0688818 0.0241059 0.0395607 0.0614986 0.160731 -0.0586941 -0.0123036 0.0409462 -0.00885146 -0.11604 0.118823 0.00441207 0.0673936 -0.0411891 0.0849049 -0.020255 -0.00676705 -0.0649621 -0.0287392 0.0874662 0.00753289 0.025473 -0.0740447 0.0686422 -0.0704897 -0.0556447 -0.0342712 -0.0148181 -0.181207 0.0513794 0.0760185 0.0531372 -0.068612 -0.070277 0.0205901 0.0140527 0.0560458 -0.225954 0.125412 -0.0810554 0.143691 0.0916682 -0.0253316 0.0723425 0.072142 -0.155954 -0.00946818 0.0660449 0.0565346 -0.137208 -0.171578 0.0085986 0.103166 0.0323847 -0.0058163 0.00179883 0.0950465 -0.111849 0.0647603 -0.0428446 0.0417854 
-0.00362536 0.0694402 -0.16432 0.0105644 0.0917238 0.100492 0.0294095 -0.165681 -0.0836482 0.0856452 0.0701 0.0753054 0.0669022 -0.00849477 0.037766 0.0139757 -0.0216083 0.0190498 0.138676 0.082729 0.0523976 -0.0418043 -0.0197301 0.0388213 0.0469661 0.142709 -0.089313 -0.235202 0.125931 0.165555 0.0599819 0.0910153 -0.0406349 -0.0978133 0.0618651 0.123081 -0.0379225 0.052934 0.0900155 -0.0049599 0.0274137 0.0163764 -0.0615543 0.121375 -0.141769 0.091309 0.206035 -0.0156691 -0.0652165 -0.175426 -0.0356774 0.0309458 -0.0129759 -0.069048 0.0912466 0.0836925 -0.0412215 0.206138 -0.0402299 0.0117972 -0.0885801 -0.067557 0.251819 -0.120565 0.166749 -0.0574688 0.0603387 -0.000851395 0.0225845 0.0260027 0.0537236 0.174306 -0.0658977 -0.0200108 0.028618 0.00692483 -0.1193 0.120554 -0.0205319 0.0278618 -0.0422986 0.127523 -0.0413785 0.0140141 -0.0397006 -0.0445923 0.0733707 -0.0238372 -0.0244608 -0.104498 0.0293951 0.011545 -0.0206193 -0.0221815 -0.00326868 -0.159555 0.0617351 0.0678047 0.0849069 -0.0265553 -0.074826 0.0132572 0.0236708 -0.0109368 -0.199751 0.129883 -0.000885978 0.0560315 0.0777337 0.0544115 0.021557 -0.00271289 -0.107713 -0.102542 0.0483408 0.0519739 -0.106758 -0.189198 -0.0295995 0.0629839 0.0444188 -0.0329711 -0.00709354 0.0468035 -0.117926 0.135969 -0.0401451 0.0703095 
0.0155496 0.0703303 -0.184723 -0.00970148 0.0989724 0.107356 0.0443915 -0.154632 -0.0920078 0.0516479 0.0671968 0.0887311 0.0858192 0.0277382 -0.00137735 -0.00931588 -0.0197444 0.0198651 0.107593 0.0948639 0.0712477 -0.0480097 -0.0120558 0.0433179 0.0367497 0.112028 -0.0699259 -0.204556 0.118519 0.185159 0.0325441 0.0755261 -0.0445239 -0.0935529 0.0364208 0.11011 -0.0580486 0.0699551 0.0602443 -0.000845339 0.0132392 0.0339159 -0.0505924 0.139764 -0.159533 0.0897084 0.203399 -0.0210248 -0.0777814 -0.141458 -0.0342421 0.0392147 -0.0359984 -0.0509569 0.100178 0.0767492 -0.0576224 0.244974 -0.0410546 -0.000756771 -0.0891585 -0.0542517 0.277757 -0.121624 0.150566 -0.0675905 0.0495035 0.0118508 0.00267321 0.0428236 0.0766487 0.166236 -0.0557728 -0.0196764 0.0221404 0.0292395 -0.0990774 0.0938541 -0.0248161 0.0148842 -0.0485859 0.110388 -0.0375025 0.00479624 -0.0590492 -0.0417876 0.0721316 -0.030427 -0.0103448 -0.0951556 0.0296876 -0.0383566 -0.0293095 -0.0351841 0.0147071 -0.164226 0.0581014 0.0776917 0.0893326 -0.0240761 -0.0800862 0.0355245 0.033737 0.0220057 -0.235241 0.140997 -0.0358583 0.0812719 0.0569509 0.0107786 0.0429477 0.00491659 -0.121066 -0.0682581 0.0400086 0.0644516 -0.0884882 -0.174529 -0.00476592 0.0887853 0.0263745 -0.0395223 -0.0109647 0.0419734 -0.115228 0.129112 -0.0414913 0.0600239 
-0.00688008 0.0547129 -0.166347 0.0177381 0.0815602 0.120772 0.0572957 -0.12629 -0.0809879 0.0682972 0.0688663 0.0857492 0.0873888 -0.011581 -0.0124232 -0.0161088 -0.0550696 0.0354067 0.0852017 0.103783 0.0908512 -0.109252 -0.00975485 0.0778741 0.0452683 0.0845976 -0.093009 -0.234152 0.111294 0.15842 0.0562245 0.0665875 -0.0585785 -0.084052 0.0308005 0.11145 -0.0944724 0.0623455 0.0224282 -0.0284873 0.0334424 -0.00677327 -0.0676299 0.154934 -0.156315 0.041925 0.196834 -0.00895988 -0.0858727 -0.140716 -0.0430664 0.010746 -0.0306009 -0.072666 0.106218 0.0907442 -0.0724044 0.237803 -0.0174904 -0.0301493 -0.0908258 -0.0457926 0.27523 -0.117046 0.154973 -0.0457753 0.0426517 -0.0116168 -0.0164841 0.0436039 0.0498725 0.178633 -0.0538188 -0.0157465 0.0167319 0.010167 -0.0917703 0.111255 -0.010218 0.0301305 -0.0793024 0.0814041 -0.0507413 -0.0148624 -0.0717766 -0.0282053 0.0802628 -0.0119181 0.0113985 -0.0966854 0.0402977 -0.0311088 -0.0230847 -0.0535525 -0.0048307 -0.153633 0.040917 0.0723884 0.085872 -0.0246194 -0.056128 0.0183839 0.0297347 0.00222424 -0.202994 0.148481 -0.0326637 0.0854979 0.0651857 0.00831382 0.0195417 0.0384085 -0.108911 -0.100112 0.0594998 0.0670967 -0.0834292 -0.160486 0.0147688 0.105002 0.0175656 -0.0552548 -0.0284505 0.0510398 -0.133462 0.146708 -0.0448066 0.061152 
-0.0235652 0.0734557 -0.15416 -0.0178842 0.0801625 0.113913 0.0141791 -0.138225 -0.108274 0.0669466 0.0523835 0.05872 0.0923925 -0.0205278 0.0243662 0.00765573 -0.0591277 0.0045626 0.10507 0.105545 0.076226 -0.0847283 0.00127246 0.0407021 0.0375482 0.130223 -0.0949883 -0.245389 0.115286 0.134796 0.0642279 0.0658607 -0.0447973 -0.0788179 0.0539389 0.126945 -0.0578174 0.0695108 0.0555644 -0.0230297 0.0304542 -0.0169234 -0.0503346 0.136465 -0.133036 0.0987469 0.228256 0.00190352 -0.119106 -0.151255 -0.0711446 -0.014625 -0.012297 -0.0642181 0.089734 0.0820298 -0.0583021 0.213629 -0.0295761 -0.0365618 -0.0799008 -0.0255853 0.258845 -0.105304 0.167591 -0.0319812 0.0429911 0.0119789 0.0146005 0.00961688 0.0318793 0.154086 -0.067743 -0.0304154 0.0470537 0.00821991 -0.121626 0.114961 0.00886913 0.0453293 -0.060556 0.0904417 -0.0653654 -0.00129304 -0.0839378 -0.0183994 0.0703521 -0.0119769 -0.00707451 -0.0868508 0.054954 -0.0055489 -0.0147348 -0.0311294 -0.0232925 -0.138329 0.049431 0.0991889 0.0737853 -0.0384879 -0.0718147 -0.000385644 0.0096001 -0.00890632 -0.197175 0.145759 -0.0338249 0.100455 0.0602974 0.0246876 0.0243271 0.0233378 -0.119366 -0.109094 0.0490021 0.0649301 -0.129443 -0.178188 -0.0112153 0.0854448 0.0294766 -0.0413754 -0.0135616 0.0593897 -0.138143 0.129422 -0.0588563 0.0535295 
-0.023324 0.0715133 -0.135559 -0.00227068 0.062827 0.0994968 0.00799372 -0.148285 -0.119228 0.091938 0.0619948 0.0678197 0.101739 -0.0362099 0.0113424 0.00336918 -0.0652217 0.0304639 0.0983007 0.110942 0.0761314 -0.0867829 0.0192635 0.0754733 0.0381733 0.126282 -0.0736647 -0.261661 0.105117 0.150331 0.0460686 0.0561346 -0.0443697 -0.0761331 0.050153 0.0982971 -0.0734899 0.0830544 0.0516803 0.000722008 0.0103002 -0.0432089 -0.0749333 0.155095 -0.149189 0.0932301 0.226588 0.0034376 -0.104744 -0.139268 0.00330064 0.013668 -0.0253224 -0.0682031 0.0889584 0.0676936 -0.0191181 0.187394 0.00604613 -0.0329337 -0.0619198 -0.056979 0.229274 -0.0744201 0.156108 -0.101147 0.0455002 0.0116561 0.0192945 0.0339021 0.0276408 0.159564 -0.0701705 -0.0348074 0.0419164 -0.00376153 -0.13946 0.14342 0.00786287 0.0941268 -0.0618591 0.0726129 -0.043326 0.00637539 -0.0829604 -0.0335189 0.0853896 -0.0146382 -0.0138506 -0.10458 -0.00065822 0.00382833 0.00101971 -0.0369142 -0.0676906 -0.158227 0.0426281 0.0982687 0.0949874 -0.0695824 -0.0476119 0.0358185 0.0170918 0.0329282 -0.153548 0.0955992 -0.0416147 0.122821 0.082783 0.0211229 0.0103665 0.0467299 -0.120056 -0.101847 0.0236181 0.081844 -0.133596 -0.176624 -0.0346656 0.100831 0.0212629 -0.0322206 -0.0436992 0.0432973 -0.133399 0.131613 -0.0670794 0.0677648 
-0.0511712 0.0877035 -0.115627 0.00182386 0.0469368 0.0972186 0.0392253 -0.134598 -0.102015 0.133736 0.0735538 0.0698315 0.0846817 -0.0492276 0.0331079 -0.00291271 -0.0787088 0.0288356 0.103238 0.0866826 0.0367692 -0.0849222 0.00429361 0.0493992 0.0151811 0.143929 -0.0851561 -0.246878 0.137588 0.114871 0.0495835 0.0769524 -0.0397165 -0.0862758 0.0496996 0.100838 -0.0635255 0.0993964 0.0563473 0.0190122 0.0349107 -0.053122 -0.103337 0.12656 -0.164545 0.0804192 0.202955 -0.00826268 -0.101127 -0.170086 -0.01983 0.0420024 -0.0463492 -0.0702328 0.0704702 0.0880152 -0.0190488 0.183827 -0.0311107 0.00876585 -0.0961224 -0.0740476 0.242046 -0.0907967 0.184265 -0.0628754 0.0565702 -0.0126198 0.00482805 0.0492184 0.0261988 0.16702 -0.063065 0.0212366 0.061942 -0.0168785 -0.133839 0.14786 0.00187256 0.0374658 -0.0809427 0.0724181 -0.0405542 0.0159515 -0.0770272 -0.0425747 0.0960394 -0.00442681 -0.00971768 -0.103724 0.0130881 0.00669405 0.0152093 -0.0361865 -0.044306 -0.170352 0.0535827 0.0721185 0.10385 -0.0377367 -0.0645937 0.020256 0.00240996 0.0159132 -0.129081 0.113071 -0.00256789 0.0991382 0.108986 0.0187255 -0.0147643 0.0516118 -0.0973179 -0.109036 0.0529523 0.0551438 -0.105712 -0.175608 -0.0011106 0.0932769 0.042889 -0.0587817 -0.0413661 0.0510179 -0.112624 0.148908 -0.0593475 0.0749728 
-0.0301614 0.0602033 -0.147091 0.00689834 0.0874823 0.105672 0.040549 -0.139441 -0.0731232 0.0868915 0.065528 0.0723684 0.0814255 -0.0219308 0.0228372 0.00403866 -0.071221 0.0283571 0.0885082 0.0953769 0.0713708 -0.0914065 0.0109498 0.0445621 0.0453705 0.113894 -0.0924776 -0.24516 0.111645 0.131564 0.0648837 0.0612358 -0.0388563 -0.0896138 0.0533269 0.117282 -0.0755908 0.0850367 0.0384795 -0.0200474 0.043235 -0.00840585 -0.0714864 0.146797 -0.170816 0.0656369 0.198518 -0.00553093 -0.0803934 -0.155532 -0.0502961 0.00192424 -0.0348346 -0.0718638 0.0981024 0.0834833 -0.053306 0.212498 -0.0313905 -0.0190414 -0.0986073 -0.0660484 0.261421 -0.0971053 0.180522 -0.0435085 0.0304872 0.0154421 0.00924355 0.0448673 0.0599688 0.186184 -0.0518014 -0.0231434 0.0366416 0.0110278 -0.130903 0.122654 -0.0103039 0.0280705 -0.0712733 0.0905967 -0.0448905 0.00539485 -0.0846554 -0.0297152 0.0915272 0.010213 -0.00283749 -0.101585 0.0320841 -0.0120861 -0.0188423 -0.0542598 -0.0257552 -0.16305 0.0374654 0.0778081 0.0834062 -0.0366907 -0.064171 -0.00102274 0.026476 -0.0187891 -0.1758 0.131567 -0.026086 0.087558 0.0933958 0.0206723 0.0111107 0.0385309 -0.106887 -0.0981692 0.0669883 0.0606833 -0.113414 -0.162012 -0.00939283 0.0963596 0.0379748 -0.0371851 -0.0279876 0.0615672 -0.123377 0.141538 -0.0435381 0.0772401 
-0.0347697 0.0759576 -0.155582 0.00657433 0.0843734 0.0916214 0.0283457 -0.165203 -0.0843126 0.0953489 0.0657951 0.0640661 0.0828679 -0.00295198 0.0179773 0.0151288 -0.0577569 0.0388117 0.106931 0.0939713 0.0655197 -0.0923736 0.0219484 0.0321417 0.0441267 0.117363 -0.0904441 -0.239276 0.121076 0.15092 0.0539539 0.0731992 -0.0201781 -0.103347 0.0596278 0.117784 -0.0702806 0.0872648 0.0470084 -0.0220981 0.0143232 -0.00783093 -0.0633526 0.140191 -0.16487 0.0966998 0.207061 -0.00193278 -0.0882227 -0.16051 -0.0449857 0.0213054 -0.0236975 -0.0745654 0.0883299 0.0834735 -0.0296896 0.197996 -0.0252093 -0.00754651 -0.0909314 -0.0594683 0.255673 -0.0938544 0.182131 -0.0504776 0.0206696 0.0165277 0.00589824 0.0495721 0.0572003 0.169806 -0.0606103 -0.0324967 0.0361033 0.0125564 -0.126587 0.120195 -0.0127466 0.021071 -0.0659078 0.091955 -0.0609659 0.0129151 -0.0805315 -0.0290362 0.0667014 -0.00405275 -0.0089039 -0.095325 0.0226523 0.000696706 -0.0130044 -0.0487548 -0.0167567 -0.16118 0.0357587 0.101366 0.0934582 -0.0406108 -0.0531399 0.0103427 0.0280563 -0.0176949 -0.171249 0.128032 -0.0160535 0.0875926 0.108469 0.0257047 0.00422912 0.0257285 -0.0982109 -0.100838 0.0554209 0.066083 -0.10787 -0.162942 -0.00997542 0.0981204 0.0334928 -0.042904 -0.032668 0.0527706 -0.129659 0.146405 -0.0415231 0.0780101 
-0.035418 0.0619365 -0.153088 0.00769314 0.0855982 0.10004 0.0200789 -0.158211 -0.0914985 0.0935327 0.0553212 0.066625 0.0832181 -0.0124405 0.0297474 0.0129661 -0.0572585 0.0310705 0.121654 0.097157 0.0682122 -0.0971471 0.0182504 0.0330259 0.0502308 0.123951 -0.0951946 -0.25458 0.102446 0.145832 0.0612922 0.0697212 -0.0175907 -0.0977861 0.0675111 0.123511 -0.0646846 0.0716144 0.0469579 -0.0402188 0.024187 -0.0166794 -0.0529911 0.137507 -0.160442 0.096938 0.213018 -0.00269983 -0.0934317 -0.161224 -0.0474323 -0.00404203 -0.0038753 -0.0757695 0.0987093 0.0875182 -0.0359837 0.189661 -0.0242637 -0.0162981 -0.0845539 -0.0503227 0.246198 -0.0995223 0.192649 -0.0401165 0.016884 0.0179405 0.00805182 0.0336074 0.0471144 0.165981 -0.0714961 -0.0507448 0.0361924 0.0231497 -0.126183 0.115928 -0.000761211 0.0340329 -0.071987 0.0852531 -0.0600421 0.0141205 -0.0811993 -0.0291926 0.0713738 -0.000291558 -0.00719244 -0.0881525 0.0240522 0.00807941 -0.0118025 -0.0397964 -0.0319661 -0.148417 0.0403397 0.101138 0.0860537 -0.0430647 -0.0454073 0.00595398 0.0246239 -0.0349702 -0.170913 0.128866 -0.0174847 0.0807057 0.0882452 0.0368095 0.00461014 0.0168209 -0.0973387 -0.120057 0.0587888 0.0661261 -0.119567 -0.165855 -0.0184483 0.0982917 0.0383107 -0.0477076 -0.0268217 0.0491088 -0.126111 0.149549 -0.0361741 0.0767141 
0.00962567 0.0521699 -0.161502 -0.0261952 0.115984 0.110231 0.0376866 -0.129187 -0.0918811 0.0310541 0.0246133 0.0824006 0.110536 -0.0337579 -0.0607308 -0.02231 -0.0968057 0.06686 0.00193748 0.15586 0.115708 -0.100898 0.0428024 0.053582 0.00725029 0.0697451 -0.0951774 -0.228144 0.0810612 0.148663 0.00589601 0.0458183 -0.0623877 -0.0548501 0.0624126 0.0687263 -0.0947741 0.107086 -0.00856168 -0.0670041 0.0206834 -0.0134693 -0.0350046 0.187066 -0.190552 0.0723649 0.20848 0.0441767 -0.099875 -0.0429754 -0.0330114 -0.00449082 -0.0533465 -0.0323684 0.133333 0.0179448 -0.0313313 0.191538 -0.00325574 -0.101611 -0.0497946 -0.0253838 0.271163 -0.0426923 0.127269 -0.11743 -0.00250289 0.0369164 0.000927139 0.0519576 0.0625448 0.144631 -0.0243202 -0.028523 -0.00750886 0.0209721 -0.129221 0.101426 0.0281056 0.0482245 -0.0443672 0.0865774 -0.0483481 0.00696884 -0.0836257 -0.0298843 0.0743891 0.0455142 0.0436515 -0.0540661 0.0507494 -0.048798 -0.0314745 -0.0866361 -0.059674 -0.172764 0.0282739 0.137789 0.0676186 -0.0800996 -0.00379812 0.0487361 0.0419058 0.0345823 -0.176667 0.0930682 -0.0814452 0.158435 0.0736278 0.0242603 0.0511326 0.0640919 -0.139637 -0.0413825 0.0218495 0.0872171 -0.103856 -0.153 -0.0148321 0.112752 0.00361567 -0.0122974 -0.0113855 0.0435053 -0.147809 0.0892253 -0.0447628 0.0509129 
-0.017534 0.0542713 -0.172344 -0.0100599 0.105378 0.0801117 0.0329743 -0.160369 -0.0863181 0.059656 0.0365966 0.0885912 0.109532 -0.00661713 -0.0387118 -0.00253298 -0.0756593 0.0426123 0.0614919 0.146292 0.096176 -0.110627 0.0202298 0.016566 0.0199852 0.116265 -0.103957 -0.234056 0.0830795 0.168789 0.0119231 0.0771347 -0.0295152 -0.0876957 0.0717885 0.0892269 -0.0663083 0.112768 0.028686 -0.0729088 0.0215555 -0.00841012 -0.0232717 0.154119 -0.178718 0.0931462 0.215827 0.0147223 -0.0889307 -0.112692 -0.0486344 -0.00904866 -0.0267679 -0.0389956 0.136457 0.0444277 -0.0400413 0.177585 -0.0278062 -0.0639002 -0.0559225 -0.0532146 0.260517 -0.0600196 0.165944 -0.0740393 0.00155271 0.0380969 0.0163513 0.0112447 0.065381 0.145914 -0.0399845 -0.0499305 0.0127326 0.0439829 -0.126848 0.096866 0.0146449 0.0395512 -0.055803 0.0889418 -0.0546126 0.026661 -0.083036 -0.0328123 0.0752957 0.0380187 0.0357748 -0.0790035 0.0238343 -0.0250096 -0.0145823 -0.0580234 -0.0610961 -0.175764 0.0411215 0.122548 0.0829414 -0.0695891 -0.0197988 0.0283522 0.0430167 -0.000253285 -0.179273 0.112245 -0.0449405 0.137799 0.0758642 0.0360637 0.0199031 0.0206819 -0.136388 -0.0729303 0.0289185 0.0718365 -0.123356 -0.154236 -0.0320499 0.0922034 0.00658785 -0.0165343 -0.0130969 0.0398394 -0.133658 0.120249 -0.043038 0.064006 
-0.024779 0.0551733 -0.170064 0.00157168 0.102042 0.0836451 0.0215574 -0.156991 -0.0938088 0.0687954 0.0415363 0.0872989 0.113 0.00625347 -0.0425405 0.0111279 -0.0529178 0.0595747 0.0769165 0.133479 0.111149 -0.117806 0.029684 0.04392 0.0342822 0.104668 -0.0976092 -0.236618 0.101237 0.178802 0.0232183 0.0710506 -0.0242177 -0.0989636 0.0584302 0.0888841 -0.0832703 0.10215 0.0279607 -0.0622143 9.80339e-05 0.0045746 -0.0275188 0.152763 -0.167002 0.0701367 0.219626 0.000713992 -0.0838849 -0.128977 -0.0286571 -0.00636183 -0.0184702 -0.0553124 0.118588 0.0614509 -0.0213146 0.190071 -0.00621289 -0.062088 -0.0581892 -0.050183 0.253282 -0.0708501 0.166709 -0.0738088 -0.00100231 0.0261905 0.00400951 0.0201439 0.060811 0.156082 -0.0494746 -0.0622311 0.0084686 0.0407502 -0.116818 0.105276 0.00677894 0.0373881 -0.0640812 0.0878157 -0.050026 0.0241161 -0.0784904 -0.0303736 0.0682921 0.0268716 0.0266026 -0.0952883 0.00304156 -0.0146295 -0.016898 -0.0477899 -0.0384215 -0.167672 0.0303214 0.136858 0.0744434 -0.0569502 -0.0184589 0.0264062 0.0416304 0.00933182 -0.17838 0.116619 -0.0383802 0.109783 0.0880131 0.0212966 0.00507338 0.0218043 -0.119121 -0.0779468 0.0303312 0.0816394 -0.12119 -0.147129 -0.0348099 0.097738 -0.00582118 -0.0265259 -0.0306582 0.0183913 -0.148073 0.144503 -0.055198 0.0675828 
-0.0326696 0.0458374 -0.161564 0.0110977 0.0911416 0.0736898 0.0126579 -0.169341 -0.0967391 0.0722395 0.0431797 0.0870076 0.10811 0.0103037 -0.0322261 0.0137674 -0.0548076 0.0526353 0.094144 0.134156 0.0980272 -0.121125 0.036802 0.0414513 0.0346023 0.122756 -0.0949048 -0.246197 0.0901914 0.169431 0.026007 0.0745587 -0.0166463 -0.103238 0.0636747 0.0977874 -0.0771141 0.113538 0.0333451 -0.0614904 -0.00314023 0.0010889 -0.0345233 0.145858 -0.167114 0.0760955 0.2226 -0.00265352 -0.0784127 -0.134136 -0.0291962 -0.0130498 -0.00848636 -0.0535816 0.122629 0.060634 -0.0131665 0.183403 -0.00297211 -0.0558239 -0.0549692 -0.0529015 0.246442 -0.0688075 0.17733 -0.0687849 0.00303495 0.0265951 0.0134864 0.0206911 0.0519089 0.15439 -0.0495404 -0.0581584 0.0157466 0.0305757 -0.122063 0.107095 0.00862345 0.0428431 -0.0652393 0.0847013 -0.0571591 0.0162106 -0.0818327 -0.0387986 0.0682824 0.0265767 0.0195387 -0.102703 0.000915325 -0.00108216 -0.0010315 -0.0485089 -0.0449864 -0.163549 0.0338435 0.136787 0.0851083 -0.0593602 -0.0247185 0.0240333 0.0382663 -4.49197e-05 -0.163664 0.111081 -0.0301394 0.103781 0.0927705 0.0256357 -0.00414496 0.0258288 -0.109105 -0.0895099 0.0317157 0.0814017 -0.120725 -0.152268 -0.0411389 0.0921546 -0.00336818 -0.0249655 -0.0319613 0.0190972 -0.145965 0.147795 -0.0521428 0.0750697 
-0.0370459 0.0459772 -0.151672 0.0154899 0.0877874 0.0949971 0.0283732 -0.161768 -0.0795253 0.0785638 0.0508998 0.0752987 0.0872453 -0.0083945 -0.00411167 -0.00274263 -0.0774818 0.05259 0.102843 0.109406 0.0837067 -0.111968 0.0253326 0.0405604 0.0419753 0.106354 -0.105178 -0.252424 0.0904688 0.153667 0.0500646 0.0539928 -0.0225623 -0.108815 0.0768742 0.113257 -0.0870092 0.0779499 0.0255336 -0.0558074 0.0207661 -0.0116408 -0.0544244 0.156343 -0.179808 0.074951 0.204064 0.00453772 -0.0738299 -0.140168 -0.0473089 -0.0053538 -0.0053673 -0.0684049 0.113566 0.0738492 -0.0282588 0.186443 -0.0162425 -0.0333201 -0.0754293 -0.0466974 0.254709 -0.0750212 0.181769 -0.0586965 0.0112191 0.0123256 0.00697696 0.0402864 0.060464 0.168097 -0.0515458 -0.0523919 0.0183536 0.0246431 -0.134787 0.105213 0.00487251 0.0391608 -0.0680012 0.0813438 -0.056282 0.0183879 -0.0833643 -0.0302785 0.0749352 0.0170999 0.00729122 -0.0927001 0.0220292 0.00362821 -0.00685316 -0.0605174 -0.0445608 -0.167729 0.0279148 0.114031 0.0851127 -0.0501328 -0.0226452 0.0223019 0.0415752 -0.0420871 -0.160188 0.122999 -0.0154572 0.0911833 0.0947698 0.0433828 0.00688667 0.017249 -0.099363 -0.113573 0.0456934 0.0824303 -0.102088 -0.149086 -0.0217293 0.0999156 0.0216143 -0.05177 -0.0372609 0.0342222 -0.140971 0.153073 -0.0335438 0.0926794 
0.000853666 0.0488318 -0.179912 -0.0111089 0.118673 0.10047 0.0338536 -0.155479 -0.0898162 0.0350635 0.031976 0.096695 0.104085 -0.0137654 -0.0633856 -0.0113113 -0.0774149 0.0577535 0.0451497 0.156232 0.109393 -0.102297 0.0162169 0.0349765 0.0168492 0.100039 -0.0983341 -0.226305 0.0819663 0.17202 -0.000132289 0.0662137 -0.0478964 -0.0775919 0.0718701 0.0833274 -0.071643 0.093041 0.0211373 -0.0860266 0.0241012 -0.00240894 -0.00926467 0.167246 -0.181236 0.0776395 0.222319 0.0246635 -0.0940452 -0.0831394 -0.0476412 -0.0151168 -0.0306764 -0.0288568 0.144743 0.0356773 -0.0454514 0.18778 -0.0235673 -0.0847957 -0.0472629 -0.0326441 0.278804 -0.0584862 0.143917 -0.0813748 0.000173534 0.026058 0.0106586 0.0229349 0.0602383 0.141158 -0.029231 -0.0450082 0.00036405 0.0388199 -0.115325 0.0951221 0.0198866 0.0304801 -0.041504 0.106698 -0.0530419 0.0181858 -0.0745251 -0.0284189 0.0673551 0.0456283 0.0433096 -0.0603259 0.0485745 -0.0387114 -0.0294943 -0.0595822 -0.0556447 -0.171937 0.0361041 0.131247 0.0765176 -0.0713571 -0.0108998 0.0353729 0.0468433 0.00758274 -0.190284 0.118421 -0.0539987 0.137344 0.0549306 0.0384123 0.0412485 0.0285731 -0.133459 -0.0565063 0.0185436 0.0706294 -0.112363 -0.151525 -0.027052 0.0877251 0.00232369 -0.0187897 0.000134194 0.0277964 -0.144723 0.115146 -0.0394142 0.0503004 
