{
  "descriptor": [
    -0.11649817228317261,
    0.0031367973424494267,
    0.09262199699878693,
    -0.08978953957557678,
    -0.1358887255191803,
    -0.039252281188964844,
    -0.031375907361507416,
    -0.08546311408281326,
    0.1447727531194687,
    -0.1876671463251114,
    0.09840860217809677,
    -0.028614088892936707,
    -0.22504717111587524,
    0.08413653075695038,
    -0.04140013828873634,
    0.16985821723937988,
    -0.16379216313362122,
    -0.17838263511657715,
    -0.18095678091049194,
    -0.13352717459201813,
    -0.026643309742212296,
    0.1304244101047516,
    -0.03968160226941109,
    -0.013498607091605663,
    -0.13799656927585602,
    -0.29147425293922424,
    -0.056984785944223404,
    -0.040044788271188736,
    0.1264631599187851,
    0.021085157990455627,
    -0.011800243519246578,
    0.07474266737699509,
    -0.16233158111572266,
    -0.009878489188849926,
    0.13181190192699432,
    0.13558471202850342,
    -0.06758686900138855,
    -0.05658302456140518,
    0.18172137439250946,
    -0.021523507311940193,
    -0.2960571348667145,
    -0.003031509928405285,
    0.0715608075261116,
    0.1779545247554779,
    0.1550900787115097,
    0.01036608312278986,
    -0.005501083564013243,
    -0.09560347348451614,
    0.11772552877664566,
    -0.2635151445865631,
    0.016697464510798454,
    0.13464851677417755,
    0.11052228510379791,
    0.09212515503168106,
    0.07799774408340454,
    -0.1692628562450409,
    0.0006106136133894324,
    0.1695152372121811,
    -0.18005985021591187,
    -0.034002333879470825,
    0.06442408263683319,
    -0.14911451935768127,
    -0.04398971423506737,
    -0.06867052614688873,
    0.12842194736003876,
    0.05063735693693161,
    -0.13771313428878784,
    -0.17197100818157196,
    0.23549316823482513,
    -0.18071748316287994,
    0.0013467376120388508,
    0.1013932004570961,
    -0.019651781767606735,
    -0.10148953646421432,
    -0.209492489695549,
    -0.01092214323580265,
    0.44359371066093445,
    0.1011996865272522,
    -0.07954763621091843,
    0.05368722975254059,
    -0.031902141869068146,
    -0.04193559288978577,
    -0.005879384931176901,
    0.05943606048822403,
    -0.12051208317279816,
    0.009085024707019329,
    0.007592673413455486,
    0.03494056686758995,
    0.1854075938463211,
    -0.032582592219114304,
    0.044067658483982086,
    0.14135998487472534,
    0.024124156683683395,
    0.03360927477478981,
    0.02652314119040966,
    0.06746777147054672,
    -0.15470406413078308,
    -0.055505648255348206,
    -0.09628356993198395,
    -0.017770595848560333,
    0.01515611819922924,
    -0.04951535910367966,
    0.04974343627691269,
    0.11912266910076141,
    -0.1329547017812729,
    0.23651833832263947,
    -0.050557468086481094,
    -0.049004729837179184,
    0.011912058107554913,
    0.045552268624305725,
    -0.003217239398509264,
    -0.0590018555521965,
    0.13682694733142853,
    -0.22615395486354828,
    0.12453489750623703,
    0.18733184039592743,
    -0.026513008400797844,
    0.16574032604694366,
    0.07430452853441238,
    0.026907682418823242,
    0.005296933930367231,
    -0.003574611386284232,
    -0.22321291267871857,
    -0.14022032916545868,
    0.07341372966766357,
    -0.0883006826043129,
    0.015501175075769424,
    0.02388143539428711
  ]
}