{
  "descriptor": [
    -0.17392322421073914,
    0.08629627525806427,
    0.01755397580564022,
    -0.04921557754278183,
    -0.1649169623851776,
    -0.08719903975725174,
    0.014391613192856312,
    -0.1273694783449173,
    0.047264691442251205,
    -0.000676229246892035,
    0.2669096887111664,
    -0.11096251010894775,
    -0.26618677377700806,
    -0.08715128898620605,
    0.017413273453712463,
    0.13950635492801666,
    -0.1345674991607666,
    -0.13575908541679382,
    -0.1283896565437317,
    -0.1020173653960228,
    0.007825792767107487,
    0.0949755534529686,
    0.023161983117461205,
    0.11275432258844376,
    -0.11961705982685089,
    -0.31138142943382263,
    0.007147760596126318,
    -0.11784887313842773,
    0.061880744993686676,
    -0.07336916029453278,
    0.059283722192049026,
    0.17644867300987244,
    -0.10774284601211548,
    -0.03476979583501816,
    0.07580967992544174,
    0.08021057397127151,
    -0.05876830220222473,
    -0.049240611493587494,
    0.19768445193767548,
    -0.030983611941337585,
    -0.17148150503635406,
    0.005940665490925312,
    0.04923130199313164,
    0.3516860604286194,
    0.16481812298297882,
    -0.028849292546510696,
    0.04621944949030876,
    -0.08301183581352234,
    0.09822683036327362,
    -0.2824968695640564,
    0.026178713887929916,
    0.17505648732185364,
    0.08883532136678696,
    0.04361455515027046,
    0.10319732129573822,
    -0.09615076333284378,
    0.03503962606191635,
    0.1490604281425476,
    -0.21780434250831604,
    0.12653183937072754,
    0.10270784050226212,
    -0.06887293606996536,
    -0.03714052960276604,
    -0.17337237298488617,
    0.14891719818115234,
    0.10015992075204849,
    -0.09972941130399704,
    -0.0850757360458374,
    0.08198419958353043,
    -0.159380704164505,
    -0.16604313254356384,
    0.11706755310297012,
    -0.13740478456020355,
    -0.18864202499389648,
    -0.2591267228126526,
    -0.025270510464906693,
    0.3035767078399658,
    0.16246816515922546,
    -0.22812481224536896,
    -0.0301465205848217,
    0.031519774347543716,
    0.027671117335557938,
    0.13432899117469788,
    -0.003517314326018095,
    -0.08300178498029709,
    -0.12765097618103027,
    -0.11210548877716064,
    0.0228592399507761,
    0.22745147347450256,
    -0.02650379203259945,
    -0.035800009965896606,
    0.27033188939094543,
    0.04277997091412544,
    -0.048435278236866,
    0.04284927248954773,
    0.047240473330020905,
    -0.029744112864136696,
    -0.021807344630360603,
    -0.09479780495166779,
    -0.0035124539863318205,
    0.0652303621172905,
    -0.14056572318077087,
    0.025819730013608932,
    0.02961442433297634,
    -0.18007703125476837,
    0.17864325642585754,
    0.0010395400458946824,
    0.08002784848213196,
    0.005787187721580267,
    -0.026102472096681595,
    -0.07353397458791733,
    0.057983774691820145,
    0.18742677569389343,
    -0.19227151572704315,
    0.27653542160987854,
    0.17734073102474213,
    0.050404053181409836,
    0.09932772815227509,
    0.02220054343342781,
    -0.0013534764293581247,
    -0.06605412811040878,
    -0.06196226552128792,
    -0.07928071916103363,
    -0.10444192588329315,
    0.1006631851196289,
    -0.048256080597639084,
    0.024039186537265778,
    0.020769769325852394
  ]
}