{
  "descriptor": [
    -0.07862309366464615,
    0.08192229270935059,
    0.05624672397971153,
    -0.04986624792218208,
    -0.11248324811458588,
    -0.003519176272675395,
    -0.07972407341003418,
    -0.06788637489080429,
    0.10762233287096024,
    -0.1306155025959015,
    0.22285805642604828,
    -0.05877093970775604,
    -0.17473295331001282,
    -0.024019701406359673,
    -0.05055376514792442,
    0.1794789582490921,
    -0.16966679692268372,
    -0.14362476766109467,
    -0.030418679118156433,
    0.010397925041615963,
    0.039301298558712006,
    0.03052673675119877,
    0.007042744196951389,
    0.04484132304787636,
    -0.11112610250711441,
    -0.3351304531097412,
    -0.09054956585168839,
    -0.06863440573215485,
    0.04140172898769379,
    -0.037410613149404526,
    -0.09305315464735031,
    0.018405325710773468,
    -0.1438320428133011,
    -0.04612640663981438,
    0.07998989522457123,
    0.10307785123586655,
    -0.03933515399694443,
    -0.0864613726735115,
    0.20109844207763672,
    0.035965025424957275,
    -0.2381802201271057,
    0.03662360459566116,
    0.08836361020803452,
    0.28961890935897827,
    0.1765151172876358,
    0.048027362674474716,
    0.01619863696396351,
    -0.15082548558712006,
    0.11151228845119476,
    -0.18691718578338623,
    0.04181453958153725,
    0.1561814546585083,
    0.06738158315420151,
    0.09283535927534103,
    0.02314617484807968,
    -0.1084594801068306,
    0.051426954567432404,
    0.1179019957780838,
    -0.1424674242734909,
    0.012109760195016861,
    0.07484954595565796,
    -0.0227681715041399,
    0.012071747332811356,
    -0.12031726539134979,
    0.2448209524154663,
    0.08144082874059677,
    -0.12380100041627884,
    -0.18168088793754578,
    0.1304265558719635,
    -0.14590178430080414,
    -0.11700102686882019,
    0.06767581403255463,
    -0.13203340768814087,
    -0.17144982516765594,
    -0.25069788098335266,
    0.0020558068063110113,
    0.3884499967098236,
    0.15414342284202576,
    -0.17693926393985748,
    0.058975886553525925,
    -0.00780295068398118,
    -0.07065511494874954,
    0.12825824320316315,
    0.19468262791633606,
    -0.0019356055418029428,
    0.03041595034301281,
    -0.0364702083170414,
    -0.009947949089109898,
    0.2512868642807007,
    -0.05216708406805992,
    0.0018265236867591739,
    0.17857253551483154,
    0.009713880717754364,
    0.05680590122938156,
    0.04815022647380829,
    0.039431117475032806,
    -0.10536188632249832,
    0.0428454615175724,
    -0.175133615732193,
    -0.03663026914000511,
    -0.012775884941220284,
    -0.0290917307138443,
    0.00446261465549469,
    0.12604674696922302,
    -0.17345838248729706,
    0.14736241102218628,
    -0.004615497775375843,
    -0.01924213394522667,
    0.022951094433665276,
    0.00767201604321599,
    -0.0610276535153389,
    -0.05285566672682762,
    0.12864859402179718,
    -0.21892507374286652,
    0.1753334403038025,
    0.1716284155845642,
    0.09051576256752014,
    0.10990779846906662,
    0.14164826273918152,
    0.07578679919242859,
    0.00976712629199028,
    -0.008343697525560856,
    -0.21095682680606842,
    -0.04086974635720253,
    0.05898075923323631,
    -0.05716545507311821,
    0.07842782139778137,
    -0.006032268982380629
  ]
}