{
  "descriptor": [
    -0.08220057189464569,
    0.07060355693101883,
    0.034320853650569916,
    -0.07310856878757477,
    -0.1451200544834137,
    0.006753586232662201,
    -0.030544066801667213,
    -0.0913863405585289,
    0.19488543272018433,
    -0.0687282457947731,
    0.15071837604045868,
    -0.07966698706150055,
    -0.2418517768383026,
    0.010754714719951153,
    -0.06439872831106186,
    0.17543423175811768,
    -0.16971533000469208,
    -0.15637263655662537,
    -0.09754973649978638,
    -0.0519137978553772,
    0.039816416800022125,
    0.04248247295618057,
    0.05792642757296562,
    0.02790435589849949,
    -0.09146429598331451,
    -0.3637757897377014,
    -0.04620952159166336,
    -0.10731826722621918,
    0.06735062599182129,
    -0.05921578407287598,
    -0.06456134468317032,
    0.1038772463798523,
    -0.12291036546230316,
    -0.03661409765481949,
    0.05131126567721367,
    0.09086302667856216,
    -0.07450125366449356,
    -0.12850721180438995,
    0.24226036667823792,
    0.009445076808333397,
    -0.2315637618303299,
    -0.04425888508558273,
    0.08139295876026154,
    0.22806987166404724,
    0.2358666956424713,
    0.009186336770653725,
    0.08344132453203201,
    -0.06853919476270676,
    0.10573754459619522,
    -0.3898846507072449,
    0.06842269748449326,
    0.1605830192565918,
    -0.012210899963974953,
    0.11980722844600677,
    0.11875146627426147,
    -0.23337440192699432,
    -0.010592097416520119,
    0.14735108613967896,
    -0.1635213941335678,
    0.11697381734848022,
    0.015612716786563396,
    -0.07673940062522888,
    -0.00389244151301682,
    -0.031199073418974876,
    0.22088083624839783,
    0.1303565502166748,
    -0.07428743690252304,
    -0.1702648103237152,
    0.23769910633563995,
    -0.15399596095085144,
    -0.0614430233836174,
    0.11472027003765106,
    -0.09898538887500763,
    -0.22834210097789764,
    -0.2223215401172638,
    -0.01264138799160719,
    0.3916979432106018,
    0.16247281432151794,
    -0.15069109201431274,
    0.055304162204265594,
    -0.10419877618551254,
    -0.05492343381047249,
    0.0577239990234375,
    0.05335115268826485,
    0.02726651355624199,
    -0.016635559499263763,
    -0.15259495377540588,
    -0.04886164143681526,
    0.28671470284461975,
    -0.09389258921146393,
    -0.02055543288588524,
    0.2995082437992096,
    0.03524978458881378,
    -0.031751226633787155,
    0.044152431190013885,
    0.14823950827121735,
    -0.09567354619503021,
    -0.009739046916365623,
    -0.20552735030651093,
    -0.09275825321674347,
    0.07453843206167221,
    -0.09743084013462067,
    -0.04470408707857132,
    0.07777374982833862,
    -0.23400983214378357,
    0.14516867697238922,
    -0.04387713223695755,
    -0.0356285497546196,
    -0.08109128475189209,
    -0.1253701150417328,
    -0.04079873114824295,
    0.055396635085344315,
    0.222799152135849,
    -0.2587018609046936,
    0.20214466750621796,
    0.22105780243873596,
    0.0798121988773346,
    0.22004640102386475,
    0.046671122312545776,
    0.003811958711594343,
    0.08360254019498825,
    -0.13495579361915588,
    -0.12866978347301483,
    -0.10832923650741577,
    -0.010881667025387287,
    0.05415404587984085,
    -0.09575055539608002,
    0.1278008073568344
  ]
}