0.0312216 0.191848 -0.0635638 -0.00674984 0.0772867 0.169865 0.0341144 -0.117606 -0.105541 0.0447939 0.0699367 0.110815 0.0784244 -0.133716 -0.0430268 0.030368 -0.00102812 0.0680154 -0.0907521 0.127032 0.0839162 -0.00200391 9.21551e-05 0.121113 -0.0320439 0.0307937 -0.0623377 -0.144578 0.123645 0.146912 -0.0245136 0.136934 -0.0390204 0.0924029 0.00514158 0.0318942 0.0181903 0.0918199 0.0450549 0.0281857 0.0203417 -0.0980953 0.0264886 0.0357738 -0.101298 0.0508853 0.224263 0.00481796 -0.220781 0.00921413 0.095284 0.0552803 -0.122446 0.00177441 0.0905662 0.0470523 -0.0411023 0.133689 -0.0618296 -0.0245786 -0.107373 -0.0330896 0.217063 -0.195667 0.143878 -0.113803 -0.00227661 -0.0224799 -0.166206 0.127018 -0.0129986 0.0560651 -0.0921797 0.0695816 0.0612819 0.00182948 -0.00793665 0.146664 -0.00577382 -0.012633 -0.0509181 0.106845 0.000835028 0.0099304 -0.071483 0.0119348 0.0447754 -0.0338117 -0.0143204 0.0909823 0.0316477 -0.171596 -0.0586427 0.0597909 -0.0097934 -0.048894 0.0184871 0.0623377 0.0478835 -0.0260691 -0.0283413 0.0634703 -0.0980607 0.21342 -0.0921864 0.0814234 -0.0640268 0.129788 0.0169058 -0.0669001 -0.0280159 0.110271 -0.0833723 0.0392153 0.0502158 -0.00248372 -0.111356 -0.13781 0.0299821 0.168695 0.0765048 -0.00614832 0.0348524 0.0590506 -0.0128175 0.0951086 0.00361842 -0.087364 
0.035417 0.195629 -0.0709385 0.0045793 0.0801818 0.169941 0.0428054 -0.124149 -0.0953266 0.0455028 0.0778133 0.109309 0.0780819 -0.137362 -0.0490486 0.0287909 0.000193476 0.0773241 -0.0941338 0.125765 0.0881059 -0.00771934 -0.00173657 0.114204 -0.0249139 0.0198683 -0.0688162 -0.14433 0.127343 0.156168 -0.0211666 0.147471 -0.0419966 0.0899663 0.0067335 0.0254463 0.0181485 0.0879176 0.0511619 0.0224103 0.0240719 -0.101141 0.0253679 0.0358151 -0.106191 0.0419335 0.216431 0.00630603 -0.209425 0.00506841 0.0964091 0.0700988 -0.123942 0.000613097 0.0845833 0.0418399 -0.0369893 0.122996 -0.0640537 -0.0221183 -0.108489 -0.0410649 0.217227 -0.196141 0.138173 -0.114263 0.00138371 -0.0277789 -0.16477 0.128439 -0.011697 0.060451 -0.0923123 0.0726832 0.0548131 -0.00421163 -0.00550005 0.146724 -0.0164004 -0.00707723 -0.0527226 0.106991 0.00461041 0.0129601 -0.0626919 0.0184603 0.0417748 -0.0362261 -0.0152753 0.0834964 0.0325981 -0.172096 -0.0630481 0.0543386 -0.0125147 -0.0626878 0.0149885 0.0616302 0.0486131 -0.0277738 -0.0231023 0.0660611 -0.089278 0.219365 -0.0845039 0.0804487 -0.05271 0.140909 0.0258846 -0.059021 -0.0371003 0.103784 -0.0895503 0.0406165 0.0515805 -0.00697202 -0.105619 -0.134873 0.0378925 0.169968 0.0762744 -0.0025058 0.0313196 0.062493 -0.0104316 0.089864 0.00759038 -0.079073 
0.0633823 0.155066 -0.0870485 -0.00867642 0.0871049 0.171194 0.05645 -0.100555 -0.118791 0.0330884 0.0593083 0.119828 0.0972484 -0.128236 -0.0676439 0.0317011 0.00590672 0.067307 -0.105878 0.143711 0.107286 -0.00289875 -0.00101047 0.118746 -0.0425129 0.0384716 -0.0698465 -0.163665 0.111507 0.161774 -0.0562445 0.148931 -0.0593775 0.091667 -0.00692796 0.00153234 -0.00143134 0.112932 0.0349602 0.0097051 0.0125208 -0.0846609 0.0225281 0.0544858 -0.108315 0.0432427 0.213549 0.00419906 -0.209845 0.0173286 0.11667 0.0478544 -0.118706 0.0130093 0.111797 0.0172085 -0.0239473 0.139147 -0.0368646 -0.0556098 -0.0780742 -0.0349116 0.216011 -0.165568 0.118726 -0.130956 -0.00658147 0.00303867 -0.137655 0.0979168 -0.00403235 0.0599061 -0.0756874 0.0570559 0.0346306 0.0100526 -0.015237 0.129908 -0.00124505 0.013803 -0.0304428 0.103629 0.00749368 -0.00604675 -0.0621071 0.000664549 0.0621668 -0.0231147 -0.00161846 0.0745218 0.019858 -0.171775 -0.0790819 0.0534593 -0.0375737 -0.0527967 0.0378426 0.0596994 0.0456346 -0.0355999 -0.000901366 0.0848805 -0.0753673 0.231841 -0.122888 0.0540021 -0.0919506 0.148566 0.0111316 -0.0689177 0.000347758 0.120792 -0.102649 0.0304953 0.047168 0.0135726 -0.130204 -0.139186 0.00464716 0.152342 0.0526351 0.00634669 0.0499977 0.0429815 -0.0150608 0.0849049 -0.00856874 -0.0924187 
0.0684083 0.171047 -0.0515509 0.00161088 0.0998008 0.210286 0.0687964 -0.130778 -0.119733 0.0309738 0.0585451 0.106495 0.0788346 -0.132566 -0.0257203 0.0032213 0.00990811 0.112136 -0.100689 0.108246 0.0774269 0.043175 -0.023447 0.143309 -0.0394438 0.00389028 -0.0906157 -0.152875 0.108441 0.161416 -0.035321 0.160502 -0.0861097 0.0964356 0.0292409 0.0222777 0.0216236 0.0311285 0.0417749 0.0201249 0.055696 -0.0964724 0.024002 0.0320358 -0.122013 0.0598533 0.211444 0.0213254 -0.214979 0.000673731 0.120823 0.0379459 -0.0956296 0.00245423 0.0831002 0.0397469 -0.0277193 0.135217 -0.0342506 -0.0179743 -0.0847595 0.0155935 0.189809 -0.198161 0.12244 -0.11924 0.0206102 -0.0379794 -0.162794 0.128 -0.00868144 0.0543265 -0.0720113 0.0538813 0.0306927 0.0150747 -0.0243645 0.130368 -0.00789304 -0.0228397 -0.00730987 0.137373 0.00157164 0.00252414 -0.0459577 0.0255972 0.0552647 -0.0609672 -0.064477 0.113642 0.0538869 -0.162784 -0.060832 0.044284 -0.0522591 -0.0376602 0.0238146 0.052422 0.0574512 -0.0169677 0.0113935 0.0946338 -0.0719636 0.21533 -0.0951255 0.0594201 -0.0674552 0.12698 -0.0293559 -0.0194054 0.00163916 0.0866151 -0.0736697 0.00810071 0.0211358 0.000314694 -0.125131 -0.132889 -0.00476398 0.141729 0.0854613 -0.0299855 0.0362674 0.042854 -0.0146067 0.0947507 -0.0261694 -0.0982194 
0.0561846 0.204284 -0.0123277 0.0318354 0.095835 0.218705 0.0686524 -0.169482 -0.0731429 0.0143724 0.0663806 0.101441 0.0504679 -0.120789 -0.0164634 0.00559466 0.00262002 0.124951 -0.123652 0.0670433 0.0643386 0.0540334 -0.0326221 0.132861 -0.00704002 -0.0279545 -0.0986432 -0.106495 0.097502 0.166286 -0.00563615 0.177842 -0.0864946 0.106856 0.0457416 0.0243015 0.0386222 0.00779682 0.0634488 0.0186679 0.0685454 -0.101317 0.0468751 -0.0126953 -0.10426 0.0313635 0.182852 0.0154422 -0.199672 -0.00506623 0.130129 0.0527728 -0.0802488 0.00076295 0.0669959 0.0556612 -0.0517856 0.124243 -0.0564446 0.000281452 -0.104896 0.0165094 0.171017 -0.231729 0.130444 -0.0643411 0.0218315 -0.0540442 -0.210018 0.163649 -0.00646011 0.055001 -0.0710844 0.0613082 0.0348431 0.010731 0.0026793 0.0891563 -0.0316549 -0.0398097 0.0020123 0.143389 0.0185296 0.00854664 -0.0424888 0.0191989 0.0349621 -0.0728705 -0.0841495 0.140208 0.0541168 -0.181908 -0.0462367 0.0553976 -0.043615 -0.0213642 0.00321159 0.0377919 0.0657782 0.00577464 0.00969193 0.0811527 -0.0874962 0.210735 -0.0591521 0.0693143 -0.0367705 0.104 -0.0321643 -0.0181367 -0.0191357 0.0719653 -0.0603274 0.0356957 0.0347282 -0.0250131 -0.11264 -0.0790171 0.0167338 0.143576 0.112307 -0.0288898 0.0265997 0.0350506 0.0261569 0.100804 0.00288977 -0.102186 
-0.00108455 0.195053 -0.0223215 0.0226004 0.0479105 0.19232 0.0552733 -0.164925 -0.107569 0.0707025 0.06749 0.104491 0.0578849 -0.131041 -0.0215471 -0.00580288 -0.0330019 0.115736 -0.0499615 0.0578081 0.0505832 -0.0219557 -0.0231864 0.114228 -0.0122879 0.0372723 -0.0976409 -0.147401 0.11649 0.145621 0.0109019 0.179526 -0.0708022 0.0729528 0.0492755 0.0385736 0.00239972 0.0412152 0.0881654 0.0150055 0.0554728 -0.132979 0.00971106 0.00430945 -0.102758 0.0292502 0.200647 0.00815136 -0.224562 -0.0553113 0.0853928 0.0718347 -0.0632283 -0.0213228 0.0544988 0.0852517 -0.0241319 0.133607 -0.0777026 0.007642 -0.110427 0.010427 0.205223 -0.214247 0.173869 -0.0430564 0.0191237 -0.0722489 -0.199836 0.15166 -0.037113 0.051937 -0.104631 0.092112 0.0526473 -0.0160816 -0.0120492 0.0970032 -0.00235949 -0.0302008 -0.0757896 0.0989937 0.00371891 0.00822771 -0.0799173 -0.00385949 0.0450813 -0.0653716 -0.0470587 0.0888409 0.0511379 -0.134726 0.0060636 0.052487 -0.0237395 -0.0451897 0.0174604 0.0691437 0.0761909 0.000189394 -0.00416848 0.0706598 -0.105897 0.193898 -0.0145448 0.0921116 -0.00272675 0.113111 0.00804227 -0.0316122 -0.0592493 0.0761329 -0.0625423 -0.00775805 0.0605447 -0.0129682 -0.08778 -0.112958 0.07965 0.160717 0.113111 -0.0789228 0.00552411 0.0190311 -0.0153536 0.127614 -0.00084134 -0.0651298 
0.0300561 0.201524 -0.0469594 0.00852145 0.0703007 0.255062 0.05628 -0.152342 -0.0680889 0.000577346 0.0662265 0.0635324 0.0484969 -0.139347 0.000991354 -0.0479302 -0.0443522 0.10292 -0.083699 0.0302063 0.0698881 0.0472859 -0.0290421 0.103103 0.00902459 -0.0263377 -0.0968376 -0.127887 0.106354 0.13993 0.0564633 0.146083 -0.0850735 0.103282 0.0814961 0.0425527 0.0356186 -0.00559489 0.052672 -0.00443424 0.106339 -0.122064 0.0224635 0.0604182 -0.136302 0.00161082 0.184482 0.0528904 -0.199796 -0.0220628 0.0615735 0.0583206 -0.0443616 -0.0191981 0.0480067 0.0806098 -0.0597367 0.133925 -0.0628181 -0.0548255 -0.135709 0.0335468 0.21968 -0.212307 0.130256 -0.0323531 0.0516617 -0.081829 -0.182703 0.171916 -0.0320865 0.0356086 -0.0753763 0.0705125 0.0395618 -0.03559 -0.0483331 0.0575733 -0.0216996 -0.0100545 -0.0232232 0.129029 0.0176716 -0.0102823 -0.0491357 0.00654866 0.0465958 -0.0731246 -0.0687351 0.128847 0.123021 -0.170674 -0.0423128 0.00167007 -0.0304157 -0.0635548 0.000731885 0.0713459 0.0419655 -0.00576555 0.00849989 0.0969534 -0.0558164 0.162935 -0.070283 0.0826039 -0.0235157 0.11669 -0.0218398 0.0113513 0.0195854 0.0607292 -0.0997185 0.00902905 0.0362024 -0.0250381 -0.0819196 -0.113334 0.0857028 0.146106 0.144506 -0.0717697 0.019662 0.0445214 -0.00739748 0.065709 0.0253957 -0.0538934 
0.0104889 0.159887 -0.0126784 0.035865 0.103598 0.26652 0.0338537 -0.190605 -0.0491904 -0.0425053 0.0176614 0.0558879 0.00954664 -0.0941392 0.0278464 -0.0644592 -0.0173213 0.105342 -0.0606867 0.00795208 0.0445703 0.0757008 -0.0203744 0.113892 0.0233269 -0.0382272 -0.117715 -0.108354 0.0743046 0.10484 0.110675 0.165497 -0.0929585 0.0975644 0.121235 0.0897803 0.0448427 -0.044958 0.0205797 -0.0402292 0.140439 -0.0821438 0.0197717 0.0223381 -0.136536 0.0302812 0.156114 0.0877286 -0.160635 -0.0460034 0.0388263 0.0403704 0.0331008 -0.052449 0.0605281 0.0962181 -0.0620206 0.141323 -0.048768 -0.0417751 -0.134203 0.102494 0.177296 -0.228245 0.159248 -0.00128125 0.0583106 -0.0822258 -0.192739 0.218731 -0.0263775 0.033481 -0.0619508 0.05552 0.0170084 -0.0101329 -0.0472624 0.0389219 -0.0229679 -0.0499304 -0.0121448 0.162204 0.00988216 -0.0267575 -0.0394048 -0.0307211 0.0409087 -0.0532291 -0.128531 0.150785 0.164369 -0.124161 -0.00644618 -0.00603612 -0.0122793 -0.0263469 0.00904445 0.0675098 0.0401106 0.00343262 0.0345466 0.0958698 -0.0621793 0.104509 -0.0600945 0.0755621 -0.00930749 0.0391001 -0.0290055 0.0652901 0.0287017 0.0455342 -0.0777671 -0.00780524 0.0311409 -0.0378022 -0.0854152 -0.113609 0.0678091 0.141197 0.154624 -0.0622361 0.0101712 0.0192675 -0.012003 0.0918573 0.0214883 -0.0639008 
0.0299515 0.146553 -0.0562607 0.00889983 0.11493 0.256172 0.0537748 -0.189416 -0.0850767 -0.0481912 0.0169894 0.0683357 0.0420535 -0.037685 -0.0138198 -0.0669384 0.0117701 0.081074 -0.0406404 0.0213039 0.063114 0.0787987 -0.0388085 0.0915891 -0.00244113 -0.00463828 -0.114634 -0.0983106 0.103267 0.13874 0.0589928 0.177826 -0.101447 0.0763441 0.0982939 0.0797556 0.039448 -0.017769 0.0294084 -0.0461546 0.121669 -0.0490156 0.0126668 0.0151593 -0.134575 0.0684313 0.16303 0.0782591 -0.167549 -0.0775138 0.0242696 0.0759042 0.0342376 -0.035819 0.0862241 0.0919885 -0.0421856 0.173622 -0.0532985 -0.0356594 -0.112089 0.118891 0.203682 -0.215343 0.149896 -0.00450216 0.055708 -0.0485752 -0.156895 0.191698 -0.01626 0.0248645 -0.06138 0.0494755 0.014287 0.0287071 -0.0296946 0.0383427 -0.0215272 -0.0659903 -0.00637602 0.159846 0.0164582 -0.0212487 -0.0326463 -0.0393975 0.0579806 -0.047567 -0.126634 0.132246 0.172993 -0.127697 -0.0038115 0.0168385 -0.0121786 -0.0486174 0.0417251 0.0743405 0.0611343 0.0122146 0.0492362 0.132626 -0.0559947 0.129576 -0.109242 0.0855973 -0.0254048 0.0550566 -0.0381815 0.0468015 0.0555117 0.0259667 -0.100365 -0.000839467 0.0254388 -0.00971066 -0.0970559 -0.127561 0.0448788 0.133116 0.113537 -0.0709661 0.0134657 -0.00737334 -0.0374451 0.119692 -0.00887213 -0.0691599 
0.0421778 0.14387 -0.090701 -0.0119864 0.113418 0.264734 0.0622241 -0.173386 -0.112675 -0.02786 0.0148349 0.0630187 0.0585876 -0.00496288 -0.0161334 -0.0666557 0.02329 0.080226 -0.00311741 -0.00329026 0.070066 0.0720643 -0.0437626 0.0727939 0.00767057 0.00788207 -0.106016 -0.105352 0.114177 0.158179 0.0376496 0.17651 -0.111214 0.0542138 0.0791427 0.0651088 0.032517 -0.0239256 0.0597071 -0.0335074 0.108863 -0.0411843 0.0203079 0.0199513 -0.14104 0.0655171 0.169893 0.0610756 -0.167015 -0.102624 0.0431963 0.0919131 0.0365253 -0.0203347 0.0855461 0.090887 -0.00514217 0.186466 -0.0383722 -0.0432969 -0.100055 0.117774 0.206751 -0.213624 0.130542 0.000200757 0.0585929 -0.0255061 -0.124609 0.175411 -0.00838995 0.0444057 -0.0731201 0.0339085 0.0183893 0.0437088 -0.0363201 0.0308143 -0.0243949 -0.0583499 -0.00912944 0.165722 0.0396487 -0.0071356 -0.0271051 -0.0264636 0.0704827 -0.0542246 -0.112211 0.0969512 0.146631 -0.123695 -0.00852445 0.0143851 -0.018488 -0.0684196 0.0555482 0.0942953 0.0596459 0.016579 0.0554706 0.145951 -0.0302338 0.149517 -0.135559 0.083783 -0.0459866 0.0638728 -0.057697 0.034533 0.0651335 0.00690182 -0.105523 -0.0129713 0.0232262 0.00585322 -0.0967487 -0.135376 0.0375134 0.119187 0.111416 -0.0925029 0.0215285 -0.0349967 -0.0532411 0.123606 -0.0298323 -0.0390087 
0.0976746 0.0902706 -0.0831626 0.0103189 0.145273 0.275587 0.0812795 -0.160532 -0.103132 -0.102447 -0.00561723 0.0642153 0.0639706 -0.035983 -0.0205314 -0.068483 -0.0015749 0.0826716 -0.0727865 0.0477711 0.100868 0.055343 0.0123514 0.102843 0.00169168 -0.0445541 -0.137159 -0.145082 0.0484205 0.11825 0.0461526 0.15145 -0.150497 0.100403 0.0803554 0.0546397 0.0260552 -0.00405135 0.0233643 -0.0561624 0.124199 -0.0176939 0.0175586 0.0268094 -0.166004 0.0338932 0.157493 0.0755122 -0.142751 -0.00638731 0.0188995 0.00553025 0.0241782 0.00177543 0.0967032 0.0398679 0.000603254 0.200326 -0.0110304 -0.0820929 -0.0814058 0.152019 0.200418 -0.215864 0.100726 -0.0151755 0.0558395 -0.00558337 -0.113734 0.160742 -0.00727144 0.0689886 -0.0381754 0.0536021 -0.0149506 0.0188872 -0.0411119 0.00528875 -0.00373078 -0.0245622 0.0101243 0.153082 0.0129886 -0.0551107 -0.0406441 -0.0058893 0.0695098 -0.0370843 -0.125056 0.0942842 0.203165 -0.141682 -0.0123409 -0.0328055 -0.0446422 -0.0602618 0.0312956 0.104552 0.0381301 0.00945328 0.0471732 0.111177 -0.0252304 0.164851 -0.127141 0.054475 -0.0702095 0.0980181 -0.0666713 0.0580941 0.0786261 0.0539307 -0.0887822 0.00933583 0.0091977 0.0251538 -0.104587 -0.116273 0.00534239 0.119412 0.0852911 -0.0333629 0.0223374 0.0161039 -0.0736171 0.0660556 -0.0452647 -0.059209 
0.105587 0.083584 -0.102681 -0.00801558 0.143385 0.268106 0.0744343 -0.14345 -0.137114 -0.0893012 -0.0099039 0.0577661 0.0746126 -0.0216621 -0.0203971 -0.069358 0.0111982 0.0762011 -0.048351 0.0591564 0.0942364 0.0590296 0.016008 0.0846812 -0.00932497 -0.0213811 -0.120077 -0.146408 0.0600067 0.119331 0.0194457 0.155821 -0.144796 0.0924795 0.0727325 0.0503282 0.0295973 0.00689589 0.0233015 -0.0654549 0.110821 -0.0201281 0.0163928 0.0428241 -0.177396 0.0597316 0.170559 0.0798177 -0.160209 -0.00746366 0.0181408 0.0165153 0.02096 0.00937318 0.102592 0.0304117 0.0154076 0.193814 -0.000508928 -0.0913275 -0.0716985 0.148268 0.208434 -0.200991 0.0964667 -0.0189768 0.0514544 0.00443622 -0.0915397 0.151154 -0.0135351 0.0595717 -0.0382451 0.0479361 -0.01623 0.0184614 -0.0427513 0.014118 0.00429466 -0.0283483 0.0133978 0.148456 0.00558458 -0.0615876 -0.0327207 -0.0119213 0.0679084 -0.0293379 -0.10722 0.0961285 0.208319 -0.129767 -0.0245304 -0.0326767 -0.0439654 -0.0650657 0.0500057 0.121213 0.0388632 -0.00572213 0.0496561 0.12583 -0.0122735 0.164301 -0.146766 0.0542247 -0.0816624 0.109062 -0.0622888 0.0470282 0.0917893 0.0583849 -0.0969323 0.0042267 0.00879148 0.0200944 -0.0984185 -0.141139 0.00828732 0.110755 0.0766772 -0.0423059 0.0404111 0.0126513 -0.0766693 0.0571867 -0.040561 -0.0607645 
0.0952017 0.0830909 -0.0983294 0.00163708 0.142985 0.266705 0.0736508 -0.166424 -0.111309 -0.103498 -0.00835387 0.0583916 0.0735456 -0.019876 -0.0385902 -0.0622468 -0.0069792 0.0807562 -0.0621908 0.0501011 0.115131 0.048533 0.00704153 0.0772674 -0.00398578 -0.0248876 -0.141749 -0.150887 0.0565968 0.133396 0.0331151 0.166158 -0.151017 0.0846055 0.085725 0.0553029 0.0194277 0.00611063 0.0352411 -0.0721697 0.107352 -0.0158527 0.0157243 0.0338802 -0.154291 0.0539809 0.163132 0.079275 -0.154287 -0.0248951 0.00250944 0.0205546 0.0345947 0.00462768 0.100443 0.0341593 0.0140046 0.191381 -0.0142424 -0.0916824 -0.06405 0.15577 0.210615 -0.191294 0.0970435 -0.0129877 0.0527515 0.0122467 -0.0869989 0.150725 -0.00483769 0.0583614 -0.0410248 0.0388731 -0.0229864 0.021269 -0.0480439 -0.00119546 -0.00415051 -0.0215714 0.0165989 0.157859 0.00180766 -0.0590257 -0.0423083 -0.00365716 0.0673535 -0.0308525 -0.115512 0.0901017 0.212044 -0.131172 -0.0175891 -0.0260042 -0.052737 -0.0616863 0.0372574 0.116743 0.0443437 0.00373026 0.0620067 0.114807 -0.0220441 0.157499 -0.134009 0.0573214 -0.0718138 0.112329 -0.0601678 0.0581678 0.0795277 0.0443746 -0.111685 -0.000636575 0.0132953 0.033311 -0.113114 -0.125467 0.00848808 0.107665 0.0749786 -0.0331592 0.034577 0.00749185 -0.0820706 0.0674428 -0.0421999 -0.0550353 
0.0902565 0.0843525 -0.0984571 -0.00372106 0.132828 0.271485 0.0671648 -0.154443 -0.110734 -0.100346 -0.00171512 0.0574548 0.077894 -0.024758 -0.0405554 -0.0551443 -0.0169669 0.0735102 -0.066282 0.0528328 0.125859 0.0354166 0.0198712 0.0799188 -0.00507476 -0.0183122 -0.135646 -0.158945 0.0650211 0.124028 0.0401248 0.15882 -0.147131 0.0876499 0.0748553 0.0587589 0.0114277 0.0263238 0.0364223 -0.0630742 0.100268 -0.0223644 0.00451421 0.0383114 -0.15505 0.0361511 0.166744 0.073776 -0.15794 -0.0195057 -0.00300912 0.023311 0.021632 0.009196 0.097573 0.0355474 0.0201557 0.198632 -0.019769 -0.10121 -0.0734108 0.145508 0.226045 -0.195691 0.100299 -0.0128378 0.0531277 0.0160662 -0.0875197 0.157204 -0.0103886 0.0640206 -0.0498866 0.048837 -0.0127133 0.00695094 -0.0480103 0.00365527 -0.00193175 -0.0123833 0.00278947 0.14757 0.0070215 -0.062414 -0.0527604 -0.00388134 0.0710532 -0.0249125 -0.1023 0.0801535 0.209196 -0.13816 -0.0173082 -0.0243239 -0.0443855 -0.0677883 0.0338772 0.125526 0.0397897 0.00577523 0.0526818 0.106596 -0.0335776 0.166366 -0.126797 0.064106 -0.0747663 0.113209 -0.0488508 0.038743 0.0663837 0.05965 -0.111422 0.00551335 0.0273537 0.0393282 -0.107019 -0.129143 0.0213457 0.118839 0.0754006 -0.0366873 0.0351439 0.00987369 -0.0869169 0.0686611 -0.038522 -0.0443636 
0.11349 0.0683626 -0.103645 -0.00762732 0.126103 0.278385 0.0617531 -0.12122 -0.158944 -0.0778192 -0.00827826 0.0423118 0.0880675 -0.0373408 -0.0230593 -0.0301202 -0.00916731 0.0586302 -0.0437344 0.0740257 0.123398 0.0145706 0.0496497 0.0509445 -0.00839769 0.00963345 -0.140959 -0.181496 0.0674515 0.0920658 0.0200237 0.169373 -0.153193 0.0894432 0.0596971 0.0439239 0.00890779 0.0632945 0.0622968 -0.0770411 0.0813207 -0.0373896 -0.00235641 0.0185624 -0.165285 0.0348794 0.172898 0.0658509 -0.177993 0.000708686 0.00372302 0.0192044 0.0171916 0.0318591 0.0904398 -0.00125222 0.0607203 0.178613 -0.0164104 -0.11902 -0.0628486 0.141083 0.226627 -0.202061 0.105235 0.0122284 0.0447001 0.0372557 -0.0757782 0.132868 -0.0242162 0.0792436 -0.0599802 0.068204 -0.00576301 -0.0111294 -0.0425227 -0.00701543 0.0235891 0.0118285 -0.00289376 0.117609 0.00981394 -0.0797799 -0.0478924 -0.00585415 0.065504 -0.00225618 -0.0704258 0.0643107 0.209766 -0.117573 -0.0253237 -0.00649094 -0.052905 -0.0755848 0.061494 0.151297 0.0190512 -0.002097 0.0512146 0.0961445 -0.0376324 0.177552 -0.11756 0.0689062 -0.0695604 0.128046 -0.0254198 0.0157857 0.0548587 0.0871061 -0.0973619 -0.00140288 0.0543137 0.0301 -0.114809 -0.125061 0.0236083 0.114112 0.0580145 -0.0482232 0.0727212 0.00655234 -0.073278 0.0591876 -0.0226714 -0.0411508 
0.119087 0.0493057 -0.103006 -0.00709529 0.128519 0.278226 0.0787609 -0.115174 -0.149947 -0.0826514 -0.0114104 0.0541543 0.0933564 -0.0557699 -0.0316036 -0.0322497 -0.0301275 0.0683451 -0.0689951 0.0787877 0.129553 0.00257735 0.0496651 0.0708696 -0.0155574 -0.00286879 -0.144555 -0.19786 0.0425448 0.0912214 0.0130735 0.156191 -0.170179 0.0985796 0.0565961 0.0341255 -0.00731528 0.0562015 0.0490295 -0.0703259 0.0865933 -0.0401899 -0.00190366 0.0318535 -0.163853 0.0165082 0.167211 0.0647071 -0.17101 0.0196638 0.0119124 -0.0211049 0.0060681 0.0318541 0.0928301 -0.00265322 0.0486619 0.192543 -0.00871118 -0.116701 -0.0498354 0.141287 0.225595 -0.195038 0.101273 -0.00507294 0.0353795 0.0346864 -0.0795981 0.122193 -0.0225216 0.0908091 -0.0489682 0.0657804 -0.0227917 -0.00816584 -0.0423758 -0.0116017 0.0275282 0.0184221 -0.00116578 0.106943 0.00105375 -0.083177 -0.0694048 0.00111199 0.0770347 -0.00727024 -0.0700271 0.0583336 0.202234 -0.127772 -0.0234657 -0.0212579 -0.0662965 -0.062191 0.0497325 0.137204 0.022118 0.00526466 0.0522789 0.0853558 -0.0415073 0.180327 -0.104888 0.0532288 -0.0848594 0.136207 -0.0488239 0.0221688 0.0564969 0.0942804 -0.0883688 -0.00220741 0.0434132 0.0447129 -0.113884 -0.107249 0.00932061 0.115291 0.0516055 -0.0418768 0.0627056 0.0152458 -0.0818687 0.0523845 -0.0461405 -0.0497468 
0.112667 0.0480387 -0.101126 -0.00888744 0.136784 0.275968 0.0746386 -0.112649 -0.132413 -0.115693 -0.0152993 0.062963 0.0869345 -0.0548645 -0.0420617 -0.0596435 -0.0282206 0.0593853 -0.0790066 0.0854395 0.130941 0.0148372 0.0494244 0.0755875 -0.0168305 -0.0197745 -0.132219 -0.184541 0.0389645 0.0852478 0.0262581 0.134589 -0.157978 0.103618 0.057622 0.0330954 0.0058264 0.0528406 0.0264022 -0.070146 0.109563 -0.0268765 -0.00279503 0.0470057 -0.182595 0.0113366 0.162035 0.0663193 -0.150928 0.0244206 -0.0034884 -0.0191921 0.00676717 0.0310501 0.0984812 0.000391492 0.0358805 0.192858 -0.0145364 -0.123746 -0.0596726 0.143368 0.222816 -0.187353 0.0927743 -0.0249153 0.0481796 0.0232362 -0.0749084 0.124427 -0.0173582 0.0757483 -0.0370578 0.0612177 -0.017769 -0.000400085 -0.0529217 -0.00442896 0.0218219 0.0223769 -0.0081636 0.115349 0.0159822 -0.0689261 -0.0526307 -0.00230123 0.0863261 0.00422149 -0.0830758 0.0586028 0.212712 -0.142412 -0.0210883 -0.0327413 -0.0666014 -0.0807742 0.0422933 0.130948 0.0150184 1.66751e-05 0.0438585 0.0961772 -0.0308583 0.184232 -0.115355 0.0485013 -0.0854815 0.141741 -0.0565365 0.0290769 0.0711197 0.083946 -0.104438 0.016375 0.0219813 0.0428067 -0.113122 -0.119416 0.00785039 0.118979 0.0505724 -0.0252103 0.0383799 0.0167915 -0.0795835 0.0416599 -0.0509284 -0.0467306 
0.101261 0.0757741 -0.0817921 -0.0118076 0.13855 0.282557 0.0687991 -0.126942 -0.133795 -0.11152 -0.0201938 0.0538533 0.0771039 -0.0312005 -0.0188428 -0.0616593 -0.0153404 0.0540439 -0.0709074 0.0574864 0.112278 0.0394724 0.0401026 0.064247 -0.00331927 -0.0184306 -0.132885 -0.153626 0.0511469 0.0852513 0.0411741 0.149594 -0.154927 0.103237 0.0620829 0.0447585 0.0214881 0.0412289 0.036288 -0.0605822 0.122073 -0.0237239 0.0110011 0.0268287 -0.177695 0.0278373 0.16092 0.0654661 -0.156482 0.00334002 0.00397431 0.00256861 0.0145034 0.0259051 0.0940666 0.0154104 0.0301606 0.1971 -0.0137432 -0.114239 -0.0757963 0.151669 0.207121 -0.201944 0.102256 0.000398238 0.0565128 0.0243017 -0.0880325 0.147972 -0.0126434 0.0744605 -0.0385494 0.0651182 8.05729e-05 0.00763295 -0.0522647 -0.0104741 0.0128234 0.00129507 -0.00146214 0.1297 0.0302713 -0.059877 -0.0471933 -0.0136772 0.0844761 -0.00529633 -0.102805 0.0738131 0.211545 -0.142653 -0.0126786 -0.0278592 -0.0572187 -0.0737458 0.048971 0.133172 0.0190894 0.00533728 0.0342574 0.106052 -0.0309065 0.187341 -0.124711 0.0552071 -0.0842186 0.12764 -0.0529742 0.0226732 0.0730146 0.0738037 -0.106554 0.0234698 0.0282106 0.0249137 -0.114559 -0.120389 0.015087 0.119736 0.0745858 -0.0303156 0.0397531 0.00859369 -0.06659 0.0478672 -0.041159 -0.04475 
0.101681 0.0743874 -0.0852942 -0.016581 0.142881 0.276078 0.0757085 -0.129019 -0.126955 -0.105686 -0.0177572 0.0537785 0.0816614 -0.0244257 -0.0187917 -0.0602102 -0.0167873 0.0540577 -0.0766327 0.0593919 0.10996 0.0470391 0.0363766 0.0734983 -0.0129901 -0.0194664 -0.135547 -0.149697 0.061696 0.0908375 0.0362432 0.153281 -0.160724 0.0995009 0.0594312 0.0513566 0.0192141 0.0391539 0.0291213 -0.0516647 0.119194 -0.0154363 6.4145e-05 0.0281748 -0.175168 0.0343285 0.156454 0.0759187 -0.147357 -0.000416115 0.00102933 0.00880756 0.00856351 0.0190257 0.0957086 0.0182771 0.0270627 0.204892 -0.0107742 -0.103974 -0.0764038 0.153022 0.208982 -0.196146 0.0963606 -0.00719469 0.058346 0.0271419 -0.0825479 0.14951 -0.0100026 0.0791346 -0.0347167 0.0690444 -0.00371261 0.00900642 -0.0524414 -0.00233131 0.0120892 -0.00849499 0.0108135 0.134767 0.0222765 -0.0601712 -0.0443828 -0.0133163 0.0857309 -0.00743955 -0.107148 0.0737189 0.216299 -0.137137 -0.0115099 -0.0310777 -0.0537552 -0.07542 0.0452347 0.126686 0.0293111 0.00587445 0.0386713 0.104734 -0.0293138 0.183879 -0.132179 0.0539745 -0.089085 0.120783 -0.045887 0.0308279 0.0776832 0.0774239 -0.105226 0.0226403 0.0223683 0.0329949 -0.109141 -0.12158 0.00670752 0.117547 0.0730692 -0.0286065 0.0374307 0.0148105 -0.0832678 0.0519507 -0.0542341 -0.0467988 
0.0960565 0.0811017 -0.0824416 -0.0168107 0.136235 0.273959 0.0628836 -0.127758 -0.137554 -0.101452 -0.0162553 0.0463841 0.080039 -0.0227326 -0.0173746 -0.0524141 -0.015456 0.0439936 -0.0652461 0.0669887 0.111606 0.0366767 0.0442919 0.0558627 -0.00878523 -0.00275401 -0.13791 -0.148726 0.0746634 0.0822447 0.0406167 0.156819 -0.153394 0.0943368 0.0574418 0.0560404 0.0169327 0.0618706 0.0412374 -0.0599067 0.109294 -0.0210391 -0.00325668 0.0207053 -0.171154 0.0393841 0.163148 0.0723874 -0.15801 -0.00319418 -0.0104495 0.0270286 0.00838809 0.0228826 0.0945069 0.010228 0.0346582 0.196689 -0.0194478 -0.113309 -0.0797315 0.148322 0.217291 -0.195258 0.102907 0.00617333 0.0595599 0.0328494 -0.0804387 0.151054 -0.0114681 0.0778503 -0.0434058 0.0795197 0.00745013 -0.00293898 -0.0527406 -0.00319117 0.0181755 -0.00172833 0.00148629 0.131393 0.0250105 -0.0640376 -0.0402041 -0.0209612 0.0786316 0.0055695 -0.0913873 0.0691506 0.21903 -0.129911 -0.010134 -0.0193429 -0.0483384 -0.0856868 0.0560795 0.139129 0.0229497 0.000197114 0.0315726 0.104465 -0.0368059 0.182584 -0.131297 0.0685878 -0.0780853 0.124544 -0.0224514 0.0183169 0.0684675 0.0845974 -0.113483 0.0256911 0.0390163 0.0258341 -0.110956 -0.129079 0.0198618 0.120734 0.0685627 -0.0294944 0.0481297 0.0111629 -0.0775404 0.0552295 -0.034618 -0.0402761 
0.110779 0.0584704 -0.0790266 -0.00303313 0.124504 0.285688 0.081696 -0.115685 -0.138874 -0.0634965 -0.00858505 0.0426258 0.096424 -0.0668791 0.00207361 -0.0416387 -0.0521125 0.0820066 -0.0814612 0.0727238 0.124973 -0.00655654 0.0722151 0.0862965 -0.000677108 -0.0286868 -0.159942 -0.203655 0.037821 0.0819861 0.0356451 0.141533 -0.172095 0.103001 0.0641408 0.035702 -0.0141493 0.06156 0.0460022 -0.06232 0.091475 -0.0558427 -0.0176278 0.0334364 -0.185139 -0.0081973 0.152016 0.0778873 -0.151902 0.0324628 0.0241228 -0.0279759 -0.00214225 0.0262954 0.0827444 -0.00395763 0.05104 0.186717 -0.00167628 -0.120396 -0.0631855 0.131518 0.209468 -0.197452 0.10465 -0.00536121 0.0392134 0.0287024 -0.0973334 0.136279 -0.0199284 0.113403 -0.0522075 0.070056 -0.0181782 -0.0230299 -0.0592137 -0.0164462 0.0408027 0.0394059 -0.00490925 0.0902365 0.0106287 -0.0749008 -0.0659767 -0.00470464 0.0795977 -0.00322507 -0.064787 0.0550675 0.18986 -0.12666 -0.00533476 -0.0382844 -0.0864913 -0.0838203 0.0304958 0.142565 0.0202249 0.00552944 0.0566347 0.0845391 -0.0371867 0.176617 -0.0803976 0.0475278 -0.0829231 0.133741 -0.0197003 0.0279002 0.0433278 0.106972 -0.0857887 0.00170301 0.0427357 0.0535447 -0.104624 -0.0905732 0.00512595 0.133475 0.0651452 -0.0511221 0.0389478 0.0272171 -0.0817261 0.0450109 -0.0412675 -0.0263904 
0.12511 0.0155261 -0.101298 -0.00533739 0.114138 0.263957 0.106889 -0.0860395 -0.10126 -0.107007 -0.00447267 0.0676875 0.121378 -0.0938291 -0.0534543 -0.0542092 -0.0684065 0.0758364 -0.122996 0.092109 0.167505 -0.0244936 0.0582784 0.107328 -0.0368202 -0.0606381 -0.152308 -0.231574 -0.00395968 0.110531 0.0086788 0.103003 -0.16484 0.117937 0.0535433 0.00290318 -0.0142697 0.0621503 0.0163237 -0.0550544 0.0832098 -0.0502366 -0.0148818 0.060563 -0.172503 -0.0437403 0.13524 0.0572461 -0.122611 0.0642413 0.0192439 -0.0860629 -0.0130523 0.050859 0.0888911 -0.00629622 0.0373251 0.180193 -0.0114307 -0.116818 -0.0323149 0.112921 0.20399 -0.179698 0.084006 -0.0757183 0.0335403 0.0118143 -0.0841977 0.0724742 -0.023474 0.0811025 -0.045665 0.0382848 -0.0477102 0.00235583 -0.0415937 -0.0207662 0.0371774 0.0716858 -0.0135027 0.05366 0.00319328 -0.0551257 -0.0833472 0.0296742 0.0978788 -0.0192765 -0.0659995 0.0355957 0.169554 -0.173776 -0.0144589 -0.0453183 -0.106789 -0.0706341 0.00140867 0.109769 0.0197972 0.0313369 0.068673 0.0813694 -0.0416993 0.198689 -0.0604856 0.011599 -0.0991354 0.159061 -0.0785409 0.0349481 0.0361437 0.0759027 -0.0955977 0.00178643 -5.86379e-05 0.101308 -0.093403 -0.0662453 -0.0269232 0.129234 0.0239743 -0.0265531 0.0111777 0.0389037 -0.0799715 0.0277297 -0.0853583 -0.0395389 
0.114928 -0.00379041 -0.104037 -0.0127499 0.111938 0.219306 0.0824267 -0.0817385 -0.0522196 -0.127755 0.0110133 0.0730109 0.136002 -0.0719512 -0.0996757 -0.0212943 -0.0811199 0.0853514 -0.167388 0.110982 0.215887 -0.0444335 0.0648947 0.135464 -0.0460393 -0.08125 -0.130973 -0.23635 -0.0137634 0.144277 -0.00900688 0.0655164 -0.128399 0.0982234 0.0457363 0.0106749 -0.0412371 0.0849159 -0.0228215 -0.0517976 0.0328386 -0.0183009 -0.0198218 0.0751274 -0.128923 -0.0435352 0.134637 0.0514313 -0.115302 0.0691704 0.00412397 -0.103189 -0.00689906 0.0478516 0.107321 -0.00145489 0.031514 0.175374 -0.0123392 -0.138558 -0.0217263 0.0956911 0.206584 -0.138108 0.0620101 -0.101427 0.0131096 0.0460656 -0.0702699 0.0470916 -0.00170132 0.0597646 -0.0436754 -0.0298063 -0.0505525 0.0361332 -0.046608 -0.0116248 0.0273446 0.0855813 0.00185603 0.0531278 -0.0261584 -0.053485 -0.112721 0.0692386 0.0848416 -0.0145173 -0.0612772 0.0330267 0.137136 -0.187527 -0.029455 -0.0340209 -0.107723 -0.0486354 -0.042363 0.101025 0.031223 0.0226668 0.0984627 0.0475985 -0.0469595 0.168881 -0.0682985 0.0101334 -0.126259 0.143554 -0.0768037 0.00861745 0.024899 0.0752711 -0.100245 -0.000312567 -0.00520305 0.158245 -0.126878 -0.0413196 -0.0519306 0.130011 -0.0076968 -0.00433208 -0.00349363 0.040569 -0.0990827 0.0554753 -0.0975024 -0.0411861 
0.100173 -0.00991491 -0.112496 -0.0279567 0.108637 0.215149 0.0695932 -0.0682718 -0.0484862 -0.139387 0.0152278 0.087891 0.118957 -0.0905289 -0.112584 -0.0461729 -0.11029 0.0627097 -0.151525 0.131244 0.207263 -0.0502369 0.052922 0.136925 -0.0472348 -0.0624425 -0.10257 -0.229927 -0.00553172 0.128073 -0.0117232 0.0237842 -0.119362 0.0905972 0.0371293 0.0203195 -0.0579415 0.0706974 -0.0405085 -0.0546261 0.0480457 -0.0341192 -0.0276364 0.106403 -0.137922 -0.0360753 0.145431 0.0517055 -0.12202 0.0810595 -0.028267 -0.0874984 -0.0169758 0.0440942 0.124858 -0.000105825 0.00183988 0.185703 -0.038663 -0.139995 -0.021809 0.0891761 0.245261 -0.107176 0.057421 -0.110181 0.0109219 0.030813 -0.0578124 0.055648 -0.00125019 0.0556067 -0.0455499 -0.0147819 -0.0297039 0.0308818 -0.0545457 0.00427834 0.0358005 0.0885303 -0.0164416 0.0596482 -0.0197685 -0.0460214 -0.110682 0.0647642 0.0902441 0.0135562 -0.038499 0.0380612 0.155215 -0.182938 -0.0389894 -0.0341087 -0.0989168 -0.070419 -0.0396523 0.0910803 0.038201 0.000345391 0.0812285 0.0458672 -0.043827 0.136475 -0.084671 0.036872 -0.123425 0.153627 -0.0815167 0.00333157 0.0517655 0.0812307 -0.107439 -0.00317003 -0.00504798 0.152942 -0.111907 -0.0599871 -0.022871 0.139505 -0.00469588 -0.0109057 -0.00429998 0.0391975 -0.113209 0.0632101 -0.0769317 -0.0312799 
0.0742037 0.0148948 -0.121568 -0.0122781 0.106095 0.225244 0.0368707 -0.112029 -0.0501947 -0.120256 0.0342663 0.109491 0.0917311 -0.0560885 -0.117682 -0.0432862 -0.109749 0.0601397 -0.0841734 0.124101 0.20127 -0.0668155 0.0509301 0.141016 -0.00533093 -0.0306471 -0.0769486 -0.21274 0.0221639 0.153293 4.93038e-05 0.000698074 -0.0897236 0.0486806 0.0468183 0.0503099 -0.0773152 0.0601547 -0.0168073 -0.0671895 0.0287115 -0.0277986 -0.0228459 0.102932 -0.144629 -0.0272167 0.16985 0.0300908 -0.127124 0.0495717 -0.0336638 -0.0304971 0.00350391 0.0324825 0.150586 0.0277715 -0.00635566 0.210514 -0.0641137 -0.137347 -0.0483833 0.0725175 0.300101 -0.125711 0.082455 -0.0672604 0.00043837 0.0265443 -0.0787279 0.100174 0.015838 0.0746951 -0.0726641 -0.0249181 0.0039444 0.0429766 -0.0513299 0.00164549 0.0314599 0.0777543 -0.0459223 0.0822919 0.00432081 -0.0317157 -0.107687 0.0362208 0.073592 0.0253077 -0.0144919 0.0397856 0.137255 -0.171323 -0.0248678 -0.00381331 -0.0673153 -0.111386 -0.0319252 0.111854 0.0604315 -0.0170004 0.074129 0.0533361 -0.0420275 0.0917351 -0.113237 0.0966043 -0.0882786 0.116232 -0.0591502 -0.0151769 0.0529012 0.0694981 -0.0902779 -0.00793402 0.0293335 0.146802 -0.106865 -0.0622276 0.00800043 0.157506 0.0125278 -0.0517933 -0.00684789 -0.0018213 -0.12049 0.131364 -0.0192692 0.00618478 
0.0599099 0.0202689 -0.110219 0.0123528 0.113759 0.229469 0.0359419 -0.139417 -0.0630202 -0.103692 0.0197114 0.0975477 0.0682765 -0.0575087 -0.0942969 -0.0309174 -0.117451 0.074288 -0.0469564 0.107439 0.189008 -0.0661667 0.0415046 0.145974 0.0239042 -0.0261739 -0.102912 -0.22514 0.03027 0.159606 0.00679852 0.0263539 -0.0965823 0.02848 0.0679137 0.0606431 -0.08077 0.0199335 -0.00251003 -0.0827814 0.0457935 -0.0316302 0.00130991 0.087003 -0.140682 -0.00388725 0.192182 0.0278507 -0.136227 0.021971 -0.03151 -0.0377768 0.04118 0.01442 0.15729 0.0419812 0.0109364 0.202992 -0.0474311 -0.135327 -0.0462815 0.0994185 0.282105 -0.128316 0.0907821 -0.0245656 -0.00410605 0.00637701 -0.0800892 0.0997926 0.0108331 0.0942712 -0.0725105 -0.0250701 0.0156201 0.0474768 -0.0646507 -0.0026049 0.0318818 0.0638722 -0.0277536 0.110708 -0.00562736 -0.0353198 -0.0979266 0.047411 0.056355 0.0211248 -0.034699 0.0459609 0.145692 -0.127473 -0.0282865 -0.00963159 -0.0740423 -0.0958738 -0.0245431 0.135227 0.0703054 -0.0221465 0.0848688 0.0389581 -0.0184403 0.061723 -0.124869 0.109025 -0.0691506 0.10622 -0.0589223 0.0110899 0.05685 0.0616084 -0.07458 -0.0552372 0.034136 0.137194 -0.119006 -0.0623562 0.00427875 0.143261 0.0344523 -0.0683514 0.00565551 -0.021721 -0.141121 0.160163 -0.0124553 0.0116889 
0.076598 0.0217748 -0.113557 0.0190133 0.1055 0.230854 0.0404314 -0.141753 -0.0577109 -0.110286 0.0238459 0.0972588 0.0749609 -0.0607722 -0.0996138 -0.0351176 -0.100916 0.0794518 -0.0587499 0.110087 0.190147 -0.0546349 0.0391173 0.16041 0.0128686 -0.0314631 -0.097711 -0.229003 0.0211106 0.171191 -0.00189584 0.0394374 -0.0958757 0.0441531 0.0681025 0.050155 -0.0647752 0.031284 -0.0086513 -0.0824253 0.0393513 -0.0350467 -0.00130289 0.0842691 -0.138082 -0.00454026 0.190223 0.0310708 -0.137148 0.0309406 -0.011423 -0.032842 0.04529 0.0220737 0.162387 0.0384838 0.0161977 0.192382 -0.0360501 -0.143677 -0.0446704 0.0940306 0.272178 -0.137724 0.0805731 -0.039446 0.00608885 0.00376107 -0.0844457 0.0988169 0.00269053 0.07565 -0.0741288 -0.0241096 0.00834869 0.0435654 -0.0594494 -0.000762864 0.0301966 0.071274 -0.0212707 0.114012 -0.00945901 -0.0482271 -0.0880394 0.0459046 0.0543153 0.00667165 -0.0399708 0.0559364 0.142129 -0.141024 -0.0285704 -0.0115126 -0.080059 -0.0884383 -0.020633 0.126939 0.0771568 -0.0258809 0.0974436 0.0539496 -0.0187123 0.0840959 -0.124102 0.0877089 -0.0765873 0.104119 -0.0675272 0.0152333 0.0600276 0.0666606 -0.0788127 -0.0530607 0.0241852 0.137162 -0.121119 -0.0760726 -0.00313102 0.139963 0.0342251 -0.0589273 0.00974964 -0.0159954 -0.12772 0.147787 -0.011591 -0.00258703 
0.0746988 0.0172276 -0.101492 0.0106313 0.109459 0.236375 0.00649193 -0.158986 -0.102213 -0.0964281 0.00222336 0.0825998 0.0623587 -0.062387 -0.061991 -0.0374935 -0.092797 0.0903546 -0.00566734 0.119832 0.158477 -0.0231497 0.0684821 0.138056 0.00311031 0.0121345 -0.102532 -0.249674 0.0273703 0.140758 0.00515142 0.0460938 -0.101529 0.0245944 0.10161 0.0643748 -0.0509017 0.0454208 0.015174 -0.0819954 0.0328034 -0.0271857 -0.0219232 0.0860776 -0.169166 0.0253422 0.21247 0.0428545 -0.141534 0.0389556 -0.00992709 -0.0252505 0.0559231 0.0274228 0.148295 0.0133573 0.0635172 0.173502 -0.0211996 -0.145865 -0.0371838 0.107781 0.264018 -0.135081 0.100709 -0.0610056 0.0252166 -0.00319029 -0.0601948 0.116682 0.000399121 0.0843923 -0.0672625 -0.00129222 -0.000133149 0.00485969 -0.0951727 0.00420208 0.0513068 0.0774768 -0.00660142 0.13831 -0.0160389 -0.0533303 -0.0562097 0.00802626 0.0447456 0.0209119 -0.0439743 0.0470542 0.156965 -0.0823049 -0.0146977 -0.0192519 -0.0792324 -0.109191 0.00943314 0.172752 0.0597343 -0.0419909 0.080354 0.0684647 -0.0161354 0.0670889 -0.115626 0.0792654 -0.0514148 0.0898098 -0.0320006 0.0511084 0.0661316 0.0714133 -0.0695899 -0.0615473 0.011874 0.119082 -0.114879 -0.122236 -0.0234821 0.120251 0.0422829 -0.0593241 0.0274765 -0.0312576 -0.136294 0.128434 0.00144522 0.0170758 
0.0781869 0.0402046 -0.10298 0.0172741 0.112418 0.25706 0.00959384 -0.174887 -0.11612 -0.0815435 -0.00126965 0.0736247 0.0578721 -0.0584969 -0.0561894 -0.0288136 -0.0726837 0.108974 0.00247408 0.09916 0.148775 -0.00884129 0.0612087 0.121835 0.00648414 0.00607399 -0.122476 -0.232913 0.0315225 0.143783 -0.00156148 0.0737624 -0.112071 0.0270209 0.112512 0.064513 -0.0342353 0.0191242 0.0369719 -0.0901115 0.034915 -0.0308864 0.00291578 0.058688 -0.165627 0.0329557 0.213633 0.0502286 -0.15683 0.033365 0.00691505 -0.0159005 0.0591275 0.0299642 0.135881 0.0159253 0.0769269 0.157117 -0.0178194 -0.136084 -0.0335951 0.129534 0.253482 -0.160264 0.103453 -0.0383617 0.019998 -0.00195097 -0.0739222 0.130191 0.000950449 0.0851034 -0.0702306 0.00386132 -0.00670733 0.0110575 -0.0834876 -0.00447349 0.0463445 0.0457368 0.00292598 0.15463 -0.0123187 -0.0486469 -0.0520692 0.0182067 0.0309565 0.00728013 -0.0509281 0.0676963 0.160863 -0.0819087 -0.0147174 -0.0103424 -0.0740554 -0.0991591 0.0157292 0.181958 0.0504739 -0.0336777 0.0922548 0.0776912 -0.0182366 0.0724368 -0.105881 0.0807474 -0.0389899 0.0820713 -0.0447188 0.0692374 0.0628353 0.0565317 -0.0497939 -0.0596269 0.0125939 0.0963935 -0.11473 -0.113514 -0.023822 0.11032 0.0540615 -0.0747575 0.0464775 -0.0402413 -0.128041 0.130268 0.00632795 0.00656166 
0.0657173 0.0409226 -0.107447 0.0152252 0.115386 0.248569 0.000731756 -0.192854 -0.0982877 -0.070356 -0.00133976 0.0690985 0.050883 -0.0492229 -0.0489829 -0.0293528 -0.0804153 0.105797 0.0181347 0.0983709 0.135944 -0.00431832 0.0609937 0.115249 0.00746542 0.0195397 -0.127837 -0.232537 0.036955 0.142565 0.012644 0.0677547 -0.105639 0.00302709 0.124078 0.0813881 -0.0353154 0.0230936 0.0436471 -0.0869578 0.0344967 -0.0182325 -0.013635 0.0600674 -0.171991 0.0387851 0.208428 0.0582715 -0.133131 0.0231826 -0.0102646 -0.00229892 0.0660455 0.0265167 0.137898 0.0140782 0.0805211 0.156651 -0.0234825 -0.133236 -0.0411676 0.123109 0.259124 -0.152774 0.103734 -0.0399825 0.0291627 0.00379453 -0.0594803 0.127951 0.0162842 0.0979188 -0.0653308 0.0062275 -0.00205323 0.00722203 -0.103738 -0.000999735 0.0486174 0.0461839 0.0120475 0.169208 -0.0109352 -0.0373427 -0.0411067 0.00785194 0.0286608 0.0188865 -0.0467807 0.0514 0.155485 -0.0609854 -0.000360201 -0.0161754 -0.0709328 -0.122008 0.0161443 0.185516 0.0537339 -0.0419923 0.0936376 0.072495 -0.0103068 0.0466363 -0.111831 0.0900041 -0.0292413 0.0648456 -0.0227073 0.0919586 0.0683731 0.0495118 -0.048055 -0.0617215 0.0074395 0.0995311 -0.114964 -0.119 -0.0340886 0.100902 0.0591474 -0.0749445 0.0458181 -0.0440135 -0.144917 0.137225 0.00599785 0.0295905 
0.0696885 0.0412288 -0.102123 0.0179026 0.107955 0.249832 -0.00172565 -0.194494 -0.104193 -0.0633641 -0.00314605 0.0641781 0.0528347 -0.0527487 -0.0468057 -0.0205064 -0.0867996 0.114366 0.016805 0.0967139 0.137089 -0.00849052 0.0671598 0.119445 0.00628485 0.0149512 -0.12985 -0.237553 0.0306 0.143832 0.00347623 0.0709534 -0.109738 0.00474032 0.126077 0.0781628 -0.0383454 0.0184931 0.0471371 -0.0881356 0.0222768 -0.0288107 -0.0106182 0.0551346 -0.166253 0.0385243 0.209569 0.061021 -0.139671 0.0343049 0.00161639 -0.00656716 0.0684424 0.0291112 0.135053 0.010038 0.0915025 0.145645 -0.0155748 -0.13395 -0.0329695 0.127892 0.251991 -0.151028 0.0994006 -0.0394355 0.0228948 0.00531049 -0.0642694 0.128697 0.0102698 0.098212 -0.0680678 0.00428405 -0.00627843 0.00307795 -0.100238 -0.00721958 0.0522309 0.0515438 0.0206411 0.161712 -0.0199444 -0.0422587 -0.0482564 0.0146117 0.0197936 0.0126636 -0.0454818 0.0586776 0.150833 -0.056299 0.000136588 -0.0138764 -0.0788053 -0.11159 0.0106268 0.191555 0.0567955 -0.0428541 0.105469 0.0702278 -0.0133882 0.0444306 -0.0986292 0.0836962 -0.0299743 0.0654842 -0.0236048 0.0933807 0.0622804 0.0546885 -0.0358304 -0.0688259 0.00734255 0.104897 -0.112884 -0.108405 -0.0368558 0.100799 0.0593754 -0.0825123 0.051564 -0.0468022 -0.145784 0.13782 0.0089233 0.0272394 
0.0710545 0.0348773 -0.10317 0.0152542 0.108379 0.249273 -0.00270817 -0.177022 -0.117121 -0.0655713 -0.00428315 0.0665836 0.051639 -0.0564894 -0.0432378 -0.0272506 -0.0793486 0.10997 0.0299107 0.101037 0.137694 -0.00814282 0.0720933 0.121218 0.0081654 0.0204369 -0.11809 -0.241006 0.0360374 0.13389 0.00160042 0.0575803 -0.104839 0.00500929 0.120608 0.0703871 -0.0348462 0.0236569 0.0435698 -0.0885003 0.0304464 -0.024876 -0.00838313 0.0655632 -0.181572 0.0320633 0.216132 0.050441 -0.13953 0.0362939 0.00293113 -0.0117117 0.062202 0.0338103 0.137863 0.00958155 0.0949216 0.149514 -0.0144181 -0.14056 -0.0331787 0.119996 0.254713 -0.151653 0.102726 -0.0438891 0.0242139 -0.00433209 -0.058018 0.124744 0.00531765 0.0995172 -0.0682247 0.00762397 -0.00169387 -0.00147431 -0.101163 0.00366866 0.0571255 0.0530068 0.00833184 0.161622 -0.00867926 -0.0410086 -0.0372585 0.00821966 0.0264929 0.0221533 -0.0403151 0.0502839 0.151425 -0.0548294 -0.00699861 -0.0183831 -0.0744362 -0.121444 0.0193495 0.198999 0.0483715 -0.0461972 0.0904793 0.0741042 -0.00549297 0.050289 -0.107028 0.0839745 -0.0274478 0.0678896 -0.0241711 0.0838816 0.0667907 0.0561893 -0.0365485 -0.0670249 0.0071619 0.0973418 -0.106887 -0.125342 -0.0367426 0.100715 0.0554792 -0.0796451 0.0478615 -0.0499107 -0.144808 0.1337 0.0114799 0.0314113 
0.0715141 0.0541957 -0.107375 0.0162862 0.10713 0.255976 0.00333371 -0.178611 -0.113817 -0.0680201 -0.00023706 0.059354 0.0508065 -0.0725971 -0.0460365 -0.0331481 -0.0802036 0.0961434 0.0211739 0.102977 0.13353 -0.014138 0.0558368 0.108377 0.0108474 0.0200891 -0.130954 -0.234246 0.043252 0.131692 0.0123721 0.0697366 -0.110873 0.0133869 0.118987 0.0706007 -0.0304756 0.0199596 0.0537126 -0.0916753 0.0440931 -0.0416741 -0.00609883 0.0587042 -0.169702 0.0387316 0.214609 0.0568111 -0.151305 0.0284191 -0.0103151 0.00385424 0.0628466 0.0294664 0.130104 0.00807708 0.0792487 0.145482 -0.0242672 -0.140857 -0.0403289 0.125286 0.260348 -0.157235 0.097697 -0.0309436 0.0316174 -0.00940009 -0.0643794 0.115573 -0.00022545 0.0896431 -0.0714639 0.0198462 0.00818129 -0.0045033 -0.0966778 0.000877435 0.0545895 0.0610213 0.000630848 0.156533 -0.00593262 -0.0388751 -0.0358463 0.0145315 0.0259663 0.0173316 -0.0378092 0.0545291 0.162533 -0.0640011 -0.005177 -0.0116551 -0.0757733 -0.125707 0.0253981 0.187041 0.044576 -0.0475107 0.0856972 0.0773784 -0.0115062 0.0598519 -0.108524 0.0960594 -0.0204838 0.0879959 -0.0225953 0.0846875 0.0700611 0.0533048 -0.0540587 -0.062438 0.0102654 0.0868256 -0.116325 -0.120499 -0.0184485 0.102546 0.0587585 -0.0815793 0.0512511 -0.0416521 -0.134272 0.127721 0.0144653 0.0231723 
0.0657296 0.0167801 -0.10263 0.0258179 0.113081 0.237106 0.00372677 -0.175594 -0.0836009 -0.0951786 -0.00471077 0.0764033 0.0529953 -0.0636095 -0.054195 -0.0383278 -0.0985226 0.087628 0.00759787 0.110293 0.152743 -0.0274217 0.0648436 0.138181 0.0191847 0.00523078 -0.118037 -0.253749 0.0147848 0.141375 0.0220068 0.040767 -0.104877 0.00820853 0.114093 0.0731441 -0.0438234 0.0257782 0.0227695 -0.0879204 0.0476712 -0.0206484 -0.0136977 0.0823244 -0.172557 0.021848 0.210148 0.0451101 -0.114136 0.0305065 -0.0110874 -0.0314389 0.0699287 0.0257518 0.155966 0.0120464 0.0650674 0.161485 -0.0125336 -0.150155 -0.0380836 0.109045 0.24894 -0.139552 0.0989818 -0.0558367 0.0337293 -0.00508087 -0.0482488 0.107245 0.0115433 0.103357 -0.0607273 -0.00904262 0.00323601 0.0114708 -0.109116 0.00678282 0.0500723 0.0862094 0.00183199 0.151787 -0.00646847 -0.0392446 -0.0469392 0.0140057 0.0434751 0.0272173 -0.0512423 0.0318394 0.14573 -0.0684956 -0.00250584 -0.0320461 -0.0915162 -0.123174 0.00845376 0.175016 0.0560153 -0.047413 0.0851935 0.0623179 0.00135985 0.0480572 -0.115073 0.0802561 -0.0422247 0.0841025 -0.0345388 0.0807646 0.0662138 0.0545894 -0.0625886 -0.0708701 0.000888711 0.117165 -0.121855 -0.115998 -0.0420512 0.108531 0.0479421 -0.0560377 0.0264383 -0.0368558 -0.146219 0.133028 -0.00358675 0.0353336 
0.0538067 0.0348649 -0.0898365 0.0430917 0.108355 0.248007 0.00904503 -0.201118 -0.0744531 -0.0812581 -0.0035154 0.0720662 0.0397164 -0.0595884 -0.0453803 -0.030095 -0.0975598 0.0979656 0.0153525 0.0910916 0.138883 -0.0216999 0.0478095 0.132706 0.0272762 0.00582314 -0.145453 -0.242346 0.0205777 0.145423 0.0341219 0.0726318 -0.112364 0.0014964 0.122383 0.0862724 -0.039237 0.00700074 0.0398831 -0.0847575 0.0586747 -0.0257041 -0.00850502 0.0468403 -0.1567 0.0235436 0.205177 0.044049 -0.114204 0.00802129 -0.00931458 -0.0123996 0.0852363 0.0199149 0.150024 0.0277516 0.0683603 0.154161 -0.0184784 -0.130858 -0.0464334 0.126159 0.238839 -0.161482 0.104851 -0.023288 0.0421531 -0.013896 -0.0650963 0.119603 0.0158378 0.109534 -0.0643132 0.00565697 0.0104991 0.0164955 -0.104674 -0.00414788 0.0406046 0.063511 0.00839526 0.169478 -0.00392869 -0.0343835 -0.0440122 0.0210731 0.0361589 0.0157818 -0.065561 0.0400472 0.145736 -0.0613289 0.0131331 -0.0208486 -0.0877192 -0.116664 0.0116999 0.168987 0.0648358 -0.0347393 0.0937964 0.0586121 -0.00672505 0.04118 -0.102993 0.0929599 -0.0211734 0.0647454 -0.0371094 0.0999663 0.0527338 0.0413618 -0.0515697 -0.0840598 0.00700797 0.10447 -0.123031 -0.105595 -0.0373495 0.10143 0.0659743 -0.0707711 0.0318843 -0.0461622 -0.145396 0.156664 0.00211698 0.0388999 
0.0562382 0.0345627 -0.0847436 0.0386613 0.113577 0.251653 0.0144676 -0.185369 -0.0826488 -0.085367 -0.00367604 0.0730528 0.0400758 -0.0634018 -0.0408486 -0.037299 -0.0993899 0.0985984 0.00749759 0.10016 0.13972 -0.0275005 0.0573791 0.128818 0.0255871 -0.00367716 -0.142754 -0.236917 0.022718 0.133827 0.0300272 0.0627348 -0.107712 0.010834 0.119766 0.0818444 -0.0414557 0.0152206 0.0284418 -0.0943532 0.0624333 -0.0285427 -0.00543915 0.0497657 -0.172489 0.020262 0.204233 0.0439059 -0.125907 0.0227975 -0.017967 -0.0207074 0.0745174 0.0215756 0.149445 0.0263311 0.0589525 0.160033 -0.0294802 -0.133675 -0.0518177 0.126495 0.249395 -0.164623 0.111836 -0.0134332 0.0301834 -0.0172867 -0.0804797 0.122548 0.013675 0.106672 -0.0628545 0.011334 0.0122088 0.015656 -0.0963306 -0.0103022 0.0496318 0.0558303 -0.0046656 0.157076 -0.00547394 -0.0379474 -0.0455207 0.0186843 0.0347788 0.0252891 -0.0549238 0.0517299 0.159343 -0.0710204 0.00611644 -0.0208804 -0.0816481 -0.118607 0.00935149 0.170899 0.0571774 -0.0340143 0.08686 0.0572694 -0.00998764 0.038732 -0.105716 0.101796 -0.0201743 0.0692332 -0.0310702 0.0847175 0.0561068 0.0504358 -0.0487263 -0.0739356 0.0167116 0.0972714 -0.115456 -0.101069 -0.0241001 0.114119 0.0641424 -0.0749632 0.0281263 -0.0384695 -0.135476 0.152284 0.014079 0.0305819 
0.0686578 0.0311182 -0.106474 0.0226023 0.105979 0.248488 0.00344953 -0.176265 -0.105379 -0.0677371 -0.00188864 0.0718734 0.0589472 -0.0563315 -0.0454928 -0.02434 -0.0902058 0.0952774 0.0213243 0.0965114 0.146703 -0.0304621 0.0718103 0.137072 0.0246514 0.0114645 -0.120603 -0.247551 0.0307025 0.143674 0.0163827 0.0588777 -0.11101 0.00674434 0.0990173 0.0718059 -0.0549243 0.020649 0.0414915 -0.0739029 0.0345614 -0.0283079 -0.0117125 0.0664011 -0.168842 0.012466 0.212661 0.0435307 -0.125144 0.0258436 0.00895815 -0.0169432 0.0634957 0.024728 0.140358 0.016922 0.084691 0.168219 -0.00529831 -0.139414 -0.0441824 0.11628 0.251999 -0.155226 0.096572 -0.0370074 0.0288325 -0.00431948 -0.0627651 0.116849 0.00391223 0.11948 -0.0717593 0.00791584 0.00784057 0.00573449 -0.0970294 -0.00161642 0.0469579 0.0771013 0.00242527 0.144841 -1.89293e-05 -0.0392772 -0.053536 0.0156779 0.0382658 0.014277 -0.0447522 0.0263862 0.133569 -0.0606251 -0.00150158 -0.0222167 -0.0786754 -0.11935 0.0136851 0.190102 0.0552877 -0.0398223 0.0841745 0.0623492 -0.00313955 0.0634012 -0.113254 0.086947 -0.0439427 0.0776968 -0.025942 0.0684601 0.0580922 0.0619164 -0.0461229 -0.0739898 0.0103337 0.114053 -0.110392 -0.106312 -0.0321446 0.115499 0.0551925 -0.0793575 0.0348373 -0.0486795 -0.155263 0.142288 -0.00592709 0.0426465 
0.0490978 0.0358904 -0.109637 0.0173523 0.095149 0.238195 -0.0122234 -0.173247 -0.108984 -0.0738679 0.00407435 0.0671372 0.0584013 -0.0351377 -0.0689089 -0.021994 -0.0905342 0.0894364 0.037911 0.104637 0.159393 -0.0508711 0.0684484 0.0985545 0.0206984 0.0314178 -0.120776 -0.229413 0.0446635 0.135593 0.0082378 0.0562146 -0.0907765 -0.00500893 0.101756 0.0777065 -0.0533153 0.0441207 0.0496259 -0.100071 0.0220868 -0.0264663 -0.00567895 0.0538804 -0.159979 0.0113389 0.218372 0.0351101 -0.144832 0.0120145 -0.0321662 -0.00470016 0.0689692 0.0355161 0.139139 0.021154 0.0867329 0.157567 -0.0364772 -0.154242 -0.0365972 0.122225 0.279665 -0.147721 0.108893 0.00275471 0.0170447 0.000701075 -0.0577585 0.112964 0.00360219 0.0953663 -0.0776248 0.00633642 0.0152204 0.00605754 -0.0842537 -0.0158392 0.0533348 0.0528358 -0.021983 0.144401 -0.000175113 -0.0369154 -0.0546515 0.0147091 0.0276799 0.0387826 -0.0150297 0.0296375 0.1531 -0.0629617 0.00369318 0.00170395 -0.0642029 -0.130148 0.0157918 0.206583 0.0475521 -0.0370956 0.0851965 0.0583522 -0.0200633 0.0448182 -0.106028 0.119943 -0.0164603 0.0731826 -0.0211851 0.0518833 0.0478376 0.0498962 -0.0521989 -0.0633258 0.0296259 0.101028 -0.107558 -0.106709 -0.00949261 0.104926 0.0385026 -0.0863468 0.0410881 -0.0624841 -0.15119 0.159656 0.0207672 0.0465531 
