{
  "descriptor": [
    -0.0824381560087204,
    0.04923547804355621,
    0.1257864087820053,
    -0.09462597221136093,
    -0.19076795876026154,
    0.027219127863645554,
    -0.07660498470067978,
    -0.0919526070356369,
    0.1966945230960846,
    -0.15954360365867615,
    0.21811966598033905,
    -0.0273838359862566,
    -0.2299376279115677,
    0.06486670672893524,
    -0.06891164928674698,
    0.13375434279441833,
    -0.12887157499790192,
    -0.17056456208229065,
    -0.005141087342053652,
    -0.07114502042531967,
    0.01922721229493618,
    0.13572190701961517,
    -0.00895693339407444,
    0.06635016202926636,
    -0.11548615992069244,
    -0.3849729895591736,
    -0.08062447607517242,
    -0.1067357212305069,
    0.04160256311297417,
    -0.1359182745218277,
    -0.06376463919878006,
    0.11636234074831009,
    -0.1248081848025322,
    0.00724085932597518,
    0.036616720259189606,
    0.07254201173782349,
    -0.07283332198858261,
    -0.12310110777616501,
    0.2576243281364441,
    0.12401794642210007,
    -0.2439047396183014,
    -0.009067369624972343,
    0.0438866950571537,
    0.25581324100494385,
    0.12005263566970825,
    -0.05354444310069084,
    0.032668329775333405,
    -0.04922439157962799,
    0.12469790130853653,
    -0.25777649879455566,
    0.023397063836455345,
    0.2292591631412506,
    0.05138305202126503,
    0.0813385546207428,
    0.07927374541759491,
    -0.1264868974685669,
    -0.013245119713246822,
    0.11098047345876694,
    -0.15173427760601044,
    0.07183899730443954,
    0.09062245488166809,
    -0.07427994161844254,
    -0.0045316931791603565,
    -0.05055087432265282,
    0.17348599433898926,
    0.1063859611749649,
    -0.08467242866754532,
    -0.11734572052955627,
    0.1367131918668747,
    -0.13174451887607574,
    -0.14670641720294952,
    0.07850158959627151,
    -0.16068443655967712,
    -0.14856591820716858,
    -0.18857569992542267,
    0.04644578695297241,
    0.40752607583999634,
    0.11587981879711151,
    -0.1090899258852005,
    0.050587113946676254,
    -0.03482356667518616,
    -0.07824194431304932,
    0.01659194566309452,
    0.09090391546487808,
    -0.08703655749559402,
    0.03977842628955841,
    -0.01240640226751566,
    0.04740310460329056,
    0.2218385636806488,
    0.04589265584945679,
    0.014359423890709877,
    0.24767225980758667,
    -0.0028424386400729418,
    0.07979050278663635,
    0.08772168308496475,
    0.08376257866621017,
    -0.08243551850318909,
    -0.07595540583133698,
    -0.13819575309753418,
    -0.02767935022711754,
    -0.013362101279199123,
    -0.0940554141998291,
    -0.013484622351825237,
    0.1313350945711136,
    -0.25514379143714905,
    0.1513350009918213,
    -0.039450109004974365,
    -0.08377491682767868,
    -0.025056684389710426,
    0.03814001381397247,
    -0.073619045317173,
    -0.00029271439416334033,
    0.15976524353027344,
    -0.21955379843711853,
    0.14273031055927277,
    0.1639287769794464,
    0.0865098237991333,
    0.13570520281791687,
    0.08708302676677704,
    -0.024528175592422485,
    -0.016385551542043686,
    -0.08908205479383469,
    -0.1355661302804947,
    -0.1154446229338646,
    0.06839291751384735,
    -0.013347632251679897,
    -0.025470921769738197,
    0.0020968622993677855
  ]
}