{
  "descriptor": [
    -0.07796257734298706,
    0.07276271283626556,
    0.08129402250051498,
    -0.06808653473854065,
    -0.1743297427892685,
    0.049509670585393906,
    -0.0824003666639328,
    -0.021039962768554688,
    0.17857488989830017,
    -0.17570938169956207,
    0.16384801268577576,
    -0.017740707844495773,
    -0.21987327933311462,
    0.08722051233053207,
    -0.10350232571363449,
    0.16728045046329498,
    -0.15130053460597992,
    -0.1993570774793625,
    -0.019909603521227837,
    -0.09571366012096405,
    0.030983835458755493,
    0.0766340121626854,
    -0.021797943860292435,
    0.09781504422426224,
    -0.15765784680843353,
    -0.33923617005348206,
    -0.06535464525222778,
    -0.0855942964553833,
    0.02627774141728878,
    -0.13731510937213898,
    -0.08960665762424469,
    0.03663115203380585,
    -0.1666419953107834,
    0.02706824615597725,
    0.053762421011924744,
    0.07967998087406158,
    -0.02140679955482483,
    -0.10503550618886948,
    0.21314941346645355,
    0.13995486497879028,
    -0.24399347603321075,
    0.018572423607110977,
    0.0807095319032669,
    0.2696962356567383,
    0.13225796818733215,
    0.013033728115260601,
    0.02453470230102539,
    -0.048960551619529724,
    0.18124574422836304,
    -0.278120756149292,
    0.05722180753946304,
    0.1959865540266037,
    0.06772314757108688,
    0.07196516543626785,
    0.07718617469072342,
    -0.1585003137588501,
    -0.00971260853111744,
    0.13093367218971252,
    -0.13033530116081238,
    0.09838622808456421,
    0.04044550284743309,
    -0.041143741458654404,
    0.0013616651995107532,
    -0.054104283452034,
    0.21119967103004456,
    0.10786040127277374,
    -0.0847877487540245,
    -0.17212934792041779,
    0.2410600185394287,
    -0.14933402836322784,
    -0.08380147069692612,
    0.11962307244539261,
    -0.0982205867767334,
    -0.15596497058868408,
    -0.14613725244998932,
    0.06611939519643784,
    0.4360767602920532,
    0.16557341814041138,
    -0.08571070432662964,
    0.07712205499410629,
    -0.040386296808719635,
    -0.08375798165798187,
    -0.031910452991724014,
    0.14478784799575806,
    -0.07834140211343765,
    0.08324187994003296,
    -0.038276851177215576,
    0.051376547664403915,
    0.26156851649284363,
    0.049133818596601486,
    0.026512736454606056,
    0.26282092928886414,
    0.011258522979915142,
    0.05608227476477623,
    0.0800824984908104,
    0.06343422830104828,
    -0.1727815717458725,
    -0.05722438916563988,
    -0.150204136967659,
    -0.0867079570889473,
    -0.023678848519921303,
    -0.07256583124399185,
    -0.024069271981716156,
    0.12919236719608307,
    -0.22483520209789276,
    0.13333360850811005,
    -0.10389012843370438,
    -0.08679156005382538,
    -0.0762040987610817,
    0.08223523199558258,
    -0.04611431062221527,
    -0.012527297250926495,
    0.1201099157333374,
    -0.23731398582458496,
    0.11842039972543716,
    0.15086382627487183,
    0.1053716167807579,
    0.11797802895307541,
    0.08682236075401306,
    -0.0002932161442004144,
    0.06212615966796875,
    -0.09293343871831894,
    -0.15645171701908112,
    -0.1193951666355133,
    0.04248226806521416,
    -0.09204430878162384,
    -0.015072277747094631,
    0.011980853974819183
  ]
}