-0.0523811 0.206741 -0.085191 -0.0765616 -0.0344265 0.215828 -0.0524506 -0.0484486 -0.128559 0.1659 0.0293506 -0.0635241 0.0883195 -0.125228 -0.0169429 0.0245296 -0.0808586 0.0987499 0.0789561 -0.0284362 0.111775 -0.0840707 -0.00768191 0.0801575 0.00855891 0.0588796 -0.0524381 -0.191111 0.186774 0.0996004 0.0387593 0.0501669 -0.0388839 -0.0345694 0.070598 0.0243683 -0.0397497 -0.0224466 0.0862577 -0.032484 -0.0311959 -0.18824 -0.019367 0.105151 -0.0287554 0.0212887 0.21288 0.0671349 -0.270636 -0.131293 0.0376608 0.0723767 0.0490041 -0.0656111 -0.0202905 0.11519 0.0939057 0.0460345 0.0308667 -0.168775 -0.0380448 0.0588733 0.19152 -0.078159 0.0623803 0.0194054 0.0161263 -0.0404525 -0.0498808 0.0589255 -0.114743 0.0146445 -0.156279 -0.0590961 0.0648611 -0.0503264 -0.0881912 0.121947 0.0606396 0.0431158 -0.0551039 0.0693257 -0.0193603 0.0270305 -0.0345109 0.0422997 -0.00278969 -0.0381863 0.0639837 0.0517936 0.0289176 0.00144911 -0.0360653 0.042513 -0.0491465 -0.0590562 0.00967101 0.203609 0.012413 -0.0375593 0.118478 0.0558346 -0.0390512 0.0482443 -0.0553435 0.0830636 -0.0145721 0.0610563 0.0266622 -0.0155234 0.00439953 0.049709 -0.0522138 -0.140848 0.0480825 0.0499874 -0.138448 -0.132933 0.0615445 0.0628139 0.085263 -0.176619 0.0162409 -0.066222 -0.123407 0.137327 -0.0293368 0.030726 
-0.0438634 0.19513 -0.0511508 -0.0682945 -0.0255548 0.211854 -0.0515389 -0.0418488 -0.143636 0.136789 0.0262845 -0.0439715 0.0830955 -0.149185 -0.0335015 0.0304916 -0.111775 0.0919748 0.0501766 0.00685866 0.13913 -0.104371 0.0164606 0.0827664 0.0163507 0.0655779 -0.0592083 -0.198452 0.181409 0.0804627 0.0373089 0.0351539 -0.05049 -0.0149677 0.0628829 0.0131497 -0.0595931 0.0124417 0.0884554 -0.0426873 -0.0278289 -0.190436 -0.0105898 0.108985 -0.0387183 -0.00645852 0.225277 0.0541263 -0.277453 -0.0914588 0.03528 0.0573163 0.0229515 -0.0465385 0.00148461 0.0903562 0.0894168 0.056263 0.0156975 -0.188563 -0.0300888 0.0509698 0.205531 -0.0678181 0.075691 0.0102123 0.00189975 -0.0477766 -0.0636768 0.0700234 -0.117088 0.0339258 -0.144364 -0.0260546 0.0640533 -0.0732579 -0.079039 0.118086 0.0744839 0.0702304 -0.0652202 0.0529615 -0.00785099 0.0218293 -0.0467997 0.0212374 0.00503211 -0.00284874 0.0831338 0.0449955 0.0418694 -0.00872831 -0.0375982 0.0446432 -0.0555481 -0.0658948 0.00916323 0.222071 0.00108368 -0.0425666 0.0958551 0.0518905 -0.0549456 0.0680441 -0.0352374 0.0909636 -0.0129391 0.0925835 0.0560252 -0.043242 -0.0079368 0.0826546 -0.0674964 -0.108348 0.0680959 0.0507678 -0.126982 -0.121415 0.0627155 0.0848812 0.0708957 -0.147722 0.0167738 -0.0661961 -0.123405 0.131237 -0.00297263 0.0289429 
-0.0421949 0.185239 -0.0392442 -0.0724225 -0.0364066 0.208674 -0.0466482 -0.0221921 -0.153132 0.141222 0.0308278 -0.0429719 0.0856667 -0.160071 -0.0274959 0.0287265 -0.121694 0.0927162 0.040925 0.0135101 0.125432 -0.0985527 0.0281104 0.0832601 -0.00428075 0.0766009 -0.0440988 -0.201878 0.177861 0.0572433 0.0223476 0.0294438 -0.0498324 -0.000267598 0.0560369 0.00416433 -0.0525767 0.0333531 0.0733747 -0.0338295 -0.0190583 -0.204179 -0.0215813 0.114541 -0.0606941 -0.0118686 0.221293 0.0546112 -0.282217 -0.0755711 0.0447959 0.0498612 0.00493666 -0.0327839 0.00708686 0.0851408 0.0991557 0.0489876 0.0234953 -0.188588 -0.0348429 0.0354971 0.203808 -0.0598717 0.083318 0.00327566 0.000262529 -0.051787 -0.0565593 0.0775259 -0.128004 0.0295681 -0.135758 -0.00742557 0.0711179 -0.0866383 -0.0846738 0.132406 0.0767045 0.0633402 -0.0653387 0.0386931 -0.00273562 0.0134791 -0.0505731 0.020071 0.0190118 0.00565403 0.0852494 0.0482182 0.047103 -0.0149929 -0.039165 0.030101 -0.0625923 -0.0656868 0.0118674 0.221162 0.00941688 -0.047439 0.0908899 0.0582245 -0.0520448 0.0783865 -0.0159815 0.0739218 -0.0158275 0.100269 0.0566046 -0.0580406 -0.0142509 0.102722 -0.059706 -0.108635 0.0725724 0.0428903 -0.115262 -0.131055 0.0650563 0.0827484 0.0773077 -0.148344 0.0199313 -0.056914 -0.115383 0.121722 0.000773526 0.0335002 
-0.0425219 0.140058 -0.0556806 -0.0839741 -0.0285035 0.185909 -0.0495831 0.0140272 -0.16113 0.133499 0.0380537 -0.00842497 0.0867788 -0.154078 -0.0479099 0.00638784 -0.142935 0.0796485 0.0471557 0.0645728 0.114499 -0.129213 0.0794103 0.0919434 -0.0141464 0.0765701 0.00482157 -0.213055 0.150819 0.0183184 0.00814462 -0.0470969 -0.0271952 -0.00628537 0.0187352 -0.00259601 -0.078472 0.079972 0.0215975 -0.018962 -0.0251597 -0.181359 -0.0552814 0.152603 -0.119496 -0.0363921 0.218252 0.0374965 -0.247904 -0.0140266 0.0292137 0.0218865 -0.0353232 -0.0154305 0.0247605 0.0661386 0.101131 0.0750339 0.0242293 -0.186801 -0.0394603 0.00829909 0.236691 -0.04392 0.0990388 -0.0371189 -0.0172003 -0.043194 -0.0452912 0.0905419 -0.112718 0.0569681 -0.110641 0.0152147 0.075713 -0.0882472 -0.0816304 0.149519 0.0839467 0.060588 -0.108241 0.00289776 0.00263785 0.0158349 -0.0668734 0.00438273 0.0379828 0.0463106 0.119795 0.00740086 0.0407078 -0.0252551 -0.0245962 0.00198552 -0.0407334 -0.108498 0.00344705 0.226073 0.00807012 -0.0576088 0.0544233 0.0493484 -0.0440361 0.0596018 -0.0118483 0.0802067 -0.0247076 0.0970401 0.066701 -0.0882945 -0.0123083 0.137356 -0.024014 -0.0779359 0.0611981 0.0545055 -0.0818511 -0.125997 0.0636417 0.10771 0.0433969 -0.13439 -0.00941991 -0.0476662 -0.126836 0.119312 0.00147014 0.0627799 
-0.0319983 0.140802 -0.036781 -0.0640785 -0.0199126 0.190252 -0.0309286 -0.00505587 -0.147833 0.10822 0.0291963 -0.0195764 0.0809111 -0.157137 -0.0453851 0.00364197 -0.156225 0.0851888 0.0349671 0.052512 0.147977 -0.12978 0.0652229 0.093487 0.00869563 0.0517696 -0.0350742 -0.214949 0.157329 0.0497781 0.0179896 -0.0241375 -0.0387714 -0.000450889 0.0481577 -0.0113657 -0.0829301 0.0630342 0.0308002 -0.0577589 -0.0175946 -0.187759 -0.032973 0.149211 -0.105518 -0.0391929 0.211711 0.0439047 -0.247367 -0.0221848 0.0175051 0.0281519 -0.0032402 -0.0211075 0.0380998 0.0632597 0.0987455 0.0672722 0.0149883 -0.204818 -0.031239 0.0210181 0.227822 -0.0365556 0.0875677 -0.0119019 -0.0181142 -0.0613499 -0.056411 0.0855797 -0.12002 0.0497494 -0.118538 0.00223635 0.0599999 -0.0898338 -0.0765 0.116504 0.0906193 0.0860657 -0.0880393 0.00925116 -0.00214975 0.010615 -0.0462018 0.000742152 0.0234385 0.0426509 0.111667 0.0310859 0.0667648 -0.0188662 -0.038439 -0.00171176 -0.0641813 -0.103053 -0.00429581 0.237065 0.0186008 -0.0574588 0.087403 0.0516988 -0.0342881 0.0500815 -0.0182611 0.07853 -0.0124693 0.112267 0.0813664 -0.0709081 -0.00686017 0.124281 -0.0573827 -0.0963687 0.0748486 0.0685941 -0.0765876 -0.113213 0.0700543 0.113159 0.0508584 -0.129819 -0.00673215 -0.0503793 -0.133641 0.119874 0.0279952 0.0592853 
-0.0598366 0.163853 -0.0776616 -0.0607895 -0.0467323 0.171921 -0.0203238 -0.0311162 -0.134326 0.142829 0.0546108 -0.0027412 0.0763311 -0.12029 -0.0607582 0.00333663 -0.154774 0.0552954 0.0775155 0.0320128 0.118459 -0.144349 0.0144169 0.0857412 0.00735462 0.0773101 -0.00779261 -0.193261 0.174791 0.0943729 -0.0167495 -0.0137217 -0.0207931 -0.0394254 0.0177649 0.0106335 -0.0925799 0.0350501 0.0282574 -0.0344747 -0.0292098 -0.197716 -0.035701 0.140052 -0.0716123 0.00401373 0.215296 0.0175737 -0.263853 -0.0905029 0.0100939 0.0560636 0.00496848 -0.0410828 0.047301 0.109161 0.0521816 0.0969855 -0.00361408 -0.155659 -0.0355133 0.0106411 0.257845 -0.0373521 0.097336 0.0266 -0.0162432 -0.0628961 -0.0560093 0.0644545 -0.111513 0.041237 -0.128558 -0.0169475 0.0933233 -0.0429705 -0.053039 0.118137 0.0649898 0.0472133 -0.0939664 0.00725971 -0.0199801 0.0154164 -0.0685206 0.0195933 0.0188374 0.00364545 0.103338 0.0333824 0.0368336 -0.0363104 -0.0323494 0.032646 -0.0522463 -0.0888926 0.00303228 0.176622 0.0812351 -0.0429589 0.0810448 0.0435028 -0.0383397 0.0213017 -0.0653448 0.116889 -0.0124932 0.0997059 0.0311043 -0.0831797 0.00803599 0.0981712 -0.042749 -0.12702 0.071423 0.0714596 -0.0891787 -0.100142 0.0899007 0.0971988 0.0458409 -0.170139 -0.0128825 -0.0550611 -0.121101 0.180812 0.0071081 0.0497299 
-0.0294064 0.033149 -0.0373101 -0.0328753 0.0222651 0.0786754 0.0116838 0.00154791 -0.137866 0.173297 0.0371574 0.0620873 0.109275 -0.112441 -0.029414 0.0528592 -0.124213 0.0865438 0.0308768 0.0809543 0.166379 -0.141804 0.0412742 0.0921958 0.00839974 0.130591 -0.0161384 -0.249365 0.111612 0.107538 -0.0716241 0.083079 0.000424758 0.0257206 0.00111425 -0.0353946 -0.0822506 0.111704 0.0245643 -0.0930302 0.000287726 -0.190184 -0.0267082 0.126685 -0.106049 0.00196265 0.188883 0.000489113 -0.212823 -0.120543 0.0857223 -0.0257858 -0.0312086 -0.025321 0.123667 0.0784187 0.0648877 0.0516936 0.00574905 -0.126301 0.0211464 -0.110632 0.15756 0.0303034 0.132385 -0.02527 -0.0810819 0.0280043 0.0176585 0.0466546 -0.107309 0.0709998 -0.13057 -0.0669401 0.0299499 -0.0192857 -0.0473062 0.156428 0.0620169 0.0557383 -0.0884048 0.0131671 -0.00436799 -0.00433917 -0.0818415 -0.0376221 0.115059 0.0799735 0.103458 0.0124063 -0.000119497 -0.00914346 -0.0777102 0.0337572 -0.142532 -0.0394676 -0.00699613 0.131755 0.115653 -0.0786742 0.105408 0.00264627 -0.0185998 0.0562657 -0.013062 0.00881261 -0.0779657 0.119255 0.0716613 -0.109448 -0.0511611 0.139775 -0.106785 -0.134908 0.131818 0.0662515 -0.110555 -0.152105 0.00398137 0.102432 0.0527299 -0.036778 -0.00408889 -0.00990425 -0.091771 0.144707 0.0118567 0.0225835 
0.0491071 0.00146128 -0.0529207 -0.0310175 0.125317 0.131757 0.117723 -0.0110032 -0.137138 0.0753105 -0.0529538 0.101885 0.0986238 -0.184719 -0.042911 0.0204612 -0.123194 0.0860305 -0.0526056 0.0865434 0.173413 -0.0457809 -0.0376534 0.142909 -0.027271 0.038659 -0.11669 -0.245762 0.0824162 0.160089 -0.085971 0.0982752 -0.14282 0.0511947 0.0634049 -0.0659189 -0.0761266 -0.0239275 0.00456338 -0.103461 0.0648747 -0.115812 0.0424345 0.144483 -0.084496 0.0310032 0.173583 0.0554328 -0.175924 -0.0512318 0.10037 -0.12997 -0.0289998 -0.056799 0.140803 0.0356932 -0.0268163 0.123302 0.00405841 -0.0758039 0.0725732 -0.00597114 0.136653 0.00617411 0.103222 -0.131609 -0.0720129 -0.0268327 -0.030187 -0.0361063 -0.0794919 0.103656 -0.067972 -0.0570353 -0.0841641 0.0455287 -0.0307172 0.116543 0.0856649 0.0678167 0.0424245 0.0384999 -0.0297947 0.0166655 -0.0569336 -0.0466952 0.12047 0.0390159 0.0220702 0.0595624 0.0472806 -0.0201884 -0.12657 0.0113765 -0.167322 0.0257473 0.0211676 0.0536659 0.0708985 -0.0287951 0.117787 0.0272791 -0.026774 0.0766728 -0.106363 -0.0357996 -0.115201 0.15513 -0.0366232 0.0319588 0.0546439 0.0797331 -0.128186 -0.112865 0.0380733 0.101224 -0.12265 -0.0691503 -0.103105 0.0803096 0.0128074 2.44899e-05 0.0201006 0.00152963 -0.117685 0.094789 -0.104959 -0.103365 
-0.0128026 0.0940324 -0.015618 -0.100652 0.0969964 0.109543 0.0606559 0.0184133 -0.136149 0.219414 0.0762013 0.0510862 0.166356 -0.0288956 0.0703872 0.00924013 -0.028492 0.13111 -0.0220278 0.070047 0.159176 -0.0784646 -0.0337508 0.0486699 0.0267772 0.0831714 -0.0888698 -0.143181 0.156244 0.139125 -0.0372394 0.0784162 -0.0207992 0.0313603 0.0116214 0.00026614 -0.0566916 0.0966824 0.0829093 -0.0577193 0.039753 -0.103367 0.00750315 0.0984819 -0.13401 -0.022018 0.14283 0.0190249 -0.183227 -0.170214 0.0718212 0.0155898 -0.141497 -0.0312192 0.0843008 0.0879209 -0.0524798 0.104451 -0.0616995 -0.0782204 -0.0424105 -0.131561 0.138954 -0.0301562 0.124493 0.00583146 -0.0564437 0.0935304 -0.0404474 0.021912 0.0366843 0.131471 -0.0955441 -0.101724 0.0200958 0.0321776 -0.0765907 0.127808 0.0782382 -0.000295826 -0.100723 0.0663559 0.0590659 0.0711131 -0.0816162 -0.0461113 0.163036 0.0781464 0.134197 0.0133365 -0.0382996 -0.0773321 -0.0583861 0.0581863 -0.130842 -0.140421 -0.0177502 0.0695323 0.017655 -0.0636246 0.0340697 0.040618 -0.0155227 0.0791136 -0.0908043 0.0922953 -0.0888258 0.101777 0.124086 -0.116886 -0.0285177 0.0569 -0.183501 -0.0187609 0.130711 0.0238511 -0.135624 -0.145701 -0.0357209 0.11269 0.0678648 -0.047243 -0.0341079 0.0500169 -0.0412565 0.112854 0.00335456 0.0110555 
-0.0174198 0.0597103 -0.0430559 -0.110708 0.0857985 0.117282 0.0258937 0.0580072 -0.16441 0.192649 0.0487529 0.0692811 0.19113 0.0322807 0.0875965 0.0145047 0.0438295 0.067293 -0.0183111 0.110997 0.119035 -0.095219 -0.0025798 0.0581934 0.00510408 0.0867217 -0.0604425 -0.131457 0.0990976 0.0945783 -0.00774471 0.102953 0.00370242 0.0485951 -0.0515463 0.0604573 -0.0429271 0.139032 0.0235043 -0.0365004 0.0339824 -0.0680968 0.0127642 0.0674962 -0.119973 -0.0148074 0.163786 0.00399413 -0.189991 -0.145411 0.0647083 -0.0485958 -0.129419 -0.0280272 0.0914365 0.0979568 -0.100443 0.149282 -0.0150266 -0.0909632 -0.0833237 -0.0895865 0.110429 -0.104193 0.144307 0.0410327 -0.0465916 0.130913 -0.0724881 -0.00175267 0.0371193 0.118666 -0.091838 -0.0977167 0.0488164 0.0647709 -0.0416304 0.120356 0.0773952 -0.0260384 -0.135574 0.0453465 0.024937 0.0192679 -0.112729 -0.0405613 0.159636 0.0626868 0.122573 0.00482814 -0.0564466 -0.0973197 -0.0347504 0.0664729 -0.0729768 -0.0706702 0.012159 0.0587648 -0.00848391 -0.0499793 -0.028125 0.0156271 -0.0370551 0.105645 -0.147791 0.11254 -0.159401 0.0534601 0.0719236 -0.15888 -0.0509978 0.0895361 -0.153485 -0.00642003 0.120873 0.000452458 -0.146524 -0.175279 -0.0265059 0.135992 0.0534164 -0.0456453 -0.0126941 0.0748332 -0.0240076 0.0984651 -0.0315276 -0.0251057 
0.00975167 0.0239719 -0.0040146 -0.0984016 0.111151 0.0974508 0.0523999 0.0836618 -0.146494 0.124634 0.023759 0.114167 0.186754 -0.0121941 0.0530972 -0.0169199 0.0213951 0.0538809 -0.095629 0.166014 0.1335 -0.095399 0.0109596 0.0916299 -0.0156553 0.0548622 -0.0874615 -0.121982 0.0598838 0.0706455 -0.0120474 0.0639612 -0.0101901 0.0900472 -0.0775878 0.0175017 -0.0717906 0.161565 -0.0297753 -0.0239555 0.0631589 -0.0426418 0.015545 0.0828735 -0.143451 -0.0613382 0.141313 -0.00958621 -0.134537 -0.0395104 0.085277 -0.0768723 -0.169267 -0.00591524 0.12045 0.0489791 -0.109496 0.150094 -0.0133218 -0.10454 -0.0715572 -0.0848595 0.0885595 -0.0681857 0.109722 -0.039414 -0.0470767 0.111063 -0.0957238 -0.00763342 0.0656049 0.121254 -0.0529753 -0.0505819 0.0266004 0.0729711 -0.0420586 0.0997123 0.0924676 0.02403 -0.135604 0.0233858 0.0681479 0.0449977 -0.0974736 -0.0548033 0.190031 0.0941973 0.132631 -0.0111845 -0.073373 -0.127315 -0.0290341 0.0391297 -0.101878 -0.0893886 0.0116585 0.0418428 -0.0463075 -0.0528027 -0.0426878 0.0335811 -0.0361803 0.152814 -0.146254 0.0773045 -0.183012 0.0915965 0.0698468 -0.157732 -0.035916 0.11378 -0.17715 0.044411 0.0862807 0.0174645 -0.118627 -0.148986 -0.0523495 0.171502 0.0200113 0.00963158 -0.0358364 0.0750722 -0.02128 0.059512 -0.0280473 -0.0247114 
0.0549149 0.0289134 -0.0550028 -0.0783666 0.147867 0.12416 0.0908863 0.0533494 -0.147751 0.12097 0.0301929 0.117829 0.195649 0.00799504 0.0633195 -0.0125721 0.0656703 0.0712325 -0.0956534 0.167032 0.128625 -0.0905757 0.0251379 0.0682137 -0.0157969 0.0134829 -0.109414 -0.122067 0.0612204 0.111382 -0.0256767 0.130312 -0.0138724 0.0970311 -0.0600593 0.0174446 -0.0362221 0.146821 -0.00664988 -0.064994 0.0606894 -0.0415534 0.0311902 0.0478373 -0.173249 -0.040304 0.127026 0.0114056 -0.133351 -0.031136 0.0775726 -0.0605485 -0.151418 0.00123283 0.112884 0.0345979 -0.106728 0.146821 -0.0366277 -0.0749364 -0.0889262 -0.0701355 0.0993275 -0.133747 0.120579 -0.00851686 -0.0588551 0.114249 -0.137445 -0.0123012 0.0594291 0.119712 -0.0712582 -0.0568834 0.00170509 0.0891018 0.0044844 0.0615238 0.0831856 0.00677514 -0.123277 0.012034 0.0450009 0.0365266 -0.0761517 -0.0428489 0.151304 0.0642338 0.116183 0.0250314 -0.0372156 -0.150604 -0.0495126 0.0494936 -0.0912217 -0.0912806 0.0114664 0.0502219 -0.0397723 -0.0412385 -0.00593725 0.0359787 -0.028501 0.16804 -0.149002 0.0905555 -0.16438 0.100314 0.0675867 -0.131904 -0.0475371 0.0951959 -0.156935 0.0520033 0.0930874 0.00709225 -0.10692 -0.128192 -0.0318803 0.196651 0.025496 -0.0148233 -0.0123736 0.0958797 -0.00036954 0.049606 -0.018271 -0.0487148 
0.0636538 -0.0142718 -0.0825277 -0.0654898 0.130559 0.0554676 0.0748061 0.0643945 -0.113285 0.0769734 0.0331566 0.13506 0.199346 0.0101431 -0.00756516 -0.0083583 0.0848246 0.0392397 -0.143027 0.232497 0.118808 -0.108974 0.0301407 0.101734 -0.0579242 0.0305611 -0.0753577 -0.107607 0.0413604 0.0852153 -0.0502363 0.112059 -0.00676717 0.0950871 -0.115485 0.0073891 -0.0677447 0.206203 -0.0887583 -0.0534616 0.0244058 -0.0034137 -0.0117217 0.0854384 -0.150615 -0.0503629 0.103909 0.0170247 -0.0848405 0.0238139 0.0753746 -0.0724207 -0.166555 -0.00667517 0.12219 -0.00144389 -0.129475 0.151014 0.0106871 -0.0898716 -0.0671407 -0.0800614 0.101672 -0.0742266 0.0751467 -0.0749174 -0.0455279 0.116038 -0.102592 -0.0349726 0.0613418 0.0812667 -0.0160829 -0.0348321 -0.0130814 0.0695162 0.0125628 0.0812522 0.0709825 0.0196172 -0.10467 0.00112873 0.0141964 -0.0114891 -0.0626902 -0.056879 0.148719 0.0785048 0.129711 -0.00484283 -0.059051 -0.149792 -0.047699 0.0252643 -0.0663769 -0.0800289 0.0260292 0.00436219 -0.0340412 -0.0673662 -0.0150542 0.0332649 -0.0235014 0.17581 -0.168982 0.0510329 -0.187936 0.0957025 0.0721621 -0.13963 -0.0164776 0.149106 -0.149381 0.0791325 0.0534712 0.0114424 -0.110936 -0.133103 -0.0483352 0.166082 -0.0469099 0.0433737 -0.0191509 0.108089 -0.0132226 0.0234931 -0.0572495 -0.0743126 
0.0681354 0.00926311 -0.0778206 -0.0661011 0.154215 0.0871353 0.0885503 0.0587441 -0.135167 0.119539 0.0298299 0.137921 0.188988 -0.00162827 0.054364 -0.0268911 0.10017 0.0395437 -0.0963202 0.220362 0.0770244 -0.106962 0.052426 0.0749267 -0.0414334 0.0107666 -0.0917397 -0.107781 0.0301618 0.0791731 -0.032181 0.112436 0.0129138 0.109106 -0.087372 0.0176488 -0.012827 0.180553 -0.045432 -0.067785 0.0524205 -0.0253755 0.0164843 0.0419342 -0.199441 -0.0441947 0.101841 0.026421 -0.0780162 0.0462662 0.0752063 -0.0670859 -0.173436 0.0119671 0.126154 0.00037413 -0.111179 0.125253 -0.0283137 -0.0529829 -0.0972043 -0.08063 0.087697 -0.14561 0.114879 -0.053013 -0.0589877 0.11568 -0.140325 -0.0243468 0.0598911 0.112472 -0.0508791 -0.0147696 0.000738192 0.0839473 0.0356315 0.0832568 0.0918434 0.00272845 -0.137456 -0.0107174 0.0356808 0.0358229 -0.0456042 -0.0602729 0.133388 0.0846381 0.144518 0.0178771 -0.0446476 -0.153141 -0.0292591 0.0356698 -0.0696427 -0.108313 0.0244549 0.0208818 -0.0519935 -0.0609323 -0.0195036 0.0354663 -0.0281927 0.160743 -0.138127 0.0693928 -0.160416 0.0892634 0.0780844 -0.1046 -0.0454071 0.125191 -0.116286 0.0890946 0.0609293 -0.0124571 -0.0683806 -0.13243 -0.041309 0.206067 -0.00102282 0.021153 -0.00524731 0.124988 -9.48066e-05 0.0151151 -0.0221048 -0.0602832 
0.0536448 0.0128274 -0.0349127 -0.0787698 0.13558 0.107309 0.0643564 0.0686914 -0.146213 0.129854 0.0319955 0.128069 0.173017 0.00377586 0.100778 -0.0106897 0.0875284 0.014734 -0.0643293 0.171154 0.0785606 -0.0835334 0.0455016 0.0681488 -0.00852765 0.0513541 -0.0700314 -0.111962 0.0360516 0.0548283 -0.00437229 0.118295 0.01237 0.120741 -0.0899574 0.0267488 -0.00425765 0.176736 0.0052129 -0.0388797 0.0717095 -0.042386 0.022241 0.0165389 -0.175495 -0.0419205 0.110262 -0.000928465 -0.101219 -0.000304105 0.0839749 -0.0535439 -0.164653 0.0162412 0.126175 0.0241152 -0.0965148 0.134348 -0.042452 -0.0542916 -0.106203 -0.0998391 0.0741698 -0.151685 0.12613 -0.0103819 -0.0511131 0.138357 -0.116887 0.0083629 0.0460817 0.130531 -0.0876956 -0.0141344 0.0360647 0.0697832 0.0171063 0.0867787 0.0853777 0.0140252 -0.150758 0.00900551 0.0715883 0.037227 -0.060276 -0.0741777 0.162138 0.089055 0.128865 0.00873502 -0.0452976 -0.14037 -0.0243182 0.0617245 -0.0745918 -0.0908009 0.031783 0.0245706 -0.0424456 -0.0605566 -0.0496546 0.0181782 -0.0485287 0.167216 -0.127893 0.0717411 -0.166379 0.0732986 0.0753764 -0.143518 -0.0610205 0.127663 -0.133108 0.0733287 0.108779 -0.0208067 -0.0858948 -0.159658 -0.0321872 0.208148 0.0522777 0.0225583 0.00428404 0.111583 0.00995402 0.0242939 0.00797305 -0.0334262 
0.0565639 0.0076976 -0.0618727 -0.059467 0.138708 0.095318 0.072081 0.0569302 -0.151833 0.120959 0.0289612 0.131634 0.183514 -0.0212394 0.0645027 -0.0045232 0.0846574 0.0348721 -0.0817505 0.207037 0.089611 -0.107658 0.0555473 0.0822725 -0.0251935 0.0391145 -0.0886297 -0.136241 0.0397491 0.0662566 -0.0123163 0.129567 0.00543355 0.113588 -0.0902302 0.0195896 -0.0204015 0.184693 -0.0206765 -0.051918 0.0636783 -0.0416157 0.016622 0.0416391 -0.181579 -0.0477793 0.128793 0.00787166 -0.101415 0.0134664 0.0842134 -0.073363 -0.162266 0.00759086 0.119683 0.0113156 -0.0915453 0.129553 -0.0176863 -0.064691 -0.0991339 -0.0857927 0.0863117 -0.141952 0.123675 -0.0400937 -0.0531815 0.107747 -0.123776 -0.0141489 0.0381037 0.120048 -0.069287 -0.0043526 0.0165775 0.0600945 0.0178144 0.0964596 0.0811584 0.0191159 -0.143529 0.00186971 0.0406508 0.024584 -0.0594533 -0.0536922 0.147528 0.0810987 0.122575 -0.00351433 -0.0420542 -0.135116 -0.0332509 0.0383136 -0.0724889 -0.0893622 0.0299768 0.0402261 -0.0444412 -0.0608028 -0.0408044 0.0178654 -0.0355857 0.181117 -0.128027 0.0662377 -0.160136 0.0991014 0.0841367 -0.124556 -0.0658947 0.137019 -0.129587 0.0671118 0.081784 -0.0144126 -0.0862535 -0.156304 -0.0355784 0.202956 0.0196458 0.0274301 -0.00315057 0.113229 -0.0107684 0.0210933 -0.0206753 -0.048445 
