{
  "descriptor": [
    -0.09281828254461288,
    0.06112224981188774,
    0.13128991425037384,
    -0.10783158987760544,
    -0.19078876078128815,
    0.024070441722869873,
    -0.06803388893604279,
    -0.10765933990478516,
    0.21777218580245972,
    -0.16285154223442078,
    0.2165190577507019,
    -0.030097616836428642,
    -0.22295309603214264,
    0.07966990768909454,
    -0.07314775139093399,
    0.1418309509754181,
    -0.12617510557174683,
    -0.16775858402252197,
    -0.019245916977524757,
    -0.06383394449949265,
    0.014781727455556393,
    0.13130222260951996,
    0.0008606904884800315,
    0.07301118224859238,
    -0.10080689191818237,
    -0.3809049129486084,
    -0.08744459599256516,
    -0.10445242375135422,
    0.045992590487003326,
    -0.13943462073802948,
    -0.0743703544139862,
    0.11081612855195999,
    -0.1304934322834015,
    -0.0012894198298454285,
    0.03397560864686966,
    0.06968829780817032,
    -0.08355774730443954,
    -0.13002443313598633,
    0.2640916109085083,
    0.11939661204814911,
    -0.26139453053474426,
    -0.014745698310434818,
    0.06045428663492203,
    0.23662857711315155,
    0.12113231420516968,
    -0.05497154965996742,
    0.02747805416584015,
    -0.07378039509057999,
    0.13746900856494904,
    -0.2380424588918686,
    0.01338953711092472,
    0.2200891524553299,
    0.04939284548163414,
    0.08645039051771164,
    0.0751069188117981,
    -0.11887946724891663,
    -0.011025618761777878,
    0.10001450031995773,
    -0.15277111530303955,
    0.07387875020503998,
    0.11199943721294403,
    -0.09072154760360718,
    -0.02079876884818077,
    -0.061364926397800446,
    0.16858357191085815,
    0.12035956978797913,
    -0.08433336019515991,
    -0.13259994983673096,
    0.1401798129081726,
    -0.14113125205039978,
    -0.15350069105625153,
    0.08597835898399353,
    -0.1497124433517456,
    -0.14052608609199524,
    -0.19340966641902924,
    0.026029536500573158,
    0.41184496879577637,
    0.10959838330745697,
    -0.10067348927259445,
    0.039888277649879456,
    -0.038102176040410995,
    -0.08921696990728378,
    0.005407968536019325,
    0.11069943010807037,
    -0.10136772692203522,
    0.05364032834768295,
    -0.0034132811706513166,
    0.03927342966198921,
    0.23262742161750793,
    0.04960174486041069,
    0.021327469497919083,
    0.2496916651725769,
    -0.0020596266258507967,
    0.09382611513137817,
    0.07780925184488297,
    0.09342749416828156,
    -0.0954153761267662,
    -0.08165225386619568,
    -0.14770816266536713,
    -0.030806871131062508,
    -0.024678142741322517,
    -0.09143979102373123,
    -0.012695238925516605,
    0.13074646890163422,
    -0.2543148100376129,
    0.15394210815429688,
    -0.039142340421676636,
    -0.0808187872171402,
    -0.025008315220475197,
    0.04197495058178902,
    -0.0691845640540123,
    -0.007516888435930014,
    0.15608468651771545,
    -0.20558716356754303,
    0.13491281867027283,
    0.1577785611152649,
    0.09180252254009247,
    0.12055079638957977,
    0.09678180515766144,
    -0.01191953755915165,
    -0.018032141029834747,
    -0.08023583889007568,
    -0.13858143985271454,
    -0.11047668009996414,
    0.07589209824800491,
    -0.017961040139198303,
    -0.016055718064308167,
    0.0016238127136602998
  ]
}