-0.0982799 0.0800322 0.135799 0.00634762 0.0030093 0.0816385 -0.0107618 -0.0815919 -0.0205487 0.00558231 0.0400108 0.0194239 -0.00803367 -0.0389662 0.0746064 0.00521378 -0.0487413 0.0801485 0.00962814 0.0184521 0.0753058 -0.0148459 0.00203327 0.0848778 -0.0265523 0.0999929 -0.107579 -0.148723 0.138735 0.00848276 0.116677 0.103172 0.0388638 0.051158 0.12912 0.152902 0.0295738 0.124805 -0.0058799 -0.0715858 0.0294562 -0.0382508 -0.0500633 -0.0157117 -0.0288571 0.0572663 0.151254 -0.0133729 -0.190688 -0.101902 -0.143716 0.0078537 0.0306405 -0.0347968 0.086857 0.124943 -0.0234846 0.101636 -0.112665 -0.0406571 -0.118643 0.0130157 0.155096 -0.133053 0.201995 0.0705978 0.0230813 -0.0780345 -0.119584 0.181964 -0.0383665 -0.0219344 -0.105772 0.0415848 0.0512423 -0.083432 -0.0473013 0.0915279 0.0450328 -0.122696 -0.108131 0.136875 -0.0873393 -0.0676477 -0.0480305 -0.0793883 0.0158779 0.0348187 -0.0352463 0.1191 0.187442 -0.0151566 0.0317364 0.00882397 0.0694919 0.037058 -0.0214561 0.122307 0.0566689 0.0422639 -0.0294698 -0.0263009 -0.141218 -0.0293671 0.0175798 0.143561 0.0709493 -0.103004 0.12641 -0.0650794 -0.105032 0.0748132 -0.0699344 -0.0997448 0.185567 0.0156545 0.00535586 -0.222046 0.0905609 0.117465 0.116297 -0.0452813 0.0137116 0.0509171 -0.0482077 0.148415 0.130319 -0.023818 
-0.0873156 0.0796417 0.122679 0.0102595 0.000290511 0.0614131 -0.00129808 -0.0657952 -0.0458631 0.032656 0.0383375 0.0181923 0.0106711 -0.0345705 0.0770825 0.00957392 -0.00643847 0.0861264 0.0320632 0.0296509 0.0822455 -0.0199137 0.0303453 0.0970982 -0.0312891 0.104386 -0.0967089 -0.161842 0.161343 0.016857 0.104615 0.119339 0.0522966 0.0535641 0.121752 0.115972 0.0549676 0.17609 -0.00194554 -0.0699139 0.020404 -0.026163 -0.0504778 -0.0169031 -0.0573184 0.0409747 0.159076 -0.0181356 -0.165198 -0.0987421 -0.103694 0.0254693 0.0192869 -0.0215666 0.0917576 0.110811 0.02814 0.0878159 -0.0917597 -0.0531064 -0.121748 -0.0258892 0.134391 -0.145411 0.213341 0.0391104 0.0243629 -0.0915921 -0.11571 0.17493 -0.0575358 -0.0162622 -0.11843 0.0641145 0.0494235 -0.100648 -0.0377446 0.122805 0.0521685 -0.112693 -0.126401 0.126851 -0.0691104 -0.0624244 -0.0132167 -0.107006 0.0162659 0.044751 -0.0171825 0.0831229 0.159138 -0.00014921 0.0339328 -0.012685 0.0822734 0.001708 0.00276257 0.157926 0.0458163 0.0320976 -0.0342944 -0.00655671 -0.117926 0.0237283 0.021908 0.106777 0.0763688 -0.0948791 0.169029 -0.0790434 -0.129065 0.0890957 -0.0769433 -0.088305 0.182032 0.013808 0.0279812 -0.253047 0.0744073 0.127958 0.102067 -0.0241878 0.00648188 0.0479446 -0.0569716 0.127309 0.12183 -0.0115617 
-0.0852641 0.0357658 0.124109 -0.0248631 0.0078468 0.041688 -0.017087 -0.038533 -0.0254895 0.0876306 0.0466542 0.0119707 0.00832631 -0.0190438 0.112838 0.0198422 0.000134281 0.101785 0.0461618 0.0221559 0.0469201 0.00768027 0.0707226 0.0993222 -0.0514801 0.107452 -0.0361448 -0.142663 0.158202 -0.0236878 0.102628 0.0580021 0.070562 0.0504536 0.123243 0.125688 0.0568427 0.183097 -0.00986831 -0.0525509 -0.0187313 -0.00877356 -0.0814083 -0.0067444 -0.0731661 0.00313521 0.11215 0.0228234 -0.103816 -0.0615386 -0.0955081 0.00992383 -0.0145893 -0.0286926 0.078541 0.10561 0.0380558 0.0839938 -0.100862 -0.0227504 -0.128763 -0.056543 0.135831 -0.126511 0.214203 0.016442 -0.00906376 -0.0621088 -0.103637 0.193891 -0.0629148 0.00449516 -0.112413 0.0676812 0.0159602 -0.129499 -0.0199336 0.138686 0.0691604 -0.152128 -0.0999843 0.104012 -0.0759642 -0.0642998 -0.00737298 -0.157337 0.00907715 0.0799136 0.0292868 0.0849198 0.153431 0.0324916 0.0432041 -0.00844229 0.121123 0.0141104 -0.0206299 0.144964 0.0379058 0.0432549 -0.022659 -0.0223042 -0.134177 -0.0380742 0.0611074 0.0789941 0.0744016 -0.184118 0.20354 -0.0595849 -0.126444 0.123541 -0.00672758 -0.0519594 0.188685 0.0208657 0.0815628 -0.224288 0.0383549 0.116513 0.103729 -0.0382521 0.015002 0.055478 -0.0773581 0.110489 0.109122 -0.000114675 
-0.0826132 0.0397989 0.145138 -0.016841 0.0399949 0.095744 -0.0283545 -0.0935961 -0.0113499 0.00898568 0.0367298 0.0572764 -0.0163094 0.0118396 0.0908155 -0.0123156 -0.0383157 0.103357 0.0363034 0.0143075 0.0846828 0.0402503 0.0216166 0.115599 -0.00975769 0.0929277 -0.0510496 -0.105376 0.132509 0.0314857 0.0899891 0.0404923 0.0589605 0.0463646 0.137984 0.155438 0.0332839 0.0918409 -0.00589719 -0.0768516 0.0151962 0.00180388 -0.0243892 -0.0067956 -0.0766961 0.0022552 0.132929 -0.00257473 -0.120436 -0.058656 -0.095112 0.000286618 0.0129773 -0.0182292 0.135125 0.129985 -0.0250688 0.129287 -0.140447 -0.0341248 -0.118448 -0.00874676 0.172899 -0.120681 0.210556 0.0524146 -0.0100532 -0.0724398 -0.135393 0.228702 -0.0203481 0.00482384 -0.0993719 0.0260586 0.0296102 -0.0630974 -0.0261068 0.0741544 0.0598009 -0.153214 -0.0672776 0.155761 -0.0383396 -0.0401248 -0.0154399 -0.142717 0.0189688 0.0779564 -0.00272311 0.153193 0.173283 -0.0246328 0.0263917 0.0334222 0.0861992 0.008933 -0.0494984 0.127564 0.061223 0.0399641 -0.00701753 -0.0021963 -0.12971 -0.0708626 0.00644814 0.136137 0.0602423 -0.178052 0.124815 -0.0595033 -0.0784129 0.0721778 -0.0355185 -0.0461433 0.18157 0.0257239 0.0634654 -0.188398 0.0451897 0.128615 0.136867 -0.0585796 0.0147521 0.00677076 -0.0663695 0.170109 0.159032 0.00444583 
-0.0947994 0.0523176 0.127615 -0.00327186 -0.00353872 0.0900389 -0.0308075 -0.0511925 -0.0261005 0.038227 0.0437099 0.0197597 -0.0228295 -0.0448318 0.0963389 0.0118174 -0.0657429 0.0746285 0.0564217 -0.0024403 0.0730665 -0.0165249 0.0575561 0.0956361 0.00108791 0.104464 -0.0342954 -0.161465 0.143337 -0.0161134 0.109657 0.0487032 0.0623035 0.0479145 0.107659 0.1204 0.0288274 0.141577 0.00279007 -0.0523299 0.0181785 -0.0457445 -0.0655236 -0.0106039 -0.0677196 -0.00459335 0.138993 -0.027131 -0.15171 -0.0781552 -0.103524 0.00874089 0.0302217 -0.021104 0.0891709 0.125467 0.0334811 0.102346 -0.113715 -0.052146 -0.124837 -0.0289 0.167348 -0.130686 0.21471 0.0754429 -0.00253879 -0.0756206 -0.10992 0.20517 -0.0723899 0.0130941 -0.12622 0.0573023 0.0656251 -0.106141 -0.0315852 0.0942992 0.0460404 -0.1086 -0.121708 0.107657 -0.047701 -0.0631153 -0.0282089 -0.114809 0.0190211 0.0695273 -9.65185e-05 0.0896508 0.162305 0.000991147 0.0262268 0.0104015 0.0899926 0.0124503 -0.0289939 0.150012 0.0637015 0.0400981 -0.0293247 -0.0435456 -0.133636 -0.0356245 0.0446013 0.114203 0.0747363 -0.137191 0.141267 -0.093783 -0.107505 0.114332 -0.0215083 -0.0886032 0.204721 0.0264905 0.0406975 -0.198681 0.0874351 0.129236 0.129274 -0.058646 0.0102425 0.0203349 -0.0547748 0.15301 0.140213 0.021541 
-0.114667 0.0576578 0.14595 0.0269871 0.00340967 0.0488305 -0.0198065 -0.0638276 -0.0246991 0.0545647 0.02332 0.0196558 -0.02613 -0.0592457 0.112955 0.00937248 -0.0366227 0.0852209 0.0546018 0.0224557 0.0422936 -0.0176003 0.0432029 0.0950214 -0.00702443 0.0841629 -0.0675188 -0.15196 0.140009 -0.00779987 0.110043 0.0925168 0.0802899 0.0508718 0.132658 0.128626 0.0565414 0.118504 -0.0324234 -0.0914763 0.0353114 -0.0596677 -0.0378743 -0.0185798 -0.0616912 0.0453811 0.14166 -0.00433052 -0.138246 -0.0894268 -0.101019 0.00236016 0.0480871 -0.0548316 0.100185 0.124951 0.00869084 0.0432209 -0.0962782 -0.0230342 -0.125184 -0.0281455 0.104665 -0.124029 0.232315 0.0605528 -0.00461951 -0.111708 -0.126468 0.185313 -0.0869882 -0.0119507 -0.119404 0.0498471 0.0490856 -0.090943 -0.0190203 0.122832 0.0508053 -0.123285 -0.109528 0.103571 -0.0861601 -0.0528477 -0.0039448 -0.116872 -0.00537109 0.0638552 -0.0225531 0.120776 0.164242 0.0377238 0.0227388 0.00104088 0.0723011 0.0450081 -0.024121 0.134872 0.0680545 0.0245064 -0.0132962 -0.039218 -0.120773 -0.05875 0.0538342 0.0979016 0.0950033 -0.133395 0.162644 -0.0437202 -0.128074 0.0984813 -0.0330021 -0.112898 0.178997 0.000505609 0.0514188 -0.21497 0.0751815 0.130345 0.126297 -0.0394454 0.00367754 0.0454364 -0.048277 0.140199 0.142226 -0.0123215 
-0.113174 0.0466938 0.125061 0.0260455 0.016467 0.0457672 -0.0214181 -0.0965485 0.0024894 0.0283284 0.0312628 0.0351851 -0.0234941 -0.0470756 0.0909726 0.0117444 -0.0434207 0.074327 0.0444991 0.0359416 0.052174 -0.015781 0.0385082 0.0906541 -0.00677553 0.09367 -0.0646645 -0.155832 0.131871 0.00844088 0.123066 0.0821371 0.0810812 0.0425865 0.141794 0.148111 0.0475464 0.122957 -0.0318326 -0.0987394 0.0284642 -0.046003 -0.0402384 0.000837022 -0.0574576 0.0494632 0.137109 0.00174173 -0.121904 -0.0901529 -0.127006 -0.00672768 0.0482252 -0.0600461 0.110464 0.124636 -0.023122 0.070297 -0.115846 -0.0129957 -0.131443 -0.0350968 0.139284 -0.120658 0.242023 0.0454954 -0.00900567 -0.099497 -0.124181 0.183053 -0.0664833 -0.0123746 -0.115318 0.0318102 0.03802 -0.0835923 -0.0197092 0.115124 0.0418559 -0.115826 -0.101088 0.104831 -0.0937881 -0.0521275 -0.0207983 -0.125276 -0.00128714 0.0675935 -0.0287412 0.119491 0.171857 0.0232807 0.0262138 0.00553434 0.0768492 0.0395693 -0.0314083 0.11931 0.0778834 0.0272785 -0.015355 -0.041859 -0.130903 -0.0773596 0.0433648 0.107507 0.097321 -0.135376 0.159527 -0.0327866 -0.122567 0.0874226 -0.0393518 -0.0943754 0.179112 0.0133996 0.0425756 -0.20141 0.0659858 0.137534 0.117113 -0.0324569 -0.000847008 0.0527284 -0.0552818 0.148448 0.138294 -0.0121471 
-0.104993 0.0235204 0.117839 0.0278001 0.0190662 0.0640418 -0.043452 -0.0853865 0.00800894 0.00874056 0.0275353 0.0210368 -0.0259981 -0.0424411 0.101677 0.0272864 -0.0569155 0.0577971 0.0494294 0.0250774 0.0685769 -0.032606 0.0712932 0.0814832 0.0195478 0.0938815 -0.0613664 -0.17926 0.110714 -0.0198152 0.15708 0.0810234 0.075724 0.0475881 0.122683 0.153939 0.0306195 0.128473 -0.0118941 -0.0913051 0.0272036 -0.0455381 -0.05696 -0.0105622 -0.0489029 0.0204863 0.128637 -0.00473768 -0.112226 -0.0837269 -0.136627 -0.0175824 0.0686 -0.0564586 0.0945514 0.115907 0.00703735 0.0794082 -0.108627 -0.035534 -0.130222 -0.0239462 0.138751 -0.126226 0.225873 0.0703253 -0.0100071 -0.0643342 -0.105627 0.188801 -0.0744607 0.0123859 -0.130704 0.0286657 0.0425972 -0.0993587 -0.024189 0.089694 0.0304072 -0.0789743 -0.112668 0.0968349 -0.081205 -0.0670609 -0.0313202 -0.117418 0.00431341 0.0773627 -0.0286552 0.0851343 0.175186 0.0340612 0.0264354 0.0074153 0.0796955 0.0437612 -0.0408478 0.138493 0.0597202 0.0282021 -0.0214379 -0.0714276 -0.136561 -0.0715542 0.0553073 0.109004 0.0830278 -0.138915 0.159633 -0.0465705 -0.129324 0.105742 -0.0368895 -0.100588 0.199738 0.0241949 0.0316156 -0.191112 0.0756652 0.145676 0.124565 -0.0237107 0.0067071 0.0476617 -0.0622354 0.137786 0.140617 0.0156476 
-0.0837065 0.0106219 0.106745 -0.0149262 0.0209285 0.120402 -0.0298482 -0.0405 -0.0231661 0.02733 0.0305534 0.0322213 0.00765711 -0.035929 0.0890499 0.0110319 -0.0797512 0.0755048 0.0284692 0.00868467 0.110964 -0.0461127 0.0652791 0.104991 0.0183782 0.111215 -0.058953 -0.191071 0.115242 -0.0224226 0.140672 0.056899 0.0290205 0.0553744 0.0891904 0.126813 -0.00722386 0.148506 0.0188712 -0.0683301 0.0314216 -0.0356695 -0.0672637 0.013257 -0.0668624 -0.0670929 0.127915 -0.0137814 -0.130421 -0.0747324 -0.102342 -0.0362104 0.0241802 -0.0245602 0.0993375 0.114716 0.020375 0.144853 -0.103327 -0.102161 -0.118623 -0.0209942 0.183391 -0.119627 0.191527 0.0862128 -0.00752724 -0.0295428 -0.0907368 0.192787 -0.0612837 0.0525831 -0.120416 0.0446116 0.0404445 -0.116022 -0.0457292 0.0717516 0.0543443 -0.067319 -0.12527 0.110646 -0.0259201 -0.0740967 -0.0486151 -0.126976 0.0574213 0.0988629 0.0282633 0.0545626 0.15911 -0.00985027 0.0303834 0.00703216 0.0698412 0.00284872 -0.0414789 0.155409 0.0285005 0.0379541 -0.0228039 -0.056374 -0.131618 -0.0242863 0.0335379 0.116436 0.032824 -0.130654 0.139968 -0.0960544 -0.104696 0.135816 -0.0548174 -0.0703941 0.221275 0.036677 0.0207533 -0.194856 0.0768715 0.136008 0.131428 -0.0422615 0.0136621 0.0168431 -0.0904098 0.134513 0.119706 0.0433347 
-0.0677197 -0.00140689 0.0984474 -0.00342506 0.0183178 0.119688 -0.0240233 -0.0488659 -0.0214847 -0.0078168 0.0425228 0.052649 0.013805 -0.0293227 0.057857 0.0150747 -0.109613 0.0615783 0.0135342 0.0361142 0.14249 -0.063162 0.0633541 0.120779 0.0192972 0.111778 -0.0606657 -0.202978 0.105453 0.00407972 0.10814 0.059573 0.0266284 0.0599 0.0650839 0.11691 -0.0234107 0.164272 0.0137692 -0.0681422 0.0326471 -0.0402189 -0.0701303 0.00970335 -0.0682674 -0.0701283 0.143406 -0.0392946 -0.142162 -0.0659542 -0.107239 -0.0416559 0.0295905 0.000378003 0.124879 0.110277 0.0217543 0.159011 -0.112063 -0.11064 -0.103824 -0.0166968 0.205885 -0.109096 0.177128 0.0970928 -0.00346634 -0.0250899 -0.0809131 0.176173 -0.0575704 0.0527806 -0.11835 0.0482631 0.0629497 -0.101154 -0.0439502 0.0521059 0.0515815 -0.041653 -0.119578 0.113621 -0.0208046 -0.0858598 -0.0585267 -0.0975965 0.0654312 0.0980417 0.020715 0.0516838 0.166221 -0.0386931 0.0222351 0.018724 0.0388556 -0.0104594 -0.0493372 0.14715 0.0585653 0.0318553 -0.0162541 -0.0653801 -0.126306 -0.00799583 0.0150015 0.132464 0.020411 -0.094292 0.114579 -0.119162 -0.0953709 0.141234 -0.0661759 -0.0763588 0.216405 0.0586927 0.000336123 -0.182107 0.0752287 0.138727 0.115777 -0.0315702 0.00902184 0.0103255 -0.0947114 0.158934 0.119926 0.0470563 
-0.080286 0.0292635 0.0788117 0.0169554 -0.00298726 0.097474 -0.0182365 -0.0778511 -0.0090584 0.00488397 0.0576623 0.0419285 -0.0120689 -0.0173626 0.053044 0.000571009 -0.0977075 0.0624682 0.0699295 0.0258253 0.111134 -0.0506077 0.0447436 0.10389 0.0110019 0.114852 -0.0631066 -0.197944 0.13312 0.0330462 0.0945998 0.0523089 0.0546967 0.0151634 0.0858137 0.123097 -0.00820637 0.158951 0.0148011 -0.0538522 0.0127839 -0.0245785 -0.0912863 -0.00307719 -0.0739593 -0.027195 0.151265 -0.0595878 -0.131452 -0.0940265 -0.126286 0.0152055 0.0568718 0.000693787 0.116079 0.126455 0.0446756 0.137738 -0.123389 -0.0708343 -0.110611 -0.0180625 0.217481 -0.125963 0.188098 0.09119 0.0248091 -0.0638354 -0.0797434 0.17294 -0.041484 0.039038 -0.12137 0.0631737 0.0775037 -0.0878095 -0.049577 0.0542659 0.0364261 -0.0679214 -0.125034 0.128027 -0.0409712 -0.0685005 -0.0231149 -0.085832 0.0338565 0.0669024 0.00446203 0.0430054 0.160053 -0.0197159 0.0360708 0.0163129 0.0667462 -0.0398391 -0.0320322 0.14408 0.0871009 0.0419561 -0.0202899 -0.0493151 -0.110688 -0.0370653 -0.00671961 0.149881 0.0728301 -0.115775 0.123974 -0.0889671 -0.0869811 0.0977449 -0.0442711 -0.112141 0.193304 0.0648509 0.0159447 -0.191656 0.0834475 0.116981 0.104751 -0.0551302 -0.000767226 4.41988e-05 -0.0854928 0.190115 0.130899 0.060259 
-0.0931366 0.0637397 0.0976454 0.0206855 0.0230103 0.105486 0.00282876 -0.100562 -0.0253373 0.0222754 0.0356845 0.0488461 -0.029405 -0.0569697 0.0614371 0.00196731 -0.118524 0.0753507 0.0594371 0.0154021 0.0892778 -0.0420427 0.0276988 0.0851815 0.0201025 0.101667 -0.087339 -0.183712 0.134317 0.0400445 0.0820065 0.0637736 0.0394421 0.0234598 0.117192 0.113037 0.000320649 0.112495 0.0224337 -0.078429 0.0427869 -0.0591744 -0.0433977 -0.00546976 -0.0826806 0.0226273 0.162305 -0.0386741 -0.164011 -0.0936385 -0.117507 0.0164152 0.0480069 -0.0190102 0.129719 0.125182 0.0207802 0.118916 -0.143339 -0.0416532 -0.103904 -0.00526405 0.205794 -0.122556 0.213454 0.0908748 -0.0107464 -0.074618 -0.109652 0.179847 -0.0444883 0.0433252 -0.122638 0.06171 0.0755502 -0.0620639 -0.0452765 0.0624227 0.0473178 -0.0842681 -0.112613 0.12674 -0.0412753 -0.0385813 -0.0418718 -0.0853662 0.0243145 0.0676124 -0.00953458 0.090251 0.169264 -0.0159417 0.0188641 0.0179314 0.0401192 -0.023112 -0.030868 0.135491 0.0959927 0.0283509 -0.00521037 -0.0412987 -0.111778 -0.0545021 0.00621395 0.148002 0.0799382 -0.078725 0.115231 -0.0568475 -0.0709547 0.0818904 -0.0440786 -0.114123 0.191917 0.0432186 0.00812945 -0.168549 0.0862798 0.135017 0.126156 -0.0603284 0.00207542 0.00404785 -0.0766868 0.195447 0.13959 0.0302853 
-0.0642663 0.059391 0.0998592 0.0436648 0.0229415 0.168595 0.0182668 -0.121499 -0.0181828 -0.0232096 0.0194056 0.0635473 -0.00810792 -0.0311318 0.00546421 -0.0173126 -0.122379 0.114876 -0.00303182 0.0165897 0.136603 -0.0826861 0.00921271 0.129712 0.0365693 0.0344075 -0.143559 -0.147915 0.0883718 0.0736238 0.0864585 0.0831954 -0.0174244 0.0312591 0.0999585 0.102463 -0.0538093 0.0699837 0.016106 -0.108908 0.0363211 -0.0541615 -0.0139775 -0.0231384 -0.0557398 -0.0552752 0.144293 -0.0327905 -0.169252 -0.0565238 -0.0799636 -0.0152104 0.0661481 -0.012914 0.131195 0.121042 -0.00927639 0.160457 -0.123024 -0.0992581 -0.0831057 0.0734079 0.21301 -0.147639 0.168679 0.141491 -0.00707415 -0.0729557 -0.181249 0.179942 -0.0191959 0.0520656 -0.103331 0.0547987 0.0358962 -0.0370658 -0.0181449 -0.0281993 0.0619039 -0.0702859 -0.10376 0.120467 -0.0289992 -0.0614691 -0.0561374 -0.0682177 0.014545 0.0483426 0.00537299 0.111238 0.154422 -0.0675324 0.0434242 0.0319316 0.0251759 -0.00991493 -0.0478722 0.134917 0.0689722 0.0502587 0.0453385 -0.0229535 -0.120901 -0.0205249 -0.0041255 0.176408 0.054512 -0.0765532 0.0604637 -0.0589205 -0.0634449 0.0810308 -0.0383425 -0.0876916 0.178947 0.0486535 -0.0110396 -0.0896245 0.0954818 0.142916 0.0995624 -0.0906378 -0.00504644 -0.042002 -0.0843414 0.215026 0.12505 0.00755518 
-0.10252 0.12115 0.0874178 -0.00270884 -0.0137925 0.193964 -0.0317613 -0.0859147 -0.0510689 -0.0332047 -0.0132278 0.0294416 -0.0237589 -0.0288266 0.0647476 -0.0266736 -0.126908 0.0310203 0.0794209 -0.0205757 0.0870831 -0.0305639 0.0324543 0.062604 0.036716 0.0474961 -0.137071 -0.160513 0.0819086 0.0418633 0.101301 0.0361409 0.0239158 0.00289753 0.0908585 0.121762 -0.0135464 0.0583353 0.0409959 -0.0121615 0.0485021 -0.0587927 -0.0297822 -0.0682848 -0.0659146 0.0312021 0.176924 -0.0884586 -0.209866 -0.0676667 -0.0921613 0.020078 0.0994935 0.0173214 0.0773961 0.134736 0.0585031 0.130125 -0.12793 -0.0755724 -0.101288 0.109117 0.170414 -0.188782 0.170101 0.12775 0.0302329 -0.0462261 -0.151883 0.152188 -0.00622233 0.0463318 -0.143589 0.0474818 0.138477 0.0211202 -0.0926263 -0.0337644 0.0607211 -0.0273005 -0.137042 0.123118 0.0237991 0.00988896 -0.054171 0.000839671 0.0194105 0.00163071 -0.0526661 0.0691147 0.105566 -0.0604223 0.0600237 0.0498486 0.00922498 -0.0375857 -0.00592217 0.164864 0.0309329 0.0438804 -0.00712189 -0.0179628 -0.113383 0.000852487 -0.0507643 0.180141 0.0395436 -0.045099 -0.00222423 -0.063735 -0.0480438 0.010998 -0.0380402 -0.13947 0.123864 0.061409 -0.0631207 -0.122386 0.0935856 0.14877 0.135315 -0.116152 -0.0168682 -0.0594765 -0.0577068 0.210703 0.109094 0.0602733 
-0.0747457 0.0612014 0.137886 -0.0878353 -0.069027 0.189094 -0.0750712 0.0894868 -0.16377 0.0542261 -0.0145272 0.00535787 -0.000136119 -0.0302913 0.113488 -0.0661586 -0.0794206 0.0184546 0.136698 -0.00648536 0.0373593 -0.0250042 0.056885 0.0921622 -0.0241729 0.10593 -0.0402516 -0.139588 0.0887252 -0.0981287 0.046063 -0.0759061 -0.0134722 0.0279714 0.00284737 0.0788922 -0.0266485 0.108872 0.0363683 0.0844335 0.00899026 -0.0501708 -0.122365 -0.0971102 -0.0662684 -0.0292835 0.147796 -0.100265 -0.226057 -0.00578073 -0.0378151 0.0213759 0.00995782 0.06567 0.0174521 0.0997679 0.128268 0.127704 -0.0767584 -0.0984773 -0.0462099 0.108246 0.129546 -0.16513 0.108034 0.0929049 0.0608443 -0.0128855 -0.0876233 0.149808 -0.0414112 0.0614227 -0.126341 0.111495 0.13907 -0.0542463 -0.0816939 0.0337711 0.140002 -0.0341717 -0.201647 0.0836084 0.0609634 -0.0208574 -0.0248157 -0.0447439 0.0702595 0.0461358 0.0460424 -0.00139624 0.0709149 -0.0197929 0.120614 0.0758918 0.0350936 -0.0702144 0.0457243 0.153934 -0.0281583 0.0282281 -0.0586705 0.00360293 -0.149618 0.0460439 -0.0147772 0.152601 0.00868246 -0.109519 -0.0165525 -0.137473 -0.031372 0.0763394 0.0290258 -0.109186 0.120317 0.0395084 -0.0279986 -0.181149 0.0613068 0.0990051 0.0828765 -0.137929 -0.0186982 -0.0860158 -0.0504861 0.164482 0.0655502 0.0542281 
