{
  "descriptor": [
    -0.08620613068342209,
    0.009822198189795017,
    0.09489506483078003,
    -0.06115981936454773,
    -0.15936161577701569,
    0.03546661511063576,
    -0.05737075209617615,
    -0.018307941034436226,
    0.18503683805465698,
    -0.177010178565979,
    0.15926657617092133,
    -0.03645132854580879,
    -0.2557206153869629,
    0.10335101187229156,
    -0.02030528523027897,
    0.17843644320964813,
    -0.1392068713903427,
    -0.1772448718547821,
    -0.050005633383989334,
    -0.04195559024810791,
    0.001789870671927929,
    0.11449915170669556,
    0.0016898353351280093,
    0.0915844514966011,
    -0.13889053463935852,
    -0.3876570463180542,
    -0.0735844150185585,
    -0.05318833142518997,
    0.0592489019036293,
    -0.09145693480968475,
    -0.09510008990764618,
    0.1087225154042244,
    -0.12109201401472092,
    0.027456941083073616,
    0.09186938405036926,
    0.10536136478185654,
    -0.08265552669763565,
    -0.1994396448135376,
    0.23126377165317535,
    0.09011046588420868,
    -0.288028746843338,
    -0.026713455095887184,
    0.0655328780412674,
    0.24011558294296265,
    0.16164714097976685,
    -0.016541600227355957,
    0.047968387603759766,
    -0.08237998932600021,
    0.13970135152339935,
    -0.3204576075077057,
    0.02553214132785797,
    0.19762592017650604,
    -0.0017814310267567635,
    0.07099837064743042,
    0.08459925651550293,
    -0.18124543130397797,
    0.014847139827907085,
    0.09042654931545258,
    -0.12503083050251007,
    0.024741970002651215,
    0.06536804139614105,
    -0.07122868299484253,
    -0.003677590750157833,
    -0.06920018792152405,
    0.1515028476715088,
    0.1038421243429184,
    -0.09818512201309204,
    -0.13676325976848602,
    0.21608303487300873,
    -0.16469000279903412,
    -0.08847377449274063,
    0.06948331743478775,
    -0.144144207239151,
    -0.19400258362293243,
    -0.20697513222694397,
    0.01953970082104206,
    0.38016486167907715,
    0.16428504884243011,
    -0.07804159820079803,
    0.10521294921636581,
    0.0471607968211174,
    -0.010615144856274128,
    0.03150402382016182,
    0.1887246072292328,
    -0.08768175542354584,
    0.024334274232387543,
    -0.03288697823882103,
    0.07595885545015335,
    0.24194826185703278,
    0.022137805819511414,
    0.009818552061915398,
    0.2084580659866333,
    0.020627766847610474,
    0.03866416960954666,
    0.11243387311697006,
    0.1065552830696106,
    -0.10096073150634766,
    -0.07816223055124283,
    -0.19273045659065247,
    -0.010529600083827972,
    0.04866309463977814,
    -0.033349454402923584,
    -0.008064142428338528,
    0.16614305973052979,
    -0.19651997089385986,
    0.15432044863700867,
    -0.06880205869674683,
    -0.10385482013225555,
    -0.002247103489935398,
    0.005440801382064819,
    -0.06707646697759628,
    0.013590984046459198,
    0.10186932235956192,
    -0.1950419843196869,
    0.10854421555995941,
    0.16101619601249695,
    0.08146157115697861,
    0.14977885782718658,
    0.10045645385980606,
    0.019064724445343018,
    0.029416056349873543,
    -0.0640057921409607,
    -0.19641025364398956,
    -0.12513796985149384,
    0.06133274361491203,
    -0.006969936657696962,
    -0.023674771189689636,
    -0.0019312240183353424
  ]
}