{
  "descriptor": [
    -0.10136355459690094,
    0.08051463216543198,
    0.09651590883731842,
    -0.03531511873006821,
    -0.11354406177997589,
    0.015885548666119576,
    -0.056300513446331024,
    -0.06151726096868515,
    0.12440811097621918,
    -0.07853846997022629,
    0.20962181687355042,
    -0.018785392865538597,
    -0.2231505662202835,
    -0.02755749225616455,
    -0.04571232572197914,
    0.12389285862445831,
    -0.15477170050144196,
    -0.15957209467887878,
    -0.04113728925585747,
    -0.06403211504220963,
    0.013998357579112053,
    0.07777714729309082,
    0.007281940896064043,
    0.0017012847820296884,
    -0.12459956109523773,
    -0.3278600573539734,
    -0.057770904153585434,
    -0.08761781454086304,
    0.03642601892352104,
    -0.12848779559135437,
    -0.018744533881545067,
    0.10487981140613556,
    -0.1808595508337021,
    -0.017931794747710228,
    0.027152491733431816,
    0.07673521339893341,
    -0.03752307966351509,
    -0.06780318915843964,
    0.21729806065559387,
    0.07402651011943817,
    -0.17177163064479828,
    -0.006130959838628769,
    0.058259304612874985,
    0.291403204202652,
    0.1644972264766693,
    -0.018917160108685493,
    -0.008216545917093754,
    -0.022680889815092087,
    0.09350313991308212,
    -0.2687050700187683,
    0.012074940837919712,
    0.20701177418231964,
    0.09652943164110184,
    0.12179718911647797,
    0.029019689187407494,
    -0.13696372509002686,
    0.025771375745534897,
    0.0862036943435669,
    -0.1701883226633072,
    0.057292964309453964,
    0.04247041791677475,
    -0.09010624885559082,
    -0.02444637194275856,
    -0.056522686034440994,
    0.2244965136051178,
    0.0969158262014389,
    -0.08040843904018402,
    -0.16080133616924286,
    0.16057051718235016,
    -0.10021605342626572,
    -0.10791341960430145,
    0.07319968193769455,
    -0.15022160112857819,
    -0.14320267736911774,
    -0.22019627690315247,
    0.07856320589780807,
    0.3250156342983246,
    0.1082499548792839,
    -0.14875920116901398,
    0.06592658907175064,
    -0.06193678826093674,
    -0.05208955332636833,
    -0.026177288964390755,
    0.07804637402296066,
    -0.07384373247623444,
    0.03215428814291954,
    -0.03467971459031105,
    0.03186226636171341,
    0.195920929312706,
    -0.006019369699060917,
    -0.01698959805071354,
    0.20809336006641388,
    -0.0014840412186458707,
    0.030257999897003174,
    0.07573205232620239,
    0.023687222972512245,
    -0.05841002240777016,
    -0.020817233249545097,
    -0.15541020035743713,
    -0.027763186022639275,
    0.010716688819229603,
    -0.11374541372060776,
    0.007934854365885258,
    0.1360412985086441,
    -0.19198310375213623,
    0.1468045860528946,
    -0.024377677589654922,
    -0.0494331493973732,
    -0.01358532253652811,
    0.011407080106437206,
    -0.06186405196785927,
    -0.01949901692569256,
    0.14631886780261993,
    -0.2526363432407379,
    0.2306077778339386,
    0.17971444129943848,
    0.06714311987161636,
    0.12972980737686157,
    0.07657883316278458,
    0.054817039519548416,
    -0.008622742258012295,
    -0.0019320824649184942,
    -0.11617761105298996,
    -0.09649374336004257,
    0.05833514407277107,
    -0.018810203298926353,
    -0.030288737267255783,
    0.03197256848216057
  ]
}