0.0612207 -0.0646933 -0.0863807 0.0335772 0.0995234 0.183084 0.0807751 -0.0657868 -0.0637456 -0.0442361 0.052027 0.131338 0.0692364 -0.0817786 -0.0720472 -0.0473638 -0.167854 0.0653057 -0.0511651 0.0982367 0.176198 -0.113402 0.0173691 0.186096 0.0492365 -0.0219432 -0.0624729 -0.233715 -0.00206477 0.135598 0.00633677 -0.0112438 -0.122558 0.0246083 -0.00436459 0.0536402 -0.196518 -0.04541 -0.0501558 -0.0556003 0.0488009 -0.0656595 -0.0750875 0.162107 -0.128915 -0.0545673 0.126129 0.0213674 -0.0944283 0.00253406 0.00725628 -0.0734086 -0.0118338 -0.0613963 0.137057 0.0553279 -0.0840914 0.248219 -0.0303426 -0.0496934 -0.0187651 0.0357664 0.267365 -0.0384571 0.0743794 -0.0649778 -0.0210383 0.0126122 -0.0652277 0.0850203 0.00644255 0.157409 -0.0492207 -0.0478735 -0.0350977 0.0282965 -0.0361852 0.0185954 0.0128452 0.119687 -0.0431329 0.00394552 -0.0189404 -0.0614826 -0.144653 0.0125807 0.115073 0.00450189 -0.0203641 -0.00313423 0.0949788 -0.0853854 -0.063106 -8.29073e-05 -0.104086 -0.0546583 -0.0484741 0.00916883 0.103907 -0.020768 0.0641505 0.00909603 -0.0228729 -0.00658764 -0.105923 0.0994901 -0.0981673 0.104875 -0.0476037 -0.0261366 0.0637878 0.106506 -0.0619178 -0.0934141 0.078551 0.154321 -0.0762742 -0.0116596 0.0217117 0.167676 0.00834672 -0.0813007 -0.0449977 0.0104355 -0.123412 0.171898 -0.0258069 0.0162895 
0.053491 -0.063499 -0.0907717 0.0235077 0.0987285 0.183185 0.0723266 -0.064602 -0.0591736 -0.0383994 0.0531431 0.132781 0.0660087 -0.0809545 -0.0757593 -0.0410328 -0.171635 0.0625634 -0.0477497 0.0933089 0.174458 -0.111465 0.0196233 0.18286 0.0472406 -0.00936493 -0.0491077 -0.231914 0.00471114 0.127776 0.0102759 -0.0190198 -0.119468 0.0175196 -0.00643549 0.0572231 -0.199645 -0.0415113 -0.0475062 -0.0487688 0.0457687 -0.0630721 -0.0818163 0.16739 -0.125783 -0.0559896 0.126691 0.0217457 -0.0955274 -0.00376639 0.00176487 -0.0710357 -0.0160331 -0.0649767 0.133196 0.0595994 -0.0822922 0.255007 -0.0344575 -0.0506592 -0.0207418 0.03025 0.279409 -0.033452 0.0789953 -0.0658456 -0.0249388 0.019791 -0.0578735 0.0926563 0.00634956 0.159513 -0.0512883 -0.0489254 -0.0319313 0.0251972 -0.0395482 0.0263807 0.00959362 0.109996 -0.0458776 0.010007 -0.0169684 -0.0586222 -0.149504 0.00616382 0.118305 0.0120441 -0.0153105 -0.00853802 0.0918521 -0.0818396 -0.0641868 0.00284749 -0.0915676 -0.0533366 -0.048179 0.0108021 0.103022 -0.0191216 0.0596408 0.00143896 -0.0294232 -0.0117964 -0.105446 0.101989 -0.0998754 0.0943479 -0.0465152 -0.0319823 0.0650004 0.111388 -0.0548993 -0.0897314 0.0845259 0.153868 -0.0801035 -0.0139145 0.0238334 0.164461 0.0102337 -0.0805071 -0.0426243 0.0062304 -0.12915 0.175662 -0.030687 0.0203546 
0.0505836 -0.0621929 -0.0845223 0.0205857 0.092596 0.188382 0.0683549 -0.0640154 -0.0604182 -0.041993 0.053375 0.127707 0.0640934 -0.0815778 -0.0741868 -0.0416123 -0.183041 0.0581038 -0.0497243 0.0916537 0.17397 -0.114554 0.0251445 0.17558 0.0459105 -0.00920633 -0.0479245 -0.230249 -0.00175322 0.118916 0.0104685 -0.0242984 -0.120133 0.0225106 -0.00587718 0.0607318 -0.200096 -0.0408198 -0.0464709 -0.0473926 0.0455567 -0.0721533 -0.080851 0.162974 -0.1238 -0.0595455 0.125875 0.0229193 -0.100379 0.00456654 -0.00315937 -0.0730744 -0.0169384 -0.0582391 0.13299 0.0576135 -0.0800197 0.252343 -0.0385052 -0.0526449 -0.0214968 0.0362276 0.281329 -0.0336397 0.0816356 -0.0582986 -0.026905 0.0217027 -0.0589988 0.0978496 0.00326439 0.157929 -0.0513294 -0.0447294 -0.0265936 0.0206678 -0.0376039 0.0193052 0.0114277 0.111572 -0.0451851 0.00230413 -0.015464 -0.0590635 -0.15898 0.0105708 0.117083 0.0136595 -0.0125495 -0.00301604 0.0981551 -0.0869801 -0.0595857 0.00339309 -0.0951367 -0.050957 -0.051272 0.0144573 0.102481 -0.0160626 0.0605892 0.00124411 -0.0357371 -0.015537 -0.0930211 0.106336 -0.0996248 0.0966805 -0.0508257 -0.0351693 0.0604274 0.11363 -0.0507834 -0.0881214 0.0880716 0.154599 -0.0741484 -0.00688433 0.0308109 0.166286 0.0147395 -0.0869665 -0.0383893 0.00520924 -0.126144 0.175415 -0.0240488 0.0248049 
0.0478544 -0.0553846 -0.0880423 0.0249292 0.0960099 0.18517 0.0778064 -0.0690015 -0.0571023 -0.0391242 0.0511025 0.126906 0.0644212 -0.0827036 -0.074044 -0.0464226 -0.182892 0.0657125 -0.0501302 0.0917018 0.172325 -0.11827 0.0170686 0.170327 0.0473322 -0.0159199 -0.0607659 -0.2315 -0.00130154 0.129598 0.0104008 -0.0160922 -0.119645 0.017638 0.00273585 0.0600649 -0.197957 -0.045861 -0.0486942 -0.0557186 0.0496008 -0.0735132 -0.0746582 0.166263 -0.127608 -0.0510531 0.127357 0.0237729 -0.100618 -0.001983 -0.00516075 -0.0716351 -0.0146737 -0.0625845 0.134642 0.0610612 -0.086578 0.247094 -0.0375992 -0.0507908 -0.0209094 0.0348397 0.278144 -0.035034 0.0837402 -0.059727 -0.0269383 0.0153936 -0.0629663 0.093344 0.00953939 0.157113 -0.0486932 -0.0493471 -0.032244 0.0271631 -0.0407039 0.0192351 0.0103679 0.106928 -0.0468766 0.0061098 -0.0217248 -0.0542238 -0.156337 0.0142897 0.11402 0.00913403 -0.0122128 0.000870739 0.0963891 -0.0869249 -0.0617746 -0.00476095 -0.0987541 -0.0546697 -0.050485 0.0132373 0.10411 -0.0167901 0.0628938 0.00534616 -0.0275987 -0.0188688 -0.0985372 0.106747 -0.0963799 0.103473 -0.0487936 -0.0241263 0.0609813 0.103735 -0.0597642 -0.0943267 0.0830698 0.151905 -0.073994 -0.00980867 0.0312251 0.164669 0.0159268 -0.0860893 -0.0411112 0.0111801 -0.123816 0.172742 -0.0228423 0.0223178 
0.0337075 -0.0426695 -0.0847301 0.0103681 0.0837113 0.181588 0.0652818 -0.0644436 -0.0635572 -0.0323494 0.0557749 0.129623 0.0707476 -0.0807601 -0.0844996 -0.0487234 -0.183256 0.0624828 -0.0536164 0.0941864 0.168372 -0.121451 0.0148677 0.168485 0.0378377 0.0011137 -0.047238 -0.222459 0.00694514 0.119583 0.00677038 -0.0306368 -0.110865 0.0100272 -0.00737636 0.0587684 -0.203974 -0.029079 -0.0545952 -0.0406928 0.0442563 -0.0733703 -0.0813513 0.174509 -0.126957 -0.0513655 0.134365 0.0156486 -0.114549 -0.00829104 -0.00416494 -0.0689363 -0.0265816 -0.0617757 0.127075 0.0647037 -0.0908992 0.252424 -0.0357255 -0.0594786 -0.0246686 0.0299154 0.286031 -0.0243021 0.0876746 -0.0641028 -0.0249138 0.0180321 -0.0630529 0.0924757 0.0153333 0.147207 -0.0428025 -0.0490217 -0.0175244 0.0287315 -0.0519299 0.0264164 0.0115779 0.10158 -0.0578363 0.00394296 -0.0152186 -0.0478155 -0.164308 0.00971082 0.121509 0.0124266 -0.00283858 -0.00680192 0.0788716 -0.0932393 -0.0542319 -0.00226571 -0.0940756 -0.0605033 -0.0468858 0.0154966 0.0993752 -0.018463 0.0497834 0.0105819 -0.0320209 -0.0107581 -0.102209 0.111606 -0.0998197 0.105954 -0.049695 -0.0443866 0.0632207 0.107502 -0.06032 -0.0844592 0.0792778 0.149095 -0.0868982 -0.0145942 0.0351025 0.161594 0.00852511 -0.0919174 -0.0480833 0.00259026 -0.118723 0.17871 -0.030138 0.0237994 
0.0531968 0.00534769 -0.100985 0.00133346 0.0719783 0.19319 0.0575115 -0.0702711 -0.0945383 -0.0187992 0.0774864 0.141712 0.0708826 -0.123687 -0.0894919 -0.0473756 -0.171804 0.0624219 -0.0638401 0.0985796 0.145806 -0.0727302 0.00671589 0.148709 0.0204274 0.0167648 -0.0236594 -0.217568 0.0246043 0.133693 -0.0191868 -0.0250493 -0.109525 0.013536 -0.00619959 0.0311525 -0.185597 -0.0257288 -0.0319979 7.53605e-05 0.0382674 -0.0869929 -0.087787 0.196344 -0.151161 -0.0249468 0.159027 0.00644311 -0.145384 0.00868759 0.0454065 -0.0224246 -0.0671359 -0.0493108 0.100459 0.0439913 -0.0870644 0.230873 -0.0357397 -0.0449134 -0.0399224 -0.00339713 0.297059 -0.0281716 0.0792854 -0.125509 -0.00762985 0.0073027 -0.0715259 0.097984 0.0241042 0.13396 -0.0347357 -0.0291671 -0.0120989 0.0181339 -0.0774451 0.0376422 -0.00686618 0.129313 -0.0441458 0.00752188 0.00152765 -0.0332058 -0.15477 0.00875136 0.118965 -0.0216784 -0.0145724 -0.00219844 0.0471529 -0.111414 -0.0819204 0.00698247 -0.101088 -0.0841973 -0.0241389 0.00937453 0.0890213 -0.0420051 0.0230222 0.047366 -0.025182 0.0396841 -0.115107 0.0922767 -0.0950546 0.1552 -0.0445337 -0.0448799 0.0837459 0.102928 -0.0748899 -0.0573247 0.051477 0.123244 -0.101499 -0.0331812 0.0394353 0.157547 0.0162996 -0.0873241 -0.0370361 0.00713881 -0.0701233 0.146628 -0.0138013 0.0147614 
0.0353061 -0.0083802 -0.112002 0.00719001 0.0700402 0.178541 0.0426374 -0.0932079 -0.0782406 -0.0121325 0.0847089 0.138894 0.0740396 -0.0827436 -0.0951213 -0.039286 -0.163717 0.0731929 -0.0317635 0.0830603 0.158757 -0.0833813 0.00614187 0.149411 0.0344705 0.03345 -0.0169225 -0.224743 0.0300752 0.150843 -0.00415489 -0.0199734 -0.0929354 -0.0207527 -0.00329789 0.0489162 -0.200279 -0.0233054 -0.0200519 0.000299652 0.0258112 -0.0641969 -0.0991751 0.199629 -0.143143 -0.0310587 0.157006 -0.00592962 -0.122578 -0.0389796 0.0332565 -0.016853 -0.0404094 -0.0574719 0.0991028 0.0647379 -0.0683355 0.241785 -0.0304301 -0.0459833 -0.0395322 -0.00955203 0.302985 -0.0194617 0.083534 -0.110348 -4.94642e-05 0.0183796 -0.0436647 0.102545 0.0347288 0.140754 -0.0399622 -0.060017 -0.0132782 0.0232082 -0.0895858 0.0388544 -0.0254019 0.116798 -0.0517689 0.0299843 -0.00209371 -0.0322798 -0.157953 0.0101719 0.122002 -0.0211949 -0.0215882 -0.0326249 0.0340051 -0.0915407 -0.0702064 0.00483005 -0.0884948 -0.0917218 -0.0337194 0.0233617 0.102251 -0.0351847 0.028444 0.0356665 -0.0133536 0.021995 -0.118565 0.101442 -0.0868164 0.12457 -0.0366753 -0.0473429 0.0687977 0.0877824 -0.0745196 -0.0759117 0.0565755 0.137139 -0.110558 -0.0446195 0.0328496 0.141786 0.0151264 -0.0937427 -0.0477056 -0.0107911 -0.0944777 0.173466 -0.0271729 0.0444439 
0.0180599 0.00890208 -0.101313 0.017585 0.0712273 0.188535 0.046446 -0.122908 -0.0463943 -0.0120566 0.0859739 0.116478 0.0598233 -0.0613584 -0.0676851 -0.0556844 -0.170315 0.0789482 -0.0115345 0.0474176 0.14936 -0.0794918 -0.00156024 0.140498 0.0593325 0.0105706 -0.0394094 -0.213167 0.038956 0.159586 0.0335513 -0.0236792 -0.0879413 -0.0456088 0.0250712 0.0709635 -0.201825 -0.0515045 -0.0160886 -0.00766814 0.0342335 -0.058405 -0.100869 0.199167 -0.145982 -0.0270407 0.139167 0.00384191 -0.101096 -0.0680518 0.0145833 0.00305578 -0.0128469 -0.0796849 0.0872722 0.0852095 -0.078127 0.247288 -0.0355581 -0.0327822 -0.0603541 0.00117705 0.298938 -0.026908 0.0922737 -0.0844149 0.0105449 0.00490085 -0.0544698 0.122351 0.0524763 0.146961 -0.04112 -0.0771761 -0.0143988 0.0256854 -0.103934 0.0197426 -0.0329212 0.111521 -0.0468321 0.0399196 -0.00437879 -0.0214898 -0.146536 0.00693139 0.10917 -0.0345024 -0.0392559 -0.0233721 0.0409223 -0.0795517 -0.0567998 -0.00914605 -0.0840115 -0.10719 -0.0460709 0.0228843 0.10552 -0.022718 0.0397027 0.043481 -0.00098774 -0.0209144 -0.123468 0.118113 -0.0605254 0.0997104 -0.0159656 -0.0215801 0.0721256 0.0594375 -0.0773216 -0.0898822 0.0601787 0.139727 -0.100273 -0.0340242 0.0433248 0.145264 0.0371465 -0.119099 -0.0680283 -0.0114473 -0.0953249 0.185254 -0.0119444 0.0699092 
0.0424481 -0.00474485 -0.120951 -1.91195e-05 0.0757082 0.185997 0.0417674 -0.102633 -0.0500152 -0.0267991 0.0927582 0.143117 0.0739488 -0.0761036 -0.101784 -0.05297 -0.16179 0.0714217 -0.0535002 0.0729357 0.151057 -0.0636689 -0.00483162 0.155483 0.0304699 0.0197755 -0.00336372 -0.202795 0.0194966 0.157736 -0.00524756 -0.0274514 -0.0969203 -0.0134748 -0.00346713 0.0515708 -0.193522 -0.0411453 -0.0264221 0.00909854 0.0327333 -0.0585996 -0.101101 0.204886 -0.143288 -0.0332052 0.13844 0.00886462 -0.108194 -0.029431 0.0352118 -0.00962198 -0.0465183 -0.0580065 0.0936792 0.0642813 -0.0914758 0.245898 -0.036073 -0.0405639 -0.0439805 -0.0115479 0.307178 -0.0146985 0.0622535 -0.119892 0.00637949 0.0295811 -0.0432616 0.111362 0.0452612 0.126966 -0.0319201 -0.0736754 -0.017227 0.0324196 -0.0933268 0.0286889 -0.0360589 0.115713 -0.0374691 0.0420199 0.00307321 -0.0299838 -0.158065 0.0150116 0.126269 -0.0319665 -0.0303113 -0.015258 0.0338115 -0.113391 -0.0676825 0.00226099 -0.0917924 -0.0985287 -0.0469714 -0.00340822 0.106006 -0.0412034 0.0363685 0.0419207 -0.0119512 0.01848 -0.122578 0.0945203 -0.0977546 0.120934 -0.0595893 -0.0365151 0.088429 0.0774197 -0.0750312 -0.0545857 0.0396975 0.135334 -0.117168 -0.0348906 0.033388 0.137686 0.0241485 -0.0927221 -0.0533217 -0.00130308 -0.0831757 0.16218 -0.0309325 0.0404569 
0.0338076 -0.00173336 -0.11216 0.00244148 0.0723237 0.190202 0.0347937 -0.102358 -0.046555 -0.0306704 0.0970102 0.136586 0.0689467 -0.0682442 -0.0949196 -0.0523515 -0.163837 0.0712706 -0.0417966 0.0637213 0.156732 -0.0658646 -0.000928774 0.156809 0.0421531 0.012784 -0.000108238 -0.197429 0.0255557 0.155152 0.00626942 -0.0438184 -0.088479 -0.018638 0.000448391 0.0587268 -0.195282 -0.0502682 -0.0268641 0.00846028 0.0329256 -0.0564016 -0.0961226 0.205181 -0.144332 -0.0426044 0.13742 0.00303192 -0.105119 -0.0359466 0.0303541 -0.00893369 -0.0411179 -0.0604437 0.0913862 0.0741354 -0.0911576 0.248136 -0.0382035 -0.0407307 -0.0526738 -0.0109567 0.30859 -0.0182886 0.0695338 -0.106895 0.00404507 0.0210556 -0.0488225 0.120192 0.0467143 0.129697 -0.0358737 -0.0820743 -0.00877746 0.0337839 -0.0919609 0.0270806 -0.0375882 0.114593 -0.0426869 0.0371646 0.0112504 -0.0231081 -0.157964 0.0185545 0.12277 -0.0307255 -0.0335453 -0.0143763 0.0341257 -0.11302 -0.0668076 0.00359756 -0.086387 -0.102713 -0.0550872 0.0049534 0.102461 -0.0349609 0.0350744 0.0422428 -0.0108997 0.00405604 -0.118427 0.10501 -0.0865946 0.110546 -0.0547494 -0.0440521 0.0810953 0.0686941 -0.0695988 -0.05607 0.0461084 0.138515 -0.109908 -0.0264723 0.0375371 0.143736 0.0279991 -0.104027 -0.0622819 -0.00925961 -0.0832971 0.174263 -0.0210404 0.0540829 
0.0366874 -0.021318 -0.119842 0.00944765 0.0691165 0.185719 0.0419389 -0.0964048 -0.0417225 -0.0228776 0.0902104 0.133878 0.0666553 -0.0615087 -0.0755429 -0.0578073 -0.167427 0.050017 -0.0231141 0.0621769 0.138659 -0.0724977 0.0148342 0.157534 0.0439817 0.0171554 0.00719586 -0.213071 0.0119159 0.141461 0.0147514 -0.0469739 -0.08217 -0.0258252 -0.00909234 0.0645737 -0.193596 -0.0387691 -0.0429649 0.00834293 0.0387596 -0.0556496 -0.110602 0.209078 -0.159234 -0.0380731 0.129218 0.00324219 -0.0843444 -0.0349122 0.0274398 -0.0165603 -0.0280316 -0.0627356 0.104602 0.0742896 -0.0840729 0.252923 -0.0232585 -0.0376971 -0.0614936 -0.0157617 0.299853 -0.021977 0.0763495 -0.100654 0.0100127 0.0276716 -0.0340013 0.117454 0.0411531 0.144704 -0.0371079 -0.077372 -0.00118517 0.0349795 -0.0975769 0.0293777 -0.0358472 0.122385 -0.0459203 0.0240797 0.00577791 -0.0327367 -0.152528 0.00912509 0.127306 -0.0276989 -0.0358651 -0.029478 0.0343235 -0.0984808 -0.0603211 -0.0117202 -0.0890473 -0.102334 -0.0445864 0.00202271 0.11594 -0.0367024 0.0345554 0.0364531 0.00226273 -0.0142249 -0.129034 0.0955346 -0.0942064 0.100064 -0.0503152 -0.0389815 0.0853605 0.083883 -0.0567775 -0.0778037 0.0523359 0.143731 -0.100818 -0.0351702 0.0344633 0.147289 0.0350736 -0.105153 -0.062726 -0.000982575 -0.0898858 0.173648 -0.023153 0.0710697 
0.0308311 -0.0126493 -0.121899 0.00161551 0.0686835 0.185711 0.0373292 -0.0853473 -0.0433534 -0.0133966 0.0995741 0.135286 0.0773661 -0.0670955 -0.0876446 -0.0558449 -0.164269 0.0607782 -0.0359847 0.0701988 0.148072 -0.0840578 0.00977076 0.1594 0.039714 0.0130413 0.00782554 -0.203522 0.0199602 0.139187 0.011614 -0.0499191 -0.0816043 -0.0182191 -0.0163129 0.0618184 -0.195163 -0.0431014 -0.0402914 0.00958226 0.039463 -0.0646999 -0.107167 0.208645 -0.155377 -0.0538822 0.128489 0.00854129 -0.0917225 -0.0340908 0.025723 -0.0167778 -0.0473528 -0.0611066 0.0928959 0.0764733 -0.0904083 0.245178 -0.0286502 -0.040567 -0.060057 -0.018574 0.30284 -0.0196369 0.0701491 -0.100853 0.00421274 0.0265626 -0.0389311 0.115286 0.0384348 0.138187 -0.0388234 -0.0799958 0.00021669 0.0344519 -0.0886582 0.0400247 -0.0347094 0.114064 -0.057513 0.0207539 0.0124499 -0.0219624 -0.158518 0.0233245 0.132033 -0.0216667 -0.0215008 -0.028193 0.0313914 -0.109793 -0.0602203 -0.00526881 -0.088374 -0.109671 -0.057462 0.00286407 0.102548 -0.0388657 0.0365869 0.0336786 -0.00496258 -0.0037205 -0.112447 0.103325 -0.0937769 0.108082 -0.052563 -0.0488182 0.0711399 0.0801845 -0.058006 -0.0620948 0.0490109 0.138361 -0.101038 -0.0301485 0.0396474 0.149476 0.0283919 -0.108197 -0.0677321 0.00283823 -0.0921132 0.172282 -0.0293781 0.0687801 
0.0214211 -0.00541818 -0.126775 0.00474542 0.0623281 0.193227 0.0289202 -0.0969308 -0.0374248 -0.0125124 0.0973764 0.116529 0.0703416 -0.0494089 -0.072627 -0.0511834 -0.164355 0.0493204 -0.0122266 0.052567 0.142493 -0.0879131 0.0126324 0.14739 0.0564729 0.0107924 0.00496398 -0.20251 0.0216706 0.13651 0.0338921 -0.0567532 -0.0752808 -0.0384772 -0.00761349 0.0791078 -0.200167 -0.0500328 -0.03755 0.00599063 0.0309539 -0.0590509 -0.107028 0.20743 -0.145417 -0.0458755 0.126689 0.00745691 -0.0898328 -0.0504228 0.0124791 -0.0121648 -0.0254969 -0.0727515 0.0876657 0.0865173 -0.0920317 0.253621 -0.0208362 -0.0419683 -0.072634 -0.00915098 0.306358 -0.0306197 0.0812129 -0.0754314 0.00532137 0.0276833 -0.041354 0.116899 0.0453916 0.145746 -0.0439527 -0.091758 0.00649829 0.0367056 -0.09105 0.0272813 -0.0384784 0.115917 -0.0543256 0.0127204 0.00588913 -0.0246559 -0.160906 0.0213466 0.117802 -0.0306448 -0.0263434 -0.032196 0.030818 -0.0969316 -0.0564368 -0.0064541 -0.0757024 -0.104539 -0.0529767 0.0120129 0.101771 -0.0298475 0.0355024 0.0318975 -0.0018131 -0.0314942 -0.126892 0.118944 -0.0840885 0.0891899 -0.0443486 -0.0458038 0.0736355 0.0703943 -0.0498967 -0.0763842 0.0582889 0.1419 -0.101758 -0.0204627 0.0454535 0.149085 0.0335477 -0.126017 -0.0662047 -0.00390852 -0.0928624 0.182907 -0.0211452 0.0816454 
0.0278129 -0.000394287 -0.123874 -0.00604962 0.0682436 0.197434 0.0389199 -0.0871648 -0.0338312 -0.0120694 0.102344 0.122823 0.0746319 -0.0647067 -0.0804783 -0.0586334 -0.167097 0.0564135 -0.0354141 0.052494 0.144554 -0.0776216 -0.000868452 0.154967 0.0467595 0.00624928 0.00295895 -0.192533 0.0302883 0.13461 0.0286369 -0.0553299 -0.0923157 -0.0235203 -0.0128492 0.0671766 -0.198201 -0.0612365 -0.0297486 0.0190249 0.043868 -0.0635041 -0.108468 0.20963 -0.145128 -0.0589318 0.118771 0.0178318 -0.0881413 -0.0423223 0.0154511 -0.00858005 -0.047395 -0.0707822 0.0748642 0.0816447 -0.0997139 0.254757 -0.031362 -0.0367719 -0.0687306 -0.0100706 0.307315 -0.023085 0.0620479 -0.0901467 0.0127185 0.0228396 -0.0401021 0.115556 0.0426535 0.142937 -0.0385032 -0.0790583 0.00157557 0.0294557 -0.091599 0.0327717 -0.0381452 0.11524 -0.0498877 0.0227963 0.0164356 -0.0158864 -0.1576 0.0266251 0.130386 -0.0299013 -0.0246755 -0.0296798 0.0373379 -0.107003 -0.0590084 -0.00567667 -0.0804374 -0.112914 -0.0611138 -0.00147131 0.0941563 -0.0319305 0.0346318 0.032066 -0.0054297 -0.0105272 -0.118097 0.112894 -0.0892368 0.103511 -0.0525373 -0.0420039 0.079143 0.0715357 -0.0587504 -0.0578836 0.0479284 0.137911 -0.100619 -0.019222 0.0457924 0.146463 0.0347987 -0.11958 -0.0693908 0.00303594 -0.0974519 0.169144 -0.0358201 0.0734638 
0.0281765 0.000141614 -0.120494 -0.0068359 0.0705954 0.197933 0.0427318 -0.0923539 -0.0370445 -0.0101021 0.0999286 0.125201 0.0715397 -0.0680781 -0.0770473 -0.0609941 -0.172149 0.0555702 -0.0321047 0.0541445 0.141185 -0.0743807 -0.00705489 0.149306 0.0468998 0.0125279 -0.00185482 -0.192599 0.0289251 0.137911 0.0251132 -0.0532961 -0.0944764 -0.023618 -0.00471864 0.0675775 -0.195546 -0.0624188 -0.0241858 0.0115271 0.0459921 -0.0670298 -0.104161 0.207293 -0.146089 -0.0531622 0.120214 0.0188079 -0.0921126 -0.0430632 0.0133543 -0.00762144 -0.0445569 -0.0695978 0.0816486 0.0798915 -0.105012 0.25385 -0.0406922 -0.0350015 -0.0665657 -0.0108023 0.311566 -0.0221873 0.066911 -0.0860514 0.0106342 0.0223702 -0.0431745 0.11252 0.0441613 0.143071 -0.0386063 -0.0767826 -0.000252744 0.0318174 -0.0915071 0.0283547 -0.0330432 0.114432 -0.0462771 0.0243441 0.0160132 -0.0146745 -0.157284 0.0200095 0.130103 -0.0264807 -0.0196906 -0.021747 0.0414395 -0.105847 -0.0581129 -0.000256812 -0.0865662 -0.113395 -0.0569902 -0.00555354 0.0980464 -0.0334307 0.0364725 0.034669 -0.00853652 -0.0177042 -0.119968 0.116088 -0.0845564 0.103978 -0.0513479 -0.0351422 0.0840575 0.0688942 -0.0624653 -0.0592291 0.0506742 0.135772 -0.101455 -0.0174535 0.0439423 0.144393 0.0380041 -0.121652 -0.0635065 0.00196299 -0.0934518 0.171753 -0.0285355 0.0694165 
0.0259179 -0.00535486 -0.128851 -0.00723641 0.0746542 0.191877 0.0362686 -0.0929562 -0.0383173 -0.0128211 0.0947229 0.127577 0.0752118 -0.0604303 -0.0831729 -0.0531228 -0.166045 0.060714 -0.0351958 0.0570569 0.142811 -0.0760029 0.00635077 0.151008 0.0423488 0.0113451 0.00269955 -0.197451 0.0237997 0.136814 0.0241449 -0.0499183 -0.0908123 -0.0283439 -0.0106179 0.0687604 -0.199984 -0.0563116 -0.0334927 0.0182616 0.0390719 -0.0549176 -0.107885 0.212714 -0.149325 -0.048601 0.125486 0.016757 -0.0879104 -0.0404957 0.0176965 -0.0170691 -0.0468742 -0.0710917 0.0786822 0.0782833 -0.0943837 0.257378 -0.0262793 -0.0358744 -0.0629747 -0.0080287 0.306516 -0.0195538 0.066947 -0.0995582 0.00694442 0.0312048 -0.0354093 0.116343 0.0483215 0.146257 -0.0333149 -0.0824196 -0.00552578 0.0341781 -0.0967857 0.0334665 -0.0398093 0.107591 -0.0460894 0.0294205 0.00832087 -0.0182117 -0.163059 0.0234157 0.12899 -0.0284139 -0.0268502 -0.0327128 0.033211 -0.102504 -0.0609124 -0.0108922 -0.0767826 -0.106255 -0.0585861 0.00382482 0.0943928 -0.0326692 0.0312336 0.0293599 -0.00413967 -0.0102865 -0.122326 0.107806 -0.09684 0.101813 -0.0537047 -0.0373334 0.0809703 0.073221 -0.0565962 -0.0587796 0.0435639 0.138524 -0.104078 -0.0243668 0.0386223 0.142981 0.0323426 -0.111413 -0.0658895 0.00215741 -0.101421 0.167183 -0.0421322 0.0689975 
-0.0145648 0.0505996 -0.132941 0.000392842 0.0533502 0.194845 0.0264756 -0.11717 -0.00772584 0.0221259 0.108129 0.0913449 0.0595952 -0.0491969 -0.0537058 -0.0498464 -0.157968 0.0643368 0.00979727 0.0203388 0.121851 -0.0811789 0.00140517 0.131914 0.0615699 0.00317197 -0.00483247 -0.190796 0.0647198 0.147828 0.0653848 -0.0475202 -0.0491825 -0.0632126 0.0164212 0.092318 -0.177181 -0.0580947 -0.0233479 0.0209071 0.0319978 -0.0683429 -0.106502 0.211118 -0.146881 -0.0357696 0.129076 0.0123336 -0.0860353 -0.089581 -0.000572904 0.0280338 -0.0238425 -0.0932537 0.0594411 0.118619 -0.0889763 0.239488 -0.0320241 -0.0250011 -0.105918 -0.0268557 0.310272 -0.0500895 0.0994796 -0.0717938 0.0150873 -0.000927844 -0.0568522 0.135027 0.0525608 0.138917 -0.0576259 -0.0922836 0.0201015 0.0296042 -0.103002 0.051447 -0.0547741 0.0806961 -0.0647474 0.0369 0.000718683 0.00715866 -0.144139 0.0280252 0.0997126 -0.0467134 -0.0275851 -0.0268152 0.0205569 -0.0938181 -0.0520134 -0.021278 -0.0456519 -0.122369 -0.0602411 0.0206428 0.0986009 -0.0181248 0.0332893 0.0359459 0.00204642 -0.0433944 -0.123251 0.130865 -0.0542475 0.068833 -0.0138526 -0.0291843 0.0555744 0.0441621 -0.0518025 -0.0803598 0.0544288 0.12728 -0.0879235 -0.0366786 0.0657362 0.149304 0.0608603 -0.143203 -0.0789676 0.00441069 -0.0946412 0.187345 -0.0179083 0.0998906 
-0.0211635 0.0532816 -0.128974 0.000291409 0.0429439 0.193002 0.0396354 -0.120752 0.00983689 0.0387942 0.115147 0.0792206 0.0459311 -0.0402239 -0.0243113 -0.0580801 -0.148103 0.0562418 0.0328421 -0.00186615 0.0953327 -0.0609865 -0.0164633 0.112903 0.0558648 0.022679 -0.00901307 -0.187348 0.0820202 0.138219 0.0870522 -0.0376185 -0.0477063 -0.0816493 0.033835 0.107165 -0.16429 -0.0434862 -0.0116825 0.0297129 0.0349613 -0.052164 -0.134729 0.205767 -0.147102 -0.0305863 0.110207 0.00914317 -0.0688053 -0.121853 -0.0195851 0.0487961 -0.0170247 -0.104187 0.0474004 0.130441 -0.0984507 0.24933 -0.0503605 -0.00477662 -0.126018 -0.0438808 0.318469 -0.0630661 0.116411 -0.0577754 0.0373493 -0.00981518 -0.0533781 0.137106 0.0630691 0.141244 -0.0523585 -0.0767361 0.016108 0.013807 -0.112132 0.0486053 -0.0592958 0.0609054 -0.0632459 0.0481818 -0.00730326 -0.00130322 -0.12587 -0.0030704 0.101948 -0.0517273 -0.0305942 -0.0353811 0.0283188 -0.0786269 -0.0425813 -0.0242139 -0.0210067 -0.12867 -0.040773 -0.00352686 0.102618 0.00101824 0.0156643 0.0364553 -0.0026547 -0.0670444 -0.135066 0.138607 -0.0291043 0.0301619 0.0116565 -0.0167522 0.0604016 0.0380264 -0.0516876 -0.0906603 0.0705981 0.115671 -0.0776859 -0.0538053 0.0699578 0.132292 0.0724694 -0.153716 -0.072516 0.0122896 -0.0781679 0.187483 -0.00877449 0.104847 
-0.0277268 0.0580168 -0.127257 0.000643904 0.0444333 0.195411 0.0412442 -0.126691 0.0155557 0.02897 0.104106 0.0763586 0.0369697 -0.0384598 -0.0242855 -0.0532576 -0.15167 0.0444865 0.0386304 -0.0189075 0.0953828 -0.0565501 -0.0235397 0.103862 0.0650395 0.0198171 -0.0153821 -0.182416 0.0839529 0.141175 0.0972876 -0.0350351 -0.0512521 -0.0892542 0.0359431 0.106929 -0.167327 -0.0597362 -0.00470455 0.0343147 0.0400413 -0.0476809 -0.124089 0.200441 -0.133435 -0.0228926 0.107758 0.00186453 -0.0666588 -0.133512 -0.0246655 0.0478338 -0.00195713 -0.110993 0.0414961 0.135333 -0.0975434 0.254838 -0.053842 0.00182542 -0.12648 -0.0337045 0.312357 -0.0649494 0.117931 -0.049595 0.0381078 -0.01448 -0.054184 0.130847 0.0630608 0.144083 -0.0559133 -0.0805448 0.0184334 0.023965 -0.111575 0.0367891 -0.0667744 0.064828 -0.0562132 0.0479796 -0.00314067 0.00746428 -0.127909 -0.000619636 0.0989489 -0.0588937 -0.0445812 -0.038674 0.0251334 -0.0733844 -0.0452548 -0.0201602 -0.0160019 -0.115777 -0.0392457 -0.00428633 0.101665 0.011516 0.0126714 0.0304681 -0.00430549 -0.0675591 -0.142013 0.139269 -0.0273214 0.0306779 0.00248788 -0.011496 0.0635296 0.0250314 -0.0553479 -0.0963766 0.0702872 0.120515 -0.0812043 -0.0396964 0.0732117 0.130764 0.0757316 -0.15451 -0.0730067 0.00271892 -0.0817568 0.191756 -0.0159681 0.103673 
-0.0126321 0.0420347 -0.135105 0.00127588 0.0330659 0.204117 0.0433716 -0.119316 0.00751076 0.0196194 0.108274 0.0828564 0.037779 -0.0379938 -0.0329343 -0.0716292 -0.158782 0.0401835 0.0384226 -0.0096407 0.0852996 -0.0575369 -0.026626 0.106835 0.053176 0.0241266 -0.00463148 -0.184715 0.0580631 0.13242 0.0820998 -0.0472352 -0.0603353 -0.0845653 0.029044 0.106346 -0.170476 -0.0599517 -0.0137328 0.0333739 0.0401702 -0.0488908 -0.136636 0.202534 -0.140591 -0.0304988 0.103828 0.000706986 -0.0709343 -0.11262 -0.02635 0.0385853 -0.000965589 -0.0968103 0.0482217 0.12884 -0.104774 0.26122 -0.0487785 -0.00521088 -0.119353 -0.0222397 0.323555 -0.0663264 0.106553 -0.0450794 0.0474879 -0.0110121 -0.0489926 0.1276 0.0624371 0.137248 -0.0434788 -0.0716149 0.0160234 0.0216632 -0.111312 0.0229447 -0.0609603 0.0673775 -0.0585077 0.0399229 -0.0076063 -0.011647 -0.1334 0.00170798 0.101839 -0.0642019 -0.0365396 -0.0354825 0.0347747 -0.0826895 -0.0354488 -0.0225345 -0.0236103 -0.117239 -0.0343662 -0.0163751 0.107235 0.0078567 0.0117731 0.0385629 -0.00198463 -0.0750061 -0.145207 0.142167 -0.031874 0.0295232 -0.0246477 -0.0109844 0.0814969 0.0328835 -0.0404178 -0.101839 0.0622021 0.118442 -0.0790492 -0.0411393 0.0771284 0.119531 0.0716175 -0.165927 -0.0651556 0.00225525 -0.0713899 0.1891 -0.011831 0.101896 
-0.00421665 0.025681 -0.134284 0.00770802 0.0446125 0.192324 0.0437799 -0.120725 0.00292611 0.0120885 0.109512 0.0918802 0.0436942 -0.0353521 -0.0409951 -0.0564613 -0.149515 0.045445 0.0323646 0.00306571 0.105913 -0.0606141 -0.0257525 0.119746 0.0577527 0.0287828 -0.00838413 -0.194233 0.0585753 0.144003 0.0757909 -0.0420541 -0.0618805 -0.0836312 0.0263929 0.102819 -0.178406 -0.051454 -0.0127186 0.0250546 0.0337539 -0.036505 -0.132002 0.20462 -0.134172 -0.0305255 0.110328 -0.00399113 -0.0675758 -0.118547 -0.019938 0.0263981 -0.00161219 -0.0981023 0.0592998 0.123116 -0.10308 0.265038 -0.0443414 -0.00926962 -0.107958 -0.0283347 0.320449 -0.0570408 0.1047 -0.054985 0.0400017 -0.00192093 -0.0400622 0.117714 0.0661194 0.143414 -0.0440953 -0.0842717 0.00686397 0.0243349 -0.109605 0.0309565 -0.0612871 0.0765165 -0.0525717 0.0461144 -0.00853779 -0.0188096 -0.134782 -0.000350381 0.106723 -0.0574857 -0.0409695 -0.044901 0.0309219 -0.0778068 -0.0461576 -0.0162981 -0.029204 -0.111922 -0.0344259 -0.0132681 0.108247 0.00323807 0.0129989 0.0319643 0.000261291 -0.0669665 -0.150739 0.137779 -0.0378153 0.0342865 -0.0175133 -0.0175622 0.0779816 0.0364239 -0.05125 -0.101445 0.067638 0.126891 -0.0932482 -0.0438005 0.0578822 0.119625 0.0565938 -0.146962 -0.0659605 0.00212585 -0.0802019 0.19429 -0.0176365 0.0949713 
-0.0108134 0.035972 -0.135667 0.00953049 0.0324111 0.199887 0.0417827 -0.115032 0.0105368 0.0194973 0.114962 0.0815855 0.040585 -0.0341228 -0.0391412 -0.0613195 -0.150992 0.0445586 0.0359293 -0.00677935 0.099049 -0.0696151 -0.0281724 0.116362 0.0595966 0.0196113 -0.00527856 -0.185742 0.0606061 0.136067 0.0832806 -0.0461024 -0.0595512 -0.0850588 0.0223206 0.107354 -0.177585 -0.0596887 -0.0168089 0.0264616 0.0346639 -0.0463392 -0.133898 0.201586 -0.129442 -0.0410528 0.103085 -0.00284406 -0.0699731 -0.120361 -0.0244569 0.0334885 -0.00164168 -0.0998241 0.0495948 0.132968 -0.107361 0.261219 -0.0416939 -0.00943315 -0.116577 -0.025216 0.321983 -0.0664971 0.105112 -0.0397012 0.0421756 -0.0117381 -0.0484174 0.1248 0.0605268 0.138577 -0.0457031 -0.0811264 0.0125577 0.0198923 -0.100048 0.0305763 -0.0640495 0.0668734 -0.0618933 0.0370756 -0.00995898 -0.0181812 -0.135311 0.00748777 0.0998362 -0.0626268 -0.0345652 -0.0397378 0.0315546 -0.082863 -0.0407124 -0.0193907 -0.0201099 -0.111082 -0.03792 -0.0163097 0.105578 0.0111919 0.0146585 0.0325244 -0.00249075 -0.074474 -0.141969 0.146023 -0.0309549 0.0252918 -0.0221498 -0.0211497 0.0712395 0.0337935 -0.039563 -0.102914 0.0702367 0.120244 -0.0812555 -0.0375967 0.075034 0.119771 0.061034 -0.163136 -0.0674352 0.00217108 -0.0736985 0.195914 -0.0132467 0.0999868 
-0.0195495 0.0483533 -0.138225 0.00226816 0.0313759 0.19831 0.0374217 -0.11983 0.0124591 0.0256712 0.112747 0.077244 0.0433534 -0.0271422 -0.0356945 -0.05885 -0.148859 0.0442675 0.0375865 -0.010927 0.0937064 -0.0664657 -0.0204688 0.10802 0.0563585 0.0184689 -0.00545532 -0.181343 0.0675528 0.138334 0.0879657 -0.0445734 -0.0507997 -0.0895881 0.0244801 0.109832 -0.173547 -0.0512638 -0.0149169 0.0358417 0.026896 -0.0437219 -0.135334 0.198684 -0.131191 -0.0345142 0.104278 -0.00108297 -0.0685741 -0.122398 -0.0261848 0.0436939 -0.00189597 -0.101049 0.0420796 0.136 -0.0997852 0.261153 -0.043845 -0.0064965 -0.12427 -0.0258456 0.321263 -0.0708674 0.109117 -0.041696 0.0416262 -0.00746721 -0.0534145 0.128909 0.065062 0.137449 -0.0491272 -0.079927 0.0172603 0.0230222 -0.104249 0.0274405 -0.0646365 0.0617073 -0.0631832 0.037609 -0.010036 -0.00917141 -0.135698 0.00553082 0.095699 -0.0650283 -0.034519 -0.0415865 0.0247098 -0.083839 -0.0347751 -0.0195844 -0.0114492 -0.114818 -0.0397944 -0.00787735 0.102923 0.013309 0.012704 0.0345411 -0.00500449 -0.0701063 -0.142842 0.14643 -0.0312067 0.0211299 -0.0128595 -0.0218496 0.0677409 0.0314162 -0.0395279 -0.0966431 0.0664021 0.123013 -0.0797764 -0.0376431 0.0768964 0.124675 0.0647531 -0.166169 -0.0707483 0.00122883 -0.0758799 0.195591 -0.0165218 0.104283 
-0.0182151 0.0466198 -0.137998 0.010457 0.0308092 0.194854 0.052026 -0.118936 0.00355323 0.0310107 0.110221 0.0805127 0.0409806 -0.0293914 -0.0398638 -0.0588207 -0.148213 0.0459834 0.0433808 -0.00966336 0.0951976 -0.0790746 -0.0323737 0.100319 0.0599609 0.0234866 -0.0190245 -0.182892 0.0685373 0.14355 0.0786396 -0.0325863 -0.0583218 -0.0921771 0.0263936 0.10323 -0.177307 -0.0510959 -0.00795888 0.0212838 0.0297235 -0.0475378 -0.128112 0.19161 -0.126749 -0.0330043 0.103946 -0.00945017 -0.0761277 -0.133387 -0.0268997 0.0434773 0.000500141 -0.101274 0.0490083 0.137056 -0.104508 0.262262 -0.0495088 -0.00197674 -0.11604 -0.0249894 0.322697 -0.074197 0.117344 -0.0285069 0.0361234 -0.0133749 -0.0577963 0.118242 0.0625558 0.140289 -0.0495731 -0.0751553 0.0120678 0.0267387 -0.0930305 0.023665 -0.0614801 0.0565499 -0.0700833 0.0316399 -0.0117747 -0.0121034 -0.136538 0.0014972 0.0953014 -0.0634948 -0.0276822 -0.0421526 0.0257054 -0.0822071 -0.0357657 -0.0142927 -0.0142493 -0.110733 -0.0293808 -0.0133305 0.106957 0.0182852 0.0129633 0.0360662 -0.00682305 -0.0692088 -0.143333 0.153015 -0.0222904 0.0281613 -0.013063 -0.0230277 0.06469 0.0279565 -0.0431704 -0.104744 0.0760131 0.118203 -0.0792381 -0.0334552 0.0807635 0.120981 0.0575416 -0.169362 -0.0661014 -0.0024942 -0.0694917 0.203026 -0.0126671 0.0946139 
-0.0150952 0.036981 -0.140322 0.0148896 0.0273986 0.192401 0.0394938 -0.108059 -0.00989754 0.033422 0.118184 0.085875 0.0467621 -0.0292222 -0.0380815 -0.0584082 -0.135173 0.0397399 0.0565178 0.00101827 0.0959589 -0.0876418 -0.0185315 0.109901 0.0655055 0.0253777 -0.00026787 -0.1888 0.0623963 0.135379 0.0793786 -0.0484754 -0.048979 -0.0901007 0.0144532 0.10193 -0.176233 -0.0487032 -0.0108148 0.0252623 0.0269926 -0.0495595 -0.131773 0.193284 -0.135805 -0.0413727 0.110325 -0.0162081 -0.0733012 -0.127689 -0.0164194 0.0401205 -0.00216621 -0.09702 0.0479448 0.13464 -0.097234 0.258367 -0.0393094 -0.00448636 -0.117356 -0.033683 0.317333 -0.0799263 0.121423 -0.0352275 0.0357221 -0.0118174 -0.053627 0.116751 0.0551257 0.143528 -0.0566111 -0.0822162 0.0209177 0.0277047 -0.0888678 0.038103 -0.0590986 0.0720725 -0.0866571 0.0161786 -0.00183276 -0.010521 -0.135613 0.00381381 0.0999208 -0.0611273 -0.0269 -0.0566649 0.0139878 -0.0795037 -0.0324009 -0.00971538 -0.0169906 -0.120852 -0.0271456 -0.00776888 0.101355 0.00875231 0.00583875 0.0381557 -0.00560526 -0.0641217 -0.135153 0.150383 -0.0222917 0.03025 -0.0157535 -0.0347249 0.0535656 0.0300388 -0.0331765 -0.101796 0.0754124 0.118622 -0.0805781 -0.0375109 0.0774897 0.1287 0.0493155 -0.170424 -0.0757518 -0.00495794 -0.0667702 0.205181 -0.0129792 0.105096 
-0.0286167 0.0632864 -0.142363 0.00611414 0.0258299 0.182432 0.0363439 -0.121254 -0.000729214 0.0424964 0.115086 0.0661911 0.0478752 -0.0160577 -0.0327313 -0.0411624 -0.133547 0.0396755 0.0600064 -0.0145893 0.100733 -0.0797806 -0.0158851 0.0956904 0.0645391 0.02583 -0.00980064 -0.185426 0.0915914 0.150497 0.0807889 -0.0321156 -0.0338234 -0.100456 0.0223925 0.105177 -0.164544 -0.0340043 -0.0025321 0.0333687 0.0149329 -0.0458925 -0.1237 0.187898 -0.125152 -0.0175473 0.118066 -0.0149013 -0.0775343 -0.150454 -0.023971 0.0623052 0.00308824 -0.0990271 0.043844 0.140929 -0.0768032 0.248836 -0.0434553 -0.00393432 -0.123919 -0.0389115 0.31354 -0.0760587 0.125135 -0.0315715 0.0344593 -0.00955398 -0.0482927 0.120683 0.0588744 0.137698 -0.0670209 -0.0842869 0.0335851 0.0280168 -0.0978931 0.0432615 -0.0678229 0.0577572 -0.0755405 0.0340033 -0.00909439 5.33364e-05 -0.129814 0.0119906 0.0873963 -0.0656881 -0.034869 -0.0538087 0.0116643 -0.0753466 -0.0384546 -0.0155039 -0.00560064 -0.120134 -0.0298983 0.0124828 0.11012 0.0140361 0.0113881 0.0340482 0.000465765 -0.0585493 -0.144883 0.148914 -0.0206213 0.0309182 0.00902062 -0.0367442 0.046374 0.0230984 -0.0469005 -0.106702 0.0784581 0.125368 -0.0822512 -0.0461979 0.0779769 0.127277 0.0570283 -0.164341 -0.0711199 -0.00213763 -0.0781817 0.207391 -0.0139826 0.110913 
-0.0271882 0.0550716 -0.137731 0.0023177 0.0301223 0.187357 0.0339241 -0.125573 0.0167462 0.0214966 0.114545 0.0721645 0.046618 -0.0119065 -0.037872 -0.046224 -0.140734 0.042024 0.0415554 -0.0177095 0.106288 -0.0647165 -0.0207959 0.100249 0.0600146 0.0204937 -0.00925828 -0.178973 0.0792171 0.15265 0.0875081 -0.0364728 -0.036873 -0.0943879 0.0277997 0.112406 -0.164773 -0.0412294 -0.00788066 0.0353089 0.0200208 -0.0353489 -0.124054 0.192582 -0.123914 -0.024541 0.110277 -0.0117896 -0.0689181 -0.140565 -0.0307098 0.0503876 0.00300769 -0.0956374 0.0457245 0.141672 -0.0912411 0.256032 -0.049797 -0.00539374 -0.125819 -0.0358987 0.316915 -0.0728892 0.116674 -0.0378958 0.0380021 -0.0041213 -0.0484889 0.12737 0.0700713 0.131197 -0.0582506 -0.0927144 0.0248651 0.0316863 -0.104352 0.0300587 -0.0727827 0.0556886 -0.0642532 0.0442494 -0.00851679 -0.00212249 -0.136123 0.0130411 0.0928303 -0.0671262 -0.0421531 -0.0447996 0.0188087 -0.088474 -0.0395869 -0.0191316 -0.00598613 -0.114229 -0.0423911 0.002023 0.10723 0.0185744 0.0123159 0.0320583 -0.00190311 -0.0643921 -0.145557 0.146845 -0.0292651 0.0226728 -0.00594943 -0.0309368 0.0534318 0.0174201 -0.052179 -0.0983189 0.0734456 0.129034 -0.0818581 -0.0428628 0.0749122 0.124814 0.0637095 -0.15911 -0.0706396 -0.000243086 -0.0759977 0.202007 -0.0131816 0.108601 
-0.0184114 0.0473017 -0.138986 0.00411359 0.0263973 0.188507 0.0350307 -0.116135 -0.00103502 0.0311188 0.11702 0.076486 0.050788 -0.0258567 -0.0415787 -0.0454854 -0.145801 0.043267 0.0423682 -0.00621308 0.106342 -0.0738586 -0.0151877 0.107203 0.0575892 0.0293249 -0.0020979 -0.191474 0.0759044 0.146253 0.0743864 -0.0386607 -0.0436567 -0.0892694 0.0198125 0.102208 -0.172662 -0.0343787 -0.0108848 0.0324311 0.0186573 -0.0490324 -0.130658 0.200227 -0.130207 -0.0286906 0.116528 -0.0102903 -0.0787876 -0.132332 -0.0166901 0.0478083 -0.00391457 -0.0934367 0.0518307 0.133495 -0.0844692 0.253321 -0.038143 -0.0127818 -0.117237 -0.039473 0.319733 -0.0642388 0.115367 -0.0452741 0.034786 -0.00330522 -0.0427483 0.124958 0.0575531 0.135716 -0.0573483 -0.0852656 0.0247472 0.0225181 -0.103481 0.0413698 -0.0659206 0.0681758 -0.0672867 0.0335705 -0.00778174 -0.0113154 -0.137892 0.00903113 0.0978313 -0.0617717 -0.0335291 -0.0489756 0.0164809 -0.0821698 -0.0426076 -0.0177881 -0.0192824 -0.115181 -0.0340946 0.0042247 0.112133 0.00772318 0.0150992 0.0365758 -0.00073199 -0.0576477 -0.140544 0.139682 -0.0338277 0.0359121 -0.00379657 -0.038125 0.0559606 0.0355108 -0.0481145 -0.104306 0.0757151 0.127795 -0.0852973 -0.046769 0.0728031 0.125371 0.0581806 -0.159277 -0.0673729 -0.00130762 -0.0762733 0.200804 -0.0133548 0.107862 
