{
  "descriptor": [
    -0.09174049645662308,
    0.059222519397735596,
    0.04244367778301239,
    -0.029098186641931534,
    -0.08959603309631348,
    -0.07570362836122513,
    -0.02177201211452484,
    -0.03948153555393219,
    0.11293548345565796,
    -0.010940300300717354,
    0.19282640516757965,
    0.017896128818392754,
    -0.2079218029975891,
    -0.08384634554386139,
    -0.004835048690438271,
    0.05447950214147568,
    -0.10976555943489075,
    -0.06658162921667099,
    -0.13996130228042603,
    -0.13590969145298004,
    0.04224549978971481,
    0.03415507823228836,
    0.037801384925842285,
    -0.02006550133228302,
    -0.09522783756256104,
    -0.25813406705856323,
    -0.07363337278366089,
    -0.11006997525691986,
    0.0935535803437233,
    -0.16707471013069153,
    0.0430942103266716,
    0.033166155219078064,
    -0.14537405967712402,
    -0.07004499435424805,
    -0.016438959166407585,
    0.036388032138347626,
    -0.03698812797665596,
    -0.09147319942712784,
    0.1951996088027954,
    -0.020203623920679092,
    -0.13480781018733978,
    -0.016009477898478508,
    0.03367838263511658,
    0.23200219869613647,
    0.22495101392269135,
    0.019461141899228096,
    0.005258473567664623,
    -0.042893972247838974,
    0.0682494193315506,
    -0.2563375234603882,
    0.057774197310209274,
    0.16544850170612335,
    0.07845737785100937,
    0.10683241486549377,
    0.08870454877614975,
    -0.13049110770225525,
    0.02509615197777748,
    0.09644924104213715,
    -0.13853982090950012,
    0.04144953936338425,
    0.04039163514971733,
    -0.09543567150831223,
    -0.049350839108228683,
    -0.09293591231107712,
    0.16836237907409668,
    0.08445380628108978,
    -0.06467531621456146,
    -0.1251872479915619,
    0.10536327213048935,
    -0.1715531349182129,
    -0.0651361495256424,
    0.09809297323226929,
    -0.1057073175907135,
    -0.14496243000030518,
    -0.20421740412712097,
    0.10649827122688293,
    0.3191308081150055,
    0.18090574443340302,
    -0.15387681126594543,
    0.014964052475988865,
    -0.10114830732345581,
    -0.04341254010796547,
    0.01793583482503891,
    0.0034304503351449966,
    -0.07802747189998627,
    -0.046368930488824844,
    -0.0752042606472969,
    0.024737536907196045,
    0.16801784932613373,
    -0.052693068981170654,
    -0.000448448583483696,
    0.18037863075733185,
    -0.004652760922908783,
    -0.00038709910586476326,
    0.0099598728120327,
    -0.00557803176343441,
    -0.10031581670045853,
    0.027410460636019707,
    -0.04741397500038147,
    -0.017792511731386185,
    0.1329292356967926,
    -0.14985477924346924,
    0.04460160434246063,
    0.08286350220441818,
    -0.15309786796569824,
    0.13585850596427917,
    -0.03226423263549805,
    -0.03175752982497215,
    0.03274916857481003,
    -0.04143743962049484,
    -0.04162720590829849,
    -0.01361066848039627,
    0.19393515586853027,
    -0.18601161241531372,
    0.27161622047424316,
    0.1977202296257019,
    0.019263695925474167,
    0.1431843787431717,
    0.053887903690338135,
    0.13637438416481018,
    -0.03600028529763222,
    0.004884978756308556,
    -0.09107470512390137,
    -0.045875757932662964,
    0.01083291508257389,
    -0.002990040462464094,
    -0.002954455092549324,
    0.015528596006333828
  ]
}