{
  "descriptor": [
    -0.11597897112369537,
    0.0853971391916275,
    0.023280974477529526,
    0.01516135223209858,
    -0.07253649085760117,
    0.029084162786602974,
    -0.02805345505475998,
    -0.08544821292161942,
    0.2037116289138794,
    -0.00810714066028595,
    0.1450357735157013,
    0.03795558214187622,
    -0.14872726798057556,
    -0.007499529980123043,
    0.010275671258568764,
    0.0207036342471838,
    -0.19077463448047638,
    -0.12598374485969543,
    -0.05461643263697624,
    -0.05187486857175827,
    0.07994269579648972,
    0.08882733434438705,
    -0.013271884992718697,
    0.10236970335245132,
    -0.2082965075969696,
    -0.30996716022491455,
    -0.057680655270814896,
    -0.12418744713068008,
    0.06439651548862457,
    -0.12669380009174347,
    -0.012025250121951103,
    0.01000167801976204,
    -0.16822664439678192,
    -0.06217159330844879,
    0.026537617668509483,
    0.04996107891201973,
    0.020087745040655136,
    -0.0626673549413681,
    0.18784449994564056,
    0.09640408307313919,
    -0.1401118040084839,
    0.03567967563867569,
    0.001671884674578905,
    0.33113446831703186,
    0.19041574001312256,
    0.042972732335329056,
    0.037264611572027206,
    -0.05915158987045288,
    0.10742403566837311,
    -0.23713940382003784,
    0.021755732595920563,
    0.20560917258262634,
    0.023034239187836647,
    0.012295028194785118,
    0.10822755843400955,
    -0.1598026156425476,
    -0.033426057547330856,
    0.06617961078882217,
    -0.14969103038311005,
    0.16084954142570496,
    0.065653957426548,
    -0.0013381385942921042,
    0.058784905821084976,
    -0.021735263988375664,
    0.12327425181865692,
    0.0022194492630660534,
    -0.08117831498384476,
    -0.11311948299407959,
    0.02770303376019001,
    -0.16979311406612396,
    -0.06470086425542831,
    0.09417911618947983,
    -0.0862148180603981,
    -0.23858298361301422,
    -0.2306356430053711,
    0.05965050682425499,
    0.4957562983036041,
    0.13399405777454376,
    -0.20108474791049957,
    0.0354168601334095,
    -0.10850418359041214,
    -0.08955109119415283,
    0.13914433121681213,
    0.050076697021722794,
    -0.02614598162472248,
    -0.02877836674451828,
    -0.12474378198385239,
    0.03909632936120033,
    0.2601235508918762,
    0.08679881691932678,
    0.018674658611416817,
    0.2457028478384018,
    0.0060883802361786366,
    -0.07031585276126862,
    0.04269887134432793,
    0.08689159899950027,
    -0.1457616686820984,
    0.04843350127339363,
    -0.06433584541082382,
    -0.0274240393191576,
    0.020388098433613777,
    -0.0713338628411293,
    0.039133429527282715,
    0.10300615429878235,
    -0.23417037725448608,
    0.12750251591205597,
    0.007933775894343853,
    -0.0671410858631134,
    -0.009938029572367668,
    0.004644626285880804,
    -0.1849662959575653,
    -0.020469380542635918,
    0.19292353093624115,
    -0.29539400339126587,
    0.11466126888990402,
    0.18283426761627197,
    0.02219853363931179,
    0.15624485909938812,
    0.006839732173830271,
    0.06034594401717186,
    -0.011246956884860992,
    0.05141100659966469,
    -0.0835210382938385,
    -0.06631765514612198,
    -0.028729408979415894,
    -0.020129745826125145,
    0.007121478207409382,
    -0.017925787717103958
  ]
}