0.115294 0.0608032 -0.136866 0.0357221 0.105471 0.190832 0.0704859 -0.0635199 -0.0157773 -0.0281 0.124535 0.13569 0.0794118 -0.136449 -0.0967529 -0.0835603 -0.0305005 0.0911016 -0.110408 0.139692 0.144598 -0.0661499 0.00597192 0.179236 0.0409099 -0.0761428 0.0165662 -0.154558 0.0591138 0.153084 0.00854915 0.00930751 -0.0542644 0.0869352 -0.00340877 -0.0152355 -0.0793888 0.00435869 -0.0375009 -0.0835133 0.0477728 -0.110043 -0.05097 0.185387 -0.178122 -0.0833064 0.0994126 0.0662179 -0.108886 0.0470286 0.0640857 0.0447291 -0.076347 -0.0565888 0.0789272 0.0305863 -0.129663 0.154313 -0.0454864 -0.0802012 -0.0957761 -0.0739279 0.272775 -0.105444 0.0368776 -0.126039 -0.00761443 -0.0266211 -0.13804 0.112862 -0.020027 0.0452407 -0.0782207 -0.0484501 -0.0389932 -0.0247469 0.00398871 0.0861166 -0.0152893 0.136779 -0.0877378 0.0185829 0.0285563 -0.0327571 -0.023498 -0.0110675 0.0792702 -0.0150534 0.0233753 0.067336 0.0721632 -0.177013 -0.105447 0.0163348 -0.0534602 -0.149608 -0.0483678 -0.00821494 0.0342747 -0.093667 0.0579217 0.0882161 -0.0126891 0.104592 -0.0844675 0.0625506 -0.0379173 0.143086 0.0190105 -0.043517 0.048257 0.0905967 -0.10271 0.04628 0.0550844 0.0397557 -0.0811414 -0.0714466 0.0816723 0.193205 0.0223571 -0.0412037 -0.0742514 0.0759145 -0.00389898 0.0557591 0.0548452 -0.0138768 
0.106564 0.108089 -0.122803 0.0389699 0.0971456 0.224525 0.0931183 -0.0579034 -0.0460877 -0.00465311 0.108353 0.111466 0.0842684 -0.166661 -0.0827292 -0.0451183 -0.0243906 0.100434 -0.11004 0.093048 0.16132 -0.0746121 -0.0165965 0.157234 0.0516647 -0.0897363 -0.0273809 -0.16845 0.0733274 0.165487 0.0125026 0.0536263 -0.0714436 0.101015 0.0117767 -0.0407375 -0.0540915 -0.0140482 -0.000871353 -0.0797588 0.0544995 -0.135012 0.00388153 0.144374 -0.135724 -0.0782045 0.122948 0.0399381 -0.166873 0.0113977 0.0916819 0.0120941 -0.0743999 -0.0550726 0.0532902 0.0534998 -0.115324 0.14697 -0.0431658 -0.0709388 -0.0817945 -0.0533958 0.241735 -0.162569 0.0777692 -0.0901166 -0.0249436 -0.0486462 -0.172303 0.0962202 -0.0458383 0.0479553 -0.103509 -0.0473384 -0.034374 -0.010212 0.0264999 0.0848484 -0.0180308 0.111261 -0.0931363 0.00507394 0.0264004 -0.0191927 -0.0500048 0.0125512 0.0677383 -0.0531983 0.00484148 0.0813836 0.0579934 -0.190779 -0.118687 0.0218838 -0.0520948 -0.0950674 -0.0311609 0.0103747 0.0201139 -0.0413751 0.0559944 0.0775593 -0.033231 0.14169 -0.071848 0.0570396 -0.0363331 0.163518 -0.0206246 -0.0585625 0.0116305 0.0665988 -0.0951185 0.0157535 0.0783715 0.0249635 -0.10065 -0.0435055 0.0843004 0.192251 0.036818 -0.0549264 -0.0520149 0.0681368 0.0203055 0.0595307 0.0335866 -0.0504388 
0.12765 0.0695441 -0.134127 0.0532818 0.12238 0.215243 0.0920593 -0.0446297 -0.0699513 0.012993 0.100855 0.132114 0.100296 -0.139698 -0.0780981 -0.0284046 0.0292774 0.115502 -0.0869516 0.118217 0.168693 -0.0867722 -0.00375286 0.190678 0.0571922 -0.099371 -0.0372279 -0.169812 0.0660349 0.182766 0.00237228 0.0587741 -0.0648035 0.0962628 -0.0118025 -0.0352302 -0.0675942 -0.0311695 0.000315086 -0.0883458 0.0332792 -0.106302 0.0152236 0.121019 -0.138035 -0.0977484 0.119137 0.03561 -0.137964 0.0209297 0.123955 -0.00502427 -0.0703808 -0.0602033 0.0630063 0.0518626 -0.102672 0.157106 -0.0231726 -0.0560524 -0.0762869 -0.0436423 0.216306 -0.18395 0.0679473 -0.096422 -0.045519 -0.0412633 -0.187371 0.0719833 -0.0350342 0.0725647 -0.115198 -0.0644384 -0.0534371 0.0209663 0.0599715 0.0912677 -0.00489808 0.109799 -0.0991349 -0.00503301 0.0348313 -0.012004 -0.035927 0.0130198 0.066614 -0.0441328 0.0153373 0.0608613 0.0273046 -0.171028 -0.117242 0.0533549 -0.0424602 -0.0855341 -0.0291075 0.013083 -0.00176979 -0.0396869 0.0663606 0.0796499 -0.0339626 0.149786 -0.0851793 0.0635635 -0.0467587 0.127472 -0.0113348 -0.0582011 -0.00302759 0.0618978 -0.0705034 0.0198888 0.0718046 0.0373273 -0.0907633 -0.0306542 0.0478285 0.206576 0.0106111 -0.0634187 -0.0566485 0.049754 -0.00108449 0.0801547 0.0182421 -0.0544276 
0.122128 0.0478686 -0.115839 0.0489834 0.106006 0.216125 0.0877785 -0.0353507 -0.0328813 -0.0290769 0.105544 0.136987 0.0897324 -0.159136 -0.0886456 -0.0657303 -0.0204577 0.11607 -0.121659 0.119331 0.175581 -0.0793902 0.00656273 0.201548 0.0403149 -0.112415 -0.0243777 -0.181514 0.0353176 0.157527 0.00785247 0.0293691 -0.0630591 0.11235 -0.00562757 -0.0383619 -0.0780312 -0.0226623 -0.0419587 -0.0851472 0.0527822 -0.114062 -0.0212012 0.149233 -0.155537 -0.113934 0.102692 0.0408551 -0.129538 0.0528696 0.096227 -0.0214809 -0.067322 -0.0520761 0.0618898 0.0500411 -0.106521 0.149882 -0.0296001 -0.07396 -0.0697934 -0.03867 0.225728 -0.14706 0.0518662 -0.115282 -0.0275222 -0.0462118 -0.169113 0.0943642 -0.0410119 0.0456425 -0.0932997 -0.058244 -0.0559752 -0.000766984 0.0263813 0.0688216 -0.0062354 0.123106 -0.103559 -0.000690339 0.0249342 -0.0311918 -0.0413 0.0192551 0.0822054 -0.0414638 0.00189611 0.0719027 0.0585734 -0.188259 -0.109431 0.018708 -0.060696 -0.0963157 -0.0566651 -0.00040926 0.0115145 -0.0430627 0.0724398 0.0733006 -0.0269793 0.130064 -0.0606749 0.0443089 -0.0509035 0.135667 -0.0322933 -0.0502195 0.014134 0.0725946 -0.0783124 0.0107657 0.059994 0.0488959 -0.0824887 -0.0436126 0.067406 0.204138 0.0200121 -0.0507098 -0.0777378 0.064862 0.0033055 0.0588435 0.0293321 -0.0388681 
0.133066 0.0816421 -0.147849 0.0443385 0.116304 0.191249 0.0848964 -0.0427431 -0.0477585 0.000120849 0.111755 0.134558 0.0951672 -0.134707 -0.0892995 -0.0399204 0.0315093 0.108723 -0.108289 0.135926 0.156534 -0.0704861 0.00817716 0.172102 0.0407571 -0.0944537 -0.0113399 -0.152569 0.0654657 0.179781 -0.0119282 0.0640485 -0.0413579 0.103538 -0.0205133 -0.0418158 -0.0593731 0.00747306 -0.0215705 -0.0851102 0.0221522 -0.103172 -0.00476947 0.145545 -0.153573 -0.0787692 0.112948 0.0431436 -0.134066 0.0447827 0.120402 0.0289508 -0.0876792 -0.0551537 0.0621076 0.0351508 -0.108634 0.13803 -0.0252868 -0.0643009 -0.0856457 -0.0743505 0.22784 -0.156242 0.0477671 -0.125348 -0.0403666 -0.0267329 -0.17565 0.0907025 -0.0253609 0.0465444 -0.0998938 -0.054728 -0.056879 0.00310494 0.0465024 0.0871616 -0.0197727 0.112519 -0.0967317 0.00698212 0.0251673 -0.0202991 -0.0174928 -0.00106562 0.061566 -0.0407718 0.029557 0.0711259 0.0303188 -0.183242 -0.130613 0.0368224 -0.0291618 -0.103533 -0.0292231 0.00635453 0.00267464 -0.0654235 0.0578531 0.0903064 -0.0214259 0.157033 -0.0968725 0.0490594 -0.0552423 0.140402 0.0137507 -0.0679627 0.013803 0.0781086 -0.0952644 0.0442419 0.0662438 0.0232256 -0.0815872 -0.0637974 0.0693388 0.207735 0.0106582 -0.0336822 -0.0556398 0.0763152 0.019222 0.0447188 0.0465139 -0.0522258 
0.139496 0.071742 -0.143378 0.0703069 0.112768 0.204531 0.0730768 -0.0575819 -0.060274 0.00217692 0.110879 0.135061 0.0903925 -0.121819 -0.0818454 -0.017546 0.0497338 0.116906 -0.0759339 0.123272 0.169395 -0.0808152 0.0191026 0.183701 0.0624381 -0.102502 -0.0188628 -0.166293 0.0493492 0.197315 -0.00512009 0.0732199 -0.0382646 0.103489 -0.0167762 -0.0318759 -0.0555891 -0.0117 0.00384885 -0.0919497 0.00412506 -0.0996082 0.0153379 0.10595 -0.136431 -0.0930721 0.118402 0.0226392 -0.131014 0.0403559 0.141465 0.0163979 -0.0632519 -0.047155 0.0656771 0.0465772 -0.0841691 0.134584 -0.0221785 -0.0553885 -0.0781394 -0.0608308 0.212757 -0.199982 0.065615 -0.102685 -0.0490065 -0.0305293 -0.192899 0.0965919 -0.0336727 0.0622723 -0.127055 -0.066748 -0.0601879 0.0140199 0.0760094 0.0771 -0.0233475 0.113233 -0.105198 -0.00223325 0.0281504 -0.0241454 -0.0242186 0.00742084 0.0448009 -0.0533684 0.0218345 0.0687937 0.0175695 -0.180374 -0.121212 0.0624148 -0.0232138 -0.0819694 -0.0319897 0.0197871 0.00295985 -0.0441455 0.0661519 0.0829851 -0.0370556 0.157497 -0.0781736 0.0578122 -0.0420134 0.111171 -0.00587207 -0.0686339 -0.0191973 0.0646839 -0.0643582 0.0291681 0.0805482 0.0302263 -0.0722537 -0.0444218 0.0622923 0.214246 0.0142364 -0.0500187 -0.0447958 0.0534006 0.0236758 0.0702435 0.0567953 -0.0498459 
0.122549 0.0791327 -0.126693 0.0666926 0.0912161 0.209502 0.0884766 -0.0357856 -0.0626317 0.00457891 0.111068 0.12101 0.102835 -0.159635 -0.086283 -0.0312343 0.0274979 0.118471 -0.100155 0.124964 0.166297 -0.0932588 -0.000363231 0.197057 0.0423135 -0.111597 -0.0366887 -0.172428 0.0552038 0.173351 -0.000307429 0.0608871 -0.0545541 0.112163 -0.0165095 -0.0429578 -0.0579708 -0.0236025 -0.0175792 -0.0847844 0.0279937 -0.128169 0.0125731 0.119512 -0.128817 -0.110509 0.119335 0.0332451 -0.147351 0.0392266 0.130174 -0.0157934 -0.0714949 -0.0519709 0.0468082 0.0530715 -0.100474 0.126467 -0.00804532 -0.0586179 -0.0740835 -0.04226 0.20113 -0.188713 0.0634099 -0.10399 -0.036976 -0.0696522 -0.199329 0.0648293 -0.0569643 0.0432918 -0.111458 -0.0496033 -0.0530616 0.00292085 0.0687511 0.0921071 -0.00915131 0.115646 -0.10453 -0.0271774 0.0216575 -0.022139 -0.0340958 0.0303475 0.0540519 -0.0644921 0.0126259 0.0673014 0.0266348 -0.1818 -0.110965 0.0411229 -0.0457878 -0.072439 -0.0356974 0.0133826 -0.00339408 -0.0335041 0.0665471 0.0839812 -0.0377531 0.161138 -0.0560222 0.0518768 -0.034051 0.137357 -0.0253391 -0.0606032 -0.0227068 0.063183 -0.0638509 0.0113241 0.0579318 0.0270071 -0.0757714 -0.0315071 0.0589554 0.205103 0.00325613 -0.0624582 -0.0618423 0.0608818 0.0134461 0.0645054 0.0215925 -0.0602773 
0.129916 0.0768775 -0.133688 0.0612213 0.100542 0.213366 0.0785357 -0.0368034 -0.0564727 -0.00192034 0.108096 0.130115 0.0925132 -0.155002 -0.085816 -0.0200867 0.0397835 0.12318 -0.0961937 0.122687 0.164973 -0.0674793 -0.000336278 0.189451 0.0349755 -0.107731 -0.0207857 -0.170182 0.0409973 0.182868 -0.0126615 0.0647498 -0.0396428 0.118669 -0.00970894 -0.0368968 -0.0377165 -0.0321102 -0.0168601 -0.085307 0.0219575 -0.11867 0.0287093 0.114126 -0.128739 -0.0971795 0.126171 0.0259785 -0.154172 0.049669 0.139811 -0.0246343 -0.0721616 -0.0405495 0.0598685 0.055972 -0.101302 0.118982 -0.0172194 -0.0542775 -0.0704396 -0.0488382 0.2019 -0.201259 0.0703066 -0.115383 -0.0468778 -0.0568797 -0.199598 0.0786444 -0.0505173 0.0367124 -0.11538 -0.0672855 -0.0607129 0.0165846 0.0742819 0.0946368 -0.0199185 0.0932348 -0.0965857 -0.0038283 0.0183312 -0.0197508 -0.0351462 0.0304114 0.0485181 -0.0654062 0.0111909 0.0915217 0.0236142 -0.194668 -0.128087 0.0516294 -0.0350439 -0.0521406 -0.0371229 0.00854005 -0.00441307 -0.0294623 0.0662883 0.0802206 -0.0446856 0.154272 -0.0637788 0.0481267 -0.0441382 0.116163 -0.0500142 -0.0583147 -0.0184283 0.0555109 -0.0537529 0.0155667 0.0612313 0.0200224 -0.0760972 -0.0434392 0.0513761 0.200394 0.0170654 -0.0533825 -0.0398807 0.0619865 0.0330143 0.0608333 0.0358786 -0.0716507 
0.144489 0.0654288 -0.154767 0.0584317 0.10747 0.191202 0.0717373 -0.0219661 -0.0330275 -0.00505042 0.136929 0.129945 0.0914347 -0.151666 -0.081258 -0.0387318 0.0439002 0.0957329 -0.114564 0.151709 0.146974 -0.0636405 0.00288519 0.196623 0.038812 -0.117434 0.000178919 -0.15189 0.0470066 0.164349 -0.00170629 0.036368 -0.0409638 0.109726 -0.0391456 -0.0187276 -0.068755 -0.0280672 -0.0452494 -0.0675064 0.0202307 -0.105592 -0.0280691 0.147904 -0.134324 -0.0849442 0.0966297 0.0583189 -0.119344 0.0653374 0.117123 0.024371 -0.0948889 -0.0714508 0.0468605 0.0355986 -0.140704 0.124914 -0.0158466 -0.0442718 -0.0965571 -0.0697943 0.217487 -0.158723 0.0234965 -0.142842 -0.0263975 -0.0276771 -0.170455 0.0729824 -0.0205964 0.0447641 -0.0950895 -0.0683688 -0.0622784 0.000242374 0.0565716 0.102412 -0.0281584 0.136442 -0.0893949 -0.0113084 0.0109062 -0.0317722 -0.0206254 0.0326157 0.0557644 -0.0575573 0.0185276 0.0715451 0.0314993 -0.179703 -0.138174 0.0563542 -0.0330268 -0.0927722 -0.0396073 -0.042159 -0.00815166 -0.0748147 0.0593971 0.0819948 -0.028602 0.124342 -0.0951435 0.0579334 -0.0495185 0.120836 -0.000832184 -0.0509755 0.0202174 0.0773446 -0.0720938 0.0407858 0.0534404 0.0263324 -0.0840722 -0.0515836 0.0596405 0.20644 -0.0054516 -0.0383544 -0.0613149 0.101307 0.0270677 0.0451627 0.0476519 -0.0612612 
0.135012 0.0853457 -0.159487 0.0416619 0.107211 0.172993 0.0703474 -0.024687 -0.0527731 -0.0129589 0.12133 0.13733 0.089132 -0.133604 -0.111595 -0.0367589 0.0588778 0.094984 -0.11318 0.147288 0.147424 -0.0504294 -0.0169939 0.183682 0.030171 -0.0882286 0.0139101 -0.132085 0.0655299 0.179043 -0.0365835 0.0385159 -0.0366221 0.0959098 -0.0459118 -0.0386413 -0.0692816 -0.0115209 -0.0531152 -0.0608719 0.0143426 -0.084797 -0.00787549 0.161906 -0.131815 -0.0459474 0.122939 0.02983 -0.149384 0.0449819 0.126169 0.0365845 -0.100267 -0.0632465 0.0612239 0.0324643 -0.1356 0.136477 -0.00566114 -0.0590979 -0.0785289 -0.0728649 0.219835 -0.134441 0.0223116 -0.156389 -0.0284243 -0.0250117 -0.15728 0.0717111 -0.0082403 0.0278882 -0.0809901 -0.074302 -0.0519033 0.023491 0.0396493 0.112059 -0.0328745 0.111507 -0.0855514 0.0145622 0.0185762 -0.028454 -0.0211295 0.017664 0.059845 -0.0588299 0.0182923 0.0721124 0.00871301 -0.184709 -0.147601 0.0463284 -0.0218328 -0.0888431 -0.0133683 -0.0294066 0.000520889 -0.0837795 0.039511 0.0993451 -0.0137201 0.151577 -0.135799 0.0506531 -0.0693353 0.142403 -0.0141032 -0.0762602 0.0492947 0.0679539 -0.0948257 0.0428306 0.0446855 0.0199476 -0.108006 -0.0773305 0.0565897 0.186096 -0.0161264 -0.0241776 -0.0567325 0.0775888 0.0316164 0.0495745 0.0352788 -0.0766302 
0.134141 0.0823799 -0.171348 0.0482949 0.115174 0.178807 0.0789122 -0.0373745 -0.0624449 -0.0126543 0.105738 0.129747 0.10059 -0.139748 -0.114353 -0.0168075 0.051482 0.112635 -0.114189 0.141907 0.168711 -0.069811 -0.00609075 0.178532 0.0310758 -0.0997179 -0.0180574 -0.161078 0.0619842 0.192182 -0.0312497 0.0746227 -0.0464841 0.0955294 -0.0330997 -0.0433983 -0.0644809 -0.0184473 -0.0342092 -0.0756719 0.0151002 -0.0901972 0.0128788 0.149528 -0.126673 -0.050632 0.136039 0.0297822 -0.155963 0.0349126 0.125053 0.00737907 -0.0831179 -0.0575449 0.0543369 0.0341883 -0.103108 0.130923 0.00509931 -0.0640907 -0.0649196 -0.0490899 0.210321 -0.148905 0.030993 -0.144817 -0.0403488 -0.0304741 -0.1584 0.0572253 -0.0235409 0.0333259 -0.0921353 -0.0738548 -0.0627123 0.0256197 0.0437687 0.102282 -0.0355389 0.104475 -0.0848351 0.014474 0.0018554 -0.0268691 -0.0346424 0.0413045 0.0506196 -0.0690825 0.00584984 0.0622103 0.0174199 -0.179754 -0.150058 0.0316334 -0.0265605 -0.0700641 -0.0216805 0.00576521 -0.00498033 -0.0635478 0.0540501 0.0821606 -0.0118059 0.170756 -0.117745 0.0423576 -0.072134 0.159279 -0.0250101 -0.0638613 0.0214537 0.0600146 -0.092325 0.0226671 0.042487 0.0271022 -0.10582 -0.0700803 0.0549329 0.186251 -0.0131792 -0.0248447 -0.0478654 0.0719493 0.00828307 0.0448352 0.00913116 -0.0792217 
0.13217 0.0756068 -0.153886 0.037766 0.119746 0.174269 0.0790394 -0.0395426 -0.0657651 -0.00946477 0.109578 0.133379 0.102123 -0.132865 -0.111735 -0.0252391 0.0401065 0.112768 -0.122913 0.14805 0.166799 -0.0654812 -0.0109101 0.173611 0.0259235 -0.0795311 -0.0160178 -0.155235 0.0684418 0.182696 -0.0351027 0.0686831 -0.0540433 0.0975071 -0.0246702 -0.0395353 -0.0717582 0.000726652 -0.0319332 -0.0825649 0.0175737 -0.0905833 -0.00258037 0.15736 -0.133524 -0.0460692 0.129574 0.0378663 -0.161265 0.0295309 0.114533 0.0126305 -0.0957455 -0.0565179 0.0641916 0.0274227 -0.119324 0.142054 -0.0102528 -0.0650054 -0.0624804 -0.0598243 0.222748 -0.130374 0.0410957 -0.14481 -0.0419401 -0.0175332 -0.153095 0.067644 -0.0170005 0.0340017 -0.0823598 -0.0725294 -0.0642475 0.015561 0.0366826 0.104559 -0.0237262 0.10259 -0.0807809 0.0163872 0.00489483 -0.0330955 -0.0388462 0.0151066 0.0639111 -0.0506886 0.01455 0.0698732 0.0271979 -0.179007 -0.143786 0.0359512 -0.0363649 -0.0800678 -0.0196923 -0.00330715 0.00161976 -0.0699173 0.0536976 0.0883715 -0.0215407 0.160512 -0.112748 0.0474207 -0.071784 0.159458 -0.00515624 -0.0717237 0.031033 0.07166 -0.104563 0.0352391 0.0534025 0.026249 -0.111956 -0.0748075 0.0522145 0.183387 -0.0141729 -0.0225317 -0.0493036 0.0762832 0.0157042 0.0475523 0.0181228 -0.0809024 
0.1156 0.0842678 -0.128847 0.0408979 0.112878 0.214794 0.0830827 -0.0432051 -0.0715588 -0.0115158 0.0934505 0.123795 0.0989551 -0.156889 -0.094178 -0.0164725 0.00724269 0.122737 -0.122368 0.110103 0.178027 -0.071636 -0.0027371 0.174036 0.0403522 -0.0992615 -0.0382823 -0.173499 0.0582181 0.17232 -0.000450332 0.0655847 -0.070194 0.107344 -0.00514136 -0.0409491 -0.0653463 -0.0294191 -0.0107606 -0.0766622 0.0352793 -0.111598 0.0283216 0.142886 -0.127306 -0.0862449 0.13803 0.0326753 -0.168979 0.0314655 0.121614 -0.0313319 -0.0809503 -0.0518421 0.0486606 0.0471567 -0.0996577 0.149843 -0.00798601 -0.0717758 -0.0671759 -0.0321719 0.213735 -0.163207 0.066108 -0.115728 -0.0465833 -0.045515 -0.179804 0.0794 -0.0391469 0.0513277 -0.0946735 -0.0638484 -0.0587092 0.00946298 0.0377573 0.0863437 -0.0198622 0.0994468 -0.0796756 0.0043536 0.0199632 -0.0190149 -0.0624319 0.0307529 0.0635143 -0.0585931 -0.00120539 0.0720247 0.0348754 -0.18439 -0.134563 0.0269215 -0.043724 -0.053526 -0.0363504 0.0292389 -0.0127078 -0.0301332 0.0542551 0.0742006 -0.0352324 0.165411 -0.0748604 0.0467125 -0.0647741 0.155599 -0.0329966 -0.0653979 -0.00276279 0.0632021 -0.0846914 0.0226092 0.0589711 0.0318415 -0.0962692 -0.0379095 0.0553779 0.194045 0.0156794 -0.0475452 -0.046262 0.0546367 0.00434434 0.0525432 0.00586176 -0.0671263 
0.0739497 0.0523457 -0.00486745 0.0637045 0.107027 0.218335 0.0806523 -0.0340094 -0.0124029 -0.0415302 0.0683555 0.098713 0.0821053 -0.181779 -0.0385524 -0.0306293 -0.066809 0.138839 -0.170902 0.0813432 0.210965 -0.0821587 0.00967446 0.201249 0.0604589 -0.128603 -0.0909098 -0.203864 0.0356406 0.12713 0.0744912 0.0626045 -0.07286 0.135409 0.0476403 -0.0247989 -0.0637762 -0.0147657 -0.0305479 -0.107543 0.0859766 -0.129445 -0.00154184 0.113136 -0.108112 -0.124206 0.100454 0.0378971 -0.149939 0.0125702 0.0819623 -0.0778234 -0.0357272 -0.0632223 0.0606014 0.0691549 -0.100434 0.119339 -0.0320781 -0.102331 -0.0648841 -0.0213413 0.149126 -0.142433 0.0949222 -0.0683825 -0.0306258 -0.0579567 -0.182289 0.11099 -0.0590626 0.0503815 -0.0963166 -0.0760323 -0.055943 -0.0181062 0.00972795 0.0703891 0.0129026 0.1221 -0.0843782 0.00729703 0.0141852 -0.034349 -0.0594414 0.0115293 0.0873117 -0.0143562 -0.0318885 0.0982546 0.0815591 -0.172031 -0.0993739 0.0126921 -0.103465 -0.0304074 -0.0795792 0.0251364 -0.001204 -0.00104727 0.0911903 0.0294529 -0.0656445 0.114514 0.00602937 0.0311309 -0.0390778 0.114472 0.000234933 -0.0516084 -0.0537771 0.0858966 -0.111881 -0.0102563 0.0985848 0.0484744 -0.111691 -0.0294746 0.04637 0.202555 0.0554018 -0.0180073 -0.0790663 0.0686756 0.0175579 0.0619 0.0341098 -0.0562462 
0.0609185 0.0290263 0.00492139 0.0645981 0.119994 0.220719 0.0812591 -0.0662699 -0.00403938 -0.0416675 0.0593693 0.101569 0.0788237 -0.16582 -0.0301909 -0.0292859 -0.0825197 0.167897 -0.16327 0.070527 0.213732 -0.0653195 -0.000407989 0.208808 0.0561547 -0.116026 -0.109067 -0.218477 0.0211078 0.135637 0.0775741 0.075094 -0.0863423 0.128066 0.0808685 -0.000722559 -0.061224 -0.0358621 -0.0237964 -0.118931 0.0989433 -0.113233 0.006805 0.111996 -0.114242 -0.11961 0.106438 0.0491674 -0.138012 -0.00395457 0.0714651 -0.106632 -0.0173766 -0.0604155 0.0810569 0.0788112 -0.0948869 0.130517 -0.0348114 -0.10111 -0.0536449 -0.00207388 0.151432 -0.134661 0.107622 -0.0587745 -0.0306995 -0.0539391 -0.165466 0.126223 -0.0510535 0.0625295 -0.0835639 -0.0866003 -0.0719344 -0.0146538 -0.0114091 0.0698101 0.0155873 0.0840486 -0.0576229 0.051188 -0.00123192 -0.0411742 -0.0741105 0.0105667 0.0934338 -0.00646539 -0.0497892 0.108138 0.103661 -0.157927 -0.0853514 -0.00405732 -0.114742 -0.0163003 -0.0957881 0.0322763 0.0166615 0.0053084 0.106136 0.0186736 -0.0599964 0.0832172 0.01435 0.0297417 -0.0438529 0.0866532 -0.0185318 -0.013797 -0.053665 0.0754681 -0.101887 -0.0302743 0.0938351 0.0534495 -0.109509 -0.0412948 0.0202389 0.179093 0.0763658 -0.0184381 -0.0681486 0.0628898 -0.0141678 0.0779361 0.0179783 -0.0519341 
0.0723565 0.0401754 -0.0486573 -0.0113537 0.0705294 0.20664 0.035738 -0.00601523 -0.0472387 -0.0183931 0.0549463 0.0908763 0.0859679 -0.223779 -0.0878038 -0.00587858 -0.117631 0.125129 -0.154304 0.119053 0.199215 -0.0447216 0.0301804 0.159191 -0.0263224 -0.0252784 -0.011399 -0.238683 0.0505537 0.099618 -0.0121308 0.0203329 -0.0563021 0.115072 0.0562717 -0.0479172 -0.0549327 0.0507551 -0.0499392 -0.105186 0.0334751 -0.152938 -0.0206652 0.189329 -0.123265 -0.0840188 0.151272 0.0536967 -0.204677 0.0595282 0.0730878 -0.0867519 -0.0563017 -0.0209128 0.0855055 0.0279902 -0.0529755 0.0873765 -0.0161511 -0.164249 -0.0253017 -0.0548612 0.219232 -0.058318 0.0960608 -0.138388 -0.0443573 -0.0392571 -0.102264 0.0961336 -0.0868639 0.00339005 -0.0732954 -0.0646419 -0.0558471 -0.0549694 -0.0357326 0.112217 0.0349439 0.101072 -0.0292545 0.0281512 -0.0183861 -0.0508994 -0.0572181 -0.0108825 0.0818136 0.0270177 0.0338634 0.119665 0.0940094 -0.151937 -0.144722 0.0089257 -0.103704 -0.0163288 -0.0489948 0.0693267 0.0174967 -0.0451334 0.106962 0.0377153 -0.0676237 0.0914112 -0.00959686 -0.0051 -0.0638419 0.123422 -0.0143623 -0.0535926 0.000478994 0.136133 -0.0932159 -0.0154134 0.0818549 0.0517471 -0.121217 -0.0883306 0.0253295 0.136174 0.04524 -0.0101719 0.00589167 0.0485388 0.00146602 0.0396751 0.0398366 -0.0636647 
0.0471428 0.0591721 -0.0327155 -0.0152747 0.0711641 0.206222 0.0261607 -0.0193156 -0.0607846 0.0130264 0.0612704 0.0663085 0.0775058 -0.192473 -0.0544282 -0.0114185 -0.109366 0.138627 -0.111077 0.0999238 0.186952 -0.0685416 0.0361763 0.152778 0.00155674 -0.00354229 -0.0108012 -0.227612 0.0860454 0.0776063 0.0145719 0.0233888 -0.051978 0.0971733 0.0737291 -0.0178147 -0.0555016 0.0605824 -0.0305673 -0.128554 0.0457493 -0.15616 -0.0232834 0.185537 -0.13509 -0.0757846 0.156775 0.063196 -0.22043 0.0173184 0.0416164 -0.0570753 -0.0494 -0.0367691 0.0870294 0.0504554 -0.0496303 0.104341 -0.0279293 -0.171084 -0.0460917 -0.0535912 0.238989 -0.0670132 0.124538 -0.0777245 -0.0489894 -0.0423943 -0.109875 0.133755 -0.0980172 0.0152886 -0.0899092 -0.0578115 -0.0357511 -0.0811919 -0.0381016 0.129487 0.048648 0.0650193 -0.0635846 0.0420186 -0.0215322 -0.0605804 -0.055941 -0.0383845 0.0749525 0.0484859 0.0492711 0.120805 0.122826 -0.124055 -0.119373 -0.00148444 -0.07543 -0.0397265 -0.042177 0.104906 0.0244521 -0.0525124 0.0938384 0.0365375 -0.0643832 0.0654053 -0.00088387 0.0337533 -0.0394505 0.0994458 0.0356205 -0.0719225 -0.013368 0.141858 -0.0884513 -0.0223612 0.124803 0.0308281 -0.102173 -0.120428 0.0612348 0.145907 0.0685792 -0.0407792 -0.00316007 0.0475132 -0.0187937 0.0604176 0.0636657 -0.0397236 
0.061813 0.0589549 -0.04737 -0.035738 0.0613828 0.168584 0.0223934 0.00980111 -0.0860295 0.0347737 0.0614389 0.0676641 0.0965844 -0.191616 -0.0740651 0.00975613 -0.0761363 0.132133 -0.11772 0.13421 0.180587 -0.0626793 0.0459854 0.139444 -0.0325859 0.0196673 0.0100915 -0.222368 0.0987148 0.0773351 -0.0340851 0.0231199 -0.0311349 0.101399 0.049057 -0.0509897 -0.049313 0.118988 -0.0375242 -0.121362 0.00202117 -0.153034 -0.0277919 0.184997 -0.125615 -0.0522714 0.159543 0.0568245 -0.236012 0.0357354 0.0630999 -0.0483998 -0.0725897 -0.0228993 0.0838144 0.0222819 -0.0313235 0.0822845 -0.0170242 -0.170071 -0.0277429 -0.0817961 0.227403 -0.0461812 0.116349 -0.116684 -0.0665109 -0.0202428 -0.0998227 0.0963149 -0.0957384 -0.00740156 -0.0880539 -0.0521243 -0.0416192 -0.0773911 -0.0256522 0.147118 0.0572579 0.0648316 -0.0648434 0.023478 -0.0309071 -0.0602523 -0.0475071 -0.0530133 0.0685731 0.0528691 0.0817812 0.112704 0.0877185 -0.122997 -0.13358 0.0165563 -0.0648091 -0.0309321 -0.0189913 0.101064 0.0146059 -0.0693131 0.0902235 0.0487234 -0.0722518 0.0982748 -0.0133565 0.00622135 -0.0495577 0.108756 0.0567764 -0.099727 -0.00471808 0.160478 -0.0891584 -0.00158597 0.113769 0.0310264 -0.115921 -0.131598 0.038118 0.134864 0.0295239 -0.0153767 0.00974315 0.0527256 -0.00341008 0.042446 0.0583351 -0.0705166 
0.0676499 0.0532804 -0.0361911 -0.00765488 0.0593488 0.168418 0.036823 0.00155215 -0.0690658 0.00682644 0.0479414 0.0844517 0.0943113 -0.217773 -0.090145 0.0286716 -0.110382 0.10688 -0.142233 0.137901 0.20279 -0.0732181 0.0551029 0.125216 -0.025513 -0.0123468 -0.0152338 -0.232156 0.06582 0.109468 -0.042413 0.0243139 -0.0233176 0.111768 0.0499941 -0.0735781 -0.0464674 0.109665 -0.0389836 -0.122947 -0.00958931 -0.161536 0.00347058 0.156944 -0.110932 -0.0686646 0.1563 0.0298194 -0.222266 0.0648166 0.0862775 -0.0740867 -0.0554109 -0.00727612 0.0990827 0.0139665 -0.0290435 0.0578971 -0.0268916 -0.158755 -0.0181546 -0.0846657 0.202524 -0.0577555 0.119982 -0.12314 -0.0836783 -0.0240454 -0.118757 0.0699711 -0.0908466 -0.00172197 -0.0960466 -0.0621802 -0.0456341 -0.0389034 -0.00507926 0.105091 0.0493582 0.107305 -0.0444112 -0.0146438 -0.0197967 -0.0340134 -0.0547317 -0.0271587 0.0573992 0.0400865 0.0705038 0.118756 0.0602485 -0.149729 -0.147216 0.0362368 -0.101459 -0.0101654 -0.0353424 0.0912341 0.0249929 -0.0487354 0.107158 0.0377576 -0.0786298 0.0991329 -0.000955394 -0.00899802 -0.0483305 0.13447 0.0293386 -0.0899873 -0.027507 0.142937 -0.0919605 -0.0089828 0.106838 0.059842 -0.117522 -0.0640931 0.0177015 0.151423 0.0224918 0.00171507 0.0155886 0.0422392 0.0264787 0.0499783 0.0741931 -0.0716426 
0.0468022 0.0800677 -0.0611613 -0.0269005 0.0492147 0.195739 0.0159019 -0.0269432 -0.0668827 0.0293269 0.063908 0.0536376 0.0812526 -0.198554 -0.0592267 0.00804718 -0.110848 0.12704 -0.0956844 0.0997856 0.169282 -0.0579016 0.0631325 0.126262 -0.0231997 0.00493317 0.0172011 -0.240697 0.0849845 0.088621 -0.00842705 0.0225861 -0.0241468 0.0903505 0.0776084 -0.0268155 -0.0296456 0.0901782 -0.0331768 -0.110042 0.0109446 -0.170613 -0.0232327 0.187436 -0.140134 -0.0382674 0.171627 0.0625659 -0.238879 0.0290038 0.0544688 -0.046709 -0.0488073 -0.0207321 0.0781649 0.041885 -0.0140734 0.0731007 -0.0159038 -0.163712 -0.044654 -0.0707662 0.239266 -0.0741831 0.135897 -0.109495 -0.0535205 -0.0311275 -0.0973998 0.130443 -0.10627 -0.00431287 -0.102652 -0.0595355 -0.0260172 -0.0801828 -0.0433294 0.143001 0.0370833 0.0640655 -0.0586612 0.0284475 -0.0447822 -0.053005 -0.0611977 -0.0265473 0.0500412 0.0248528 0.0490267 0.125026 0.102658 -0.126046 -0.126465 -0.00956024 -0.0691525 -0.0352949 -0.0370176 0.123315 0.0429042 -0.0608792 0.0975915 0.04098 -0.0601999 0.0729341 0.00272895 0.00505328 -0.0424308 0.112671 0.0303778 -0.0728261 -0.0206368 0.144936 -0.0702908 -0.0328703 0.108231 0.0388913 -0.102167 -0.130005 0.0566759 0.142213 0.0700409 -0.0388132 0.015388 0.0578802 -0.00598029 0.0456993 0.0617215 -0.0389221 
0.0374071 0.0868056 -0.0301876 -0.00873279 0.0490944 0.195886 0.0150275 -0.0205264 -0.0684471 0.0374603 0.0659481 0.0550935 0.0857703 -0.213335 -0.0533472 0.0217801 -0.110039 0.135113 -0.104339 0.100086 0.188216 -0.0711813 0.0517608 0.123219 -0.00630626 0.003048 -0.0138485 -0.237246 0.0913433 0.0918813 0.00488032 0.0409443 -0.021864 0.0988312 0.0786607 -0.0339274 -0.0274313 0.0839246 -0.0104338 -0.119428 0.0227569 -0.18006 -0.00226507 0.161909 -0.126242 -0.0707519 0.173977 0.0457753 -0.23561 0.0145018 0.0679723 -0.0523408 -0.0503677 -0.0165487 0.0785508 0.0458798 -0.0132254 0.0472021 -0.0229614 -0.169806 -0.0470763 -0.0791249 0.211055 -0.0796333 0.137012 -0.086588 -0.0555399 -0.0451755 -0.110139 0.113969 -0.107306 0.00395369 -0.109432 -0.0597319 -0.0194051 -0.0762818 -0.0371681 0.138161 0.0419419 0.0792799 -0.0642097 0.0243211 -0.0196753 -0.032709 -0.0544536 -0.017896 0.0570155 0.0373177 0.0558316 0.117773 0.0843818 -0.12472 -0.126821 0.01104 -0.0901889 -0.0341427 -0.0420036 0.128803 0.0225666 -0.052697 0.0979223 0.0344919 -0.0663953 0.084108 0.0264029 0.0148033 -0.0261169 0.119094 0.0440233 -0.0783216 -0.0549107 0.132085 -0.0882171 -0.0322931 0.1207 0.0303278 -0.107323 -0.114386 0.0488717 0.145689 0.0727832 -0.0317377 0.0130076 0.0454518 0.00390725 0.0546328 0.0772314 -0.0319919 
0.0425863 0.0790075 -0.0225444 -0.00976902 0.0538881 0.212711 0.0168884 -0.0196149 -0.0617143 0.0164312 0.0566807 0.065868 0.0813512 -0.217337 -0.0482805 -0.00394485 -0.113684 0.134361 -0.111996 0.0964856 0.183793 -0.0564128 0.0486806 0.124288 -0.00694625 -0.00957173 -0.015813 -0.240034 0.0654301 0.0892338 0.011889 0.0250643 -0.0236073 0.105074 0.088851 -0.0347529 -0.0236382 0.0742102 -0.0233681 -0.120505 0.035973 -0.173044 -0.0055953 0.16787 -0.142145 -0.0727139 0.166145 0.0418097 -0.230772 0.031653 0.0714848 -0.0673509 -0.0452891 -0.0132032 0.0804786 0.0438319 -0.0277928 0.0531915 -0.0281493 -0.172984 -0.0476535 -0.0715746 0.206479 -0.0896016 0.142204 -0.100089 -0.0473681 -0.043237 -0.120673 0.121794 -0.0936479 0.000246127 -0.0996714 -0.0698303 -0.0272915 -0.0623536 -0.0491733 0.120242 0.0458782 0.0881925 -0.0682981 0.0261269 -0.0105143 -0.028619 -0.0526065 -0.0282338 0.0684884 0.0346525 0.0455039 0.128018 0.0822919 -0.140797 -0.120441 0.00660522 -0.102694 -0.0387992 -0.0410213 0.114714 0.0139228 -0.0484467 0.0976627 0.0457714 -0.0676246 0.0769499 0.0199851 0.00763466 -0.0315755 0.114905 0.0191735 -0.0663721 -0.0388765 0.121622 -0.0895833 -0.0283094 0.109696 0.0302176 -0.115729 -0.110111 0.0439391 0.149818 0.0767344 -0.0313638 0.00511926 0.043473 0.0283881 0.0469707 0.0835369 -0.0351196 
0.0250903 0.086356 -0.0154298 -0.0218547 0.0583149 0.209036 0.00380456 -0.0247809 -0.0701789 0.0360452 0.0563733 0.0361051 0.0803704 -0.202688 -0.0206978 0.00245511 -0.111824 0.145962 -0.0975226 0.0803394 0.173812 -0.0583694 0.0575603 0.124083 0.00250218 -0.000315531 -0.015316 -0.239234 0.088193 0.0633065 0.0336427 0.0301857 -0.0291574 0.0925194 0.100077 -0.0115439 -0.0273884 0.0679904 -0.0180836 -0.124568 0.0459188 -0.174059 -0.0137337 0.17755 -0.14429 -0.0550722 0.169415 0.0696358 -0.237863 0.00150912 0.0476859 -0.0617556 -0.0390097 -0.0330198 0.0667496 0.0503462 -0.0196507 0.0581537 -0.014641 -0.183496 -0.0562728 -0.0569441 0.205329 -0.07312 0.141707 -0.071768 -0.0449356 -0.0383496 -0.102095 0.134067 -0.102344 0.00866103 -0.0983049 -0.0735226 -0.0202297 -0.0871231 -0.06993 0.139381 0.0512148 0.0700502 -0.0626745 0.0440282 -0.0277415 -0.0436796 -0.0551801 -0.0288293 0.0630188 0.0428712 0.0399321 0.125167 0.109068 -0.106383 -0.114244 -0.0119308 -0.0924156 -0.0395395 -0.0450561 0.139325 0.0126148 -0.0610379 0.0958841 0.0340977 -0.0552374 0.0576564 0.0224701 0.0179863 -0.0292736 0.105109 0.0527987 -0.0625845 -0.0375851 0.134583 -0.088576 -0.0392099 0.120957 0.0198402 -0.11819 -0.135133 0.0520959 0.140126 0.091327 -0.0430733 0.00297563 0.0531687 -0.00542336 0.0443726 0.0704223 -0.0257964 
0.0344077 0.0877841 -0.00863006 -0.0252544 0.0640354 0.217119 0.0121207 -0.0183603 -0.0611961 0.0225565 0.0524163 0.0542677 0.0791697 -0.217905 -0.0257283 -0.0112042 -0.112544 0.141453 -0.111493 0.0824932 0.175325 -0.0347747 0.0495858 0.113955 -0.0100826 -0.00501149 -0.0203261 -0.242786 0.0746538 0.0758263 0.0268856 0.0230818 -0.023915 0.102874 0.107452 -0.030304 -0.00997511 0.0772424 -0.016118 -0.114111 0.0523991 -0.168565 -0.0127337 0.170902 -0.156197 -0.0592845 0.163004 0.0514262 -0.230583 0.0156711 0.0618008 -0.0642946 -0.0456108 -0.015858 0.0691872 0.0445555 -0.0212984 0.0482293 -0.0335181 -0.175527 -0.0547958 -0.0736804 0.196327 -0.087335 0.148935 -0.104433 -0.0366919 -0.0366528 -0.106946 0.127914 -0.0857139 0.00175833 -0.0947884 -0.0776308 -0.0251957 -0.0667678 -0.0788864 0.128095 0.0500382 0.08255 -0.0655389 0.0466897 -0.00577375 -0.0185726 -0.0444279 -0.035961 0.0789784 0.0428478 0.0357783 0.130449 0.0894434 -0.131848 -0.117217 -0.00312654 -0.106998 -0.0498924 -0.0397577 0.120767 0.00484349 -0.0524174 0.0934717 0.0460825 -0.0631811 0.072594 0.0210545 -0.00029993 -0.0281369 0.11171 0.0312869 -0.0554506 -0.0321017 0.115839 -0.0998747 -0.027412 0.109224 0.0251459 -0.132082 -0.129112 0.0332348 0.139673 0.0908839 -0.0268091 0.00236473 0.0508968 0.0291395 0.0349318 0.0776329 -0.0300602 
0.0232508 0.0821812 0.00595083 -0.0292518 0.0356729 0.225635 0.0022929 -0.00640457 -0.0725119 0.0394012 0.0571289 0.028592 0.0787312 -0.214238 0.0022838 -0.0221928 -0.124808 0.134231 -0.0862267 0.062011 0.158598 -0.0417565 0.0619346 0.131457 -0.00515779 -0.00220244 -0.00813723 -0.252065 0.0742093 0.0443475 0.0449955 -0.00955203 -0.0240363 0.0926623 0.107153 -0.0178258 -0.0233695 0.0737638 -0.0267861 -0.102834 0.0494263 -0.180728 -0.0397536 0.177813 -0.159426 -0.0652645 0.157118 0.0618589 -0.237419 0.0126979 0.0534355 -0.061625 -0.0283181 -0.0228817 0.0582911 0.0524446 -0.00608153 0.0534023 -0.0152273 -0.186339 -0.0662899 -0.0570766 0.196596 -0.081875 0.142531 -0.0808464 -0.0245447 -0.0418166 -0.101612 0.135709 -0.0988099 0.00469544 -0.100161 -0.073197 -0.00664146 -0.0847638 -0.0924368 0.128514 0.0639287 0.0925896 -0.0729009 0.02815 -0.0101985 -0.0362961 -0.0500839 -0.0361951 0.0754293 0.0350211 0.0364109 0.123999 0.0976636 -0.10808 -0.0954767 -0.0151693 -0.111018 -0.0532531 -0.0400651 0.131974 0.0100475 -0.0567729 0.0976278 0.0496742 -0.0552868 0.0454734 0.0280913 0.00419976 -0.0224594 0.0898406 0.0408725 -0.0593998 -0.0244484 0.132461 -0.0765908 -0.0555385 0.114661 0.0330726 -0.123033 -0.134692 0.0441309 0.138933 0.098632 -0.0649568 -0.00695788 0.0466835 0.0132271 0.0476076 0.0800486 -0.00679688 
0.0248223 0.104195 0.0100474 -0.0189368 0.0279172 0.231198 0.00365535 -0.00871993 -0.0590879 0.0383386 0.0593952 0.0253636 0.0708123 -0.246676 -0.00292927 -0.0296232 -0.140681 0.12306 -0.0968337 0.0811053 0.144625 -0.0393927 0.0566348 0.118409 -0.0111495 -0.0199355 -0.0189126 -0.240617 0.0689829 0.0419882 0.0427065 -0.0246731 -0.0225229 0.0965959 0.1137 -0.0258558 -0.00243542 0.0703727 -0.030483 -0.107675 0.0530247 -0.196776 -0.0304148 0.170368 -0.163629 -0.0724534 0.157793 0.069016 -0.226093 0.0471391 0.055401 -0.0574727 -0.0421354 -0.0118159 0.0629183 0.0361115 -0.0208993 0.0174358 -0.0198091 -0.191022 -0.0684638 -0.0635676 0.189233 -0.0893456 0.137697 -0.0895657 -0.0120991 -0.0622069 -0.112138 0.123218 -0.0960626 0.00495391 -0.0871599 -0.0497642 -0.00253994 -0.0893971 -0.0879966 0.129653 0.0725712 0.105815 -0.0602718 0.0210745 -0.00753561 -0.0176898 -0.0246512 -0.0306633 0.059574 0.0451114 0.0529323 0.137575 0.0950886 -0.115767 -0.0943509 -0.0112329 -0.12819 -0.0749267 -0.0382324 0.121837 0.00446593 -0.0633354 0.0991587 0.0556782 -0.0528525 0.0342932 0.0321646 0.00915294 -0.000934061 0.102075 0.0384146 -0.0285375 -0.0206019 0.12816 -0.0694261 -0.0417222 0.0943227 0.0190571 -0.116134 -0.113198 0.0342834 0.130532 0.0918398 -0.0527203 0.00279751 0.0551762 0.0329039 0.0361429 0.0974119 -0.0105464 
0.00226104 0.0755455 0.0546291 -0.0269543 0.0207228 0.213683 -0.00445351 0.00406595 -0.0320853 0.0303436 0.0505863 0.00433133 0.0435628 -0.217505 0.0414248 -0.082786 -0.148424 0.107309 -0.056461 0.0632745 0.118714 -0.0348817 0.061391 0.128217 0.00778878 -0.00640602 -0.0109794 -0.224848 0.0790593 -0.0135591 0.0909252 -0.0804571 -0.0129564 0.0699793 0.138693 0.000225843 -0.00555545 0.0860183 -0.0385943 -0.120758 0.0802883 -0.172239 -0.0802341 0.183094 -0.189484 -0.0762362 0.119098 0.079865 -0.175039 0.0320657 -0.000459046 -0.0213097 -0.0132689 -0.0235216 0.0687855 0.033757 -0.0227633 0.0319186 -0.0386479 -0.203905 -0.08937 -0.0661604 0.184346 -0.0572708 0.1286 -0.0654307 0.0190095 -0.0668927 -0.0916017 0.14407 -0.08121 0.00815789 -0.0800609 -0.0393054 0.0115013 -0.115593 -0.12099 0.127215 0.103746 0.116535 -0.0887639 0.0317735 0.011144 -0.0232625 0.0153614 -0.0838363 0.0732109 0.0878232 0.0592678 0.11647 0.126492 -0.073293 -0.0429894 -0.0350199 -0.119388 -0.130623 -0.0318884 0.118487 0.000236104 -0.0828422 0.0859602 0.0649315 -0.0385298 -0.0225248 0.0340411 0.0228665 0.0325827 0.0540836 0.0982517 -0.016856 5.50513e-07 0.128991 -0.0783009 -0.0424396 0.111004 0.0199764 -0.0910293 -0.147826 0.0453411 0.125594 0.105719 -0.0638387 -0.0330978 0.0497582 0.0135395 0.0372217 0.12683 0.0340132 
-0.00664474 0.0667011 0.11029 -0.0209547 0.00106018 0.203422 -0.0157929 0.014863 -0.0362377 0.0234882 0.0447468 -0.022501 0.0267093 -0.192983 0.0657109 -0.0879373 -0.136396 0.113564 -0.0378652 0.0183985 0.135506 -0.0319731 0.0504197 0.140089 0.033593 0.00904482 -0.014718 -0.209723 0.0889801 -0.0304293 0.112567 -0.0725768 -0.0171894 0.0679645 0.144364 -0.00806851 -0.0204021 0.0885399 -0.0191822 -0.124893 0.0791416 -0.16061 -0.0885827 0.159291 -0.155172 -0.0873677 0.101698 0.061177 -0.18013 -0.00772613 0.00339116 -0.00182805 0.0251013 -0.0299989 0.0565535 0.0439163 0.00257135 0.0317373 -0.0313601 -0.226365 -0.0755796 -0.0553153 0.149243 -0.0369283 0.10903 -0.0213881 0.0348883 -0.072595 -0.0826821 0.157549 -0.0920855 -0.000440057 -0.0852952 -0.047098 0.0113403 -0.138564 -0.127999 0.105036 0.106567 0.127845 -0.10005 0.0458465 0.0235967 -0.0466498 0.0332737 -0.114228 0.0766294 0.0887582 0.0513665 0.10752 0.130347 -0.0437069 -0.0241881 -0.0297026 -0.116376 -0.113354 -0.022185 0.130033 -0.00114542 -0.076467 0.0822185 0.0661961 -0.0406643 -0.0164576 0.0466907 0.0171879 0.0449398 0.0274305 0.123708 -0.0482068 -0.00145056 0.13146 -0.0993294 -0.0641057 0.139785 0.0203622 -0.09722 -0.164546 0.0556656 0.110903 0.112556 -0.0632664 -0.0447241 0.0234921 0.0135259 0.0426398 0.148248 0.0394863 
0.0164327 0.141391 0.0689739 0.0158881 0.0112238 0.23884 0.0194992 0.00205607 -0.0537293 0.0796279 0.0659488 0.00447474 0.0510551 -0.27063 0.0470596 -0.0366471 -0.148032 0.130696 -0.105166 0.0467752 0.121088 -0.0555653 0.0352594 0.123524 0.0321697 -0.0392032 -0.0715201 -0.205669 0.0853118 0.0170612 0.078128 0.0151243 -0.0646533 0.111421 0.0989812 -0.0354591 -0.012059 0.0403886 0.00916362 -0.0878434 0.0827199 -0.213609 -0.035151 0.125936 -0.141908 -0.137059 0.129825 0.0699641 -0.199248 0.0349567 0.0899181 -0.0264695 -0.0623464 -0.0294457 0.0322767 0.0434033 -0.0385244 0.000962122 -0.0209493 -0.180795 -0.0862097 -0.0631999 0.147913 -0.105521 0.115766 -0.0260463 0.0185631 -0.100903 -0.145613 0.125224 -0.10937 0.0540292 -0.0731443 0.017671 -0.00567085 -0.136058 -0.070731 0.100519 0.0768329 0.120266 -0.0599277 0.0145673 0.0190361 -0.0220744 0.00538338 -0.0441988 0.0583311 0.0454854 0.0752491 0.117876 0.0851602 -0.0958259 -0.0649117 -0.00370858 -0.131524 -0.0874231 -0.0309051 0.0976849 -0.0166751 -0.0426125 0.0709428 0.0427812 -0.0589065 0.0505959 0.0605165 0.0324705 0.0249368 0.0987422 0.078703 -0.0181408 -0.0388303 0.149129 -0.0774225 -0.0328574 0.111828 -0.0274105 -0.0847111 -0.0854199 0.0629456 0.120024 0.108709 -0.0485316 -0.00246991 0.0600125 0.045349 0.02224 0.110356 -0.00655226 
0.0123644 0.11307 0.0418289 0.00786215 0.00642483 0.227237 0.0011592 -0.00766743 -0.0740694 0.0672095 0.0614249 0.0179864 0.0383499 -0.255445 0.0237966 -0.0504146 -0.188851 0.0959405 -0.0423731 0.0744181 0.11954 -0.0771901 0.0711588 0.111988 0.0313969 -0.00349939 -0.0591285 -0.225481 0.0930054 0.00559888 0.0693087 -0.0297215 -0.0622813 0.0649624 0.0918756 -0.0150669 -0.0473698 0.0539954 0.0234989 -0.0792938 0.0626034 -0.192774 -0.0776987 0.128212 -0.173008 -0.123722 0.141815 0.0572841 -0.171647 0.0577291 0.0415775 0.023517 -0.0432 -0.0123191 0.0532461 0.0215546 0.0186028 0.0252806 -0.0482611 -0.172639 -0.085227 -0.0412151 0.205891 -0.0804608 0.104754 -0.0338418 0.0202358 -0.0903973 -0.111557 0.123158 -0.0991809 0.0827899 -0.0791106 0.0508057 0.0195597 -0.131591 -0.0899173 0.0805673 0.0914698 0.149642 -0.0778676 0.00419714 0.0332178 -0.00770689 0.00472166 -0.0424909 0.0512158 0.0748678 0.0886416 0.0698868 0.104408 -0.0587116 -0.0383567 0.00307237 -0.117706 -0.154233 -0.0241468 0.133145 0.00167986 -0.0624782 0.064713 0.0443896 -0.0540416 0.0235794 0.0495479 0.0687475 0.0519128 0.103697 0.109026 -0.00688516 -0.0167369 0.152777 -0.0561207 -0.04567 0.10935 0.0171332 -0.0564378 -0.0857669 0.0745912 0.135992 0.0932985 -0.0796142 -0.0063286 0.0171313 -0.0130704 0.0607081 0.123392 0.0505684 
-0.0251231 0.163519 0.0673767 0.0228702 -0.0186462 0.195313 -0.0142091 -0.0440808 -0.053173 0.102591 0.0654384 0.00157332 -0.00444198 -0.236424 0.0684171 -0.0956244 -0.134291 0.142458 -0.00057523 0.0410459 0.0333926 -0.0287188 0.0552162 0.105645 0.0218573 -0.000204391 -0.0358939 -0.184875 0.0841257 -0.0128898 0.0774358 -0.0205861 -0.0264631 0.0594666 0.139719 0.00106715 0.0280505 0.0613121 0.00925971 -0.071665 0.0727462 -0.180159 -0.0782176 0.118108 -0.201201 -0.0785435 0.139477 0.0609663 -0.1597 0.049198 0.0650452 0.0625085 -0.0505008 -0.0116359 0.0455952 0.0389515 0.0164188 -0.0211956 -0.0356123 -0.147795 -0.0973953 -0.0721645 0.160844 -0.109989 0.13925 -0.0617134 0.0562128 -0.129202 -0.129718 0.192233 -0.0852312 0.043486 -0.059657 0.0742056 0.0188569 -0.162131 -0.101354 0.127 0.0835384 0.056959 -0.105315 0.0660871 0.0168081 -0.00131858 0.048677 -0.0910889 0.0244475 0.053541 0.0844625 0.097101 0.0827225 -0.0438722 0.015669 -0.0509447 -0.0766119 -0.170215 -0.00376954 0.119938 0.00854923 -0.0694754 0.0257573 0.0889849 -0.0344236 0.0129497 0.074646 0.0424069 0.0817965 0.0442844 0.110511 0.0364856 -0.0182856 0.133423 -0.0311299 -0.033325 0.0745331 -0.0558574 -0.0102433 -0.170341 0.0904233 0.0944603 0.131313 -0.0680128 -0.013577 0.0315263 0.0399893 0.0254601 0.147606 0.0397014 
-0.0471803 0.128249 0.0493937 0.0155121 -0.0100244 0.229672 -0.0244842 -0.0532925 -0.0550241 0.13055 0.0312298 -0.00461975 0.0191787 -0.198752 0.0782567 -0.0909104 -0.145473 0.163833 -0.000536739 0.0282241 0.0239324 -0.0626135 0.0787909 0.138119 0.0362665 -0.0108732 -0.0544287 -0.189466 0.0568392 -0.0264889 0.10908 -0.00467568 -0.0505332 0.046324 0.122438 0.0336426 -0.0144297 0.0279817 -0.0137849 -0.0809774 0.0845897 -0.183144 -0.0644484 0.125378 -0.202951 -0.128787 0.130167 0.102691 -0.135762 0.0394278 0.0772757 -0.00991002 -0.0137001 -0.0437179 0.0457601 0.0727107 0.00280327 0.0314099 0.0177795 -0.173054 -0.114844 -0.00918825 0.156471 -0.119672 0.138498 -0.00315419 0.0355231 -0.117466 -0.15315 0.196448 -0.0992591 0.0774599 -0.0492819 0.0563111 0.00862131 -0.150322 -0.0975613 0.089641 0.0921661 0.0330282 -0.0883278 0.0533748 0.00470917 -0.0211232 0.00813481 -0.0903153 0.0329155 0.061601 0.089512 0.0918493 0.0768624 -0.0281748 0.0430966 -0.0678175 -0.070752 -0.126917 -0.0285008 0.148005 -0.00207088 -0.0513914 0.0604861 0.0708369 -0.0271863 -0.0190139 0.0715522 0.0516575 0.0377763 -0.00362263 0.0882889 0.0439718 -0.0201813 0.162962 0.00907593 -0.0554462 0.0675718 -0.0488125 -0.0060987 -0.125747 0.0826926 0.106241 0.145084 -0.122868 -0.0151005 0.00195999 -0.0226901 0.0582052 0.0928746 0.0498913 
-0.0448803 0.159261 0.0651946 0.01188 0.000901583 0.232522 -0.0254106 -0.0931623 -0.0358421 0.103435 0.0347357 -0.0109615 0.00186447 -0.15578 0.113173 -0.130362 -0.0917739 0.161601 -0.0045859 0.014968 -0.0326155 -0.012489 0.0621175 0.14786 0.0359053 -0.054201 -0.0441553 -0.120737 0.039207 -0.0235997 0.135223 -0.0144373 -0.0468937 0.063212 0.144682 0.0728587 0.0242634 0.00328653 -0.0234067 -0.066536 0.0869322 -0.159454 -0.0574367 0.0978019 -0.198313 -0.0823751 0.105672 0.136297 -0.131466 0.0658513 0.0533789 0.0035971 -0.0104797 -0.0627066 0.0287479 0.0798213 -0.0622788 0.060247 -0.00519129 -0.12739 -0.142623 0.0223121 0.151475 -0.173514 0.149659 -0.00182084 0.0576751 -0.119893 -0.213528 0.22546 -0.06778 0.0556008 -0.0458404 0.0677959 0.0015034 -0.14089 -0.069608 0.0673074 0.0940494 -0.0106245 -0.0864177 0.0608294 -0.0166696 -0.0309437 0.00527375 -0.114987 -0.00378222 0.0180441 0.0615791 0.140797 0.0976274 -0.0542902 0.0820239 -0.0672165 -0.0250607 -0.113613 -0.0299001 0.10299 -0.00610259 -0.0483574 0.0291412 0.0930183 -0.0491772 -0.026286 0.0518715 0.0725839 0.0433102 -0.0484867 0.0704484 0.070514 0.00875841 0.137379 0.0243337 -0.00503859 0.032158 -0.075829 0.0145135 -0.117066 0.0996339 0.117488 0.153278 -0.129473 -0.0299985 0.0358166 0.00596888 0.0387985 0.0935133 -0.000343275 
-0.0451029 0.14011 0.0448184 0.00850145 0.0024534 0.208604 -0.0261481 -0.0891654 -0.0201107 0.0914322 0.0423029 0.00824213 0.00934861 -0.130291 0.0666484 -0.154804 -0.0746826 0.161524 0.012845 0.0574523 -0.0214549 -0.0255018 0.0507136 0.178309 0.0161632 -0.0548462 -0.026417 -0.103079 0.0440057 -0.00791002 0.11447 -0.0756521 -0.0298608 0.0486405 0.135674 0.078421 0.00649226 0.00889018 -0.0657505 -0.0752206 0.0615385 -0.129007 -0.0671273 0.123353 -0.20347 -0.0994114 0.101051 0.142536 -0.0929272 0.0877347 0.0402461 0.0205608 -0.0174764 -0.0593527 0.0638228 0.0816429 -0.0779326 0.0695015 -0.00232434 -0.137922 -0.136346 0.015225 0.176955 -0.153697 0.129363 -0.0393881 0.0589996 -0.134634 -0.204702 0.221625 -0.0499822 0.0456868 -0.0378952 0.0637723 -0.0109841 -0.130214 -0.0556554 0.0933833 0.10813 -0.0171083 -0.0974183 0.0621702 -0.0119519 -0.0255516 0.0257811 -0.130949 -0.00544367 0.0391976 0.0989808 0.135563 0.0898539 -0.0538109 0.0974845 -0.072422 -0.00849689 -0.152811 -0.0315735 0.0969325 -0.00478133 -0.0606074 0.040279 0.123869 -0.0375064 -0.0569142 0.0284581 0.0903662 0.0541657 -0.0786345 0.0754422 0.0836768 0.0289875 0.122027 0.0313957 0.0083332 0.00981441 -0.0524156 0.0462771 -0.12708 0.0788918 0.118363 0.114296 -0.130803 -0.0518391 0.022867 -0.0309307 0.0609606 0.0989894 0.0156057 
-0.0402936 0.12561 0.0422574 0.0153186 -0.00103284 0.202512 -0.00357675 -0.0736479 -0.00667151 0.0754136 0.0465551 0.0195293 0.0183749 -0.157943 0.0293347 -0.170463 -0.110818 0.161009 -0.0208377 0.0798222 0.00476433 -0.062435 0.0410843 0.188726 0.0175842 -0.0582779 -0.0411554 -0.117591 0.0445845 -0.0118225 0.0996164 -0.078002 -0.0418259 0.0576445 0.117845 0.0465187 -0.0134017 0.0270407 -0.0739911 -0.0889928 0.0835268 -0.141863 -0.071384 0.136433 -0.207334 -0.140442 0.0986154 0.131266 -0.0900185 0.0946798 0.023954 0.00660717 -0.0207361 -0.0485885 0.0716795 0.0676312 -0.0794956 0.0688291 -0.0120945 -0.16925 -0.120137 0.0121991 0.188293 -0.1168 0.100415 -0.0232437 0.0594503 -0.142998 -0.188469 0.191175 -0.0619091 0.0440603 -0.0219059 0.0828974 -0.00441254 -0.139366 -0.0627195 0.0846079 0.111767 0.00571673 -0.109288 0.0660394 -0.00460071 -0.0327988 0.0295301 -0.109396 0.0159127 0.0616 0.112056 0.112384 0.103816 -0.0665371 0.0935605 -0.0847595 -0.0361026 -0.175496 -0.0459921 0.0916123 0.00250573 -0.0663681 0.0494659 0.104932 -0.0233566 -0.0381243 0.0313839 0.0904201 0.0520188 -0.0320927 0.0691726 0.0733974 0.0385466 0.141045 0.0116525 0.00421331 0.0113227 -0.0444984 0.0274873 -0.117285 0.0855197 0.110766 0.0976967 -0.113635 -0.0658696 0.0224142 -0.047717 0.0592462 0.0846876 0.020194 
-0.0588541 0.127166 0.0434385 0.0181012 0.00486157 0.195577 -0.012422 -0.0839706 0.00160581 0.0939152 0.0353618 -0.000606466 0.00623564 -0.141839 0.0453035 -0.153035 -0.112725 0.172175 -0.00157235 0.0531922 0.00916532 -0.0734808 0.0471147 0.178083 0.0406728 -0.0506721 -0.0514637 -0.12545 0.0586952 -0.015563 0.122782 -0.0583743 -0.0389779 0.0356547 0.130358 0.0574193 -0.0162826 0.0236167 -0.0604503 -0.103803 0.0872826 -0.134995 -0.0667683 0.13504 -0.199645 -0.132289 0.097648 0.133829 -0.0791963 0.0530629 0.0147821 0.0105433 0.00141187 -0.0660849 0.0702169 0.0801109 -0.0593921 0.0641593 -0.00206553 -0.179591 -0.120871 0.0127131 0.177955 -0.107702 0.107441 0.00631168 0.0522554 -0.135927 -0.170436 0.203581 -0.0627977 0.057679 -0.0289313 0.0653003 -0.00311251 -0.142935 -0.0759076 0.0874766 0.105039 -0.0119639 -0.107136 0.0890825 -0.0109364 -0.0302062 0.0350347 -0.11321 0.0104974 0.073735 0.109979 0.101817 0.105878 -0.0375113 0.0931557 -0.0979995 -0.0255467 -0.169117 -0.0493082 0.113432 0.00362567 -0.0647516 0.0573175 0.0840243 -0.00970191 -0.0599699 0.0331773 0.089157 0.0554155 -0.0525163 0.095908 0.075942 0.0275285 0.14003 0.00736045 -0.0166543 0.0316331 -0.0478237 0.022061 -0.128615 0.087562 0.0979942 0.114424 -0.111017 -0.0624352 0.0144808 -0.0671687 0.0681598 0.0882877 0.0368756 
-0.0208875 0.144316 0.0243205 0.00315233 0.015813 0.221646 -0.00877991 -0.0601258 -0.0478185 0.127093 0.0598897 0.00198776 0.0377542 -0.159939 0.0660519 -0.124119 -0.0813501 0.185446 -0.0196515 0.0650827 0.00736446 -0.0452833 0.0485078 0.186287 0.0220339 -0.0480108 -0.0447398 -0.133368 0.0739359 -0.0071741 0.102822 -0.0315099 -0.0577577 0.0626155 0.106928 0.0561477 -0.00723926 0.00873761 -0.0392064 -0.07345 0.0706098 -0.151296 -0.0646147 0.139515 -0.204296 -0.128644 0.121116 0.143947 -0.119435 0.0714896 0.062193 -0.000811909 -0.0555955 -0.0615197 0.0426243 0.0760415 -0.0616084 0.0763368 0.0179964 -0.150341 -0.126906 0.0071504 0.17888 -0.139546 0.106308 -0.0317836 0.0493822 -0.126319 -0.184874 0.20034 -0.0737552 0.0708968 -0.036347 0.0755071 -0.0127014 -0.156586 -0.0574418 0.116178 0.0990917 -0.0115749 -0.0844209 0.0673611 -0.0152284 -0.0335305 0.0192992 -0.0903293 0.0141812 0.0387567 0.10772 0.111834 0.0953869 -0.0522565 0.0559931 -0.0746445 -0.0244416 -0.143775 -0.0418182 0.112643 -0.017329 -0.0599198 0.0423985 0.0972609 -0.0228555 -0.0113729 0.0274963 0.0848511 0.0255976 -0.0298972 0.0886277 0.0552934 0.0144626 0.154832 0.015089 0.000477816 0.0287412 -0.0592012 0.0277924 -0.132679 0.0780545 0.112289 0.115271 -0.12152 -0.0359974 0.0399605 -0.0555397 0.0428365 0.0649099 0.0123971 
-0.0328397 0.118759 0.0660331 -0.020507 -0.0128768 0.221604 -0.0164385 0.00608849 -0.0360356 0.134212 0.0806039 -0.0332054 0.0633407 -0.10902 0.0866459 -0.108321 -0.0773452 0.180157 -0.0444888 0.0304457 0.0462971 -0.0771732 0.0456978 0.200267 0.03477 -0.0551641 -0.038554 -0.105759 0.0990587 -0.0428369 0.124344 -0.0453048 -0.0477817 0.0704014 0.073048 0.0632994 -0.0399972 0.0285643 -0.0458471 -0.0751854 0.0562353 -0.147087 -0.0819668 0.120925 -0.15356 -0.18669 0.0818784 0.133537 -0.130187 0.0342834 0.0371084 -0.0131322 -0.0508764 -0.0648661 0.0186862 0.0970121 -0.0694353 0.0929092 0.0196423 -0.184038 -0.134863 0.0146356 0.158559 -0.111056 0.068464 0.0588714 0.0405618 -0.0977994 -0.183379 0.186024 -0.0808748 0.0559838 -0.0482815 0.0402691 0.00905823 -0.172889 -0.040505 0.0877399 0.112736 -0.00961409 -0.0966476 0.0343543 0.000155354 -0.0646456 0.00654743 -0.0809667 0.0303216 0.0494704 0.128983 0.106273 0.103118 -0.0618581 0.0576607 -0.0516472 -0.0188283 -0.112801 -0.0763 0.116284 -0.0368735 -0.036273 0.0558913 0.0668238 -0.0388781 -0.0210604 0.0439964 0.114453 0.0127608 -0.0674436 0.11285 -0.0296997 -0.0137175 0.175798 0.00428158 -0.00237835 0.0851359 -0.0414411 0.0234852 -0.108384 0.0999054 0.118803 0.108912 -0.155895 -0.0498134 0.0322615 -0.0610871 0.0625547 0.0765022 0.0308749 
