{
  "descriptor": [
    -0.06740855425596237,
    0.04131496325135231,
    0.08568285405635834,
    -0.06989617645740509,
    -0.162273108959198,
    0.05377880111336708,
    -0.07141491770744324,
    -0.05189847573637962,
    0.16896969079971313,
    -0.16132810711860657,
    0.1564442664384842,
    -0.03721349313855171,
    -0.24787262082099915,
    0.0924810990691185,
    -0.051447853446006775,
    0.15966032445430756,
    -0.17499205470085144,
    -0.20554201304912567,
    -0.011426417157053947,
    -0.04429205134510994,
    0.030742676928639412,
    0.06341850012540817,
    0.011188732460141182,
    0.1014276072382927,
    -0.14943358302116394,
    -0.39984360337257385,
    -0.08762575685977936,
    -0.08415482193231583,
    0.030473392456769943,
    -0.11433907598257065,
    -0.06640075147151947,
    0.08332867175340652,
    -0.15738017857074738,
    0.045464541763067245,
    0.06229865550994873,
    0.07637590914964676,
    -0.04716353490948677,
    -0.15659776329994202,
    0.2415851205587387,
    0.10996333509683609,
    -0.26736980676651,
    0.0000428219027526211,
    0.06286662071943283,
    0.2556988000869751,
    0.18186244368553162,
    0.006627012509852648,
    0.030328897759318352,
    -0.05194853991270065,
    0.16026398539543152,
    -0.2927560806274414,
    0.03939105570316315,
    0.22067977488040924,
    0.03378813713788986,
    0.0664442777633667,
    0.07699070125818253,
    -0.16366945207118988,
    0.012531336396932602,
    0.09542163461446762,
    -0.12492337077856064,
    0.056506555527448654,
    0.06128775700926781,
    -0.05334477126598358,
    0.012043378315865993,
    -0.07439195364713669,
    0.19111503660678864,
    0.10264872759580612,
    -0.09232738614082336,
    -0.13494528830051422,
    0.21619001030921936,
    -0.1508491039276123,
    -0.0893167033791542,
    0.07058989256620407,
    -0.16004057228565216,
    -0.18197840452194214,
    -0.15958981215953827,
    0.017763201147317886,
    0.3840104043483734,
    0.15517769753932953,
    -0.1119227409362793,
    0.08773984760046005,
    0.006911666132509708,
    -0.017174294218420982,
    0.017130790278315544,
    0.16079504787921906,
    -0.07869653403759003,
    0.048982955515384674,
    -0.03349321335554123,
    0.051717523485422134,
    0.2489786148071289,
    0.0369916670024395,
    0.011666589416563511,
    0.25676292181015015,
    -0.01468000840395689,
    0.042785923928022385,
    0.12069705873727798,
    0.06877698749303818,
    -0.10821820050477982,
    -0.05818438157439232,
    -0.18770262598991394,
    -0.04060807079076767,
    0.0005284114158712327,
    -0.05861698091030121,
    -0.024888014420866966,
    0.1429428905248642,
    -0.22390300035476685,
    0.1386088728904724,
    -0.08706594258546829,
    -0.06741996854543686,
    -0.03529888018965721,
    0.023922506719827652,
    -0.08021530508995056,
    0.011715741828083992,
    0.13296516239643097,
    -0.2332126349210739,
    0.13205991685390472,
    0.1638151854276657,
    0.06471846252679825,
    0.1227940022945404,
    0.08344931900501251,
    0.021825585514307022,
    0.01901509426534176,
    -0.07416258752346039,
    -0.19375725090503693,
    -0.10833432525396347,
    0.07196012884378433,
    -0.042405884712934494,
    -0.0207052119076252,
    -0.010393881238996983
  ]
}