0.0474734 0.162997 -0.152796 0.0363483 0.101192 0.191567 0.0735676 -0.202415 -0.081868 0.0543905 0.0130705 0.0398781 0.0871416 -0.0109059 -0.0414287 -0.0626985 0.0512417 0.157371 -0.0169807 0.0650524 0.0382024 -0.0458521 0.00300962 0.170953 0.0181161 -0.0766598 -0.153579 -0.116926 0.108863 0.183272 0.0568485 0.169664 -0.133036 0.00490385 0.0695137 0.0643587 -0.0454218 -0.0262568 0.00314162 -0.0557293 0.0133646 -0.0366759 -0.00879299 0.0793373 -0.126371 0.0354645 0.151982 0.141474 -0.103585 -0.0158515 0.0628264 0.0918306 0.0155263 -0.102721 0.0435109 0.0608857 -0.0196111 0.181388 0.072895 -0.067499 -0.0931315 0.124187 0.192713 -0.193877 0.0504066 -0.0593162 0.0433111 -0.0708177 -0.184779 0.136967 -0.0132199 0.0896675 -0.0499254 0.0612345 -0.0656366 -0.0213337 -0.00542555 0.0470743 0.0177188 -0.0281077 -0.01006 0.119331 -0.0716449 -0.0456638 -0.00149281 -0.044981 -0.0335981 -0.0915726 -0.0093109 0.0490425 0.0778173 -0.0406721 0.030106 -0.0655113 0.035614 -0.089619 0.0290079 0.125011 0.0337051 -0.0421232 0.0828577 0.128174 0.0145202 0.131837 -0.152154 0.0758722 -0.0476472 0.053299 0.0559641 0.11168 0.0655753 0.0725555 -0.0518304 -0.0153043 -0.0515545 0.0139955 -0.0247284 -0.11715 0.0433321 0.135922 0.0371125 -0.0939313 -0.0223793 0.0147859 -0.165393 0.0799751 -0.0731307 -0.0639488 
0.000824422 0.145021 -0.123163 0.0359751 0.107134 0.193943 0.0373649 -0.200096 -0.071731 0.066216 0.00114048 0.0596886 0.0652836 -0.0679153 -0.0428672 -0.0805344 0.00223745 0.198343 -0.000888068 0.0871203 0.0327422 -0.0567753 0.0424906 0.175303 0.00850524 -0.0628304 -0.142958 -0.156537 0.0837637 0.14077 0.0771366 0.108084 -0.105943 0.00192173 0.103759 0.0713553 -0.0339964 -0.0280791 -0.00936157 -0.0604899 0.0450212 -0.0556503 -0.012429 0.109929 -0.185525 -0.00215411 0.174639 0.135499 -0.0787691 0.0130587 0.0525348 0.0388688 -0.00196989 -0.0884515 0.0454622 0.0689604 0.00740179 0.148122 0.056617 -0.0729282 -0.089066 0.106898 0.194848 -0.174724 0.0934503 -0.114868 0.0355288 -0.100876 -0.16433 0.163694 -0.0167642 0.100703 -0.0421311 0.0606849 -0.057275 -0.0416955 -0.0507201 0.095184 0.0306966 -0.0484689 -0.0510439 0.143819 -0.0588062 0.00141706 -0.0121893 -0.0385187 -0.00759961 -0.0358609 -0.000798239 0.0343242 0.0717878 -0.0251329 0.0547625 -0.101201 0.0201983 -0.127602 -0.00880343 0.158548 0.0140358 -0.0468693 0.0616731 0.108666 0.0152231 0.0990806 -0.0715736 0.0612717 -0.0225405 0.0443437 0.0498625 0.144952 0.0289014 0.0725928 -0.0230275 -0.0115632 -0.0767017 0.00803254 -0.00395016 -0.140563 0.0277547 0.133058 0.057155 -0.0824193 -0.0535933 0.00629652 -0.182603 0.0745629 -0.0802541 -0.0198951 
0.00735932 0.157763 -0.0837661 0.0300611 0.0996228 0.211682 0.0296291 -0.21737 -0.0664621 0.0131171 -0.0191188 0.0520732 0.0428924 -0.0419156 -0.0393887 -0.0848506 0.0144532 0.167266 -0.0180242 0.0736553 0.0103844 -0.00762535 0.0338704 0.171982 -0.00567948 -0.0634518 -0.140887 -0.102767 0.0953245 0.115742 0.0862278 0.114198 -0.120164 0.00619085 0.115645 0.0805118 -0.0265588 -0.0160588 -0.0219608 -0.0570109 0.0412069 -0.0275837 -0.0176039 0.0716792 -0.15764 0.0249563 0.159552 0.142387 -0.0955143 0.0302977 0.0325772 0.0619847 0.0299298 -0.0934065 0.0405273 0.0610919 -0.0101542 0.174486 0.0473356 -0.0833866 -0.10239 0.159746 0.197333 -0.191459 0.0846827 -0.0725192 0.0590734 -0.101351 -0.19804 0.185446 -0.00937655 0.0717604 -0.0306725 0.0912373 -0.0504087 -0.039126 -0.0383566 0.0495389 0.0473337 -0.0610196 -0.00510043 0.149095 -0.0573136 -0.0347864 0.0188558 -0.0772123 -0.0365748 -0.0394567 -0.0305156 0.0782993 0.112508 -0.0300289 0.0725504 -0.065808 0.0441765 -0.0981759 0.0193693 0.153025 0.0158649 -0.0414428 0.065621 0.12296 -0.0163098 0.0953485 -0.108113 0.074888 -0.00998282 0.00986016 0.0487386 0.142672 0.0675239 0.0841676 -0.0123906 0.0130605 -0.0737736 -0.00266369 -0.0257431 -0.117753 0.0286653 0.125414 0.0551881 -0.0861769 -0.0369267 -0.0187174 -0.161073 0.0870256 -0.0641014 -0.0589326 
0.041577 0.17318 -0.161795 -0.0179933 0.118846 0.188212 0.039247 -0.159273 -0.127364 0.076697 0.0208157 0.0238916 0.101067 0.0102192 -0.0293133 -0.0234363 0.0660946 0.145821 -0.00385679 0.057823 0.0518982 -0.01017 -0.00152714 0.116638 0.0112977 -0.0168666 -0.128384 -0.0984221 0.174723 0.169604 0.0446632 0.176653 -0.123386 -0.0186005 0.0451801 0.0750531 -0.0502363 -0.0172163 0.0376809 -0.0327259 -0.000410972 -0.00892728 -0.00683277 0.0998478 -0.118508 0.0555704 0.184971 0.131391 -0.130255 -0.0576977 0.0489093 0.115207 -0.0257477 -0.100814 0.0175289 0.0604656 -0.010736 0.196912 0.0656819 -0.0715278 -0.0956574 0.104017 0.217892 -0.155567 0.0423333 -0.0527967 0.0379989 -0.0301053 -0.130646 0.133362 0.000686278 0.0984795 -0.0435023 0.0517808 -0.0526311 -0.0314171 -0.0299775 0.0739049 0.00505411 -0.0625602 0.0119538 0.154288 -0.0583703 -0.03673 0.00388657 -0.0439751 -0.0176285 -0.0619371 0.00652979 0.0344363 0.0866266 -0.0265479 -0.0231363 -0.0391575 0.0729864 -0.0889418 0.0413661 0.154358 0.00518403 -0.0401644 0.0357604 0.115255 0.0233544 0.136752 -0.193869 0.10835 -0.0690702 0.0544452 0.0944802 0.0608733 0.0754927 0.0736683 -0.0825284 0.00361723 -0.0201206 -0.00147832 -0.0383118 -0.154398 0.0468591 0.108216 0.04292 -0.0876427 0.0159254 0.00300539 -0.167519 0.0692682 -0.0700952 -0.0507043 
0.0468631 0.136049 -0.146646 0.0289254 0.128925 0.172487 0.0566314 -0.150768 -0.0981881 0.0476165 0.0378623 0.0737455 0.0943899 -0.058707 -0.0687309 -0.0519413 0.064272 0.167676 -0.0393921 0.130473 0.0738097 -0.0586702 0.0306595 0.197089 0.000563387 -0.055004 -0.111617 -0.135557 0.133142 0.150968 0.0450963 0.120455 -0.102857 0.0298671 0.0427649 0.0456007 -0.0335008 0.0154126 -0.0135991 -0.0585145 0.0309753 -0.0298248 -0.00905794 0.110568 -0.166642 -0.0121619 0.180677 0.12267 -0.0946108 0.0067045 0.0577871 0.0510063 -0.0468243 -0.0856211 0.053815 0.0540779 -0.0165266 0.18079 0.0539421 -0.0812187 -0.0995459 0.0722051 0.219512 -0.174393 0.0685459 -0.105586 0.0238349 -0.0850588 -0.164779 0.126049 -0.0259002 0.0880545 -0.0443085 0.0725511 -0.0482497 -0.0463986 -0.00268132 0.12644 0.0229653 -0.0388935 -0.0561243 0.125458 -0.0401127 -0.0309623 0.00613724 -0.0366535 0.00369617 -0.025199 0.0125114 0.0241861 0.0868404 -0.0586434 0.00385369 -0.0651378 0.0503535 -0.121898 0.00890247 0.141025 -0.000452596 -0.0527537 0.037459 0.110644 0.0119775 0.165443 -0.122111 0.0772339 -0.0429002 0.0697608 0.0795495 0.0635395 0.0331215 0.100561 -0.0573451 0.0335049 -0.0391012 0.00622444 -0.0229056 -0.152982 0.0279301 0.149395 0.0114515 -0.051002 -0.0441802 0.0286919 -0.174259 0.071269 -0.0845989 -0.056419 
0.0291659 0.153485 -0.140084 0.0113928 0.0993547 0.18369 0.032454 -0.182309 -0.0985541 0.0483779 0.0295329 0.0476057 0.0817633 -0.0329471 -0.0663112 -0.052197 0.0412677 0.183315 -0.00504788 0.0823924 0.0687837 -0.031283 0.0289024 0.169586 1.29493e-05 -0.0382837 -0.106708 -0.135428 0.141027 0.166699 0.0503788 0.11897 -0.0990483 -0.00432644 0.0892339 0.0577221 -0.0401259 0.00734349 0.00576193 -0.057632 -0.00718888 -0.0287507 -0.0156428 0.12504 -0.150041 0.0183505 0.187458 0.128261 -0.116541 -0.00864546 0.0505152 0.0840595 -0.00851723 -0.0873873 0.0415056 0.0632628 0.00964621 0.175873 0.0522432 -0.0917646 -0.0887936 0.0872215 0.23217 -0.159398 0.0738043 -0.105581 0.0312054 -0.0829707 -0.155758 0.160475 -0.0210134 0.0701968 -0.0527665 0.0519678 -0.0618862 -0.0590455 -0.0299925 0.0963601 0.0225927 -0.0448383 -0.0301475 0.142766 -0.0613762 -0.0388609 0.000369177 -0.0585348 -0.0262008 -0.0497406 0.00973675 0.0436107 0.0887462 -0.0374574 0.00831322 -0.0678736 0.062037 -0.108635 0.0131433 0.170871 0.0111917 -0.0479751 0.057291 0.129176 0.00642483 0.128983 -0.122389 0.0748898 -0.0272014 0.0462937 0.0845929 0.0802457 0.0495662 0.0825598 -0.0537563 0.00553461 -0.0374751 0.0177177 -0.0141523 -0.160974 0.0430561 0.13049 0.0321845 -0.082797 -0.0259315 -0.00361702 -0.172131 0.0777538 -0.0566893 -0.0431045 
0.0204157 0.146875 -0.0703041 0.0552803 0.10137 0.213625 0.0303211 -0.244079 -0.0603418 0.00832047 -0.0184166 0.0468958 0.0287516 -0.0291708 -0.0195862 -0.0764874 0.0278412 0.184114 -0.00524987 0.0431204 0.0173969 0.000241758 0.0218263 0.180517 0.0258024 -0.0652738 -0.152991 -0.115748 0.0731922 0.135956 0.0937212 0.144938 -0.12288 -0.000281214 0.131239 0.0803135 -0.0315397 -0.0353173 0.00156612 -0.0631709 0.0424534 -0.0177372 -0.01009 0.0504494 -0.139026 0.0379095 0.153682 0.124622 -0.0975576 -7.48694e-05 0.0544243 0.0662009 0.0716797 -0.0996394 0.0445329 0.0666059 0.0011812 0.169937 0.0517048 -0.0779629 -0.0936612 0.162613 0.1714 -0.196275 0.0839701 -0.0496651 0.0592477 -0.0916591 -0.20017 0.189912 0.000642862 0.0733946 -0.0437238 0.060329 -0.0574245 -0.025471 -0.051727 0.0222016 0.0315636 -0.0479236 0.000927017 0.172851 -0.0585937 -0.0488279 0.0182302 -0.0723054 -0.0400632 -0.067503 -0.0623967 0.0793354 0.099994 -0.0206497 0.0681834 -0.0611157 0.0315954 -0.078277 0.0200676 0.142307 0.0311771 -0.0393565 0.0792773 0.118872 -0.00704343 0.0905954 -0.109741 0.0657658 -0.00484775 -0.00336444 0.0401356 0.142194 0.0684127 0.0667261 -0.0147298 -0.0208277 -0.055978 0.000903302 -0.0540564 -0.118965 0.0227178 0.116105 0.0740369 -0.0851244 -0.0330239 -0.0289609 -0.137383 0.100836 -0.0439325 -0.0568085 
0.0388339 0.145439 -0.10556 0.0178413 0.101088 0.235809 0.0151767 -0.20941 -0.0784205 0.00448771 0.00350442 0.0682799 0.0373337 -0.0389461 -0.0365377 -0.0855838 0.0303559 0.170834 0.00222558 0.0604329 0.0113511 0.0280953 0.0409078 0.186142 -0.00543191 -0.0594751 -0.0843554 -0.104148 0.0771737 0.122086 0.0682371 0.0759167 -0.117024 0.0116818 0.109167 0.0785093 -0.0167046 -0.044917 -0.00228986 -0.0226979 0.0309636 -0.022179 -0.0214068 0.0832517 -0.175282 0.0181797 0.163021 0.132731 -0.094504 0.0495476 0.0632007 0.0717499 0.0147849 -0.0698254 0.0378641 0.0593479 0.00773045 0.186471 0.0387504 -0.0642774 -0.102168 0.14365 0.220421 -0.207842 0.0745028 -0.106626 0.057533 -0.0853058 -0.18639 0.209539 -0.00338493 0.0785175 -0.0450347 0.0733122 -0.0431311 -0.0366841 -0.0413556 0.0615547 0.0304956 -0.0493578 -0.00340577 0.154925 -0.030229 -0.0335661 0.00458658 -0.0603525 -0.0289711 -0.0579101 -0.0447471 0.0784555 0.0999735 -0.0531196 0.0523241 -0.0539972 0.0499642 -0.105919 0.0139283 0.143483 0.0174656 -0.0472271 0.0561323 0.135294 -0.014977 0.105789 -0.102531 0.0671656 -0.0217483 0.00212085 0.00763198 0.131637 0.0819266 0.0720914 0.0143782 0.0255136 -0.0772317 0.00750268 -0.0215293 -0.120888 0.0238548 0.130304 0.0695094 -0.104636 -0.0252242 -0.0259217 -0.145964 0.0831489 -0.0580631 -0.0424251 
-0.00169598 0.166316 -0.119823 0.00942196 0.106655 0.182402 -0.0210894 -0.269761 -0.0563453 -0.0141804 -0.0136063 0.0277114 0.0347301 0.041905 -0.0224022 -0.0182625 0.0231521 0.122375 0.0229936 0.0446008 0.0169289 0.0392624 0.0222632 0.0983703 0.00618786 0.00159144 -0.138064 -0.0897813 0.114411 0.157287 0.0812658 0.158107 -0.0725869 -0.0588042 0.125143 0.139332 -0.0212635 -0.0209805 0.0329088 -0.037543 -0.00938045 0.0311192 -0.00740915 0.0460607 -0.100686 0.130717 0.191307 0.114693 -0.1059 -0.0385477 -0.0248546 0.109433 0.0821877 -0.0840199 0.0412418 0.064926 0.0158947 0.170979 0.0244975 -0.0593467 -0.104226 0.1617 0.213691 -0.159575 0.0707515 -0.0249624 0.053164 -0.0222909 -0.127686 0.170585 0.043948 0.0535103 -0.0520653 0.0328872 -0.010622 0.0084449 -0.0842289 0.0078399 -0.00435781 -0.0765214 0.0613369 0.206142 -0.0838292 -0.0331234 0.0039128 -0.0262491 -0.0676477 -0.0695351 -0.0774589 0.0751019 0.111619 -0.00926558 0.0271419 -0.0286995 0.0739115 -0.0694427 0.0208289 0.175318 0.0478484 -0.0400923 0.0487269 0.0860863 -0.00287394 0.0476539 -0.177212 0.119382 -0.0167941 -0.00577326 0.0609025 0.12743 0.0804844 0.0282133 -0.0386035 -0.0277235 -0.0459874 0.0232235 -0.0759694 -0.131643 0.024461 0.094885 0.0769052 -0.0808077 0.0248592 -0.0280568 -0.164835 0.119754 -0.0222311 -0.0251157 
0.00856596 0.170218 -0.111754 0.0219574 0.0857204 0.202177 0.00155441 -0.26468 -0.053435 0.00313954 -0.00865368 0.0492314 0.0281133 0.00498777 -0.0461501 -0.0384726 0.0276326 0.158711 0.0126881 0.0201234 0.0135259 0.044483 -0.00702953 0.143079 -0.00221874 -0.0139369 -0.123978 -0.089179 0.099341 0.169558 0.0693196 0.166046 -0.102345 -0.0322257 0.122595 0.103223 -0.0230554 -0.0530723 0.0296665 -0.0244591 0.00202196 0.000180177 -0.00057622 0.0571672 -0.0941048 0.0876945 0.180413 0.113126 -0.118812 -0.0277667 0.0404698 0.107174 0.0688819 -0.0892941 0.039153 0.0780389 0.00715988 0.171999 0.0352457 -0.0509255 -0.0885426 0.157191 0.202934 -0.175465 0.0691243 -0.0626954 0.0579572 -0.0641135 -0.164339 0.194826 0.0165686 0.0478833 -0.0544249 0.0492368 -0.0436183 -0.00659201 -0.0568571 0.0232329 -0.00880708 -0.0801458 0.0464674 0.204032 -0.0703538 -0.0360574 0.000284775 -0.0477613 -0.0546562 -0.0978556 -0.0754493 0.0865178 0.0867283 -0.0265946 0.0324355 -0.0334267 0.0691321 -0.0483801 0.0271314 0.146016 0.0497076 -0.0292629 0.0674033 0.112784 -0.0164541 0.0833743 -0.142454 0.0827167 -0.0181551 -0.00928917 0.0152506 0.133225 0.0790076 0.0337034 -0.0215858 -0.027195 -0.0586152 0.00817823 -0.0534432 -0.131902 0.0321741 0.0988804 0.0865503 -0.0935174 0.014786 -0.0465993 -0.148743 0.111876 -0.0395702 -0.0487694 
0.0534679 0.100634 -0.123815 0.0081699 0.104677 0.191289 0.036373 -0.201142 -0.0914404 0.00254878 -0.0140006 0.0122962 0.075927 0.0348172 0.00761759 -0.0454748 0.0260696 0.132268 -0.00103738 0.0609692 0.011067 0.0272636 0.0494229 0.144517 -0.01358 -0.0270424 -0.150058 -0.12957 0.108405 0.128656 0.0678013 0.172598 -0.131403 -0.0265366 0.0846085 0.109402 -0.0444971 0.0121123 -0.000354849 -0.0235051 0.00535302 0.0318362 -0.0694783 0.0632474 -0.141411 0.0864743 0.154224 0.13911 -0.0811517 -0.0110763 -0.00509928 0.0799123 0.0656494 -0.0819657 0.0304122 0.0375668 0.0387387 0.194438 0.0849466 -0.0825141 -0.102433 0.173415 0.188292 -0.154981 0.0235154 -0.0313032 0.0925139 -0.0163616 -0.109952 0.142461 0.0128478 0.0889895 -0.0269638 0.0785973 -0.0457443 -0.0339986 -0.0909328 0.00215103 0.0251916 -0.0399777 0.0652349 0.169681 -0.105082 -0.0926225 0.0216713 -0.0365681 -0.036725 -0.0777712 -0.0665709 0.0349794 0.140144 0.00996594 0.0383919 -0.0767387 0.0470901 -0.0755951 0.0311813 0.160487 0.0503722 -0.045524 0.061176 0.0881064 0.0301556 0.0891953 -0.188942 0.0740958 -0.055428 0.00632026 0.0796416 0.127169 0.0994172 0.0953438 -0.0352584 -0.0511269 -0.0543956 0.0450938 -0.0539893 -0.155397 0.0158632 0.0866773 0.0568365 -0.0833552 0.0135816 0.010635 -0.196083 0.0714915 -0.0728957 -0.0279727 
0.0880374 0.121361 -0.185368 -0.0392692 0.159567 0.145382 0.0621415 -0.0992997 -0.125805 0.0784321 0.0454133 0.04731 0.128056 -0.0108598 -0.041596 -0.00735255 0.0533805 0.14131 -0.0612963 0.116371 0.0896117 -0.0399952 0.030236 0.142448 0.0289681 -0.032033 -0.0721259 -0.117557 0.153932 0.160628 0.000309838 0.102382 -0.123561 -0.00308032 -0.00200304 0.0252799 -0.0827075 0.0204499 0.0218062 -0.0334574 -0.00428592 0.00238956 -0.00474029 0.168203 -0.159411 0.0239509 0.16711 0.123823 -0.0996747 -0.00698332 0.066202 0.0593508 -0.0977874 -0.0870598 0.0384573 0.0121279 -0.0308493 0.221033 0.0803634 -0.0982189 -0.0775326 0.0266669 0.224802 -0.0881607 -0.0077112 -0.0948322 -0.00374582 0.0305642 -0.0773354 0.0760717 0.0307071 0.142401 -0.0194265 0.00679269 -0.0555433 -0.0290578 -0.0457193 0.10997 0.0183627 -0.0069461 0.0152196 0.121796 -0.0366468 -0.0370824 -0.0154857 -0.0224844 0.0230864 -0.0118278 0.0504385 -0.00586567 0.0562867 -0.0528887 -0.0748109 -0.058489 0.0281783 -0.126503 0.00612577 0.125617 -0.00277307 -0.0924509 0.0167223 0.082557 0.0599826 0.162958 -0.214834 0.0780715 -0.128112 0.112645 0.113925 0.00625918 0.104668 0.122418 -0.0949795 0.0561879 -0.0156167 0.0241955 -0.0821566 -0.131026 1.44283e-05 0.108826 0.00398379 -0.028118 -0.0116146 0.0541434 -0.177041 0.0272714 -0.102946 -0.0470599 
0.04023 0.140975 -0.161381 -0.0457479 0.103005 0.166565 0.0258574 -0.100382 -0.117828 0.0874163 0.0274406 -0.0267443 0.140033 0.0310715 0.00644622 -0.00379636 0.0449694 0.104957 -0.0193185 0.080841 0.0703302 -0.0482386 0.0595747 0.126152 0.0122456 -0.0179677 -0.118946 -0.128903 0.189097 0.117526 0.0695216 0.119248 -0.115297 -0.0368366 0.011557 0.083558 -0.0640878 0.0663775 0.0124771 -0.0108176 -0.0252361 0.0150013 -0.0640189 0.123629 -0.13605 0.0306141 0.167118 0.138191 -0.0914239 -0.0483722 0.00481619 0.0831974 -0.0355162 -0.0903529 0.00439008 0.0402404 0.025675 0.206179 0.109811 -0.134772 -0.110867 0.0814352 0.209103 -0.12455 0.00604758 -0.0266648 0.0651219 0.0243945 -0.0579615 0.0868343 0.0118251 0.135525 -0.0347138 0.0441901 -0.0119532 -0.0595072 -0.0816634 0.0939589 0.0368329 -0.012574 0.0196699 0.121789 -0.0658361 -0.0614913 0.0149286 -0.0181782 -0.00488148 -0.0251899 0.0341066 -0.0309454 0.0860052 -0.0111653 -0.00725397 -0.0771585 0.0547969 -0.136545 0.0198624 0.182326 -0.00268294 -0.0585116 0.0256786 0.0707231 0.0513707 0.126104 -0.218723 0.103094 -0.0970014 0.048787 0.15975 0.0268356 0.0724593 0.125456 -0.0864975 0.00233378 -0.0112981 0.0411985 -0.0726635 -0.156587 0.0102186 0.0868336 0.0127281 -0.0646588 -0.00311787 0.0469838 -0.214742 0.0507175 -0.110092 0.00340729 
0.0584369 0.101043 -0.110527 -0.0242943 0.104673 0.20701 0.0395342 -0.071087 -0.175937 0.0837729 0.00418038 -0.0117122 0.126581 -0.0432407 0.0327878 -0.0314985 0.0266794 0.125061 -0.0246781 0.111728 0.0478103 -0.0446895 0.0916205 0.160156 -0.0115285 -0.0246727 -0.126319 -0.165741 0.150745 0.0504339 0.0484504 0.105553 -0.140965 0.0251897 0.025742 0.0653943 -0.0433996 0.0573936 -0.00854955 -0.029379 0.0356981 -0.038581 -0.0601309 0.0988828 -0.192086 0.0063004 0.171291 0.148768 -0.117004 0.0160449 0.031832 0.0271618 -0.0387326 -0.0555657 0.0245574 0.0145894 0.0637074 0.169039 0.116473 -0.135176 -0.101669 0.119144 0.180736 -0.146765 0.0378573 -0.0370776 0.0566043 -0.0170006 -0.0853028 0.104641 -0.0388316 0.129289 -0.0290097 0.0980079 -0.00267396 -0.0782226 -0.0757204 0.112756 0.0735244 -0.00559016 -0.0001938 0.0906919 -0.0440281 -0.0675336 0.0102288 -0.00997705 0.017454 0.000148467 0.0106209 0.000531324 0.128208 -0.00636631 0.0148761 -0.0894241 6.9372e-05 -0.131895 0.0316651 0.194135 -0.00804262 -0.0626106 0.038653 0.0911823 0.0372002 0.140902 -0.138234 0.0661238 -0.0810504 0.0782685 0.124157 0.0433164 0.0508888 0.161806 -0.0371311 -0.0127503 -0.0235784 0.0256972 -0.0526107 -0.157623 -0.000360683 0.107375 0.0242204 -0.0856788 -2.79612e-05 0.0431975 -0.207222 0.0411931 -0.104438 -0.00902268 
0.0795463 0.0840613 -0.112146 -0.0310099 0.0978257 0.204239 0.0189048 -0.0652823 -0.183836 0.0918717 0.00144827 -0.00839117 0.133001 -0.0586323 0.0348858 -0.0161197 0.0408818 0.132735 -0.0259685 0.114438 0.0467809 -0.0253664 0.114337 0.171367 -0.0215015 -0.00942976 -0.100007 -0.189718 0.124601 0.044892 0.0314162 0.0910582 -0.135521 0.0290163 0.0290671 0.0453593 -0.0287777 0.0756112 0.00920599 -0.0130105 0.0134677 -0.0309433 -0.0666291 0.10575 -0.198056 -0.000489118 0.171237 0.139356 -0.107005 0.0387788 0.0749936 0.0132883 -0.0362748 -0.0310172 0.0187676 -0.00840156 0.109476 0.147154 0.139259 -0.153211 -0.0886801 0.0968384 0.159307 -0.140076 0.0241294 -0.0769355 0.0572813 0.00916888 -0.0602182 0.0928867 -0.041591 0.127735 -0.030171 0.0781246 -0.00583903 -0.0820251 -0.101016 0.122713 0.0804654 0.0252932 0.0153365 0.0939714 -0.0296997 -0.0674817 0.0137265 -0.00850181 0.0250919 0.00246111 0.00787084 -0.0134982 0.0930344 -0.00480769 0.0123876 -0.0836304 -0.0214899 -0.130158 0.0295286 0.200902 -0.0185494 -0.0752988 0.049202 0.094931 0.0366027 0.170264 -0.115629 0.0220363 -0.0955268 0.0760018 0.117038 0.0448972 0.051006 0.17256 -0.0192033 -0.00588206 -0.0371634 0.0366864 -0.0792473 -0.165393 -0.0378434 0.0884623 0.0243202 -0.0742604 0.0108626 0.0300717 -0.194965 0.0200552 -0.118698 -0.00307542 
0.0367964 0.134908 -0.152597 -0.0479791 0.110534 0.171325 0.0164552 -0.0876042 -0.140512 0.098788 0.0228618 0.0129053 0.126516 -0.0356886 -0.0387876 0.00400264 0.0196512 0.155264 -0.0390555 0.113713 0.089988 -0.0744552 0.0934702 0.153402 -0.00984928 -0.0191111 -0.0791888 -0.165556 0.164093 0.103819 0.026286 0.0757599 -0.0941141 -0.00797208 0.016511 0.0440548 -0.0752729 0.0714657 -0.0150387 -0.030976 -0.0275954 -0.0266884 -0.0393585 0.148324 -0.163618 0.0146534 0.195449 0.118577 -0.143023 0.00598952 0.0410967 0.0266441 -0.0651607 -0.0719611 0.0205475 0.0400821 0.0508233 0.188191 0.102338 -0.137124 -0.0844684 0.0671455 0.226373 -0.119898 0.0520503 -0.0841398 0.000283021 0.00465214 -0.0883053 0.112081 -0.0159057 0.116813 -0.0427981 0.030347 -0.0230971 -0.0572048 -0.0633544 0.138557 0.0407669 -0.0365011 -0.0279389 0.103053 -0.0669649 -0.0413423 -0.0261574 -0.00924952 0.00438535 -0.0036254 0.0496317 -0.000706013 0.0710389 -0.0380371 -0.0273366 -0.0795686 0.0494218 -0.115457 0.00350642 0.205149 -0.00536306 -0.0576664 0.0350863 0.0688664 0.0250217 0.139497 -0.147873 0.0729591 -0.0979837 0.074344 0.119591 -0.000982847 0.0446629 0.150968 -0.0392167 0.0113877 -0.00668795 0.0381944 -0.072233 -0.152788 0.0133572 0.11319 0.00706273 -0.0666755 -0.0130479 0.0311177 -0.203296 0.0588858 -0.107105 -0.0196744 
0.0535758 0.122113 -0.14295 -0.0428094 0.12278 0.193691 0.0442136 -0.0749524 -0.114792 0.0736071 0.0213815 0.0181664 0.121149 -0.0663671 -0.0419198 -0.0344536 -0.0192601 0.151387 -0.0821587 0.105863 0.0983268 -0.0828396 0.0921095 0.16999 0.00590844 -0.0753516 -0.0966178 -0.170714 0.123662 0.0937646 0.0440272 0.0303507 -0.128195 0.00736775 0.0131687 0.0339534 -0.107286 0.0306882 -0.0341382 -0.0178102 8.38987e-05 -0.0380301 -0.056639 0.16919 -0.176706 -0.0115037 0.162209 0.130216 -0.120637 0.0361977 0.0391063 0.0134776 -0.0767263 -0.0789542 0.0115456 0.026708 0.0244575 0.204361 0.097706 -0.128659 -0.0798206 0.0843801 0.221011 -0.11026 0.0300221 -0.113104 0.00414556 0.00615466 -0.098376 0.113355 0.0023092 0.14319 -0.0273316 0.0228729 -0.0388465 -0.0458996 -0.0750273 0.115818 0.0407663 0.0126137 -0.0342122 0.0729361 -0.0480269 -0.0273897 -0.0465731 0.00968251 0.0265815 -0.0124556 0.0334361 -0.0106732 0.0747774 -0.0586654 -0.0231205 -0.0958351 0.0132803 -0.131126 -0.0192372 0.165711 -0.0164516 -0.0531688 0.0435967 0.0730152 0.0258763 0.135025 -0.133722 0.0633541 -0.109337 0.107313 0.0940434 0.0191517 0.0700217 0.14588 -0.0442081 0.0202763 -0.024622 0.0630658 -0.0748499 -0.107715 0.0124739 0.135424 6.42187e-05 -0.0667208 -0.0483148 0.0474015 -0.198404 0.0443166 -0.124059 -0.0123205 
0.0508902 0.105398 -0.140229 -0.040669 0.118105 0.197664 0.0498712 -0.0676291 -0.0908085 0.0628825 0.0321774 0.0290667 0.123527 -0.0735529 -0.0458518 -0.041813 -0.0377179 0.152008 -0.0956247 0.099357 0.115905 -0.0875802 0.0871671 0.183171 0.00757992 -0.0822889 -0.0935407 -0.183099 0.11414 0.0947926 0.0501929 0.0176007 -0.123411 0.0147649 0.0127661 0.033837 -0.115578 0.0241892 -0.042772 -0.0160621 0.0118282 -0.0416806 -0.0658639 0.181231 -0.178854 -0.0361407 0.150954 0.12588 -0.112886 0.0343312 0.0310389 -0.0040242 -0.0779922 -0.0785168 0.0152931 0.0372348 0.0114504 0.210619 0.0829205 -0.127928 -0.0818615 0.0747548 0.227143 -0.101988 0.0308337 -0.115604 0.00358463 0.0018423 -0.0973423 0.110697 0.00201612 0.140105 -0.0290035 0.00859771 -0.0382125 -0.0445264 -0.0822324 0.110367 0.037001 0.0233884 -0.0423115 0.0679672 -0.0434934 -0.0267693 -0.0605481 0.0218902 0.0429934 -0.014711 0.0249878 -0.0140028 0.0774961 -0.0735321 -0.0285085 -0.0997066 0.00118526 -0.131883 -0.0387155 0.150911 -0.013434 -0.0439716 0.0512909 0.0608666 0.0246747 0.125153 -0.121298 0.0620972 -0.11034 0.10665 0.0791388 0.012523 0.0649256 0.141348 -0.0471333 0.0121345 -0.0188668 0.0774731 -0.0756614 -0.101275 0.0161051 0.143812 0.00506146 -0.0709381 -0.0617891 0.0527314 -0.197127 0.049327 -0.123079 1.24307e-05 
0.0423762 0.0271197 -0.169128 -0.00158561 0.127414 0.151005 0.0313273 -0.0643877 -0.106633 0.0669112 0.0342477 0.102608 0.108542 -0.0750118 -0.0863283 -0.0157585 -0.0269179 0.150112 -0.0474096 0.126013 0.111555 -0.113052 0.106199 0.182789 0.00662857 -0.0259438 -0.0487955 -0.217949 0.0705472 0.0865575 0.00816485 0.00907539 -0.101347 -0.0203653 -0.0213143 0.0249141 -0.143196 0.0234601 -0.0512907 0.00148842 0.0170138 0.00321968 -0.0792548 0.192863 -0.209542 -0.0475399 0.166486 0.0688182 -0.0642989 0.0185086 0.0670756 -0.0366191 -0.0961278 -0.0669209 0.0403558 0.0230015 0.0484926 0.199233 0.0983878 -0.0838717 -0.0498225 0.028464 0.22106 -0.062878 0.0606386 -0.174481 -0.0158638 0.020153 -0.0336656 0.107482 0.0208169 0.177749 -0.0052286 -0.00504252 -0.0492018 -0.00715318 -0.0984328 0.145484 0.00179216 0.017318 -0.0780896 0.0749837 -0.0252548 -0.00897876 -0.086794 0.0304115 0.0853538 0.0159035 0.00102262 -0.0967223 0.0108069 -0.035448 -0.0368708 -0.103205 0.00157761 -0.145833 -0.0235358 0.130267 -0.00331425 -0.0564772 0.0145378 0.0352047 0.048839 0.118321 -0.0966967 0.0317128 -0.114203 0.109752 0.042882 0.004204 0.036848 0.128696 -0.00824128 -0.00707319 -0.0309646 0.0794206 -0.0785251 -0.110396 -0.0139666 0.126925 -0.0315853 -0.0336058 -0.0727603 0.0216868 -0.199893 0.0739152 -0.150212 0.0358845 
0.0406392 0.024667 -0.152709 -0.00790064 0.122409 0.152141 0.0426319 -0.0552117 -0.0878908 0.0498299 0.0358668 0.0839013 0.110961 -0.0662571 -0.0915971 -0.0330433 -0.0517221 0.147042 -0.0706177 0.111697 0.125608 -0.129059 0.100917 0.197996 0.0137077 -0.0640353 -0.0577635 -0.199321 0.0757092 0.0795872 0.0162788 -0.0190472 -0.119754 -0.0175067 -0.0221579 0.0231279 -0.164924 0.00423371 -0.0615083 -0.00485183 0.01751 -0.00846906 -0.0909966 0.194818 -0.194844 -0.054456 0.136762 0.0900149 -0.0603023 0.0210566 0.0394812 -0.0283791 -0.0849307 -0.0789603 0.0257722 0.0258069 0.0364749 0.210998 0.0923015 -0.0894903 -0.0437108 0.0561085 0.22157 -0.0400545 0.0324305 -0.15304 -0.0136006 0.0191547 -0.0372083 0.108641 0.0186805 0.17289 -0.00504088 -0.0140529 -0.0468541 -0.00825938 -0.0946542 0.127051 0.0133971 0.0363527 -0.073736 0.0540148 -0.0266943 -0.0162067 -0.0921107 0.0444531 0.082327 0.015982 -0.00192326 -0.0879995 0.0403368 -0.0408763 -0.0237687 -0.104651 -0.0126638 -0.151736 -0.0474068 0.119957 0.00419547 -0.0564513 0.0419774 0.0353674 0.0440002 0.105395 -0.0833315 0.0413897 -0.108522 0.11786 0.0472261 -0.000235448 0.0493212 0.129652 -0.0137796 -0.00587936 -0.0279883 0.107195 -0.0785563 -0.0749669 -0.000393282 0.137762 -0.0426173 -0.0524881 -0.10234 0.0257844 -0.218226 0.0829703 -0.161237 0.0363747 
0.0363805 0.0592672 -0.171657 -0.0176784 0.108871 0.149127 0.017286 -0.06349 -0.121686 0.0798932 0.0468083 0.0777272 0.124372 -0.0446339 -0.0939902 -0.0244265 -0.00897583 0.129709 -0.0320592 0.132818 0.110413 -0.133377 0.104743 0.163912 0.0077409 -0.0106848 -0.0443485 -0.188291 0.114637 0.0840147 0.0105338 0.00913574 -0.0910512 -0.030527 -0.0352743 0.0270955 -0.145186 0.0660684 -0.0411163 -0.00847623 -0.0053332 -0.007142 -0.0925181 0.176131 -0.197236 -0.0391463 0.163971 0.0737642 -0.0838894 -0.0014326 0.044412 0.0215951 -0.0919418 -0.0661047 0.0275811 0.029499 0.0519582 0.206413 0.0889904 -0.103612 -0.062161 0.0290509 0.246811 -0.0720007 0.0632655 -0.13236 -0.00989196 0.0229506 -0.04552 0.109139 0.0144716 0.161452 -0.0221729 0.0106151 -0.0247931 -0.0195022 -0.078847 0.142087 0.0144258 0.0129847 -0.0999562 0.0580029 -0.0180286 -0.0120243 -0.0662712 0.00917972 0.0707019 0.0269404 0.0356106 -0.0957711 0.019566 -0.0413281 -0.0125712 -0.0832126 0.0241655 -0.174811 -0.00317222 0.1523 0.00260871 -0.0624563 0.0168346 0.0582752 0.0380425 0.129187 -0.113429 0.0653891 -0.094037 0.105815 0.0849482 -0.0269869 0.0338621 0.136964 -0.0236813 0.0128854 -0.010215 0.0721491 -0.0830802 -0.116896 0.0107435 0.130268 -0.0461396 -0.0564305 -0.0744279 0.0113477 -0.196561 0.0905563 -0.130991 0.0392558 
0.0492202 0.088386 -0.163761 -0.0336682 0.11568 0.174555 0.0319488 -0.061851 -0.11929 0.0782596 0.0357839 0.0520986 0.130804 -0.0680755 -0.0741722 -0.037705 -0.0205223 0.127627 -0.0619725 0.123323 0.107037 -0.110291 0.0954784 0.160628 0.0118135 -0.0424768 -0.0668968 -0.181707 0.120627 0.0905476 0.0269044 0.0105907 -0.111048 -0.013437 -0.0141521 0.0179088 -0.13545 0.0456352 -0.0351247 -0.0173776 0.000384686 -0.0364844 -0.0813565 0.18643 -0.19429 -0.0276765 0.155677 0.108582 -0.0966206 0.0147995 0.0497215 0.0325212 -0.0832382 -0.077437 0.0141356 0.0168348 0.0334284 0.195865 0.0939672 -0.121421 -0.0723599 0.0469327 0.232701 -0.0763277 0.0380313 -0.136823 8.65788e-05 0.0193062 -0.0688979 0.0957659 0.0107163 0.150567 -0.0241645 0.00396741 -0.0305782 -0.025432 -0.0832653 0.12352 0.0319651 0.0510794 -0.0666101 0.0433949 -0.0135036 -0.00389652 -0.0509744 0.00253051 0.0606601 0.0122938 0.039569 -0.0608211 0.0337985 -0.0512164 -0.0211455 -0.0796223 -0.00525475 -0.170383 -0.00480602 0.153565 -0.0105605 -0.0723678 0.0392716 0.0800403 0.0358764 0.138796 -0.124955 0.0573192 -0.101122 0.130001 0.0978422 -0.00283245 0.0610032 0.137485 -0.0490295 0.0226639 -0.0247622 0.0753317 -0.0948566 -0.0982744 0.00852477 0.141019 -0.0311703 -0.0688283 -0.069587 0.0226234 -0.18733 0.0649539 -0.127225 0.0208917 
0.0456139 0.0983012 -0.154901 -0.0439077 0.119877 0.182375 0.0498475 -0.0473108 -0.133641 0.108693 0.0341873 0.038721 0.139658 -0.0682046 -0.0535945 -0.0353192 -0.0303782 0.131709 -0.0676419 0.121143 0.0931249 -0.104402 0.0609598 0.146233 0.00769408 -0.0399329 -0.0990612 -0.156159 0.136657 0.0856154 0.0257954 0.0327589 -0.148871 -0.0145661 -0.0205168 0.030275 -0.139297 0.0133936 -0.0172037 -0.00840693 0.021937 -0.0462551 -0.0670484 0.177465 -0.184574 -0.0436593 0.150584 0.126336 -0.0945925 0.00368388 0.0481188 0.0327703 -0.110333 -0.0815175 0.00895233 0.0157619 0.00526486 0.198199 0.0983344 -0.111174 -0.0731743 0.0622443 0.22409 -0.0714057 0.0146301 -0.109563 0.00803994 0.0111832 -0.0672558 0.0784125 0.0153115 0.175878 -0.00356686 0.0291403 -0.034977 -0.0327635 -0.0782967 0.122748 0.0420832 0.0299239 -0.0325 0.0509775 -0.0074028 0.00519374 -0.0476896 0.0145814 0.0668458 0.0215701 0.0639068 -0.0577628 0.0456543 -0.0401235 -0.0215999 -0.0738773 -0.0200884 -0.167302 -0.00347331 0.139193 -0.0197902 -0.0670331 0.0339115 0.0764307 0.041182 0.132585 -0.137434 0.0807897 -0.108829 0.137092 0.100687 0.0154259 0.0641111 0.132636 -0.060294 0.0244717 -0.0308769 0.0546319 -0.0759525 -0.0830551 0.000699932 0.119613 -0.021126 -0.0832554 -0.0505092 0.0304027 -0.206952 0.0581992 -0.142444 0.0164884 
0.0657303 0.137826 -0.173126 0.0046916 0.12574 0.167156 0.0813085 -0.0917493 -0.0547742 0.0918565 0.0622262 0.0712488 0.1152 -0.0960046 -0.0606419 -0.0180682 -0.015776 0.151966 -0.1118 0.122545 0.0959123 -0.0908409 0.0484962 0.196412 0.0209377 -0.0981833 -0.0881422 -0.163898 0.11375 0.156221 0.0221316 0.0736886 -0.107338 0.0313218 -0.0084968 0.0129482 -0.0987634 0.00930717 -0.032288 -0.0153199 0.00628324 -0.0579545 -0.0295319 0.16627 -0.167483 -0.0450391 0.151128 0.117143 -0.0937658 0.0471392 0.0854539 0.025876 -0.103818 -0.0945801 0.0343583 0.0417225 -0.0414131 0.18912 0.06943 -0.0829213 -0.103415 0.0120519 0.226273 -0.130771 0.0192667 -0.128342 -0.0141441 -0.0207143 -0.147753 0.0953823 0.00426994 0.145463 -0.0371467 0.0259279 -0.0480797 -0.0312413 -0.0306846 0.115474 0.00651624 0.0263146 -0.0286357 0.0629395 -0.0414369 -0.0137817 -0.0460534 0.0263151 0.0279666 -0.0403427 0.047711 0.00389923 0.0314239 -0.0991667 -0.0643779 -0.0762843 0.0131911 -0.120264 -0.0402091 0.0948411 0.00398685 -0.0645832 0.0427024 0.0550935 0.0279767 0.153029 -0.139749 0.0611301 -0.100927 0.119732 0.0801354 0.0227918 0.0472292 0.138768 -0.0486561 0.0278239 -0.0178327 0.0441691 -0.0522202 -0.0808803 0.033306 0.162738 0.0151984 -0.046836 -0.0504595 0.0825717 -0.161259 0.0438168 -0.0947727 -0.0291938 
0.0149796 0.14416 -0.149169 0.0217959 0.117031 0.189904 0.0710187 -0.201021 -0.0543977 0.0545252 -0.0018474 0.0264911 0.0555871 -0.0283401 0.00381305 -0.0396661 -0.0438677 0.0981647 -0.00933463 0.0774629 -0.000563773 -0.0602519 0.0464619 0.13212 0.0346863 -0.0456282 -0.147128 -0.146085 0.104361 0.11376 0.0797278 0.11738 -0.114357 -0.0265176 0.0782201 0.100376 -0.0566611 0.00990974 -0.0141176 -0.0626638 0.0496343 -0.0340764 -0.0238328 0.0922587 -0.170002 0.0662544 0.156492 0.142435 -0.0846912 0.0014044 -0.030562 0.0525887 0.0333371 -0.102456 0.0791691 0.0527728 -0.0258263 0.208048 0.0471414 -0.0867644 -0.135732 0.116472 0.241367 -0.170399 0.071626 0.0252103 0.0289512 -0.0267345 -0.135418 0.121072 0.0141513 0.143725 -0.0326938 0.0808258 0.00653403 -0.0191847 -0.0678071 0.0346813 0.0349348 -0.0356541 0.0258119 0.125036 -0.0847253 -0.0558761 -0.0211064 -0.021964 -0.0306238 -0.0233964 -0.00373048 0.0446771 0.130909 -0.0186518 0.0160442 -0.0962923 0.0280862 -0.112043 0.0173768 0.134983 0.0695531 -0.0671617 0.0544975 0.0449357 0.0399966 0.0287243 -0.188418 0.113213 -0.042249 0.0474386 0.0853322 0.119803 0.0980924 0.121596 -0.0124565 -0.0439868 -0.015166 0.0281235 -0.0610598 -0.0947619 0.0449956 0.120481 0.072295 -0.0938039 0.00575919 0.0479283 -0.198722 0.105945 -0.0521482 -0.0203208 
0.00848074 0.159426 -0.149372 0.0156358 0.0951286 0.176978 0.0715827 -0.176788 -0.0912782 0.102161 0.0121809 0.0152766 0.0685482 -0.0731955 -0.00923894 -0.0458444 -0.0732364 0.140297 -0.0109827 0.0804659 0.0125112 -0.0819067 0.0565102 0.0973144 0.0214897 -0.0376328 -0.151151 -0.169343 0.122621 0.11865 0.0502904 0.122783 -0.123867 -0.0259222 0.0805112 0.0615372 -0.0818934 0.0205226 0.00174198 -0.0541782 0.0332108 -0.0797673 -0.0382138 0.134139 -0.194115 0.0473726 0.163913 0.144776 -0.109733 0.000157977 0.0107144 0.0797709 -0.0192958 -0.0939355 0.047432 0.0324732 0.0085048 0.16419 0.0560173 -0.0805027 -0.108464 0.0803552 0.241504 -0.122252 0.0803367 -0.0404752 0.0189552 -0.045368 -0.120276 0.138411 -0.000572069 0.148185 -0.0251584 0.0963337 -0.0238752 -0.0656608 -0.0810419 0.0612868 0.0281251 -0.0195532 -0.00450731 0.0981699 -0.0835162 -0.0346849 -0.0347705 -0.0239483 -0.0171902 -0.0236184 0.0311407 0.0260259 0.103622 -0.0129205 -0.000234435 -0.117402 0.00307065 -0.141851 0.0177815 0.153418 0.0555416 -0.0708856 0.0526033 0.0764769 0.0467005 0.0583627 -0.130755 0.0841864 -0.0337682 0.110488 0.123255 0.10664 0.0696234 0.126921 -0.041972 -0.0431966 -0.015907 0.0180142 -0.0261016 -0.111494 0.074262 0.119723 0.0623302 -0.0977838 -0.00405214 0.0444346 -0.180462 0.0666356 -0.0466501 0.00358577 
-0.0113036 0.142499 -0.0977998 0.0399117 0.118716 0.14557 0.077103 -0.172167 -0.0590653 0.0856733 -0.00628698 -0.00940498 0.0379826 -0.0644898 0.0283498 -0.0401979 -0.0676113 0.137974 0.00157426 0.083081 0.0259319 -0.0991269 0.068808 0.0751595 0.0622265 -0.0480856 -0.188019 -0.161276 0.143097 0.09415 0.0960752 0.13024 -0.0970354 -0.0404904 0.107082 0.072857 -0.0760357 0.0416777 -0.000879039 -0.113686 0.0505423 -0.0562514 -0.0322383 0.107725 -0.187125 0.0510104 0.139841 0.138372 -0.0777003 -0.0299896 -0.0487601 0.0811379 0.0201907 -0.116117 0.0607819 0.0259269 0.00581499 0.14207 0.0244294 -0.0944124 -0.120779 0.0710887 0.216273 -0.107974 0.095148 0.0231129 0.00646909 -0.0548883 -0.126556 0.129013 0.00507828 0.156423 -0.0330326 0.0883573 -0.0227997 -0.073248 -0.0787139 0.0476764 0.0399196 -0.0214799 -0.0190256 0.110326 -0.0896283 -0.036676 0.00895878 -0.0513509 -0.0375565 0.0285201 0.0333789 0.0277168 0.13668 0.0344519 -0.00428964 -0.111411 0.0170056 -0.14842 0.0105779 0.165916 0.0425285 -0.0700574 0.0520436 0.0387033 0.0519455 0.00450065 -0.131699 0.107098 0.0139085 0.0748724 0.204368 0.107522 0.0500138 0.124402 -0.0652722 -0.0583298 0.0361763 0.00681296 -0.0233603 -0.112257 0.0784629 0.123837 0.0642036 -0.064912 -0.015152 0.0523377 -0.179657 0.0783834 0.00455957 0.0106319 
0.00838181 0.147487 -0.107201 0.00991655 0.138759 0.143012 0.0890704 -0.198611 -0.0478714 0.0801257 0.012818 0.0253325 0.0359852 -0.0394956 0.010018 -0.0402574 -0.0699552 0.149987 -0.00402265 0.0770065 0.0353372 -0.0529315 0.0378388 0.0365158 0.0391328 -0.0171168 -0.182819 -0.13844 0.164378 0.144905 0.0521656 0.151393 -0.0910681 -0.0560676 0.115853 0.062497 -0.0812451 0.042874 0.0432756 -0.0977089 0.0241889 -0.0313752 -0.0438132 0.0963921 -0.18356 0.0745045 0.132273 0.112826 -0.0887731 -0.0419283 -0.0538877 0.128755 -0.00446318 -0.0995489 0.0510797 0.0240157 -0.00839584 0.164545 -0.0520669 -0.0476618 -0.105435 0.0449719 0.263388 -0.0955749 0.0910332 -0.000259802 0.000746329 -0.022826 -0.126306 0.14057 0.0451293 0.145347 -0.0385403 0.0810908 -0.0474182 -0.0488514 -0.0752894 0.00354304 0.0294644 -0.048606 -0.00650159 0.145123 -0.0839822 -0.0156719 0.00531419 -0.0737678 -0.0287155 0.0205116 0.0373079 0.0437311 0.134792 0.00319199 -0.0229292 -0.0590038 0.0345057 -0.161709 0.00705919 0.139293 0.0623107 -0.0580783 0.0500124 0.0430101 0.02381 0.0126094 -0.149464 0.129261 0.0192436 0.0704127 0.195941 0.100693 0.0703167 0.0886924 -0.0880252 -0.0296163 0.0488959 0.017272 -0.0269049 -0.109491 0.084579 0.119061 0.0674488 -0.0638685 -0.000309916 0.0397646 -0.147325 0.0874045 0.0250837 -0.00382441 
0.0496025 0.130687 -0.0640679 -0.0398812 0.140054 0.0919458 0.091181 -0.122155 -0.089739 0.0867908 0.0153805 -0.0396914 0.0442082 0.0357592 0.107518 -0.0766265 -0.0043059 0.0637356 0.0303995 0.0951967 -0.0348732 0.00947309 0.078167 -0.00628662 0.0127954 -0.0111789 -0.145568 -0.0783278 0.185 0.0572765 0.0232129 0.0500751 -0.0841208 -0.0602866 0.0902035 0.0835625 -0.0223749 0.116674 0.0336223 -0.0420939 0.00177739 0.0486893 -0.105373 0.0472183 -0.223757 0.157195 0.0918289 0.122617 -0.0384401 0.00080218 -0.0975144 0.186014 -0.0528771 -0.0481614 0.042727 -0.0378177 0.0332684 0.151027 -0.0362072 -0.0267081 -0.105159 0.0434076 0.208055 -0.0799602 0.0530866 -0.0108496 0.0496142 0.0423485 -0.0435521 0.125943 0.0867288 0.166242 -0.00708187 0.122959 0.00277874 -0.053022 -0.0934253 0.0475431 0.0792918 -0.0573448 0.0116943 0.125292 -0.0628518 -0.0166555 0.0754225 -0.0986222 -0.0343007 0.0551585 0.0439373 0.0150578 0.166327 0.031614 0.0216958 -0.0688362 0.0358885 -0.242347 0.0552463 0.119453 0.0611007 -0.0840079 -0.0109987 0.0796574 0.0576928 -0.00597188 -0.198591 0.119526 0.0185292 0.0379614 0.264187 0.0865744 0.127116 0.105257 -0.0631257 0.0202626 0.0285861 0.025038 -0.00672812 -0.147373 0.0130928 0.073938 0.0267491 -0.0295824 0.00406844 0.0878325 -0.139503 0.0371786 0.0219086 0.0107102 
0.0668667 0.0912181 -0.0723282 -0.0463787 0.158227 0.11517 0.0884435 -0.0825566 -0.113742 0.0986386 0.00558098 0.0116787 0.0775565 -0.024755 0.0427489 -0.0695133 -0.0316961 0.133942 -0.0153802 0.135502 0.0365257 -0.0314997 0.108507 0.0482906 -0.00447435 -0.017757 -0.132667 -0.138424 0.162073 0.0698262 -0.0121553 0.0513686 -0.106928 -0.027772 0.0718806 0.0170087 -0.0668289 0.135924 0.00583086 -0.0609535 -0.00703162 0.0245451 -0.107561 0.104474 -0.24693 0.066827 0.112435 0.114058 -0.0605697 0.0468431 -0.0312064 0.121872 -0.0898247 -0.0348549 0.0489813 -0.0535006 0.0603158 0.151163 -0.00932829 -0.0883447 -0.0573271 0.0186978 0.220103 -0.0586775 0.055774 -0.0909011 0.0215977 0.0374084 -0.0459759 0.125731 0.0589381 0.174909 -0.00336436 0.103675 -0.0595932 -0.0712547 -0.092301 0.0714674 0.0954941 -0.0278296 -0.0200577 0.125202 -0.0511254 -0.0170597 0.0591352 -0.106106 0.0071645 0.0843202 0.0913316 -0.00347799 0.134312 0.00947391 -0.0041 -0.0794571 0.00416172 -0.24068 0.0336546 0.151568 0.0310353 -0.0863369 0.0263324 0.074979 0.0474384 0.0570095 -0.154856 0.0741865 -0.0250167 0.0716851 0.233556 0.0616607 0.100895 0.152427 -0.0726079 0.0288659 0.0277082 0.0389231 -0.0209534 -0.160969 0.00081493 0.0857383 -0.000787819 -0.007407 -0.00862995 0.0623824 -0.151707 0.0242762 -0.0135432 0.00151102 
