{
  "descriptor": [
    -0.07581443339586258,
    0.0415329672396183,
    0.1265779435634613,
    -0.057442016899585724,
    -0.11691725999116898,
    0.04794185608625412,
    -0.0895836129784584,
    -0.014978129416704178,
    0.13692286610603333,
    -0.15410372614860535,
    0.17371611297130585,
    -0.02613982930779457,
    -0.23103363811969757,
    0.10850708186626434,
    -0.04750445857644081,
    0.17801527678966522,
    -0.15390227735042572,
    -0.20169763267040253,
    -0.051112107932567596,
    -0.06370784342288971,
    0.020944122225046158,
    0.10380090028047562,
    -0.007939393632113934,
    0.08978818356990814,
    -0.16708531975746155,
    -0.37025541067123413,
    -0.08676670491695404,
    -0.06334665417671204,
    0.08380696922540665,
    -0.11537095159292221,
    -0.09087055176496506,
    0.05789768323302269,
    -0.1400497406721115,
    0.054436102509498596,
    0.11356945335865021,
    0.09763976186513901,
    -0.054646752774715424,
    -0.18710288405418396,
    0.2339671403169632,
    0.1169634684920311,
    -0.26912203431129456,
    0.025005321949720383,
    0.06215418502688408,
    0.2593843340873718,
    0.148056760430336,
    -0.0153016597032547,
    0.07346946746110916,
    -0.09116820991039276,
    0.16736802458763123,
    -0.2702717185020447,
    0.03995193541049957,
    0.22876960039138794,
    0.06665851175785065,
    0.09832606464624405,
    0.04858865588903427,
    -0.15065418183803558,
    0.01303870603442192,
    0.13939982652664185,
    -0.15947569906711578,
    0.09896542876958847,
    0.05944930389523506,
    -0.09223049134016037,
    0.013718140311539173,
    -0.050964973866939545,
    0.15776140987873077,
    0.0964074358344078,
    -0.1339721977710724,
    -0.17696520686149597,
    0.23114587366580963,
    -0.13654103875160217,
    -0.07293466478586197,
    0.09145557135343552,
    -0.13792580366134644,
    -0.19380077719688416,
    -0.16625036299228668,
    0.045316390693187714,
    0.39338991045951843,
    0.1343727856874466,
    -0.11980782449245453,
    0.12293721735477448,
    -0.0016454168362542987,
    -0.03504839166998863,
    -0.01404525339603424,
    0.2172340601682663,
    -0.09013653546571732,
    0.05416366830468178,
    -0.019801320508122444,
    0.060639310628175735,
    0.28039810061454773,
    0.028264502063393593,
    0.014270245097577572,
    0.2221367359161377,
    0.0012508673826232553,
    0.03923420608043671,
    0.11566853523254395,
    0.11077814549207687,
    -0.14373807609081268,
    -0.09319720417261124,
    -0.15443682670593262,
    -0.05026222765445709,
    -0.031760867685079575,
    -0.05409763753414154,
    -0.02714638039469719,
    0.12538228929042816,
    -0.1836853176355362,
    0.17990374565124512,
    -0.07410427182912827,
    -0.09176328778266907,
    -0.03463318571448326,
    0.03504526987671852,
    -0.05441819131374359,
    -0.019316615536808968,
    0.11089670658111572,
    -0.23999696969985962,
    0.13570636510849,
    0.17568439245224,
    0.11073937267065048,
    0.13459409773349762,
    0.11538639664649963,
    0.0345272496342659,
    0.05964318662881851,
    -0.06397178024053574,
    -0.15999144315719604,
    -0.12759274244308472,
    0.06148994714021683,
    -0.029656851664185524,
    -0.015482975170016289,
    -0.021139349788427353
  ]
}