0.00634177 -0.076606 0.0285937 -0.00318865 -0.000900981 0.0685873 0.0906104 0.0971824 -0.0239444 0.0414378 0.0262542 0.029002 0.198517 -0.10142 -0.0629233 -0.0427729 -0.147652 0.105283 -0.182623 0.154759 0.209611 -0.198107 0.0319784 0.22427 -0.0824867 -0.0859157 -0.146642 -0.216494 0.00265147 0.0706946 -0.0343122 0.0220206 -0.058323 0.105728 -0.0559234 -0.0235738 -0.12322 0.0993214 -0.135859 -0.0599732 0.0084842 -0.140399 -0.090479 0.0803666 -0.0545214 -0.165017 0.0506081 0.0585211 -0.0599172 0.0461601 0.0124889 -0.169702 -0.0378115 0.00676699 0.0847666 0.0526081 -0.024134 0.0569844 0.0434317 -0.125755 0.0329592 0.0196851 0.0519158 0.0218398 0.00581571 -0.0620468 -0.00767303 -0.0340231 -0.0606342 -0.0697914 -0.088227 0.0189264 -0.0386472 -0.0209048 -0.0324992 -0.00683745 0.0145853 0.0679298 0.107346 0.0941305 -0.0541298 -0.100152 -0.0569753 -0.0490867 -0.085329 0.0905243 0.118863 0.0379492 0.073949 0.00213756 0.0579556 -0.107728 0.0226314 -0.029684 -0.178836 0.00231551 -0.126393 0.0336964 0.0586295 0.024985 0.158315 -0.0101602 -0.0480938 0.0832382 0.0682926 -0.00496917 -0.105891 0.0998458 0.00125593 -0.0605144 -0.0963425 0.140652 -0.0881862 -0.0959409 0.0143145 0.160811 -0.0255099 -0.0116233 -0.0485142 0.128688 -0.0598457 -0.0337652 -0.0930921 0.0760066 -0.137634 0.0903338 -0.111399 -0.0173904 
0.00518239 -0.0666905 0.0214528 -0.0107519 0.0188973 0.0750891 0.0850702 0.0798702 -0.0294999 0.0154015 0.0135664 0.0451229 0.17873 -0.116217 -0.0733464 -0.0352157 -0.157663 0.11452 -0.185906 0.148119 0.214698 -0.177538 0.0442696 0.225462 -0.0830908 -0.0953829 -0.12707 -0.227198 -0.0126365 0.0794383 -0.0464209 0.00420141 -0.0494929 0.111742 -0.0396991 -0.0300423 -0.10621 0.0783772 -0.144033 -0.0536379 0.017356 -0.130361 -0.0560207 0.090378 -0.0670758 -0.136568 0.0825303 0.0478247 -0.0835342 0.0630677 0.019835 -0.204761 -0.0365787 0.0152065 0.0934375 0.060907 -0.0141503 0.064335 0.0359314 -0.121213 0.042693 0.0335513 0.0597578 0.0152991 0.0300651 -0.0857335 -0.028952 -0.0408249 -0.0655814 -0.0524045 -0.0875059 0.0128998 -0.0373484 -0.0368227 -0.0258582 0.0171118 0.00280681 0.0753605 0.0954147 0.0674574 -0.0509217 -0.075363 -0.0622261 -0.034267 -0.106686 0.106986 0.111804 0.0276957 0.0423362 0.0222839 0.0624424 -0.125411 0.00399822 -0.0483939 -0.170195 0.0224046 -0.135338 0.0498214 0.0601184 0.0332231 0.148724 -0.0171681 -0.0432253 0.0842252 0.0640345 -0.0186079 -0.118341 0.109656 -0.0413996 -0.0584187 -0.0824515 0.127011 -0.070261 -0.0926123 -0.00430371 0.16564 -0.0374011 -0.0127877 -0.0569693 0.13225 -0.0472124 -0.0221063 -0.0947354 0.0663771 -0.134017 0.0911734 -0.122622 -0.0322028 
0.0120445 -0.0657896 0.0156206 -0.00819194 0.0173722 0.0774535 0.0832679 0.0832578 -0.0276416 0.0215315 0.0180654 0.0385932 0.179866 -0.111925 -0.0761408 -0.0435359 -0.139618 0.121661 -0.185831 0.158179 0.21377 -0.186787 0.0403191 0.23284 -0.0802161 -0.0863832 -0.126405 -0.22552 -0.00473818 0.0708887 -0.0427132 0.0153767 -0.0485004 0.116047 -0.0355391 -0.0276325 -0.102098 0.0994673 -0.148751 -0.0797284 0.0158989 -0.131189 -0.0649757 0.0968226 -0.0674925 -0.139166 0.0818601 0.0565159 -0.094119 0.0579293 0.0111427 -0.193015 -0.0323652 0.00842662 0.1015 0.059525 -0.026017 0.0667285 0.0385792 -0.147488 0.0390658 0.0279991 0.0717247 0.00915135 0.0282048 -0.0671899 -0.0275772 -0.0332295 -0.0673185 -0.04554 -0.0929819 0.00256675 -0.0401159 -0.0342588 -0.0320677 -0.00105642 0.00833174 0.0834857 0.104877 0.0584508 -0.0647264 -0.0626661 -0.0735511 -0.0628959 -0.0911546 0.0872112 0.107758 0.0392772 0.0653983 0.0311271 0.0776553 -0.124995 0.0043201 -0.0496492 -0.158837 0.019524 -0.121669 0.0486415 0.0564338 0.0191505 0.153155 -0.0141543 -0.0444079 0.0806437 0.0508463 -0.0110946 -0.116904 0.0983571 -0.0259661 -0.0648123 -0.0740096 0.147261 -0.0764537 -0.0896959 0.0158327 0.146711 -0.0437814 -0.0399764 -0.0423848 0.12611 -0.0471723 -0.0170001 -0.0832636 0.0761028 -0.129937 0.0835161 -0.105967 -0.0439614 
0.01349 -0.0593633 0.0025234 0.00253696 0.0279203 0.0702526 0.0884402 0.061936 -0.0129163 0.0107329 0.0227652 0.048071 0.168718 -0.129534 -0.0885949 -0.0340343 -0.152524 0.127383 -0.189988 0.15788 0.216299 -0.18024 0.0456967 0.227366 -0.0800632 -0.103837 -0.125195 -0.234052 -0.0108746 0.0930779 -0.0502777 0.0138908 -0.0446211 0.114566 -0.0255902 -0.0354407 -0.0940863 0.0815729 -0.142183 -0.0731695 0.0156497 -0.132448 -0.0524826 0.0943428 -0.0703326 -0.132582 0.0825843 0.0554464 -0.0814154 0.0693074 0.0129548 -0.194316 -0.0326134 0.0110643 0.0959644 0.0575581 -0.0153492 0.0534207 0.0248729 -0.119642 0.0425607 0.0248372 0.0742643 0.00668211 0.0315806 -0.0952643 -0.0342858 -0.0483723 -0.0674934 -0.0474849 -0.0937383 0.00420349 -0.0420408 -0.0354698 -0.0373357 0.00883888 0.0115889 0.0826504 0.0868208 0.0623806 -0.0549399 -0.0610913 -0.0754893 -0.0384403 -0.0986034 0.109586 0.0962133 0.0253259 0.0440602 0.0304614 0.0754827 -0.12935 -0.00339496 -0.0546223 -0.158362 0.0151174 -0.13782 0.0468969 0.0656547 0.0238675 0.157447 -0.020515 -0.0404301 0.0819055 0.0710132 -0.0221302 -0.102597 0.113649 -0.0353927 -0.0418353 -0.0806377 0.126419 -0.0655999 -0.0868673 -0.00360748 0.158044 -0.0365123 -0.0200419 -0.0476877 0.131254 -0.045982 -0.00754613 -0.0922189 0.0764403 -0.133143 0.0850491 -0.114726 -0.0415711 
0.00852519 -0.0622801 0.0119168 0.000281849 0.0234582 0.0822525 0.0842606 0.0710132 -0.0375825 0.0267885 0.0197403 0.0478773 0.17694 -0.122427 -0.0743218 -0.0197001 -0.149431 0.126407 -0.17363 0.148191 0.217669 -0.184129 0.0486295 0.218927 -0.0758422 -0.0982507 -0.127588 -0.23581 -0.0132762 0.0892266 -0.0512439 0.0132116 -0.044289 0.11097 -0.0335713 -0.0314282 -0.0984444 0.0681718 -0.129117 -0.061684 0.0121667 -0.137152 -0.0409618 0.0825172 -0.0704464 -0.136802 0.093125 0.0417748 -0.0926993 0.0598101 0.0317394 -0.210022 -0.0348922 0.0176146 0.091539 0.0647154 -0.00239405 0.0542345 0.0356511 -0.112963 0.0424781 0.0305995 0.0615976 -0.00487828 0.0459081 -0.0826991 -0.0417637 -0.0452016 -0.0736975 -0.0506053 -0.0925792 0.0177206 -0.0487217 -0.0445895 -0.0270337 0.0214385 0.0136177 0.0828294 0.0890568 0.0602474 -0.0551268 -0.0769532 -0.0618862 -0.0270219 -0.111081 0.118651 0.101963 0.0207594 0.038847 0.0245773 0.0570841 -0.125167 -0.00515568 -0.0410831 -0.166254 0.0263594 -0.138006 0.061926 0.0589085 0.0370202 0.152219 -0.0202523 -0.0433372 0.0855752 0.0777661 -0.0155231 -0.105948 0.109692 -0.0459752 -0.057135 -0.101207 0.11682 -0.0541446 -0.097337 0.000173947 0.161029 -0.0375821 -0.00614537 -0.0587444 0.134936 -0.0440059 -0.0287035 -0.0879881 0.0626275 -0.128039 0.0986607 -0.11683 -0.0308566 
0.0200002 -0.0532232 -0.00821169 -0.00115164 0.034924 0.0800218 0.0801828 0.0630396 -0.0323323 0.0213452 0.0251965 0.048181 0.174451 -0.134998 -0.0802053 -0.0207448 -0.142638 0.135281 -0.18009 0.154331 0.217419 -0.171606 0.060044 0.220066 -0.0790644 -0.106689 -0.117945 -0.244539 -0.0116272 0.0983218 -0.0545611 0.00901399 -0.0396112 0.112578 -0.0237787 -0.0378659 -0.0923804 0.0687434 -0.131081 -0.0636943 0.00499994 -0.132055 -0.0467492 0.0987616 -0.0812315 -0.126038 0.0938902 0.0527122 -0.0916056 0.0732278 0.0306207 -0.201001 -0.0369058 0.0126386 0.0809684 0.0568455 0.00222564 0.0493566 0.0345182 -0.111696 0.0406291 0.0248209 0.0722197 -0.00296373 0.0390066 -0.111209 -0.0424543 -0.0440913 -0.0679394 -0.048565 -0.0926786 0.00958599 -0.0479478 -0.0513764 -0.0400531 0.014838 0.0062825 0.0867092 0.081357 0.066796 -0.0519395 -0.0671808 -0.0725783 -0.0275002 -0.105196 0.119651 0.0917222 0.0113547 0.0352011 0.0290368 0.0628666 -0.12764 -0.0171806 -0.0488171 -0.158055 0.0157548 -0.141756 0.0627194 0.054654 0.0238485 0.155585 -0.0159586 -0.0364874 0.0886602 0.073343 -0.0268324 -0.102971 0.116496 -0.0393927 -0.042396 -0.086203 0.117024 -0.0537852 -0.0871917 -0.0109542 0.161243 -0.0424909 -0.0169102 -0.0567035 0.133788 -0.0451019 -0.0172883 -0.0919209 0.0726052 -0.128016 0.0827163 -0.118467 -0.0374576 
0.0150389 -0.0607655 0.0121456 -0.0111902 0.0120767 0.08521 0.0932233 0.0878951 -0.0303657 0.0286848 0.0313029 0.0386631 0.183989 -0.124208 -0.0609057 -0.048276 -0.148015 0.119908 -0.182739 0.132973 0.20068 -0.163016 0.0318802 0.241163 -0.0821489 -0.109093 -0.118492 -0.223282 -0.0026079 0.0813933 -0.0413536 -0.000270758 -0.0612424 0.114034 -0.0487914 -0.0331143 -0.113844 0.0458936 -0.140967 -0.0326963 0.0239601 -0.142355 -0.0748257 0.101263 -0.0706853 -0.143426 0.066699 0.0598671 -0.0810135 0.0553525 0.0256939 -0.189343 -0.0387704 0.00069158 0.0628405 0.0698832 -0.0205434 0.0722189 0.0466732 -0.0999864 0.0324684 0.0394736 0.0576587 0.0133023 0.00767341 -0.0929253 -0.0119118 -0.051896 -0.066305 -0.057904 -0.0942909 0.0106555 -0.0391826 -0.038376 -0.0287047 0.00828545 0.000347792 0.0772265 0.0876704 0.0780268 -0.0483318 -0.0843628 -0.0589264 -0.0356262 -0.103586 0.121362 0.11496 -0.00232516 0.0270532 0.0202197 0.0636987 -0.121715 0.0019866 -0.0458362 -0.173172 0.0142261 -0.143373 0.0313183 0.0630566 0.0281752 0.152147 -0.00867999 -0.0343675 0.0905453 0.0633026 -0.0225836 -0.114041 0.110847 -0.0487406 -0.0489531 -0.068602 0.119253 -0.0627185 -0.101274 -0.01934 0.164035 -0.0347146 -0.00984899 -0.0495029 0.129616 -0.0421173 -0.0455299 -0.111252 0.0783657 -0.139693 0.0851653 -0.140339 -0.0294397 
0.0198623 -0.0473272 -0.00571093 -0.00432648 0.0271241 0.0796128 0.10317 0.0695214 -0.0167154 0.0375867 0.0417305 0.040395 0.185016 -0.129929 -0.0805064 -0.0349828 -0.143863 0.129601 -0.191183 0.147512 0.215897 -0.173954 0.0248122 0.23273 -0.0777788 -0.104136 -0.126779 -0.223582 0.0171707 0.102716 -0.0452225 0.018205 -0.0608224 0.111966 -0.0315221 -0.0397489 -0.107011 0.064564 -0.126257 -0.0664729 0.0116958 -0.141755 -0.0665589 0.10388 -0.065998 -0.144518 0.0669336 0.07357 -0.0801819 0.046784 0.0172389 -0.171576 -0.0419688 -0.00730441 0.0748981 0.0637759 -0.0325651 0.0671682 0.0274967 -0.110024 0.0314879 0.0159828 0.0850816 0.00979118 0.0134918 -0.0874234 -0.026358 -0.0472775 -0.0682364 -0.0603117 -0.0935554 0.012417 -0.046502 -0.0408808 -0.0446618 0.00187374 0.0150227 0.0860943 0.0877255 0.0749974 -0.0425925 -0.0730803 -0.0663724 -0.0354203 -0.0912701 0.105297 0.103068 0.0144205 0.0538276 0.0270004 0.073234 -0.124991 -0.0114255 -0.0366532 -0.162887 0.00275967 -0.139207 0.0311937 0.0648324 0.0185747 0.16825 -0.0113257 -0.039157 0.0847353 0.0592827 -0.0128558 -0.0984934 0.113011 -0.0193143 -0.0415069 -0.0701166 0.12585 -0.0736529 -0.0866421 0.00119197 0.157825 -0.0426311 -0.00699288 -0.0482413 0.127224 -0.0472071 -0.0292376 -0.0972904 0.0854429 -0.141159 0.0899785 -0.125234 -0.0418309 
0.0179398 -0.0441805 -0.0272687 0.00315816 0.0100361 0.0518528 0.0850092 0.0670224 -0.00657273 0.012717 0.0344927 0.0425338 0.163478 -0.164553 -0.108662 -0.0280428 -0.16511 0.110695 -0.186501 0.164742 0.204629 -0.173152 0.053941 0.207172 -0.0962246 -0.10216 -0.106309 -0.243068 0.00111284 0.0975799 -0.0704227 0.00753955 -0.0351039 0.106933 -0.0321619 -0.0554636 -0.0947946 0.0829076 -0.14507 -0.0620519 -0.00442783 -0.151946 -0.0675411 0.113666 -0.0682371 -0.118228 0.0791997 0.0600115 -0.0811951 0.0849328 0.00655481 -0.169427 -0.0364973 0.0069949 0.0709233 0.0433898 -0.00553674 0.0258617 0.0224914 -0.101757 0.0443852 0.00905256 0.0876936 0.0306319 0.0145442 -0.130474 -0.028515 -0.065561 -0.0485523 -0.0672909 -0.112328 -0.0142456 -0.0436019 -0.0211168 -0.0410913 -0.00462227 0.0117077 0.0844173 0.0718241 0.0869094 -0.0426562 -0.0834222 -0.0932811 -0.0327306 -0.0873694 0.123011 0.0756347 0.0092115 0.04596 0.0260615 0.0749092 -0.12095 -0.0263253 -0.0489128 -0.151888 0.00706013 -0.137546 0.0361802 0.0759482 0.0100842 0.159181 -0.0194625 -0.0347786 0.0820844 0.0756957 -0.0387002 -0.0826051 0.141539 -0.0272089 -0.028231 -0.0712789 0.126541 -0.0597282 -0.0913996 -0.0207611 0.158786 -0.0288 -0.0133943 -0.0316881 0.121442 -0.0617067 -0.00150606 -0.0923491 0.0884296 -0.126323 0.0672467 -0.116111 -0.0451417 
0.00608872 -0.0431341 -0.0063752 0.00795117 -0.000443532 0.0444727 0.0766374 0.070375 -0.0115397 0.0256911 0.0487978 0.0530273 0.169726 -0.146451 -0.114012 -0.0450996 -0.168167 0.110803 -0.189129 0.182881 0.199906 -0.200847 0.052313 0.205384 -0.0861113 -0.0944564 -0.107122 -0.211446 0.00399165 0.0867304 -0.0712118 -0.00486829 -0.0251057 0.108526 -0.0535085 -0.0485896 -0.119138 0.100081 -0.149455 -0.069861 -0.00809094 -0.160354 -0.0738629 0.106654 -0.0720229 -0.146299 0.06848 0.0553483 -0.0777323 0.0948883 0.00631474 -0.143854 -0.0550614 0.00903824 0.0806546 0.041878 -0.0278861 0.0285289 0.015287 -0.108217 0.0353062 -0.000284142 0.0947173 0.0437551 0.00831655 -0.104555 -0.0310082 -0.0602648 -0.067366 -0.0519026 -0.0983212 -0.0104949 -0.0391432 -0.0031935 -0.0298115 -0.0125769 0.0238712 0.069706 0.0824284 0.0892631 -0.0701366 -0.100975 -0.0710205 -0.0308993 -0.0894158 0.106642 0.0821213 0.0295334 0.0854964 0.0249833 0.0624101 -0.128816 -0.00506814 -0.0330329 -0.153379 -0.0199997 -0.141089 0.0343431 0.0704886 -0.0020646 0.15272 -0.0060858 -0.0385687 0.0762153 0.0853677 -0.00594368 -0.0760938 0.139762 4.99599e-05 -0.0560144 -0.0800471 0.140291 -0.0681214 -0.0683967 -0.00368463 0.146548 -0.0110203 -0.00544183 -0.00618568 0.138193 -0.0671302 -0.0153792 -0.101025 0.0805806 -0.119462 0.0807378 -0.0805425 -0.024277 
0.0165634 -0.0533758 -0.0336765 -0.00142152 0.012527 0.0365698 0.0726571 0.0693634 -0.0238005 0.0324662 0.0291871 0.0506123 0.172895 -0.150254 -0.115792 -0.0250815 -0.152491 0.118131 -0.183102 0.184833 0.193147 -0.188098 0.0774621 0.192894 -0.108549 -0.0829107 -0.100375 -0.239823 -0.00448965 0.0862342 -0.0883065 0.01639 -0.0247373 0.0998446 -0.0462153 -0.0585526 -0.105955 0.116516 -0.152085 -0.0672939 -0.0239266 -0.143117 -0.0836929 0.110831 -0.0826985 -0.114945 0.0756523 0.059667 -0.0771951 0.0939735 0.0178929 -0.162663 -0.0473967 0.0109051 0.0717564 0.0283501 0.00908475 0.0180077 0.0343273 -0.107375 0.0503151 0.000307889 0.0867213 0.0439759 0.0194203 -0.137616 -0.0362694 -0.0437039 -0.0427743 -0.0636923 -0.105776 -0.0121465 -0.0337197 -0.0138072 -0.0498447 -0.00559413 0.0104041 0.0806671 0.0772205 0.0779231 -0.0535013 -0.0898594 -0.0969396 -0.0377334 -0.086412 0.102543 0.0771397 0.027041 0.0732891 0.0149934 0.0579608 -0.110639 -0.017932 -0.0442306 -0.144319 -0.00112471 -0.12812 0.0439739 0.0696407 -0.00136741 0.16017 -0.0140464 -0.0354158 0.0865263 0.080425 -0.0425333 -0.090008 0.135431 -0.00512558 -0.0377278 -0.0749472 0.146462 -0.0541598 -0.0785806 -0.0183377 0.151015 -0.0308719 -0.0236715 -0.0292357 0.117613 -0.0766461 0.00338209 -0.0884871 0.0813115 -0.121873 0.0633045 -0.114894 -0.0439119 
0.0161558 -0.0652955 -0.0150224 0.00105994 0.011961 0.0542249 0.0912349 0.0697512 -0.0223272 -0.0225486 0.0049682 0.0415392 0.157617 -0.152433 -0.0950437 -0.0503342 -0.178355 0.0815163 -0.169913 0.168914 0.193719 -0.172466 0.0655085 0.203305 -0.089121 -0.101241 -0.110298 -0.248795 -0.0038507 0.0862309 -0.0625206 0.00183929 -0.0446732 0.0912902 -0.0285723 -0.0533874 -0.101403 0.0971128 -0.158989 -0.0649705 0.0143741 -0.140576 -0.0769539 0.116088 -0.0830097 -0.0976455 0.0790216 0.0537563 -0.0745288 0.0818783 -0.014828 -0.174303 0.000141244 0.00487739 0.0840367 0.0339545 -0.00213933 0.0455385 0.0278592 -0.120315 0.0423995 0.0315513 0.0838516 0.0366788 0.0162281 -0.109969 -0.0117609 -0.071352 -0.0464479 -0.0795175 -0.112243 -0.00996548 -0.0321089 -0.0141751 -0.0265134 0.00404323 -0.00702984 0.0537899 0.0892746 0.115304 -0.0388035 -0.0913708 -0.0932581 -0.0475622 -0.0742207 0.105451 0.0794512 0.0262849 0.0274822 0.0139068 0.0931549 -0.106268 -0.0111141 -0.0544429 -0.163522 -0.0020582 -0.114515 0.0473435 0.0861559 0.00563518 0.152245 -0.0184126 -0.0292677 0.0798149 0.0470881 -0.0371393 -0.0864623 0.151938 -0.022265 -0.0293807 -0.0457596 0.13372 -0.0753025 -0.103851 -0.0298754 0.173074 -0.0464423 -0.0143405 -0.0334117 0.125902 -0.0691557 -0.0061056 -0.102605 0.0754688 -0.13195 0.0721912 -0.123011 -0.0432689 
0.0144515 -0.0599054 -0.00824835 -0.0104504 0.0152004 0.0605458 0.0926757 0.0721989 -0.0139068 -0.0303021 0.0037474 0.0367329 0.158885 -0.158081 -0.0738462 -0.0298793 -0.195436 0.0522938 -0.181054 0.152229 0.197897 -0.150891 0.0607977 0.179823 -0.0932558 -0.11315 -0.11826 -0.248226 -0.00515898 0.0984001 -0.0539557 0.00231274 -0.0497584 0.0897824 -0.0305531 -0.0453336 -0.101405 0.0740409 -0.150287 -0.035156 0.0163721 -0.147771 -0.0735459 0.107133 -0.0678855 -0.0787485 0.0700482 0.0511295 -0.0710345 0.0783373 -0.0134217 -0.17343 -0.00718781 0.0038147 0.0736199 0.0340277 -0.00832111 0.0426365 0.0172223 -0.0854741 0.033762 0.031016 0.0688109 0.0342285 0.0184758 -0.126113 -0.00910394 -0.0629992 -0.0436873 -0.0920455 -0.100797 -0.0021981 -0.0401935 -0.0347515 -0.0196626 0.0295661 -0.0120024 0.0450134 0.0765607 0.140823 -0.0102185 -0.11131 -0.0876978 -0.0193811 -0.0907432 0.128678 0.0846185 0.0080885 -0.00600524 0.0199192 0.0819677 -0.114245 -0.0295043 -0.036348 -0.185947 0.00980668 -0.122455 0.0281616 0.0934 0.0183846 0.151774 -0.02793 -0.0414895 0.0769911 0.0465124 -0.0392267 -0.0959 0.166169 -0.0327831 -0.0217021 -0.0525368 0.109249 -0.0852258 -0.108304 -0.0382196 0.195282 -0.0537985 0.0196949 -0.0513904 0.137713 -0.0620139 -0.00955412 -0.100554 0.0858122 -0.11856 0.0726686 -0.132254 -0.0382107 
0.01892 -0.0588012 -0.0129024 -0.0142197 -0.00108652 0.0677239 0.0792229 0.0909588 -0.0409814 0.00468648 0.018445 0.0349776 0.169454 -0.149843 -0.0846199 -0.0404492 -0.177525 0.0799907 -0.165949 0.163476 0.19304 -0.168765 0.0668588 0.203086 -0.0914044 -0.0965222 -0.0925976 -0.236557 -0.00198916 0.0791382 -0.0711704 -0.0209649 -0.0367097 0.10273 -0.0411437 -0.0510205 -0.107157 0.0871303 -0.156186 -0.0586947 -0.00556506 -0.15759 -0.0719494 0.121765 -0.0780458 -0.109346 0.0806326 0.0584735 -0.0929599 0.096904 0.0035588 -0.176577 -0.0216251 0.00974175 0.0798157 0.0397053 -0.0108763 0.0443238 0.0325951 -0.120352 0.0372701 0.0273151 0.0875292 0.036361 0.0139067 -0.101948 -0.0252291 -0.0590792 -0.0548602 -0.0751173 -0.114734 -0.0100422 -0.0417494 -0.0231036 -0.0171815 0.00179213 0.00506411 0.0558899 0.0989602 0.114779 -0.0347984 -0.116486 -0.0817914 -0.0443241 -0.0881125 0.107674 0.078196 0.0187334 0.0526423 0.0320375 0.0818835 -0.115819 -0.0220622 -0.0347713 -0.16631 0.00951026 -0.12078 0.0500583 0.0765769 0.00304858 0.158328 -0.00836165 -0.0342602 0.0663776 0.0482275 -0.027187 -0.097807 0.140661 -0.0279937 -0.0497571 -0.0465751 0.142783 -0.0582434 -0.0988333 -0.0180963 0.169132 -0.0339386 -0.00213837 -0.0295259 0.131864 -0.0628187 -0.0343235 -0.0886334 0.0730789 -0.124203 0.0762893 -0.10479 -0.0385826 
0.00507797 -0.0599709 0.006424 -0.020599 -0.0067049 0.0640515 0.0693752 0.100216 -0.0394252 -0.011876 0.0178024 0.0253488 0.165967 -0.142275 -0.0816001 -0.0509477 -0.196431 0.0762509 -0.169529 0.160852 0.197798 -0.173909 0.0670974 0.198336 -0.0835471 -0.103803 -0.0992404 -0.222489 0.00877578 0.0607576 -0.0535928 -0.0379605 -0.0453824 0.0914583 -0.0461431 -0.0411529 -0.130642 0.0762225 -0.158597 -0.0458458 0.00593167 -0.153253 -0.0838579 0.128599 -0.0772433 -0.120388 0.0728811 0.0584164 -0.0888745 0.0938947 -0.0208545 -0.166564 -0.0238381 0.00345629 0.0631824 0.0370981 -0.0134043 0.0517933 0.0340138 -0.125755 0.0349257 0.04113 0.0882099 0.0578504 -0.00297348 -0.0916259 -0.0135698 -0.0673239 -0.0461183 -0.0708789 -0.105948 -0.00337273 -0.0280732 -0.0165394 -0.01197 -0.0113853 -0.0115808 0.0474408 0.0977268 0.123962 -0.0361814 -0.117487 -0.0769276 -0.0433061 -0.0903622 0.119188 0.0824545 0.0259984 0.0482888 0.0157453 0.0925605 -0.104636 -0.0153567 -0.0426575 -0.165893 -0.0076108 -0.129871 0.0576223 0.0673643 0.00121583 0.14452 -0.0160728 -0.0296522 0.0592952 0.0498759 -0.00827724 -0.0886177 0.150982 -0.0133529 -0.055194 -0.0471825 0.138364 -0.0718637 -0.0979976 -0.020892 0.171634 -0.0266626 0.00404733 -0.0156172 0.130625 -0.0677446 -0.0390136 -0.105168 0.0712718 -0.140911 0.07404 -0.105573 -0.0177008 
0.0226725 -0.0754754 -0.0125529 -0.017814 0.00469991 0.0709059 0.0841711 0.0838486 -0.0453572 -0.00469093 0.0133618 0.0316381 0.172683 -0.132891 -0.0854166 -0.0524827 -0.171988 0.0908934 -0.165558 0.15826 0.190803 -0.160938 0.0574735 0.213942 -0.095392 -0.0929444 -0.104913 -0.235662 0.000369481 0.0729999 -0.0651712 -0.0152837 -0.0642467 0.0923561 -0.0410926 -0.0417199 -0.120788 0.0751218 -0.151782 -0.0471537 0.00475486 -0.13598 -0.08851 0.123126 -0.0790202 -0.114759 0.0725197 0.06622 -0.0784857 0.0812691 -0.00927598 -0.178677 -0.0125841 0.00788771 0.0680885 0.0358178 -0.001905 0.0647299 0.0440616 -0.122743 0.0455343 0.0512108 0.0885689 0.0466965 -0.0060204 -0.0990814 -0.00193735 -0.0575826 -0.0363886 -0.0803298 -0.106218 0.000677491 -0.0222443 -0.0156655 -0.0278241 -0.00443179 -0.0149607 0.0506904 0.0982819 0.108581 -0.0235345 -0.0928185 -0.0851071 -0.0557391 -0.0889571 0.112501 0.0906633 0.0187416 0.0350488 0.00943426 0.0963264 -0.0983104 -0.0040128 -0.0476745 -0.167768 -0.00020342 -0.12006 0.0482313 0.0763126 0.0060988 0.157855 -0.00920254 -0.0261266 0.0724401 0.0409335 -0.0278327 -0.101957 0.135971 -0.0336889 -0.0342862 -0.0327587 0.139596 -0.0628523 -0.103775 -0.0335236 0.17644 -0.0429726 -0.00953425 -0.0421561 0.109145 -0.0706501 -0.0394123 -0.0955721 0.067317 -0.154332 0.0775954 -0.140124 -0.0348796 
0.0167455 -0.067276 -0.000558086 -0.0199628 -0.00602099 0.0795211 0.0883594 0.0991915 -0.0421331 -0.00292442 0.0173998 0.0237297 0.174114 -0.140187 -0.0714991 -0.0480498 -0.182995 0.072995 -0.168314 0.147424 0.191772 -0.163618 0.0510329 0.207166 -0.0915065 -0.100801 -0.10763 -0.230966 0.000219156 0.0649979 -0.0542533 -0.0226653 -0.062204 0.0986994 -0.0497511 -0.0393307 -0.116959 0.0634115 -0.150031 -0.0343207 0.0150559 -0.150869 -0.0818343 0.117212 -0.0718135 -0.121233 0.0698742 0.0586277 -0.0841044 0.0797275 -0.00867514 -0.185792 -0.0227655 0.00982837 0.0636975 0.0441605 -0.0149772 0.0631962 0.0411682 -0.113074 0.0360931 0.0484008 0.0787838 0.035601 0.00121951 -0.0881104 -0.00232818 -0.0646215 -0.04384 -0.0837598 -0.108999 0.00412655 -0.0278704 -0.017074 -0.0117645 -0.00118491 -0.00714163 0.0529188 0.0960759 0.114548 -0.0249652 -0.113749 -0.0740785 -0.0462159 -0.0972155 0.126779 0.0955385 0.0107047 0.0292818 0.0129002 0.0919814 -0.1099 -0.0102952 -0.0428508 -0.175132 0.00769774 -0.12342 0.0415245 0.0734272 0.0188611 0.148431 -0.013882 -0.0312425 0.0711265 0.0464281 -0.0184803 -0.101333 0.142768 -0.0432197 -0.0468578 -0.0460547 0.131911 -0.06198 -0.109018 -0.0267972 0.174138 -0.0357065 0.00652831 -0.0376165 0.120083 -0.0622684 -0.0481346 -0.0954178 0.0752138 -0.140758 0.0779577 -0.133887 -0.0283346 
0.0199348 -0.0683332 -0.00664519 -0.00345389 -0.00406795 0.058544 0.0819002 0.0903133 -0.0337324 -0.000380293 0.0210072 0.0489169 0.168532 -0.15257 -0.0927687 -0.0469552 -0.171995 0.0807552 -0.174377 0.17974 0.191045 -0.175773 0.0669303 0.197214 -0.100155 -0.0803273 -0.100673 -0.240865 -0.0107571 0.0728882 -0.0754084 -0.00724195 -0.0313914 0.106432 -0.0453433 -0.0539573 -0.10682 0.11809 -0.160513 -0.064052 -0.00247022 -0.151084 -0.0839353 0.115225 -0.0844239 -0.121773 0.076335 0.0466234 -0.0823413 0.101869 0.00647457 -0.172143 -0.0284448 0.0193226 0.0906235 0.029684 -0.013337 0.0362559 0.0269155 -0.123971 0.038164 0.0098927 0.0873771 0.0354228 0.0219918 -0.111275 -0.0175661 -0.0577197 -0.0542854 -0.0724654 -0.107642 -0.0129798 -0.0318181 -0.0056825 -0.0253298 -0.00543051 0.00246503 0.0524552 0.0972928 0.11466 -0.0494657 -0.110163 -0.0767279 -0.0504029 -0.0821413 0.0887253 0.090012 0.0318015 0.0636865 0.0211508 0.0741766 -0.120481 -0.0123805 -0.0345998 -0.166207 -0.000630848 -0.109047 0.0394128 0.0726874 0.00168915 0.148923 -0.00193883 -0.0388442 0.0756517 0.0568005 -0.0312985 -0.092318 0.139224 -0.018609 -0.0531043 -0.0556394 0.150093 -0.0685313 -0.0914132 -0.0110892 0.158788 -0.0322045 -0.0184404 -0.0273073 0.130332 -0.0704542 -0.0156978 -0.085006 0.0739265 -0.105712 0.0709894 -0.0897592 -0.0382417 
0.016679 -0.0466291 -0.0308789 -0.00202246 0.00502852 0.0449594 0.0767457 0.0568394 -0.0217013 0.00425167 0.0171297 0.0420376 0.158176 -0.162302 -0.115937 -0.0246342 -0.179689 0.0980168 -0.176328 0.171957 0.193197 -0.169804 0.0819198 0.188977 -0.108686 -0.0858811 -0.0979962 -0.250452 -0.00164233 0.0912467 -0.0916598 0.00541872 -0.0300762 0.0968247 -0.0273999 -0.0632352 -0.0901617 0.1142 -0.149886 -0.0615303 -0.0176684 -0.146939 -0.072739 0.110309 -0.0822407 -0.0973612 0.0886536 0.0564855 -0.0826897 0.102646 0.00652692 -0.165333 -0.0255524 0.0229551 0.079618 0.0246757 0.0243864 0.0173071 0.0255926 -0.112476 0.0517926 0.0130935 0.0946767 0.042586 0.0235303 -0.13472 -0.0277503 -0.0623041 -0.0373225 -0.0662621 -0.119211 -0.0177604 -0.034024 -0.00196815 -0.0327794 -0.00503552 -0.000661808 0.0674068 0.0788076 0.0922145 -0.0297388 -0.0865831 -0.10002 -0.0389292 -0.0844659 0.108468 0.0658239 0.0212428 0.0469344 0.0239273 0.078854 -0.110849 -0.0202331 -0.0537384 -0.15306 0.000698604 -0.122632 0.0577081 0.0901543 0.00392952 0.162038 -0.0138681 -0.0313742 0.0828624 0.0740912 -0.0517769 -0.0836658 0.151903 -0.0191734 -0.0271027 -0.0597068 0.143026 -0.0529268 -0.0916594 -0.0278186 0.167456 -0.0333347 -0.0141945 -0.0334038 0.114579 -0.0695621 0.00320269 -0.0802083 0.0708797 -0.126459 0.0678078 -0.113383 -0.0441581 
0.0173832 -0.0457213 -0.0292051 0.00931186 0.00887531 0.0568528 0.0853851 0.0453734 -0.0226782 0.0125986 0.02797 0.0402008 0.160362 -0.15273 -0.106846 -0.0308979 -0.175308 0.113953 -0.171296 0.169911 0.197046 -0.179172 0.073453 0.198855 -0.0959961 -0.0884906 -0.114316 -0.253667 0.00188471 0.0949928 -0.0796599 0.0199974 -0.0415453 0.102447 -0.0233891 -0.0513406 -0.0882251 0.107404 -0.13673 -0.0701439 -0.00432389 -0.149945 -0.0709948 0.102926 -0.0885272 -0.110956 0.0906731 0.0612924 -0.0809548 0.0885139 0.00355278 -0.161316 -0.0267347 0.0219469 0.0857233 0.0333039 0.0215659 0.0261442 0.027415 -0.115267 0.0449209 0.0179102 0.0997656 0.025655 0.0247397 -0.11242 -0.0220683 -0.0637012 -0.0424292 -0.0526083 -0.117964 -0.00373849 -0.0373464 0.00457792 -0.0343768 -0.0155898 0.00205648 0.0728153 0.0788301 0.0803557 -0.0389766 -0.0732403 -0.0969314 -0.046098 -0.0855788 0.112184 0.0712862 0.0210749 0.0489017 0.0213285 0.0917034 -0.111712 -0.0083069 -0.0617138 -0.154833 -0.00961194 -0.127416 0.0627313 0.0913041 0.00658563 0.162215 -0.012747 -0.0252681 0.085281 0.0792535 -0.037578 -0.0793479 0.147538 -0.0152309 -0.0231225 -0.069397 0.142825 -0.0549406 -0.0964167 -0.0173938 0.16043 -0.0239438 -0.0240681 -0.0281152 0.115314 -0.0570832 -0.00514721 -0.0811765 0.0768093 -0.139147 0.0739323 -0.109262 -0.0351412 
0.0147819 -0.0595938 -0.0309591 0.0103913 0.0133932 0.0325903 0.0789629 0.044757 -0.0107953 0.00160334 0.0222729 0.0499841 0.155719 -0.151999 -0.128583 -0.0250901 -0.173148 0.108056 -0.181072 0.1839 0.201838 -0.187516 0.0772856 0.187544 -0.102471 -0.0787978 -0.107993 -0.24801 -0.00479334 0.0900444 -0.0888196 0.0192567 -0.0326507 0.0964736 -0.026832 -0.0573502 -0.0968123 0.127931 -0.145286 -0.079545 -0.0172064 -0.136699 -0.0768625 0.100825 -0.0771 -0.107273 0.0820022 0.0552284 -0.0702663 0.0924181 -0.00621977 -0.157732 -0.0273242 0.0227363 0.0896775 0.0193333 0.0211218 0.0189863 0.0147847 -0.113451 0.0596976 0.00788403 0.100783 0.0477616 0.0260671 -0.12691 -0.0308504 -0.051548 -0.0313342 -0.0586244 -0.111934 -0.011947 -0.0310421 0.00312546 -0.0436535 -0.0112423 0.0068412 0.0709547 0.0746056 0.0805556 -0.0442399 -0.0719382 -0.10322 -0.0455041 -0.0851671 0.100235 0.0700767 0.0379338 0.0566424 0.0126503 0.0848836 -0.105645 -0.00859784 -0.0540081 -0.1469 -0.00679166 -0.123786 0.0519475 0.0914689 0.00284868 0.161862 -0.0199223 -0.0343895 0.080733 0.0872926 -0.04465 -0.0753782 0.145678 -0.00497816 -0.0267559 -0.0722613 0.145865 -0.0594702 -0.0842836 -0.0126683 0.163163 -0.030179 -0.0220146 -0.02977 0.11217 -0.0773723 0.0174289 -0.0813467 0.0718446 -0.132529 0.072451 -0.108002 -0.0427745 
0.0255953 -0.0420565 -0.0133878 0.0211131 0.0616293 0.0747417 0.0842845 -0.00360627 -0.0167942 0.000508386 -0.000158267 0.0373235 0.150497 -0.133678 -0.109165 0.00137633 -0.152855 0.157577 -0.169767 0.149771 0.244943 -0.176429 0.0844284 0.183577 -0.0650774 -0.109906 -0.161037 -0.261559 -0.00385892 0.12886 -0.0531924 0.0500065 -0.0553641 0.101726 0.0419175 -0.0543737 -0.0650508 0.103989 -0.0819993 -0.114188 -0.0256923 -0.104799 -0.0245066 0.0638033 -0.0761036 -0.116299 0.0958999 0.0566464 -0.0705833 0.0766798 0.0120221 -0.181131 -0.00566607 0.0265654 0.0926894 0.0272027 0.0559197 0.0323108 -0.000637881 -0.126498 0.0664812 0.0299796 0.0911683 -0.017398 0.0627398 -0.104243 -0.0520329 -0.0456179 -0.0624648 -0.0301492 -0.0957694 0.0258736 -0.0523274 -0.0286223 -0.0810499 -0.00458096 0.013354 0.0578073 0.0830556 0.0605916 -0.0315912 -0.026521 -0.0927377 -0.028095 -0.0831623 0.0850427 0.0536175 0.0413124 0.0431586 0.0268878 0.0994916 -0.106225 -0.00219724 -0.0551083 -0.139136 -0.00454218 -0.137692 0.106321 0.0603236 0.0341393 0.185437 -0.0239124 -0.0479091 0.0859977 0.107287 -0.0383502 -0.0587616 0.113924 0.00538481 0.00569282 -0.102502 0.1106 -0.0610665 -0.0698372 0.00848904 0.172565 -0.0381717 -0.00295749 -0.0656696 0.117018 -0.0501899 0.0228454 -0.0654445 0.050582 -0.141215 0.0827218 -0.100474 -0.0474563 
0.0340107 -0.0548129 -0.0410623 0.00557795 0.0481617 0.0741276 0.0822527 0.0230639 -0.0285287 -0.0017052 0.00237534 0.0434521 0.151302 -0.149838 -0.101828 0.00393677 -0.158607 0.128632 -0.16488 0.1555 0.218221 -0.154391 0.0947374 0.187075 -0.0934402 -0.0945845 -0.118786 -0.279559 -0.0088072 0.114355 -0.07685 0.0343731 -0.0452993 0.0987286 0.0150696 -0.0523727 -0.0674898 0.103064 -0.113915 -0.0841579 -0.0214799 -0.11657 -0.0496688 0.0878535 -0.0878699 -0.0819898 0.104683 0.0579776 -0.088126 0.0860225 0.014471 -0.185758 -0.00498174 0.0257068 0.0903878 0.0260678 0.0576557 0.0350101 0.0142941 -0.112686 0.0575263 0.0288497 0.10092 -0.00440064 0.057437 -0.130813 -0.047226 -0.0375147 -0.0426305 -0.0439439 -0.109998 0.0086183 -0.0528435 -0.0310828 -0.0597242 0.00753579 0.000269889 0.0713606 0.0751416 0.0689519 -0.0190104 -0.0453088 -0.108684 -0.039517 -0.0910259 0.101437 0.0590197 0.0219592 0.0200847 0.0315656 0.0980286 -0.105095 -0.0273022 -0.055753 -0.141973 0.015938 -0.123344 0.0868541 0.0811911 0.0239185 0.178107 -0.026136 -0.040603 0.0828329 0.079186 -0.0567537 -0.0842871 0.123069 -0.0237008 -0.00402793 -0.0729239 0.127445 -0.0415084 -0.0939156 -0.00871847 0.180546 -0.0504961 -0.0198256 -0.0622289 0.11626 -0.0508588 0.0104303 -0.0605925 0.0615853 -0.135818 0.0777108 -0.118959 -0.0558382 
0.0135527 -0.029269 -0.0218592 -0.00948125 0.0470988 0.0624058 0.0575602 -0.00734347 -0.0296843 -0.00980553 -0.00842926 0.0435976 0.138426 -0.138916 -0.143918 0.0138563 -0.180436 0.134796 -0.173127 0.157592 0.230213 -0.159943 0.103491 0.174389 -0.100199 -0.0745694 -0.117608 -0.248327 0.0135096 0.111736 -0.0937268 0.0266456 -0.0441884 0.0873042 0.0237504 -0.061287 -0.0741307 0.130516 -0.103307 -0.0859187 -0.0455613 -0.10332 -0.0353303 0.0741225 -0.0771329 -0.0798428 0.118984 0.0543502 -0.10721 0.0976404 0.00584467 -0.168138 -0.0146165 0.0412068 0.0987898 0.0162861 0.0791334 0.0373266 -0.006469 -0.13283 0.0738868 0.0429776 0.123701 0.020729 0.0629382 -0.115398 -0.056692 -0.0386596 -0.0439264 -0.0160243 -0.103177 0.00410857 -0.0389779 -0.000203066 -0.0475654 -0.00143638 -0.00137398 0.0600163 0.0789053 0.038148 -0.00757329 -0.0177348 -0.104736 -0.0346667 -0.0945222 0.0879839 0.0412345 0.0494884 0.0414317 0.0428734 0.105152 -0.106321 -0.0148934 -0.0494713 -0.123118 0.0031979 -0.130523 0.119302 0.0850981 0.0266567 0.183008 -0.030148 -0.053684 0.0839108 0.0889784 -0.0413229 -0.0733052 0.126569 -0.00807179 -0.0176291 -0.0677228 0.142221 -0.0386069 -0.0639308 -0.0017787 0.177397 -0.0561708 -0.00583842 -0.0556224 0.10363 -0.0594329 0.0231846 -0.0463067 0.0244042 -0.147755 0.098437 -0.112102 -0.0574203 
0.0171229 -0.0438374 -0.0111011 -0.0119257 0.0496781 0.0742368 0.0664875 0.0100943 -0.0283952 -0.00460107 -0.00297171 0.0366805 0.148041 -0.128741 -0.112939 0.00136607 -0.176774 0.144667 -0.174158 0.139317 0.232637 -0.150274 0.102698 0.192252 -0.0945752 -0.0987219 -0.125785 -0.25273 0.00629155 0.111549 -0.0747026 0.0168627 -0.0500071 0.0955356 0.0194224 -0.0527634 -0.0809682 0.105466 -0.106106 -0.0713452 -0.0343425 -0.103248 -0.051182 0.0751622 -0.0821498 -0.0954096 0.0976443 0.0614988 -0.0893604 0.0919633 0.00853276 -0.177356 -0.0133798 0.032478 0.0818052 0.0296473 0.0752712 0.0468414 -0.000567709 -0.117265 0.0646757 0.0517373 0.106192 0.0152352 0.0506975 -0.117423 -0.0472859 -0.0360776 -0.0479495 -0.0174079 -0.0985301 0.0137257 -0.0427774 -0.0179031 -0.0544704 0.00329534 -0.00706324 0.0540544 0.0802554 0.049489 -0.0112436 -0.0303523 -0.0973875 -0.0306219 -0.100152 0.0984326 0.0574093 0.0338904 0.0242355 0.0364213 0.106233 -0.108118 -0.00611943 -0.0529992 -0.13479 0.00367007 -0.145888 0.106162 0.0792289 0.0388713 0.189714 -0.0281966 -0.0505366 0.0804009 0.0964243 -0.0448229 -0.0832843 0.111925 -0.0114656 -0.0141831 -0.0700265 0.130876 -0.038742 -0.0731107 -0.00642591 0.192551 -0.0459405 0.00142848 -0.0615061 0.116551 -0.0499342 0.0028729 -0.0717532 0.0356805 -0.155788 0.096453 -0.125326 -0.0449072 
0.0211994 -0.065111 -0.0288301 -0.0118046 0.0549127 0.0631309 0.0714632 0.0299788 -0.0339772 -0.00466858 -0.00451379 0.0403659 0.146972 -0.139127 -0.107751 0.0090231 -0.17363 0.120023 -0.168614 0.162628 0.220779 -0.162086 0.10144 0.1808 -0.0959772 -0.0815504 -0.11608 -0.264508 0.0109143 0.0901565 -0.079721 0.0220268 -0.0497002 0.0884552 0.00199454 -0.0452489 -0.0900194 0.110963 -0.12147 -0.0805109 -0.0208658 -0.108011 -0.0611913 0.0874553 -0.0837454 -0.074148 0.101666 0.0626169 -0.0943302 0.0801844 -0.0123106 -0.180682 -0.0132699 0.0221942 0.0894621 0.0202095 0.0598158 0.0487443 0.00388124 -0.112354 0.065261 0.0456298 0.10981 0.0288383 0.053037 -0.114244 -0.0526328 -0.025981 -0.0275831 -0.0375389 -0.105067 0.0174921 -0.0421735 -0.0206343 -0.0460503 0.00485124 -0.00724486 0.0734309 0.0796825 0.0542656 -0.0149264 -0.0379923 -0.111425 -0.0431773 -0.098615 0.102114 0.0610679 0.0481981 0.0208962 0.0268514 0.116894 -0.0903678 -0.0275574 -0.051074 -0.13415 0.0125969 -0.127264 0.0926386 0.0864078 0.0223683 0.173398 -0.0448587 -0.0437277 0.0688651 0.0740196 -0.0400631 -0.0896306 0.126837 -0.00602022 -0.0216605 -0.0631193 0.145005 -0.0388984 -0.0898833 0.00215636 0.184748 -0.0595452 -0.0149553 -0.0583746 0.1149 -0.0611741 0.0118614 -0.0632226 0.0539328 -0.157937 0.0908577 -0.129914 -0.054846 
0.0285018 -0.0749083 -0.0229427 -0.00639292 0.035104 0.0665946 0.0789946 0.043161 -0.0313129 -0.00882972 0.00227575 0.0397576 0.150506 -0.136618 -0.103149 0.00180912 -0.170316 0.110023 -0.168462 0.156838 0.217105 -0.155424 0.0825526 0.201498 -0.100324 -0.0802189 -0.108801 -0.261667 0.00118644 0.0945878 -0.0833216 0.019754 -0.0532874 0.0959189 -0.0110162 -0.0439514 -0.0913655 0.105313 -0.133584 -0.0724076 -0.017077 -0.115937 -0.0636089 0.0884844 -0.0690657 -0.0848276 0.0953335 0.0574794 -0.09299 0.0775721 -0.00158973 -0.189042 -0.00538955 0.0223799 0.0980323 0.0323878 0.0425667 0.0543784 0.0154137 -0.114956 0.0605679 0.0422397 0.104341 0.0227371 0.0404653 -0.104093 -0.0420377 -0.0342957 -0.0331243 -0.0488851 -0.111248 0.00778083 -0.0433346 -0.0205867 -0.0424611 0.00748946 0.00304538 0.0694208 0.0810039 0.062983 -0.00991608 -0.0512393 -0.109749 -0.0594186 -0.0992338 0.105676 0.0678851 0.0330738 0.0194772 0.0332388 0.110078 -0.100672 -0.0247018 -0.0455238 -0.140576 0.0314384 -0.12207 0.0699864 0.0963813 0.0251857 0.174319 -0.0365658 -0.0471745 0.0720765 0.0611374 -0.0444413 -0.0974111 0.115629 -0.0278233 -0.0298402 -0.0574555 0.147728 -0.0384143 -0.102117 0.000978542 0.185658 -0.0542853 -0.0139044 -0.06192 0.109684 -0.0599005 0.00104653 -0.0617602 0.0587113 -0.151032 0.0944304 -0.129306 -0.0595287 
0.0244067 -0.0737797 0.00746264 -0.0123685 0.0193714 0.0594764 0.0860421 0.073399 -0.0499025 0.00993759 0.0112283 0.0327472 0.174149 -0.123792 -0.0876316 -0.024738 -0.156356 0.114628 -0.176861 0.163637 0.207819 -0.165568 0.0628971 0.217893 -0.0995472 -0.0915218 -0.123234 -0.23167 0.0106448 0.0798983 -0.0788037 0.00108049 -0.0627362 0.10083 -0.0372598 -0.0466344 -0.11454 0.0944359 -0.141346 -0.0557066 -0.0109621 -0.122953 -0.0726174 0.0936688 -0.0656035 -0.117136 0.0759812 0.0604215 -0.083414 0.0765546 0.00818796 -0.190296 -0.028551 0.0142027 0.0758684 0.0365966 0.0138331 0.0597024 0.0367456 -0.111282 0.0583989 0.0467315 0.0766968 0.040876 0.0145769 -0.0968738 -0.0259883 -0.0547208 -0.0500442 -0.0720356 -0.103724 0.00876329 -0.0254137 -0.00940877 -0.0401631 -0.00189053 0.00647336 0.064151 0.100622 0.0763992 -0.0197656 -0.0823152 -0.0896257 -0.0534431 -0.0925339 0.103451 0.085508 0.0303905 0.0387429 0.0186031 0.0904806 -0.0976815 -0.00324129 -0.0397347 -0.156854 0.017406 -0.125508 0.0560403 0.0745619 0.0254438 0.161719 -0.0159692 -0.040236 0.0833745 0.0614294 -0.0320708 -0.0990017 0.120743 -0.0134727 -0.0458999 -0.0589991 0.143794 -0.0543763 -0.0896765 -0.0163751 0.17488 -0.0404617 -0.000908998 -0.0656138 0.110497 -0.0793239 -0.0196174 -0.0915791 0.0617 -0.154167 0.0882976 -0.140409 -0.0516921 
0.026569 -0.0567214 -0.0405368 -0.0050128 0.0345405 0.0454868 0.070901 0.0381736 -0.0440694 0.0214562 0.011501 0.0372882 0.164573 -0.127484 -0.120603 0.0138051 -0.144203 0.123773 -0.165794 0.179012 0.214601 -0.180132 0.0929035 0.192979 -0.0996413 -0.0693919 -0.105808 -0.25074 0.0208937 0.096035 -0.0983 0.0304997 -0.0412859 0.0884607 -0.0221081 -0.0526293 -0.0967359 0.130041 -0.126359 -0.0868759 -0.0427032 -0.116388 -0.0600152 0.0895691 -0.0704591 -0.0837658 0.101444 0.0621251 -0.10114 0.0768436 0.00699968 -0.167214 -0.0217592 0.0185937 0.0898122 0.0211977 0.0531643 0.0403112 0.0306243 -0.123217 0.0651575 0.0284346 0.107045 0.0316871 0.0365699 -0.106598 -0.0558407 -0.025279 -0.0331182 -0.0536018 -0.111079 0.00445111 -0.0449285 -0.0156338 -0.0460557 -0.00299579 0.0129644 0.0848222 0.0821597 0.0526255 -0.0245419 -0.0548009 -0.113847 -0.0568291 -0.0919346 0.0984832 0.0535315 0.0394869 0.0526731 0.0213245 0.0912203 -0.0899073 -0.0258654 -0.0426579 -0.125605 0.0172117 -0.117283 0.089571 0.085088 0.00624664 0.173435 -0.0304504 -0.0387827 0.0866448 0.0624069 -0.0401394 -0.0914809 0.124985 0.00549551 -0.040915 -0.0691554 0.159466 -0.0379372 -0.0848978 0.00410992 0.169533 -0.0545904 -0.0236127 -0.0543753 0.107661 -0.0793477 0.00717591 -0.0591493 0.0567627 -0.158014 0.0894468 -0.126349 -0.0609133 
0.0260884 -0.0591107 -0.0443574 -0.0038412 0.0263488 0.0456408 0.0684327 0.0438108 -0.0397815 0.012971 0.010683 0.0415111 0.158427 -0.142619 -0.129767 0.00316765 -0.149282 0.120319 -0.164252 0.17867 0.211175 -0.176235 0.0853352 0.192489 -0.105378 -0.0647418 -0.0996015 -0.257232 0.0136355 0.0926611 -0.101658 0.0247731 -0.0394702 0.0883106 -0.0220489 -0.0587536 -0.0955517 0.124162 -0.131271 -0.0841046 -0.0347304 -0.122675 -0.0651499 0.100162 -0.0705643 -0.0845204 0.102671 0.0562998 -0.102053 0.0789215 0.00618057 -0.167808 -0.0192064 0.0204972 0.0871186 0.0219452 0.0505463 0.0308055 0.0302441 -0.125215 0.0703375 0.0255793 0.107541 0.0390244 0.0329385 -0.122523 -0.046797 -0.0365559 -0.0254115 -0.0575247 -0.117257 -0.00848907 -0.0410525 -0.0148803 -0.0481216 -0.00537657 0.00719093 0.0871175 0.0787099 0.0577726 -0.0292925 -0.0515332 -0.114352 -0.0559624 -0.0881277 0.0999837 0.0589326 0.0371266 0.050728 0.0200443 0.0887995 -0.0907019 -0.0274996 -0.0451998 -0.130024 0.0164396 -0.112099 0.0800703 0.0849798 0.00486006 0.170482 -0.0255338 -0.0369055 0.0865295 0.0643877 -0.0485841 -0.0881464 0.130213 -0.0105136 -0.0337573 -0.062417 0.153112 -0.0411434 -0.0917071 -0.00673355 0.165297 -0.056886 -0.0334761 -0.0499143 0.0986968 -0.0809829 0.0108411 -0.060633 0.0546645 -0.147683 0.0816702 -0.12718 -0.0627686 
0.0222505 -0.0580432 -0.0391155 -0.00248259 0.0443276 0.0577638 0.0660629 0.0322907 -0.0333834 0.0122105 0.00825803 0.0393248 0.152293 -0.140571 -0.111795 0.0119441 -0.159674 0.130321 -0.16094 0.164539 0.221607 -0.165615 0.0977568 0.195261 -0.0918385 -0.0821268 -0.105566 -0.265903 0.0124935 0.100617 -0.0844985 0.0208996 -0.0417315 0.0893942 -0.00410172 -0.047997 -0.0898152 0.102291 -0.121068 -0.083055 -0.0308614 -0.117651 -0.0587024 0.0958957 -0.078058 -0.0835048 0.104537 0.0642903 -0.0926068 0.0771477 0.00566771 -0.173175 -0.0142838 0.0165859 0.0863306 0.0273786 0.0612645 0.0359768 0.0233845 -0.11568 0.0645665 0.0327967 0.104703 0.0289936 0.0415762 -0.123804 -0.0532088 -0.0304328 -0.0258406 -0.0401615 -0.113033 0.0106482 -0.0498372 -0.0304176 -0.0503127 -0.000886572 0.00032292 0.0892219 0.0750433 0.0593916 -0.0198511 -0.042505 -0.110493 -0.0428184 -0.0929576 0.107135 0.0572705 0.0353577 0.0322157 0.0247039 0.0983337 -0.0872227 -0.0310354 -0.0500488 -0.134129 0.0141143 -0.131076 0.0925983 0.0844779 0.0106708 0.179354 -0.0342791 -0.0363166 0.0720463 0.0770831 -0.0466151 -0.0863497 0.120824 -0.00688482 -0.0204043 -0.0710246 0.142535 -0.0356428 -0.0936482 -0.00267693 0.179028 -0.0509541 -0.0234922 -0.0581893 0.111242 -0.0630888 0.0082786 -0.0666061 0.0545543 -0.160761 0.0890806 -0.125968 -0.0491243 
0.0179853 -0.0536649 -0.0376546 -0.0119124 0.0524626 0.0384884 0.061544 0.0330595 -0.0290435 0.0212094 0.00822224 0.0490662 0.155341 -0.131693 -0.125808 0.0164367 -0.151824 0.136498 -0.179356 0.180457 0.218559 -0.173169 0.110989 0.182853 -0.104538 -0.0742028 -0.102873 -0.24964 0.0185819 0.092321 -0.0988598 0.0258546 -0.0286274 0.0904241 -0.017668 -0.0560875 -0.0943294 0.139615 -0.128429 -0.0813681 -0.0454336 -0.103343 -0.0670275 0.085137 -0.0827634 -0.0873989 0.0968729 0.0616641 -0.0924152 0.0878256 0.00546257 -0.164826 -0.0354924 0.0203324 0.0851078 0.0172044 0.0636486 0.0344051 0.0102668 -0.114789 0.0659377 0.0214123 0.110354 0.0407255 0.0460437 -0.128058 -0.0647032 -0.0128473 -0.0304594 -0.0334913 -0.0994903 0.00817679 -0.0405638 -0.0147616 -0.0535983 0.00109343 0.00466591 0.0834486 0.0733033 0.0366548 -0.0301566 -0.0358639 -0.111763 -0.0412092 -0.0924174 0.0930705 0.0557714 0.0535739 0.0552547 0.0225119 0.0891779 -0.0954704 -0.0276413 -0.043545 -0.115966 0.00730395 -0.131845 0.0886574 0.0779288 0.010624 0.173956 -0.0402218 -0.0442484 0.0809753 0.0779981 -0.0443642 -0.090632 0.114984 0.0148533 -0.0376738 -0.0719578 0.160433 -0.0336872 -0.0666828 0.00410952 0.16968 -0.0553628 -0.0232998 -0.0527501 0.112069 -0.0756345 0.0275682 -0.0666467 0.0538713 -0.151598 0.0871039 -0.124477 -0.0590923 
0.0235334 -0.0634365 -0.0374812 -0.00447121 0.0433032 0.0523411 0.0732974 0.0398319 -0.0291274 0.0140872 0.0140458 0.0455828 0.157863 -0.13109 -0.111783 0.00840169 -0.151514 0.127902 -0.169804 0.166176 0.2181 -0.16926 0.0937089 0.199788 -0.0980075 -0.0841155 -0.104256 -0.257995 0.0101089 0.100113 -0.0890525 0.0255498 -0.0358861 0.0929699 -0.0213855 -0.0471668 -0.0945578 0.109974 -0.132003 -0.0747761 -0.0292387 -0.114755 -0.066353 0.0875869 -0.0762791 -0.086259 0.0949729 0.0593426 -0.0911909 0.0736496 0.00492186 -0.175685 -0.0188693 0.0153133 0.0847726 0.0334171 0.0521513 0.0430365 0.0191386 -0.105644 0.0598045 0.0318404 0.101795 0.0269073 0.0387918 -0.117249 -0.0537498 -0.0247606 -0.0329755 -0.0433766 -0.108012 0.00701712 -0.0497446 -0.0278511 -0.0466459 0.00917722 0.00669625 0.0833274 0.0716051 0.0496833 -0.029114 -0.0486902 -0.11052 -0.0460511 -0.097774 0.111909 0.062523 0.0319421 0.0312574 0.0246753 0.093209 -0.0980746 -0.0268326 -0.0440138 -0.129389 0.0191607 -0.134276 0.0770156 0.0891248 0.0166239 0.176601 -0.0382773 -0.0398762 0.0792307 0.0720015 -0.0438429 -0.095126 0.115658 -0.0108653 -0.0348234 -0.0715011 0.146465 -0.0336315 -0.0919461 -0.00142976 0.178717 -0.0531279 -0.0204362 -0.0550744 0.117716 -0.0662117 0.00634776 -0.075023 0.0617729 -0.15568 0.0939367 -0.132673 -0.0547298 
0.0254848 -0.0564719 -0.0420361 -0.00426755 0.0490276 0.0564001 0.0672909 0.0333796 -0.0246599 0.00148264 0.00648415 0.0457122 0.147587 -0.152894 -0.113338 0.0104996 -0.16696 0.118101 -0.170419 0.172215 0.221323 -0.161306 0.0987558 0.184371 -0.0933481 -0.0814225 -0.104294 -0.269925 0.0118257 0.101165 -0.0828986 0.0201286 -0.0368118 0.0917056 -0.00321602 -0.0503105 -0.0884892 0.111341 -0.124976 -0.0842835 -0.0273187 -0.119659 -0.0635516 0.101025 -0.080578 -0.0766837 0.102686 0.0626458 -0.09084 0.083497 1.32903e-05 -0.165703 -0.0162897 0.0156279 0.0897092 0.0204649 0.0531114 0.0319926 0.0111049 -0.114215 0.0603147 0.0226311 0.110177 0.0329896 0.0446977 -0.136777 -0.0532745 -0.0277977 -0.0264328 -0.0422075 -0.109047 0.00620809 -0.0502056 -0.0308199 -0.0494443 0.00218226 -0.00387447 0.083977 0.0720798 0.0732459 -0.0205091 -0.0436759 -0.109279 -0.0374977 -0.0888695 0.0999899 0.0590912 0.0416094 0.0311963 0.0279429 0.0984648 -0.0932096 -0.0395291 -0.0449613 -0.138092 0.00823439 -0.125132 0.082622 0.0846306 0.0068803 0.175215 -0.0339432 -0.0410886 0.0714306 0.0707669 -0.048648 -0.0857224 0.129124 -0.00138453 -0.0190602 -0.0634416 0.142791 -0.0471893 -0.0870927 -0.00161209 0.181352 -0.0583613 -0.0239329 -0.0543364 0.118633 -0.0638768 0.0198223 -0.0657281 0.0596709 -0.146358 0.0833811 -0.114708 -0.0529136 
0.020932 -0.051942 -0.034356 -0.011142 0.0592733 0.0528872 0.0635263 0.0248263 -0.0230256 0.00917562 0.00597014 0.0403015 0.147923 -0.139315 -0.116623 0.0170644 -0.160897 0.14142 -0.173228 0.160523 0.229202 -0.156899 0.106477 0.186726 -0.0956575 -0.0883772 -0.105917 -0.259508 0.0187228 0.102447 -0.0879045 0.0226962 -0.0350474 0.0916157 0.00605924 -0.0545439 -0.0817726 0.110124 -0.116029 -0.0849058 -0.0349892 -0.105963 -0.057175 0.086954 -0.0833288 -0.0797116 0.0989581 0.0670197 -0.0934061 0.0791695 -0.00128051 -0.170751 -0.0181759 0.0193621 0.0801236 0.0240017 0.0722667 0.0319924 0.00396786 -0.112547 0.0665283 0.0316263 0.10739 0.0340263 0.0450878 -0.126281 -0.0615986 -0.0212558 -0.0246069 -0.0291789 -0.106149 0.00759332 -0.0494529 -0.0332897 -0.0544241 0.00286883 -0.00345824 0.083741 0.0709863 0.0440557 -0.0169834 -0.0254856 -0.111806 -0.0351426 -0.090414 0.106717 0.0528404 0.0444299 0.0301552 0.0340144 0.107098 -0.0924383 -0.0345301 -0.048192 -0.12695 0.00881 -0.143796 0.097165 0.0827472 0.0137254 0.187187 -0.0438773 -0.0396503 0.0714073 0.0864686 -0.0492643 -0.0823748 0.116919 0.00261538 -0.0204402 -0.06967 0.141855 -0.0342112 -0.0786982 0.00052324 0.180642 -0.0584689 -0.0189916 -0.0595328 0.110894 -0.0590618 0.0210145 -0.0684203 0.0535229 -0.158259 0.0884978 -0.125521 -0.0550159 
0.0290666 -0.0674708 -0.0371625 -0.00768643 0.0463407 0.0560846 0.0780605 0.0394733 -0.0295583 0.00402028 0.00849516 0.0385668 0.157327 -0.129052 -0.109076 0.00108267 -0.149826 0.127983 -0.167836 0.162117 0.215567 -0.162834 0.0905083 0.2055 -0.100091 -0.0925201 -0.108956 -0.257441 0.0102523 0.0989995 -0.0854472 0.0186738 -0.0474031 0.089654 -0.0145506 -0.0471204 -0.0927615 0.102739 -0.132021 -0.0723746 -0.0264407 -0.107029 -0.0685889 0.0870013 -0.0765613 -0.0840029 0.0898633 0.0653352 -0.086369 0.0752922 -0.00473654 -0.179337 -0.00954744 0.0154612 0.0798256 0.0318361 0.0543033 0.0503529 0.0198818 -0.107331 0.0626883 0.0448481 0.102172 0.0239815 0.0311515 -0.115466 -0.044475 -0.0307038 -0.0314528 -0.0513462 -0.107392 0.00766231 -0.0447791 -0.0260757 -0.0496107 0.00929259 0.00347661 0.0779759 0.0771436 0.0520039 -0.0218167 -0.0437822 -0.114908 -0.0496957 -0.0926665 0.115137 0.0606468 0.0291594 0.0223972 0.0221353 0.105234 -0.0936408 -0.0199528 -0.0503269 -0.127602 0.0160825 -0.132272 0.0763174 0.0887031 0.019673 0.178212 -0.0380484 -0.0378919 0.0789111 0.0665207 -0.0453024 -0.0927006 0.113573 -0.015999 -0.0239084 -0.0602599 0.141703 -0.0315141 -0.0940677 -0.011068 0.18497 -0.0566083 -0.0171497 -0.0628766 0.109992 -0.0710547 0.00248962 -0.0783756 0.0615524 -0.165436 0.0924164 -0.147071 -0.0592055 
0.0298094 -0.0613617 -0.0354141 -0.0109918 0.0413297 0.0580513 0.0768337 0.0431744 -0.0372827 0.0132437 0.0134196 0.0380163 0.166238 -0.125251 -0.106113 0.0122555 -0.146882 0.120498 -0.175046 0.170428 0.218068 -0.168732 0.0915914 0.195951 -0.101009 -0.0790277 -0.112009 -0.255438 0.0168145 0.0966866 -0.086075 0.0306976 -0.0418116 0.0959282 -0.024168 -0.0451811 -0.0933253 0.122927 -0.126199 -0.0737989 -0.0305686 -0.112152 -0.0646605 0.0838521 -0.0734743 -0.0866195 0.0951178 0.061648 -0.0959659 0.0736518 0.00167045 -0.17545 -0.019983 0.0206078 0.0854685 0.0290636 0.051294 0.0487174 0.0238613 -0.11659 0.0534235 0.0348071 0.103171 0.0204409 0.0348034 -0.104819 -0.0493511 -0.0204646 -0.0359382 -0.0531625 -0.104919 0.00710273 -0.0473431 -0.02366 -0.0405003 0.00581887 0.00690575 0.0781058 0.0787741 0.0551437 -0.0217149 -0.0516884 -0.107629 -0.0513256 -0.0947632 0.109298 0.063223 0.033574 0.0355334 0.0239871 0.0979447 -0.10084 -0.0260273 -0.0412935 -0.131699 0.0194209 -0.125295 0.0831984 0.0836055 0.0163833 0.173684 -0.0358475 -0.0416665 0.0887365 0.0594622 -0.0381466 -0.0995101 0.118465 -0.00331445 -0.0420476 -0.0686258 0.153194 -0.0404365 -0.0876944 0.00249877 0.178924 -0.0599477 -0.020544 -0.0596468 0.114916 -0.0684116 0.00266801 -0.0652776 0.0628873 -0.157868 0.0913638 -0.133514 -0.0573836 
0.0238215 -0.0574964 -0.0450075 -0.0142376 0.0605745 0.0614553 0.0602088 0.0252084 -0.039607 0.00774085 0.000621648 0.0431069 0.152353 -0.133346 -0.124225 0.0165 -0.152533 0.135744 -0.17242 0.176763 0.221791 -0.172319 0.104083 0.182447 -0.0931229 -0.0691443 -0.107348 -0.25667 0.0170904 0.0880959 -0.0802045 0.0285047 -0.0494474 0.0869903 -0.00312892 -0.0455164 -0.094611 0.12377 -0.1158 -0.0919708 -0.0329559 -0.100096 -0.0556747 0.0983546 -0.0826148 -0.0841725 0.109681 0.0681479 -0.100249 0.0829042 -0.00484034 -0.174345 -0.0248722 0.0181501 0.0897255 0.0171435 0.0591532 0.0513145 0.0187844 -0.136904 0.0648847 0.0368762 0.122897 0.0284812 0.0467916 -0.11399 -0.0605066 -0.0151141 -0.0269921 -0.0314337 -0.101248 0.0175351 -0.037993 -0.0203673 -0.0568875 -0.00779669 -0.0029168 0.0865704 0.0782919 0.0409758 -0.0223392 -0.0215711 -0.111853 -0.0512018 -0.0940553 0.091106 0.056142 0.058077 0.0503499 0.022172 0.108653 -0.0886344 -0.031752 -0.0522134 -0.114098 0.00958076 -0.122742 0.104766 0.0678804 0.00871259 0.168121 -0.0419543 -0.0418001 0.0802113 0.0646442 -0.0340546 -0.0939666 0.11784 0.00610989 -0.0283331 -0.062514 0.159418 -0.0393011 -0.0697941 0.00745837 0.165139 -0.0637453 -0.0320839 -0.0526814 0.104266 -0.0664266 0.0211944 -0.050991 0.0509421 -0.164075 0.0818689 -0.127124 -0.0596001 
