-0.0957546 0.029063 0.151678 -0.0606713 0.0670369 0.101043 -0.0355522 -0.0299685 -0.0192308 0.111361 0.0112258 0.0129431 -0.00902214 -0.0356235 0.225926 0.0124654 -0.0959479 0.00595446 0.094992 -0.0333275 0.0349211 0.0663703 0.0680707 0.0798547 0.0456673 0.10112 -0.0163302 -0.180648 0.147568 -0.00817752 0.108878 0.0324505 0.064805 0.0541785 0.0782431 0.129323 0.0383272 0.0578349 0.0371383 0.000859541 0.0781075 -0.105311 -0.0974556 -0.0427214 -0.104906 0.103889 0.0911101 0.0239795 -0.113674 -0.134903 -0.0513908 0.0599645 0.0512163 -0.0707785 0.0817412 0.113785 0.0781932 0.0458893 -0.128959 0.044652 -0.105839 -0.0544461 0.0559854 -0.0612739 0.180192 0.0220082 -0.0191445 0.0505767 -0.00352087 0.188579 -0.0682585 0.0777724 -0.189778 -0.0304258 0.122966 -0.00667568 -0.0978086 0.144652 0.0593591 -0.0045999 -0.0587905 0.113967 0.0280574 0.0567462 0.0153113 -0.103587 0.096386 0.104735 -0.0695122 0.0876774 0.110153 0.0742862 0.00186257 0.0910096 -0.0698208 -0.0257157 -0.046559 0.0744054 0.107586 -0.0411242 0.049572 -0.0622805 -0.109362 -0.0774651 0.0251713 0.0388008 0.00051824 -0.104658 0.141521 -0.0208718 -0.0509386 0.0899521 -0.0577551 -0.132354 0.163691 0.0578698 -0.0586814 -0.185185 -0.0290956 0.168349 0.189401 -0.0298946 -0.0400307 0.0391178 -0.0888352 0.158056 0.0843558 0.0753278 
-0.091642 0.0429903 0.150723 -0.0691774 0.065249 0.093733 -0.0206092 -0.00948861 0.00131404 0.125924 0.0119951 -0.0130457 -0.000502602 -0.0354662 0.238439 0.00942239 -0.0796972 0.0137237 0.0721475 -0.0437788 0.0365252 0.0585651 0.0695648 0.0736078 0.0497597 0.0800331 -0.0210232 -0.170798 0.171398 -0.0165425 0.128724 0.0439528 0.065246 0.0568998 0.0774789 0.114501 0.0377223 0.0818915 0.034365 -0.00751978 0.0735878 -0.105307 -0.116637 -0.0366031 -0.0973465 0.0971828 0.0642499 0.0394623 -0.109086 -0.147311 -0.0664606 0.0816722 0.0511856 -0.0885968 0.0519916 0.108677 0.0737458 0.0416551 -0.128538 0.0282928 -0.119884 -0.067406 0.0496703 -0.0558574 0.160607 0.0385294 -0.0155086 0.0595411 -0.0111756 0.178236 -0.0668995 0.0708535 -0.192756 -0.0329963 0.112792 -0.0256805 -0.0949422 0.13605 0.0618724 -0.00288617 -0.0678762 0.108658 0.0204387 0.0465542 0.0344357 -0.115232 0.0896858 0.106406 -0.0537999 0.0804731 0.114138 0.076407 -0.00458647 0.0843901 -0.0527495 -0.0312666 -0.049584 0.0706367 0.0934941 -0.0417349 0.0559951 -0.0698649 -0.107308 -0.0640932 0.0186701 0.0337019 0.00384192 -0.110475 0.184938 -0.0326336 -0.0464526 0.103999 -0.0758564 -0.117091 0.177988 0.0513608 -0.0656097 -0.187602 -0.0109783 0.168775 0.185349 -0.0230945 -0.0493735 0.0579379 -0.0802439 0.132597 0.082841 0.0625733 
-0.0277149 -0.00907588 0.0288382 -0.0910576 0.0741076 0.146709 -0.0382881 0.0131231 -0.0342795 0.0696452 0.0416403 0.0352087 0.0540673 -0.0626403 0.0988171 -0.00680599 -0.0895217 0.045291 0.0356665 0.0735459 0.136685 -0.038274 0.10748 0.124854 0.0124603 0.0899896 0.0044257 -0.250232 0.118738 -0.00449156 0.0890535 -0.0529189 0.0350583 0.0484486 0.0557538 0.105713 -0.0307413 0.150653 -0.00471597 -0.0492809 0.0244273 -0.0563636 -0.125882 0.0786059 -0.13727 -0.00662806 0.12811 0.0343926 -0.151033 -0.0445921 -0.0815961 -0.0104362 -0.0132227 -0.0342299 0.0965052 0.0817001 0.0411622 0.135296 -0.0928274 -0.104078 -0.0825035 -0.0590055 0.205557 -0.0667577 0.159084 -0.0379537 -0.0321999 0.0742662 -0.00549301 0.160965 -0.03231 0.0857085 -0.160629 -0.0586127 0.0545781 -0.0504219 -0.101679 0.158098 0.0890719 0.0247371 -0.140495 0.101032 -0.00184604 -0.0129338 -0.0369561 -0.0785061 0.105587 0.129838 0.0492578 0.0276036 0.127498 -0.0142697 -0.0167077 0.0351426 -0.0189505 -0.100836 -0.0402245 0.118741 0.0324993 -0.0552114 0.0420663 -0.0451506 -0.101304 -0.0486365 -0.0338957 0.0782689 -0.0378758 -0.070834 0.130599 -0.0825599 -0.0281322 0.144972 -0.0589319 -0.0688068 0.183747 0.0906132 -0.0872341 -0.219467 -0.00847881 0.164106 0.107367 -0.0246519 -0.0293942 0.0554573 -0.113507 0.119392 0.0680735 0.0654197 
-0.0348246 0.0038779 0.0306469 -0.0888956 0.0644723 0.135502 -0.0434475 0.00989456 -0.017806 0.0522476 0.0527981 0.0240919 0.0485924 -0.0490506 0.07968 0.00667955 -0.0964795 0.0385445 0.0240001 0.0714506 0.150469 -0.0487061 0.101153 0.119159 0.0144845 0.0944896 0.00661359 -0.231082 0.132482 -0.00417585 0.0874437 -0.0502401 0.0398839 0.0461051 0.0436827 0.109459 -0.0269931 0.164633 -0.000213122 -0.043652 0.022013 -0.0494895 -0.118542 0.0694329 -0.11728 -0.0125845 0.131359 0.0232036 -0.156205 -0.0523598 -0.103791 -0.00130252 -0.0218391 -0.0211643 0.099193 0.0841994 0.0398593 0.138451 -0.105321 -0.113421 -0.0845269 -0.0630571 0.217489 -0.0616998 0.146511 -0.0136767 -0.0297765 0.0744594 0.00013205 0.16235 -0.0288317 0.0787214 -0.156416 -0.0495701 0.0731714 -0.0564279 -0.0966982 0.157406 0.0758816 0.0115444 -0.139507 0.113093 -0.000488537 -0.0175475 -0.0455997 -0.0586356 0.0984051 0.133515 0.0516609 0.0244596 0.136517 -0.0309152 -0.0193503 0.0326603 -0.00285843 -0.104715 -0.0498172 0.121926 0.0382408 -0.0499613 0.026993 -0.0591072 -0.100267 -0.0375637 -0.0327448 0.0986321 -0.0334169 -0.0614071 0.131299 -0.105739 -0.0367113 0.144724 -0.064624 -0.056911 0.193558 0.0887034 -0.0845457 -0.216637 0.00646788 0.158324 0.104181 -0.0151151 -0.0234033 0.0575296 -0.118801 0.125816 0.0717783 0.0697554 
-0.0508653 0.0120457 0.0592472 -0.0700756 0.0429639 0.126875 -0.0289385 0.0043508 -0.0176194 0.0711598 0.054593 0.018536 0.0218776 -0.0659141 0.102608 0.00234053 -0.0938314 0.0508802 0.0479381 0.040251 0.120909 -0.0308279 0.0822365 0.106674 0.00735083 0.112738 0.00770338 -0.230889 0.135678 -0.0196642 0.0889432 -0.030816 0.0450673 0.0480845 0.0724853 0.107871 -0.000241648 0.159947 0.00780808 -0.046046 0.0337756 -0.0606466 -0.115427 0.057565 -0.116517 -0.00377327 0.129499 0.0123767 -0.158984 -0.0756233 -0.0966917 0.00402608 -0.016799 -0.0220332 0.0975284 0.096023 0.0449126 0.118082 -0.113561 -0.08692 -0.0923897 -0.0777032 0.201847 -0.0771501 0.178939 -0.00365065 -0.02287 0.036608 -0.0104442 0.182552 -0.0458786 0.0640688 -0.154701 -0.0265115 0.0725195 -0.0812797 -0.093987 0.16936 0.0709904 -0.024781 -0.143468 0.119497 -0.0102105 -0.0269395 -0.0372106 -0.083379 0.0925437 0.123469 0.0377906 0.0424321 0.14385 -0.0123693 -0.0126127 0.0208074 0.00955795 -0.0810561 -0.0331178 0.115151 0.0510238 -0.0278638 0.00863206 -0.0535887 -0.107154 -0.0497731 0.00357074 0.0862344 8.77835e-05 -0.0840565 0.133907 -0.0967746 -0.0572934 0.142091 -0.0495724 -0.0805784 0.210913 0.06097 -0.0517049 -0.236326 0.0228723 0.141267 0.127269 -0.0278064 -0.00833649 0.0549064 -0.0872431 0.124772 0.0959171 0.0614969 
-0.0521705 -0.000357028 0.0591265 -0.0610936 0.0386336 0.11421 -0.0285493 0.000892471 -0.0172537 0.0700001 0.0576993 0.0181869 0.0258436 -0.0407662 0.112752 0.00651499 -0.0822388 0.0405105 0.0569472 0.0511587 0.109898 -0.0405746 0.0864778 0.106574 0.00943659 0.122251 -0.00680338 -0.225234 0.133289 -0.029083 0.0951294 -0.0141733 0.0457734 0.0461633 0.0588593 0.117693 0.00418154 0.181512 0.0164604 -0.0394441 0.033766 -0.0450811 -0.11916 0.0329953 -0.114842 -0.0180867 0.127541 0.00549052 -0.136477 -0.0762906 -0.112642 -0.000140476 -0.0128697 -0.0120982 0.10096 0.0914766 0.0470614 0.126623 -0.114936 -0.0855609 -0.101644 -0.0714374 0.197495 -0.0897782 0.170616 0.0299065 -0.00979883 0.0412666 -0.00748845 0.166337 -0.0424989 0.0773869 -0.149364 0.00313316 0.0864222 -0.0910703 -0.0881113 0.152718 0.0742797 -0.0296207 -0.143386 0.123821 -0.00990649 -0.0404378 -0.0318118 -0.0848603 0.0907169 0.128745 0.0428095 0.0189804 0.148052 -0.00502395 0.00636966 0.0194225 0.0209647 -0.0873568 -0.0306574 0.118131 0.0479247 -0.0242375 -0.0110835 -0.0692439 -0.102572 -0.0435898 -0.00299048 0.10358 0.00300352 -0.0957505 0.144538 -0.0995027 -0.0647807 0.148653 -0.0453477 -0.0782632 0.20996 0.0564447 -0.0419366 -0.237163 0.0214944 0.134932 0.120562 -0.0216663 -0.00381728 0.0586027 -0.102016 0.126914 0.0909156 0.0687926 
-0.0547403 0.00350751 0.0639675 -0.059255 0.0376268 0.109677 -0.0331948 -0.00174236 -0.0240799 0.0811644 0.0596228 0.0154203 0.0239889 -0.0341201 0.12498 0.0174274 -0.0707537 0.0470123 0.065958 0.0397097 0.107969 -0.029994 0.0835381 0.105855 0.0131162 0.12823 -0.00453672 -0.2234 0.138108 -0.0251143 0.0942911 -0.00602932 0.0483995 0.0460197 0.0602561 0.122443 0.00901197 0.174364 0.0241505 -0.0318236 0.0266051 -0.0404456 -0.113245 0.0296611 -0.108619 -0.0118418 0.133351 0.000120135 -0.137595 -0.0877267 -0.0988331 -0.00124295 -0.0177 -0.0140657 0.0976776 0.0977613 0.052873 0.12425 -0.108248 -0.0752247 -0.1003 -0.0769842 0.185895 -0.0919308 0.177053 0.0260685 -0.0114345 0.0397274 -0.00307662 0.173544 -0.0431425 0.0813512 -0.15068 0.000105492 0.0848953 -0.0938902 -0.0874904 0.163307 0.0672376 -0.0426844 -0.137186 0.131574 -0.0120165 -0.040263 -0.0341612 -0.0862314 0.0891894 0.119876 0.0342412 0.0192829 0.138917 0.0021483 0.00175652 0.0200491 0.0273414 -0.0741025 -0.0318335 0.120414 0.04903 -0.0165501 -0.0188784 -0.0686354 -0.102101 -0.0411757 -9.65961e-06 0.0981069 0.000410141 -0.105852 0.146835 -0.100972 -0.0732531 0.144634 -0.0435031 -0.0829748 0.212444 0.0516385 -0.0350194 -0.24475 0.0143562 0.129678 0.126611 -0.0201707 0.000357268 0.0579652 -0.100491 0.126266 0.0899684 0.0681899 
-0.0603384 0.0311136 0.0579108 -0.0753873 0.0514536 0.0900838 -0.0471554 -0.021837 -0.0320572 0.0988394 0.0515051 0.00760627 0.0386678 -0.0157761 0.124854 0.0423722 -0.0548169 0.0431352 0.0676807 0.0475358 0.114873 -0.0221807 0.0890503 0.100823 0.0116416 0.127129 -0.00864727 -0.21929 0.155333 0.00879146 0.0792015 0.00256569 0.0638521 0.0436257 0.0611563 0.128031 0.0158039 0.179983 0.032784 -0.0250028 -0.00678684 -0.0409341 -0.102723 0.0149718 -0.0870807 0.0450292 0.145256 0.0119503 -0.153189 -0.0989031 -0.0892481 0.0228352 -0.0169953 -0.0254366 0.0965461 0.0986456 0.070987 0.109583 -0.105632 -0.0610035 -0.0814285 -0.0765404 0.166101 -0.0799089 0.173245 5.84953e-05 -0.0286901 0.0714905 0.00702811 0.167686 -0.0369077 0.0752652 -0.174205 -0.0287878 0.0911843 -0.0631484 -0.0902996 0.182138 0.0708337 -0.0382952 -0.124259 0.140471 -0.0214459 -0.013773 -0.0372386 -0.0769424 0.0745287 0.112802 0.0270739 0.0303736 0.116763 0.00944036 0.00180628 0.0437028 0.0160794 -0.0697097 -0.0385873 0.12838 0.0645539 -0.0339777 0.00336234 -0.0650602 -0.109505 -0.0305045 -0.0149585 0.087645 -0.0197441 -0.0977326 0.159514 -0.0931307 -0.0693828 0.129559 -0.0578904 -0.079207 0.195658 0.0727755 -0.063905 -0.247408 -0.0181418 0.140059 0.120134 -0.000238153 -0.00814531 0.0667576 -0.116452 0.135068 0.0725797 0.0561874 
-0.0454951 0.0317788 0.0472275 -0.0843448 0.0578317 0.0798727 -0.0300608 -0.0287709 -0.042158 0.09717 0.0424708 0.000660477 0.0542288 -0.00305048 0.135205 0.0332353 -0.0578468 0.0327106 0.0621044 0.064784 0.103773 -0.0280093 0.104364 0.0892148 0.0040525 0.126535 -0.0246158 -0.227377 0.156205 0.0134142 0.0647295 0.0156209 0.0566403 0.0404394 0.0573359 0.112685 0.0193954 0.215741 0.0382172 -0.02708 -0.0110177 -0.0368437 -0.115969 0.00915702 -0.106406 0.0673475 0.141037 0.0204317 -0.152987 -0.0914232 -0.102227 0.0269289 -0.0114282 -0.0198904 0.0947457 0.0783798 0.0808993 0.12014 -0.105799 -0.0649203 -0.0782119 -0.067136 0.16886 -0.0722672 0.160819 0.0128967 -0.0219392 0.0902344 0.0129469 0.139447 -0.0300305 0.0818655 -0.169152 -0.0110919 0.0973654 -0.0631891 -0.100385 0.153906 0.0858008 -0.0195707 -0.117431 0.134772 -0.0314536 -0.0208217 -0.0249159 -0.0832074 0.0716856 0.112034 0.0326903 0.0184228 0.125766 0.0107498 0.014941 0.0370712 0.000290298 -0.0938041 -0.0306272 0.133809 0.0743484 -0.0471933 0.00619504 -0.0641594 -0.0955992 -0.0168437 -0.0420248 0.0855728 -0.0266075 -0.0722439 0.179751 -0.0901748 -0.0436297 0.140995 -0.0701671 -0.0758824 0.179146 0.0802004 -0.0827901 -0.245515 -0.0249378 0.137203 0.108835 0.0106275 -0.0153115 0.0787492 -0.123767 0.124101 0.0578866 0.0498428 
-0.0411108 0.0180893 0.0543029 -0.0902925 0.0573148 0.107204 -0.0219524 -0.0135064 -0.025883 0.0763103 0.0389456 0.00676226 0.049003 -0.0437295 0.128273 -0.00624826 -0.109907 0.0189775 0.0415096 0.0676147 0.113796 -0.0321524 0.0971404 0.0982317 0.0091796 0.106539 -0.0148949 -0.24157 0.135494 0.00380039 0.0675605 -0.0320388 0.0452148 0.046294 0.0648011 0.102326 -0.000423092 0.190415 0.0131432 -0.04041 0.0226358 -0.0690614 -0.129316 0.0434259 -0.125092 0.0560369 0.128362 0.032103 -0.159342 -0.072146 -0.111795 0.0183916 -0.00141281 -0.0237532 0.106091 0.0761958 0.0519735 0.120045 -0.114562 -0.0843626 -0.0742095 -0.0612209 0.184062 -0.0458363 0.155696 0.000318424 -0.0186072 0.0814624 0.0147373 0.137976 -0.0329048 0.0736404 -0.163599 -0.0318348 0.0985481 -0.0532407 -0.116023 0.145154 0.100025 0.025922 -0.122842 0.11324 -0.0185459 -0.0126491 -0.0228604 -0.0812449 0.0928505 0.124408 0.0338097 0.0362365 0.142947 -0.005411 0.010333 0.0367468 -0.0489362 -0.111822 -0.0386046 0.109506 0.0846392 -0.0633408 0.0339016 -0.0520097 -0.0922245 -0.0477898 -0.0415825 0.0807429 -0.0287863 -0.0461907 0.15319 -0.0800627 -0.0106951 0.14345 -0.0780238 -0.0846336 0.175383 0.0924858 -0.102018 -0.226361 -0.0190174 0.147363 0.116553 -0.00302371 -0.0339064 0.076075 -0.111133 0.127405 0.0702592 0.0565061 
-0.0426825 0.0514131 0.13649 -0.124098 0.0761504 0.124611 -0.0370952 0.00993318 -0.0321145 0.077273 -6.97977e-05 -0.0128707 -0.00662007 -0.0696433 0.212354 -0.0444982 -0.114771 -0.0450345 0.080881 -0.00951923 0.0530277 0.0781436 0.0636764 0.0789092 0.0469048 0.0726343 0.0280405 -0.156397 0.150447 -0.015193 0.0756322 -0.0879564 0.0442963 0.0686072 0.0979164 0.0795504 0.053998 0.0590593 0.0383825 -0.0356594 0.0641435 -0.125275 -0.0962145 0.000250467 -0.111142 0.135004 0.0763225 0.0672667 -0.148053 -0.0596695 -0.0807504 0.0892201 0.0463283 -0.053633 0.0924157 0.0651243 0.0457631 0.05235 -0.165138 -0.0208348 -0.0624295 -0.0404555 0.0954108 -0.0153092 0.120819 0.000378967 -0.0252515 0.0814418 0.0118477 0.153934 -0.0676519 0.05034 -0.200184 -0.0650755 0.12697 -0.00496139 -0.0983032 0.134653 0.126492 0.0723648 -0.0583088 0.0932245 0.0464045 0.0675005 0.0480079 -0.126638 0.0804463 0.132133 -0.00448967 0.130397 0.150846 0.0368965 -0.00905139 0.119985 -0.112817 -0.0910478 -0.0269258 0.0543022 0.0912213 -0.0985412 0.0871898 -0.0190665 -0.108103 -0.101011 -0.0300602 0.0403928 -0.0108132 -0.0621647 0.127622 -0.0244125 0.0596162 0.0957734 -0.0796278 -0.0770448 0.145361 0.0789137 -0.100794 -0.169905 -0.0389477 0.169975 0.161871 -0.0178713 -0.0420433 0.0505057 -0.0708492 0.122376 0.11609 0.0388478 
-0.0648675 0.13537 0.196671 -0.106125 0.0568673 0.105973 -0.000451963 0.00155693 -0.0680279 0.0484646 -0.0410128 -0.0608701 -0.0290069 -0.112919 0.159195 -0.0127255 -0.177557 -0.0638195 0.0288961 -0.0549039 0.1097 0.107188 0.00274662 0.068143 0.0485937 0.0341695 -0.0652922 -0.133867 0.217998 0.0328588 0.0412849 -0.103379 -0.0589477 0.0353632 0.106744 0.038611 -0.0147645 0.0177984 0.0270824 0.0299215 0.0321244 -0.106017 -0.0826933 0.0226801 -0.0150403 0.217264 0.114138 0.0412413 -0.178413 -0.0840716 -0.031805 0.151096 0.0036926 -0.0732479 0.0743331 0.0409408 0.0709722 0.046153 -0.103309 -0.0196486 0.0210233 0.0022567 0.0488792 0.0648416 0.0886937 -0.0962172 0.0179801 0.0260223 0.0470046 0.147791 -0.0344927 0.0914675 -0.133588 -0.025658 0.098102 0.00081774 -0.137156 0.158127 0.110563 0.110146 0.0258443 0.0998814 0.0445863 0.0963787 0.0393877 -0.107891 0.0703599 0.0766399 -0.057239 0.109823 0.114967 0.0650189 -0.0364371 0.0764307 -0.152675 -0.0706912 0.0144086 0.0486347 0.101546 -0.0584697 0.0768497 0.0466091 -0.0879314 -0.0509354 -0.0842584 0.00985379 -0.0228039 0.0407518 0.143582 -0.00457985 0.106133 0.0630781 -0.168272 -0.0902172 0.105385 0.137143 -0.112111 -0.131012 -0.0886973 0.123342 0.0944891 0.0373555 -0.0517909 0.0234065 -0.0959223 0.127777 0.0676478 0.00941275 
-0.0471415 0.0588633 0.151923 -0.115084 0.0775678 0.120276 -0.0367685 0.00445638 -0.0370099 0.0754018 -0.000663434 -0.0230415 -0.012076 -0.0583907 0.219451 -0.036775 -0.106269 -0.0395891 0.0802907 -0.0106043 0.0563211 0.0694031 0.0634743 0.0768764 0.0548138 0.0652149 0.00642577 -0.14998 0.157086 -0.0208738 0.0796326 -0.0839255 0.0394849 0.0633523 0.0981476 0.0898379 0.0497027 0.0625809 0.0413622 -0.0373018 0.0602697 -0.111528 -0.0945766 -0.0202423 -0.101315 0.144905 0.0790832 0.0589618 -0.158306 -0.0699363 -0.0917915 0.0899999 0.0460358 -0.0563078 0.0874038 0.0660074 0.0473341 0.0553668 -0.165375 -0.0158881 -0.0596853 -0.0254398 0.0873415 -0.0235752 0.125844 0.0214379 -0.0251513 0.0828739 0.00524564 0.158226 -0.0569606 0.0597039 -0.195019 -0.0598562 0.131212 -0.00316321 -0.0983688 0.132395 0.128396 0.0575366 -0.064199 0.101791 0.0381221 0.0615313 0.0446891 -0.118088 0.0714146 0.131017 -0.0139791 0.128273 0.156911 0.0425819 -0.00243892 0.11951 -0.102186 -0.088831 -0.0278652 0.0579206 0.0862747 -0.089981 0.0771897 -0.0274534 -0.111009 -0.104732 -0.0322075 0.0560264 -0.00152788 -0.0658911 0.139815 -0.0303676 0.0542281 0.0938205 -0.0757866 -0.0787865 0.153833 0.0769782 -0.107486 -0.166623 -0.041659 0.166403 0.152434 -0.013773 -0.0454938 0.0546954 -0.0717471 0.132062 0.116836 0.0321118 
-0.0139262 0.0499783 0.114851 -0.0979801 0.10108 0.121644 -0.0274982 -0.01055 -0.0312228 0.0847476 0.026394 -0.0170271 0.0187598 -0.0233216 0.207213 -0.00896597 -0.0520435 0.000423403 0.0480404 0.0240314 0.0865164 0.0364244 0.0681866 0.087181 0.0579673 0.0585655 -0.0169878 -0.154804 0.152745 -0.000130082 0.0775882 -0.0369521 0.0455368 0.0732804 0.0906758 0.113189 0.0476661 0.0979481 0.0433396 -0.076336 0.0378721 -0.0811692 -0.0802904 -0.0231726 -0.10209 0.127277 0.0869905 0.0662059 -0.16834 -0.0787963 -0.0974652 0.0715808 0.0210505 -0.0526774 0.100396 0.0675536 0.0202172 0.0742107 -0.153775 -0.0339166 -0.0770965 -0.0383848 0.110723 -0.0591375 0.132352 0.0468521 -0.0470551 0.114145 -0.0157659 0.159511 -0.0296557 0.0649584 -0.19502 -0.0810564 0.103585 -0.00909704 -0.0779281 0.135087 0.119396 0.0191988 -0.0789429 0.121163 0.00625293 0.0193837 0.0260228 -0.101615 0.061519 0.128315 0.0102561 0.132208 0.165106 0.0160902 -0.0217754 0.113304 -0.0687503 -0.0816103 -0.0370575 0.0665817 0.0699971 -0.0887773 0.0719998 -0.0395268 -0.106552 -0.0922975 -0.051013 0.0843184 -0.0146378 -0.0804482 0.168476 -0.054745 0.026096 0.111658 -0.0788991 -0.060495 0.19031 0.061272 -0.11644 -0.188581 -0.0381244 0.167891 0.144432 -0.00516846 -0.0234614 0.0894371 -0.066154 0.125494 0.133094 0.0100526 
-0.0193946 0.0542561 0.0922505 -0.107274 0.0910857 0.131351 -0.0252337 -0.0186692 -0.0299039 0.0934147 0.0349158 -0.00897693 0.0367309 -0.0252511 0.191011 -0.022902 -0.066332 0.00772382 0.0358304 0.0398294 0.0812416 0.0206116 0.0647885 0.105787 0.0400111 0.0670466 -0.0162054 -0.167951 0.147133 0.00223736 0.0748926 -0.0423206 0.03977 0.0690616 0.080342 0.123375 0.03646 0.109733 0.0317941 -0.0589159 0.0386253 -0.0824922 -0.0948304 -0.00121672 -0.113053 0.11012 0.104095 0.0740034 -0.174548 -0.0722083 -0.103328 0.0563356 0.00630825 -0.0473314 0.102578 0.0758103 0.00588437 0.10162 -0.144161 -0.0497559 -0.0869461 -0.0318771 0.14087 -0.0611705 0.127976 0.0413531 -0.0323895 0.110291 -0.0172874 0.154151 -0.0234139 0.0669528 -0.182834 -0.0645025 0.11247 -0.0156756 -0.0941724 0.142138 0.123729 0.0103222 -0.0864675 0.128087 -0.00457686 0.00894431 0.0050184 -0.0843782 0.0715931 0.119111 0.0203205 0.118544 0.164601 -0.00319315 -0.00269182 0.0938405 -0.0671775 -0.0969311 -0.0443875 0.0655728 0.0760093 -0.0884644 0.0609603 -0.0392523 -0.103266 -0.084082 -0.061874 0.0980385 -0.0323016 -0.073304 0.153013 -0.0550761 0.0320121 0.123788 -0.0734988 -0.0606925 0.175189 0.0651143 -0.120057 -0.200701 -0.0314062 0.162757 0.146834 -0.0203958 -0.0268776 0.0955023 -0.0863654 0.128366 0.103858 0.0158682 
-0.0348107 0.0462102 0.131733 -0.111469 0.0846875 0.110732 -0.050675 0.00533045 -0.0364806 0.0663494 0.0135756 -0.0141717 0.00479808 -0.0356898 0.21033 -0.0187706 -0.0746857 -0.0346556 0.0742092 0.0187519 0.072206 0.0520673 0.0807109 0.0913583 0.0545329 0.069259 0.0195426 -0.1567 0.151303 -0.0166881 0.0801167 -0.070664 0.0646736 0.0765747 0.0772919 0.105681 0.0569663 0.0900681 0.0335966 -0.0444157 0.0498467 -0.0983361 -0.0857191 -0.0192307 -0.103943 0.136762 0.0940595 0.0504599 -0.16382 -0.0661014 -0.0974712 0.069953 0.0368757 -0.0462304 0.0957533 0.0709704 0.041789 0.0636429 -0.157152 -0.0241935 -0.0692085 -0.0368438 0.0929683 -0.0412756 0.128943 0.0236817 -0.0347163 0.0959261 0.0020511 0.155241 -0.0574352 0.0487176 -0.206685 -0.0727629 0.135319 -0.00460999 -0.0839949 0.144483 0.120951 0.0474827 -0.0835705 0.106483 0.0260938 0.0453565 0.0349848 -0.102258 0.0682752 0.128224 -0.0092904 0.124188 0.156809 0.0243159 -0.0120374 0.120988 -0.081076 -0.0812909 -0.0388106 0.0689487 0.0810313 -0.0960676 0.0613905 -0.0413378 -0.110876 -0.0860368 -0.039544 0.0669428 -0.0155475 -0.0705961 0.144126 -0.058765 0.0323185 0.103915 -0.0751709 -0.0683294 0.161012 0.071986 -0.109496 -0.19311 -0.0393995 0.179619 0.150037 -0.000145945 -0.0468328 0.073348 -0.0765218 0.12588 0.118804 0.0284225 
-0.0488648 0.0638319 0.145381 -0.120416 0.0805535 0.119817 -0.0429309 0.00322344 -0.0261562 0.070843 0.00792632 -0.0146777 -0.0128509 -0.0536079 0.210043 -0.0319996 -0.097509 -0.0408753 0.0759322 -0.0113038 0.0574605 0.0790744 0.0501828 0.081856 0.0501239 0.0699658 0.0205333 -0.138319 0.159938 -0.0130601 0.0785356 -0.0826729 0.0512271 0.0695779 0.093503 0.0992565 0.0613443 0.0498834 0.042323 -0.0329927 0.0648013 -0.110336 -0.0823902 -0.018766 -0.093932 0.146922 0.0847876 0.0566018 -0.16237 -0.0760586 -0.098169 0.0878288 0.0407388 -0.0527486 0.0902424 0.0762278 0.0315424 0.0565982 -0.175873 -0.00912804 -0.0656049 -0.0317862 0.0917565 -0.0280728 0.121598 0.0197404 -0.0274699 0.0832026 0.00594714 0.156967 -0.0549818 0.0455672 -0.200342 -0.071991 0.138735 0.00691285 -0.0943768 0.144105 0.11932 0.0413747 -0.0618296 0.116157 0.0393808 0.0682353 0.0401273 -0.104151 0.0720671 0.12579 -0.0189502 0.140102 0.158723 0.0275411 -0.0122939 0.128679 -0.0935652 -0.0809221 -0.0360728 0.0464774 0.0876692 -0.0906821 0.0715232 -0.0327673 -0.114772 -0.10323 -0.0361102 0.0645557 -0.00579011 -0.0719374 0.120647 -0.0346846 0.0520098 0.0817972 -0.0754449 -0.0722723 0.150842 0.0706497 -0.10917 -0.175242 -0.0381999 0.166252 0.161328 -0.013821 -0.0426009 0.0595626 -0.0717826 0.135343 0.114642 0.0269878 
-0.0341126 0.0599583 0.132061 -0.108843 0.0984715 0.11945 -0.0368626 -0.0160985 -0.0300623 0.0579341 0.0126008 -0.00633812 0.000152032 -0.0352252 0.201123 -0.00878794 -0.0805156 -0.0343006 0.0597792 0.00539692 0.0778427 0.0621154 0.0607724 0.0804322 0.0565873 0.0693247 0.0025873 -0.147254 0.158372 0.00435998 0.078848 -0.049655 0.0503131 0.076719 0.0865019 0.109266 0.056341 0.0717113 0.0488124 -0.0457507 0.0571158 -0.0964665 -0.0679253 -0.0254834 -0.0902079 0.152211 0.096473 0.0491327 -0.174505 -0.0823224 -0.102049 0.0730498 0.0328414 -0.0505905 0.0980863 0.0763492 0.0232658 0.0789592 -0.174818 -0.0055814 -0.0713806 -0.0319472 0.104286 -0.0488703 0.137738 0.0282979 -0.0417974 0.096526 -0.00796811 0.159777 -0.0451564 0.0540534 -0.205347 -0.076516 0.129678 0.0104115 -0.0796503 0.137279 0.107121 0.0339607 -0.0661015 0.120232 0.0256674 0.0520115 0.0197795 -0.0961899 0.0684151 0.118671 -0.0262535 0.138666 0.164974 0.0113633 -0.0251723 0.127713 -0.0776465 -0.0671418 -0.0386509 0.0571079 0.0883536 -0.0821159 0.0588887 -0.0442223 -0.118497 -0.0816581 -0.0473451 0.0765978 -0.0163534 -0.0594953 0.132526 -0.0539954 0.0348695 0.0884015 -0.086222 -0.0633864 0.168393 0.0725416 -0.117183 -0.17684 -0.0367219 0.180809 0.155268 -0.000331531 -0.0357532 0.0740908 -0.0729916 0.137092 0.115502 0.0142081 
-0.0607882 0.0798008 0.155407 -0.116655 0.0609537 0.106957 -0.0470733 -0.0106827 -0.0304357 0.0629093 0.00481887 -0.0281003 -0.0287236 -0.0657155 0.199472 -0.0370528 -0.120451 -0.0441967 0.0901056 -0.0234677 0.0511856 0.0809013 0.0496249 0.0743823 0.0517961 0.0771904 0.0227398 -0.138649 0.174184 -0.0142578 0.0733252 -0.0916705 0.0445818 0.0570993 0.0966849 0.0879645 0.052937 0.0491638 0.055717 -0.0138076 0.0589745 -0.121233 -0.0927962 -0.0209273 -0.082723 0.160756 0.0901344 0.0475572 -0.165476 -0.0808628 -0.101853 0.115175 0.0514595 -0.050771 0.0753617 0.0705388 0.0614343 0.0495177 -0.175894 -0.00484632 -0.0495147 -0.0215564 0.0939114 -0.00627242 0.112184 0.0130156 -0.0139886 0.0617069 0.0156374 0.160538 -0.0676144 0.0402217 -0.197525 -0.045518 0.152533 -0.0102548 -0.102225 0.141721 0.114826 0.0517932 -0.0608481 0.119695 0.040813 0.0739975 0.0446018 -0.101908 0.0614028 0.116002 -0.0326585 0.126732 0.160404 0.0429998 0.00232367 0.122639 -0.0948797 -0.090242 -0.0338192 0.0564343 0.10388 -0.0876566 0.0645575 -0.0269034 -0.11168 -0.0883899 -0.0235739 0.058712 0.0111938 -0.0525054 0.125486 -0.0322547 0.0604663 0.0771878 -0.0782516 -0.0794289 0.136189 0.0777045 -0.102637 -0.173393 -0.0281698 0.157692 0.157191 -0.0128238 -0.0536574 0.0417365 -0.0812842 0.138301 0.10739 0.0366403 
-0.0309196 0.0620538 0.125504 -0.1026 0.0805358 0.113434 -0.0431332 -0.0135166 -0.0331879 0.0742857 0.0282208 -0.0232546 0.00480001 -0.0253261 0.212008 -0.0113186 -0.0667448 -0.0250871 0.0665909 0.0086619 0.0656525 0.0490423 0.0644144 0.0850624 0.0556402 0.0739557 0.00814404 -0.146727 0.156922 -0.010001 0.0798605 -0.0471267 0.0547875 0.0770377 0.0814897 0.12164 0.0604211 0.0852867 0.0477826 -0.0476018 0.0460704 -0.0983518 -0.0793832 -0.0283887 -0.0915846 0.146663 0.0958448 0.0552537 -0.174605 -0.0841181 -0.105232 0.0803798 0.0294563 -0.0471246 0.0929986 0.0757356 0.0272421 0.0691863 -0.157564 -0.0164711 -0.0794228 -0.036182 0.104547 -0.0542707 0.128202 0.0463682 -0.0355865 0.0992345 -0.00359203 0.163274 -0.0491862 0.0489644 -0.203962 -0.0691075 0.136155 -0.0121822 -0.0784054 0.145539 0.109791 0.0221419 -0.0763721 0.119191 0.0118059 0.0297317 0.0211017 -0.0893957 0.0598519 0.11399 -0.0132316 0.134182 0.167718 0.0157313 -0.0128697 0.115924 -0.0690373 -0.0722663 -0.0385233 0.0615149 0.0907878 -0.0893063 0.0519267 -0.0431852 -0.111555 -0.0837769 -0.0403003 0.0829175 -0.0127558 -0.0706389 0.14533 -0.0595874 0.0257607 0.102517 -0.0754646 -0.0689713 0.175054 0.0595202 -0.106172 -0.195223 -0.0263696 0.168639 0.157671 -0.00939699 -0.0292573 0.0866348 -0.0695928 0.128144 0.124818 0.0200201 
-0.00608699 0.0737552 0.104336 -0.110348 0.0947442 0.119914 -0.0172331 -0.0178323 -0.0368493 0.0808825 0.0374552 -0.0225003 0.0267542 -0.00800447 0.199648 -0.0110944 -0.0532043 -0.00671285 0.0380618 0.0237447 0.0892586 0.0465763 0.0496757 0.0862459 0.0442811 0.0633014 -0.0200241 -0.139285 0.165935 0.0191958 0.0531021 -0.0381682 0.0358534 0.0761765 0.0864074 0.119344 0.0548113 0.103071 0.0470205 -0.0593147 0.0304561 -0.0744258 -0.0724414 -0.0188076 -0.0945731 0.149746 0.100647 0.0663279 -0.181657 -0.0795221 -0.103035 0.0874292 -0.0037748 -0.0347161 0.111518 0.0675661 0.00735955 0.0894234 -0.158414 -0.0312602 -0.0755578 -0.0395415 0.128294 -0.0584788 0.121388 0.040158 -0.0382661 0.11542 -0.00968691 0.159191 -0.0157792 0.0605669 -0.187632 -0.0707511 0.117609 -0.00628208 -0.079622 0.142274 0.118468 0.00271668 -0.0650609 0.133873 0.00239399 0.0174307 0.0136199 -0.0839843 0.0607332 0.110691 0.0128955 0.140334 0.171203 -0.00924564 -0.023315 0.100616 -0.0659038 -0.0904972 -0.0325872 0.0604635 0.0839808 -0.0841665 0.0582254 -0.023635 -0.0998027 -0.0778697 -0.075079 0.0987875 -0.030247 -0.0617926 0.156947 -0.0646738 0.0401011 0.103376 -0.0958074 -0.0527613 0.185009 0.0670677 -0.107128 -0.200957 -0.0359764 0.159633 0.144075 -0.00810884 -0.0110641 0.102117 -0.0691035 0.124543 0.128286 0.00616196 
-0.0346589 0.0542305 0.104962 -0.116728 0.0624672 0.11492 -0.0451971 -0.000458901 -0.0357962 0.0818642 0.0315735 -0.0254006 0.0108665 -0.0302289 0.208718 -0.0310301 -0.0897692 -0.0332922 0.0786677 0.0193374 0.0547602 0.0397211 0.0778425 0.0864387 0.0387153 0.0822077 0.0258497 -0.165566 0.145958 -0.0222115 0.071532 -0.0775323 0.0563418 0.0713625 0.0751526 0.123122 0.0543251 0.102199 0.0307392 -0.0309169 0.040323 -0.102717 -0.106654 -0.00442765 -0.112521 0.136493 0.100851 0.0583033 -0.167543 -0.0655068 -0.113357 0.0729304 0.0204991 -0.0355746 0.0948463 0.0752165 0.0345361 0.07676 -0.148387 -0.0285183 -0.0780168 -0.0389777 0.125037 -0.0465695 0.125943 0.0292052 -0.0223374 0.0983222 0.0152138 0.159231 -0.0527793 0.0524186 -0.195584 -0.0555978 0.141234 -0.0242998 -0.0930181 0.150251 0.119138 0.0275802 -0.0870796 0.107006 0.00487577 0.0245805 0.0135005 -0.0879954 0.0677943 0.11331 0.00594818 0.114671 0.167772 0.0126542 0.00341444 0.0950643 -0.0719158 -0.0939048 -0.0374805 0.0638395 0.0990575 -0.0914036 0.0452834 -0.0380323 -0.105482 -0.0943139 -0.0443927 0.0799796 -0.0216123 -0.0698687 0.133475 -0.0554068 0.0385158 0.113863 -0.0620958 -0.0771912 0.160531 0.0697867 -0.0931048 -0.20802 -0.0237757 0.159656 0.154464 -0.0193016 -0.0323583 0.0921867 -0.0794352 0.120681 0.11168 0.0370778 
-0.0433818 0.134139 0.187371 -0.127989 0.0397893 0.0882579 0.00178374 0.0292973 -0.0944798 0.0630406 -0.0223275 -0.0608211 -0.0214939 -0.0814528 0.170389 -0.0416471 -0.127823 -0.0426244 0.056499 -0.0292304 0.0868524 0.107754 0.0232648 0.116897 0.030507 0.0452302 -0.00608447 -0.114088 0.240689 0.017647 0.00531241 -0.129011 -0.0288714 0.0510129 0.0871784 0.0248547 0.0130224 0.0678777 0.00683877 0.0310925 0.0157523 -0.0914405 -0.0835392 0.0334352 -0.0549518 0.203114 0.130691 0.0367713 -0.198793 -0.0536138 -0.0273871 0.147378 -0.0120294 -0.0508924 0.0872084 0.0470981 0.0701221 0.0784707 -0.0965384 -0.0435433 0.00756022 -0.0111453 0.0759427 0.0494265 0.0760301 -0.0748111 0.014104 0.006471 0.0241384 0.159192 -0.0543767 0.0622979 -0.138808 0.0117838 0.122637 -0.0321954 -0.114376 0.179106 0.141765 0.0595398 -0.00681417 0.114662 0.0299085 0.0511804 0.0708197 -0.132858 0.049119 0.0751229 -0.0203004 0.122727 0.136291 0.046251 -0.0243524 0.05392 -0.0939968 -0.0891777 0.0200788 0.0723631 0.113353 -0.0784782 0.0463432 0.0582647 -0.0687321 -0.0278837 -0.115802 0.0175658 -0.0285033 0.0037054 0.156245 -0.0559811 0.128874 0.1037 -0.130511 -0.0758974 0.107566 0.112515 -0.0738359 -0.190421 -0.0674197 0.123979 0.098761 0.0232907 -0.0587788 0.0321673 -0.105207 0.116333 0.0785657 -0.0063887 
-0.0537933 0.134743 0.195891 -0.117181 0.0421488 0.100433 -0.0114772 -0.0101964 -0.112983 0.0509508 -0.0307299 -0.0577872 -0.0208679 -0.0775672 0.178973 -0.0286134 -0.149873 -0.0569929 0.05703 -0.0321116 0.0759065 0.104873 0.0377476 0.0946855 0.0394438 0.0430076 -0.0313363 -0.117003 0.219772 0.0170683 0.0161745 -0.115913 -0.0385927 0.041118 0.0942216 0.0456474 -0.00786407 0.0460597 0.021244 0.034716 0.012664 -0.104978 -0.0835887 0.00831367 -0.0470549 0.23464 0.128602 0.042517 -0.212958 -0.0548486 -0.0319964 0.146786 0.00726642 -0.0616493 0.0740073 0.0414707 0.071568 0.0813022 -0.106148 -0.0057197 0.00627655 0.0251826 0.0693347 0.0425741 0.0979042 -0.0637737 0.00286624 0.0225115 0.0043937 0.160545 -0.0457938 0.071573 -0.144213 0.00396307 0.127343 -0.0103009 -0.117806 0.141073 0.136929 0.0881669 0.0077367 0.0799064 0.0238223 0.060914 0.0300786 -0.12007 0.0429939 0.0551518 -0.0587508 0.129658 0.133737 0.0539388 -0.00751266 0.0783646 -0.119535 -0.074053 0.015882 0.0706521 0.120789 -0.0746646 0.0556277 0.0558893 -0.0883896 -0.0407032 -0.0937831 0.030592 -0.021622 0.0273102 0.151402 -0.0399794 0.118972 0.0893589 -0.122087 -0.0828974 0.101103 0.125271 -0.0929898 -0.142216 -0.065827 0.150498 0.0972483 -0.00154651 -0.0670325 0.021406 -0.100248 0.139015 0.0742183 -0.00509402 
-0.0570641 0.139152 0.189095 -0.116454 0.0377926 0.0938502 -0.00886459 -0.00400624 -0.09817 0.0447106 -0.0351414 -0.0571685 -0.0241791 -0.0875367 0.169114 -0.0383282 -0.153611 -0.0574246 0.0538829 -0.0321607 0.077204 0.100463 0.0394592 0.097049 0.0416624 0.0424333 -0.0218469 -0.123355 0.220544 0.0199262 0.0252011 -0.115522 -0.0292569 0.0438835 0.0930376 0.0333117 -0.00353985 0.0601979 0.00955901 0.0309574 0.0189129 -0.108867 -0.0814287 0.0297527 -0.0535403 0.222825 0.132403 0.0405249 -0.203859 -0.0497979 -0.0312088 0.149816 0.0119125 -0.0634631 0.0801965 0.0433471 0.0727343 0.0790204 -0.0969118 -0.0275708 -0.0007043 0.00819624 0.0728245 0.0492103 0.0935877 -0.0747143 0.00651476 0.00927611 0.00599407 0.164518 -0.0536649 0.0635146 -0.144104 0.0107304 0.125067 -0.0225216 -0.119933 0.146285 0.132014 0.093282 -0.00419028 0.0848078 0.0254555 0.0594304 0.0442458 -0.132706 0.0442108 0.0615802 -0.0480673 0.122958 0.13056 0.0516229 -0.0120516 0.05842 -0.111925 -0.0792584 0.0192027 0.0798056 0.120643 -0.0811771 0.0497283 0.0598397 -0.076943 -0.0296379 -0.100659 0.01747 -0.0252916 0.0307925 0.159859 -0.0436555 0.123227 0.0969105 -0.137273 -0.0818995 0.0990441 0.119683 -0.0805954 -0.160632 -0.0526259 0.152418 0.105223 0.013576 -0.0703646 0.0227114 -0.101098 0.122091 0.0826417 0.00108146 
-0.0116521 0.0995615 0.092535 -0.127191 0.0776334 0.120086 -0.00943263 -0.00689125 -0.0565341 0.116128 0.0424809 -0.028042 0.0320054 -0.0209915 0.197423 -0.0221912 -0.0675665 -0.0191212 0.0495384 0.0158468 0.07069 0.045571 0.0292203 0.0829569 0.0362182 0.0741847 -0.00917345 -0.129885 0.181381 0.0226112 0.0287454 -0.0503364 0.0199376 0.0694059 0.0690111 0.108881 0.0483909 0.0885284 0.0544782 -0.0302812 0.0281429 -0.0970358 -0.0827208 -0.0139976 -0.0888183 0.167036 0.107215 0.0692104 -0.197212 -0.0882748 -0.0879091 0.117296 -0.0263463 -0.0348014 0.102576 0.0682952 0.00784415 0.087826 -0.156543 -0.0205467 -0.0620884 -0.0427115 0.133367 -0.0438678 0.10671 0.0278367 -0.0286173 0.11584 0.00663133 0.149758 -0.020655 0.0670376 -0.185622 -0.0550295 0.134606 -0.00320946 -0.0830512 0.162435 0.12409 0.00481589 -0.065346 0.126932 0.00891625 0.0320245 0.00725387 -0.0739518 0.0677926 0.0990707 0.0244849 0.133095 0.153726 -0.00928936 -0.0145332 0.107284 -0.0812476 -0.108259 -0.0189992 0.0412652 0.100654 -0.0908438 0.0551054 -0.00902825 -0.0983172 -0.0684831 -0.0835967 0.0993292 -0.0401627 -0.0370623 0.141939 -0.0609538 0.0591265 0.101787 -0.0953953 -0.0579229 0.169004 0.0675824 -0.110031 -0.20222 -0.0341005 0.149814 0.140457 -0.0221802 -0.0135077 0.100993 -0.0738266 0.128471 0.104877 0.00550229 
-0.0279079 0.0668249 0.110313 -0.118513 0.0695079 0.131853 -0.0227541 -0.00301545 -0.0482204 0.0894808 0.0274019 -0.0114499 0.0167979 -0.0334688 0.21388 -0.0531888 -0.109062 -0.0385303 0.0656525 0.0164193 0.0481054 0.0509421 0.0581007 0.092933 0.0381936 0.0684258 0.00631299 -0.153879 0.147218 -0.00397875 0.0564715 -0.0721629 0.0292115 0.0705413 0.0677545 0.117618 0.0375065 0.0763193 0.0258471 -0.0174373 0.0552625 -0.111043 -0.108907 -0.00525307 -0.123308 0.147685 0.0978617 0.0632645 -0.171245 -0.0613277 -0.0922636 0.0938256 0.00845066 -0.0398803 0.105881 0.0728852 0.0166573 0.0905777 -0.150072 -0.0171784 -0.0786249 -0.0276025 0.12524 -0.0411758 0.116123 0.0220455 -0.0117637 0.0977057 0.0036498 0.161753 -0.0367049 0.0707741 -0.183535 -0.0430099 0.143322 -0.00216654 -0.101119 0.136768 0.124986 0.0414751 -0.0717207 0.10324 0.0176797 0.0371231 0.0136107 -0.0872229 0.081691 0.103881 0.00137589 0.125953 0.159283 0.00389497 0.00373124 0.0989593 -0.100626 -0.108036 -0.0295919 0.0422558 0.110299 -0.0938075 0.0561203 -0.0153819 -0.0985534 -0.0907106 -0.0694598 0.0847436 -0.0373381 -0.0466094 0.123507 -0.0422212 0.0624981 0.109945 -0.077446 -0.080503 0.150343 0.0774585 -0.0978563 -0.192006 -0.0245052 0.168535 0.158692 -0.0336713 -0.0367308 0.0853352 -0.0775183 0.131584 0.106829 0.036455 
-0.020142 0.0682173 0.113752 -0.12166 0.0744788 0.124943 -0.0237988 -0.00213642 -0.0461537 0.0877328 0.030358 -0.0147863 0.0211121 -0.0257319 0.21223 -0.037479 -0.0973714 -0.0426595 0.0573085 0.014162 0.0603044 0.0569109 0.0527373 0.0905071 0.0409333 0.0712841 0.00801927 -0.144736 0.155755 0.00517277 0.0523129 -0.06132 0.0285602 0.0765725 0.0624932 0.11565 0.0378016 0.0815965 0.0356734 -0.0181786 0.0453718 -0.110306 -0.104175 -0.0127337 -0.104317 0.156013 0.0913029 0.0633968 -0.175496 -0.070545 -0.0880688 0.104836 0.00338984 -0.0410194 0.103611 0.0682143 0.0150724 0.0880532 -0.15531 -0.011317 -0.071886 -0.0370603 0.119393 -0.0363265 0.111506 0.0182777 -0.0188683 0.111663 0.00758321 0.16083 -0.0354868 0.067127 -0.192248 -0.0536084 0.139325 -0.000116773 -0.0898795 0.140189 0.119523 0.0458232 -0.0630068 0.103843 0.0208248 0.037091 0.0130435 -0.0900342 0.0817617 0.103203 -0.000272601 0.130548 0.156021 0.00164482 -0.00725353 0.115319 -0.100208 -0.0969621 -0.0292674 0.0351131 0.11103 -0.0940999 0.0600894 -0.0167888 -0.106588 -0.0796272 -0.0702099 0.0816432 -0.0432198 -0.0446102 0.13163 -0.0543232 0.0589691 0.107808 -0.0907549 -0.0706355 0.159564 0.0809787 -0.104256 -0.189618 -0.0307472 0.171938 0.153909 -0.0218509 -0.0312617 0.0898675 -0.0728236 0.129051 0.11004 0.0280527 
-0.00645124 0.0886889 0.103681 -0.122866 0.0955167 0.132851 -0.00314911 -0.00938598 -0.0576275 0.106431 0.0267624 -0.0197755 0.0324061 -0.023359 0.201833 -0.0189817 -0.075549 -0.0120694 0.0330678 0.0174249 0.080678 0.0516877 0.033742 0.0842776 0.040665 0.0640075 -0.0318239 -0.135052 0.174442 0.023881 0.0369095 -0.0345631 0.00627625 0.0721578 0.074943 0.107809 0.0368732 0.0836432 0.0499874 -0.0413667 0.0373447 -0.0905217 -0.0764198 -0.0155382 -0.093896 0.159694 0.103723 0.0754226 -0.194825 -0.0807628 -0.0809971 0.102733 -0.0216562 -0.0403494 0.109183 0.0617092 0.00475935 0.09565 -0.152593 -0.0267736 -0.0635902 -0.0295059 0.12652 -0.0440273 0.110211 0.0294855 -0.0331845 0.119947 -0.0036667 0.154785 -0.012895 0.0819613 -0.177278 -0.0537473 0.119115 0.00129131 -0.0886177 0.145019 0.126426 0.0120551 -0.0492848 0.13032 0.0112092 0.0295532 0.0100023 -0.0835891 0.0734199 0.107929 0.0191427 0.139612 0.159474 -0.00389557 -0.0249456 0.106835 -0.0898115 -0.096123 -0.0197105 0.0470827 0.0894063 -0.0872944 0.0649473 -0.0114579 -0.0972291 -0.0698827 -0.0914923 0.095803 -0.050074 -0.0374331 0.148697 -0.0533662 0.0629788 0.108209 -0.104075 -0.0591156 0.174521 0.0700674 -0.115067 -0.191621 -0.0413177 0.156649 0.144276 -0.0162857 -0.00759298 0.0945881 -0.0785919 0.126351 0.10755 0.00175485 
-0.0071029 0.0755737 0.105197 -0.11624 0.0910399 0.130652 -0.00868206 -0.00729721 -0.0581369 0.100947 0.0260672 -0.0197887 0.0362065 -0.019376 0.206615 -0.0220905 -0.0747143 -0.0157428 0.0390806 0.0250695 0.0822883 0.0392629 0.04624 0.0930521 0.0453768 0.0640144 -0.0345618 -0.148094 0.166811 0.0173438 0.0472208 -0.0338343 0.010155 0.0729003 0.0679838 0.110279 0.0316038 0.0948266 0.0464743 -0.0423623 0.0377044 -0.0898609 -0.0880405 -0.0203496 -0.0966292 0.148575 0.102548 0.0709548 -0.189196 -0.0798022 -0.086054 0.0939672 -0.00654653 -0.0416281 0.106529 0.0617967 0.0126935 0.0993791 -0.145237 -0.0350296 -0.0659168 -0.0243073 0.122354 -0.0473092 0.107689 0.0398422 -0.026053 0.121089 -0.0037647 0.148325 -0.0191761 0.0838969 -0.182501 -0.051694 0.122714 -0.00293671 -0.0918869 0.135464 0.130187 0.0279494 -0.0612777 0.124362 0.00944979 0.0210271 0.012661 -0.0844891 0.0746763 0.109043 0.0166639 0.125191 0.16034 0.00297009 -0.0138043 0.106023 -0.0910296 -0.0991995 -0.0225209 0.0533062 0.0883434 -0.0915447 0.0636842 -0.019912 -0.0973519 -0.0680662 -0.0896674 0.0961754 -0.0483345 -0.0414168 0.152817 -0.0568044 0.0575686 0.114845 -0.101031 -0.0671862 0.173952 0.075157 -0.120673 -0.194576 -0.0410993 0.160523 0.140583 -0.015289 -0.0173097 0.0940694 -0.0858684 0.128276 0.104006 0.00962319 
-0.0306277 0.0378656 0.0549769 -0.112657 0.0757911 0.0996909 -0.0408525 -0.0480292 -0.053418 0.0711456 0.029723 0.0170706 0.0522892 -0.00476558 0.135205 -0.00826139 -0.0912063 0.00555267 0.052526 0.0869437 0.0983196 0.00506376 0.0800705 0.1207 0.00527539 0.112618 -0.00683596 -0.206471 0.134053 0.0352288 0.0299194 -0.051527 0.040743 0.0509611 0.064798 0.128602 0.0175301 0.16365 0.0163204 -0.0287483 0.00269338 -0.0529675 -0.0955502 0.0291491 -0.113225 0.117356 0.158045 0.0492108 -0.173644 -0.0508484 -0.0991136 0.0184898 -0.0103963 -0.013856 0.14059 0.0737884 0.0269138 0.141666 -0.117237 -0.0668841 -0.0553264 -0.0338072 0.181425 -0.0438515 0.141764 -0.0162474 -0.0235786 0.0976447 0.0135872 0.138313 -0.0164613 0.0725894 -0.160649 -0.0360432 0.113816 -0.0203851 -0.110401 0.155622 0.120498 0.00486701 -0.0791288 0.143248 -0.0267836 -0.00336297 -0.0297961 -0.0779546 0.0759551 0.109742 0.0279642 0.0762274 0.144617 -0.0142561 0.0193354 0.0548769 -0.0543252 -0.103062 -0.0376408 0.0976197 0.107003 -0.0822519 0.0299217 -0.0319675 -0.0921717 -0.0560737 -0.0886567 0.0958548 -0.0640764 -0.0533321 0.122419 -0.062025 0.0344527 0.127621 -0.0767109 -0.0670131 0.137062 0.100308 -0.105228 -0.232026 -0.0605303 0.143426 0.116373 0.00364455 -0.0225876 0.0799353 -0.136303 0.141025 0.0579637 0.0279589 
-0.0178753 0.0493957 0.0500329 -0.112945 0.090428 0.100633 -0.0261247 -0.046438 -0.0504289 0.0470442 0.0273751 0.0212495 0.0498104 -0.0133585 0.113271 -0.000983204 -0.0912095 0.00873998 0.024905 0.0933979 0.121416 0.0033542 0.0744316 0.103685 0.00556488 0.105089 -0.0173259 -0.202228 0.137458 0.0459777 0.0228054 -0.0391395 0.0295138 0.0569406 0.070391 0.113504 0.0167286 0.177357 0.0217329 -0.0409989 0.00635421 -0.0441509 -0.0771121 0.0371298 -0.107506 0.122524 0.161032 0.0407717 -0.18712 -0.0442986 -0.10449 0.0220326 -0.0265951 -0.00588533 0.144131 0.0614349 0.0165707 0.146006 -0.130231 -0.0767439 -0.0491481 -0.0410195 0.195263 -0.0468688 0.146533 -0.0264112 -0.0329224 0.100356 0.00861363 0.142518 -0.00498055 0.0704828 -0.154041 -0.0372236 0.0988436 -0.0203001 -0.102648 0.152717 0.11094 0.00205801 -0.0819012 0.150216 -0.0271112 -0.0052473 -0.0362592 -0.078193 0.0750476 0.114306 0.0331847 0.0804479 0.153813 -0.0368269 -0.00211915 0.0488881 -0.0465315 -0.103645 -0.0299655 0.101347 0.0975283 -0.0768802 0.0208387 -0.0310022 -0.0947318 -0.0336141 -0.0974149 0.0969366 -0.0662186 -0.0254999 0.125318 -0.078091 0.0339226 0.125193 -0.100569 -0.0465014 0.151475 0.0954012 -0.111053 -0.230355 -0.0493323 0.146258 0.106308 0.0276593 -0.0116366 0.0875425 -0.120102 0.125877 0.0691187 0.0102876 
-0.038459 0.0577876 0.0510102 -0.104759 0.0751289 0.0927431 -0.0261622 -0.0310405 -0.0531705 0.0756553 0.0281136 0.0127546 0.0319542 -0.030029 0.120474 0.00483358 -0.0958394 0.0108216 0.058133 0.0696103 0.110104 -0.00928343 0.0778355 0.0794431 0.00998627 0.113245 -0.0169464 -0.213712 0.153674 0.031574 0.0274655 -0.0308847 0.0440699 0.0410883 0.0647717 0.103441 0.0175525 0.172786 0.0305125 -0.0272784 0.0133927 -0.0545374 -0.0899443 0.0235099 -0.107882 0.125269 0.161499 0.01462 -0.193376 -0.074145 -0.10688 0.0449505 -0.0212961 -0.011058 0.120206 0.0740849 0.0554819 0.11845 -0.134964 -0.0595185 -0.0473717 -0.0480508 0.184649 -0.0476158 0.159946 -0.0203142 -0.0312949 0.0861721 0.0233898 0.149033 -0.0163732 0.0734303 -0.165251 -0.0273127 0.112509 -0.0233943 -0.107806 0.16589 0.0961593 -0.0131312 -0.115562 0.151493 -0.0219488 0.0128731 -0.0283618 -0.0651516 0.0749687 0.11455 0.0264157 0.0563616 0.140894 -0.0139423 -0.00463183 0.0471573 -0.0336842 -0.109053 -0.0205722 0.111104 0.0965317 -0.0639429 0.0130462 -0.0438039 -0.0923867 -0.0332575 -0.0743462 0.0952672 -0.0411415 -0.0252697 0.131527 -0.0817612 0.00868561 0.114058 -0.0879211 -0.0764725 0.164283 0.0871671 -0.103143 -0.244165 -0.0262561 0.142382 0.112537 0.0184211 -0.0203631 0.0745853 -0.114634 0.133655 0.0717126 0.0320158 
-0.0462025 0.0465758 0.0608538 -0.0430221 0.0477332 0.0923678 -0.0161604 -0.0328438 0.00845958 0.0318143 0.0728742 0.0109379 -0.000734115 -0.0328821 0.0813305 0.0177786 -0.0603796 0.0329775 0.0347475 0.0360114 0.124314 -0.0294435 0.0753678 0.101106 0.0228619 0.0967672 0.0055381 -0.188927 0.164416 -0.0033257 0.113731 -0.0255477 0.0354475 0.0284248 0.0715238 0.121483 0.00760287 0.18943 0.0125547 -0.0223996 0.0100961 -0.00437236 -0.114979 0.0506211 -0.090377 0.0148696 0.12637 -0.00894884 -0.123981 -0.0856426 -0.11541 0.0519517 -0.0397061 -0.0279242 0.0942823 0.0887664 0.0264154 0.157305 -0.121775 -0.0611545 -0.113241 -0.0970151 0.218702 -0.102873 0.186201 -0.0156023 -0.00345947 0.0156757 -0.0255228 0.207726 -0.01402 0.0813378 -0.129555 0.000155797 0.0727612 -0.0965428 -0.0681704 0.181574 0.0340988 -0.0430272 -0.135861 0.130387 -0.0185535 -0.0380923 -0.0327498 -0.102285 0.0638939 0.106893 0.0134461 0.0164987 0.144726 -0.0245212 -0.00767061 0.000631464 0.0763153 -0.0963789 -0.01914 0.107935 0.0606182 0.00187881 -0.0524766 -0.0465245 -0.109673 -0.0125067 -0.0171359 0.103228 0.0297211 -0.0858816 0.179642 -0.116809 -0.0714126 0.136564 -0.0627246 -0.0290383 0.217337 0.061457 -0.0268771 -0.223389 0.0315754 0.141137 0.0933868 0.0123756 -0.0164959 0.0723172 -0.0795827 0.125582 0.0968757 0.047087 
-0.038404 0.0379657 0.0677567 -0.0356133 0.0604644 0.110285 -0.00865504 -0.0396588 0.0216069 0.00568226 0.0679347 0.0248299 -0.00623657 -0.0351766 0.072854 0.00494543 -0.0756774 0.032309 0.0154279 0.0387671 0.135837 -0.0265852 0.0721826 0.111758 0.031965 0.0764923 -0.00707158 -0.178018 0.152417 -0.0006691 0.121637 -0.0310837 0.0256526 0.0360557 0.0736513 0.122332 -0.00254584 0.174112 0.00328152 -0.0337996 0.0276455 -0.00137081 -0.104571 0.0503 -0.0987595 -0.00560844 0.118722 -0.00518078 -0.111801 -0.0624925 -0.118354 0.0480833 -0.0353088 -0.0243459 0.112931 0.0848792 0.00872722 0.169696 -0.13385 -0.0695862 -0.122241 -0.0849027 0.229294 -0.107776 0.179368 -0.00625381 -0.00457384 0.0106434 -0.0458828 0.218747 -0.0042309 0.0880149 -0.124043 0.00917401 0.0668614 -0.0882804 -0.0607907 0.156176 0.0362921 -0.0351586 -0.127895 0.129692 -0.00397987 -0.0380108 -0.0311234 -0.104964 0.0676589 0.117277 0.0147044 0.0303622 0.159669 -0.0401909 -0.0103224 -0.000403743 0.0719311 -0.0991569 -0.0282344 0.103191 0.0542471 0.00424249 -0.0426117 -0.0430347 -0.107616 -0.0207814 -0.0233001 0.114456 0.0269195 -0.0850233 0.171424 -0.112328 -0.0617889 0.13795 -0.067714 -0.0184294 0.222302 0.0656569 -0.0154368 -0.202104 0.0408885 0.158751 0.0999197 0.00754341 -0.0155409 0.0639457 -0.0834768 0.131527 0.113442 0.0507239 
-0.0433707 0.0572847 0.0921034 -0.0346516 0.0575304 0.0912324 0.00792693 -0.0390432 0.0252529 0.00821886 0.0740818 0.0271195 -0.00823415 -0.0207089 0.0854791 -0.0135819 -0.0485596 0.0264073 0.0119594 0.0362967 0.121261 -0.00762639 0.0479302 0.129719 0.0260837 0.0572539 -0.0154891 -0.149374 0.169008 0.0134157 0.122609 -0.0337412 0.0311698 0.0442514 0.0735658 0.132611 0.0131403 0.165916 -0.0145713 -0.0172109 0.0303676 0.00666424 -0.102949 0.0387028 -0.0897821 0.0207199 0.112119 -0.00721119 -0.10443 -0.0723685 -0.11858 0.0726306 -0.0477836 -0.0342005 0.114191 0.0967374 -0.0144455 0.171728 -0.138995 -0.0396008 -0.131836 -0.0902881 0.20668 -0.118567 0.183409 -0.0244249 0.00972063 -0.0110335 -0.0639817 0.224452 0.00637411 0.0763414 -0.122269 0.013641 0.0750196 -0.0738031 -0.0487494 0.177331 0.0374953 -0.0534953 -0.134182 0.131845 -0.00771684 -0.0250354 -0.0198134 -0.109536 0.0650713 0.0980732 -0.00411693 0.0432352 0.155872 -0.0447373 0.00361674 -0.0031398 0.0807098 -0.099782 -0.0234323 0.0788892 0.0663983 0.0117301 -0.056274 -0.024409 -0.110885 -0.0114754 -0.0338501 0.115281 0.0328797 -0.0924706 0.176963 -0.11116 -0.0645964 0.118392 -0.0794295 -0.0127617 0.209963 0.067104 0.0012465 -0.213518 0.0346896 0.169953 0.0932031 0.0117418 -0.0354296 0.0846163 -0.077566 0.13454 0.108382 0.0358101 
-0.0340388 0.00716302 0.0729454 -0.0187424 0.0690658 0.101762 -0.00203301 -0.0549294 0.0405331 -0.0184343 0.0668214 0.0497746 -0.0115664 -0.00989199 0.0682124 -0.00783577 -0.0705404 0.0314724 0.0207052 0.0534836 0.132892 -0.0283957 0.0669455 0.118516 0.0353141 0.0733189 -0.0161972 -0.16851 0.137752 0.0102259 0.122652 -0.0160926 0.0363531 0.0321641 0.0721114 0.130694 -0.00520328 0.167758 0.000472544 -0.0518479 0.0380018 0.00966444 -0.10163 0.0308055 -0.105363 -0.0215005 0.10159 -0.0154256 -0.0835312 -0.0603379 -0.135431 0.0430585 -0.0115304 -0.0207133 0.127327 0.0860092 -0.00541216 0.177482 -0.156684 -0.0540633 -0.127563 -0.0786931 0.230084 -0.114356 0.178458 0.0162829 -0.00383771 0.000913901 -0.0616815 0.210777 0.00160076 0.0810394 -0.124736 0.0122901 0.0612013 -0.0755795 -0.0432818 0.120598 0.0352688 -0.0377346 -0.128998 0.131675 -0.00366275 -0.0402579 -0.013141 -0.1142 0.0650227 0.123938 0.00935497 0.0349548 0.170452 -0.0418497 -0.00104993 0.013663 0.0758719 -0.0989267 -0.0373564 0.091332 0.0644811 0.00988802 -0.0375458 -0.0531189 -0.108423 -0.0369561 -0.0245619 0.13005 0.043263 -0.103713 0.163933 -0.105222 -0.0682669 0.123161 -0.06526 -0.0212178 0.222053 0.064918 -0.00116193 -0.188995 0.0467277 0.168493 0.0981945 0.00224375 -0.0219871 0.0531293 -0.0862841 0.146449 0.127062 0.0553405 
-0.0461618 0.0477888 0.0822032 -0.0124997 0.0591335 0.0897825 -0.00297363 -0.0563355 0.0306192 -0.0103495 0.070933 0.0344692 -0.0134679 -0.0141095 0.063896 0.00132788 -0.0442693 0.0314298 0.0158317 0.0484689 0.128803 -0.0280069 0.0553833 0.11848 0.0299977 0.0619143 -0.0268541 -0.152335 0.15944 0.0162718 0.128587 -0.00227081 0.0398349 0.0377558 0.0719909 0.136466 0.00931391 0.17015 -0.0049058 -0.0390406 0.0284728 0.0072532 -0.0937524 0.0155373 -0.0793598 0.00744732 0.113125 -0.0182662 -0.102908 -0.0756135 -0.131695 0.0671198 -0.0200402 -0.0302952 0.112826 0.0966287 -0.00484312 0.16283 -0.14589 -0.0451007 -0.134999 -0.0770762 0.21179 -0.132864 0.185323 0.00679182 0.00384165 -0.01629 -0.0765135 0.217877 -0.00130932 0.0643692 -0.128827 0.0160013 0.071641 -0.0718599 -0.0341831 0.148857 0.0273488 -0.0549818 -0.141105 0.132568 -0.0132288 -0.0343737 -0.0178171 -0.0999904 0.0488175 0.103854 -0.00349248 0.0411867 0.163941 -0.0411129 0.00456462 0.0101266 0.0938193 -0.0874494 -0.025532 0.094259 0.0605455 0.015004 -0.0493923 -0.0407496 -0.117104 -0.0122011 -0.0213223 0.130713 0.0518496 -0.0974916 0.174961 -0.112215 -0.0858874 0.112112 -0.0719867 -0.0206802 0.218601 0.0605702 -0.00326734 -0.2003 0.0532218 0.171031 0.0887501 0.00804024 -0.0260657 0.067003 -0.0769468 0.148848 0.121838 0.0359255 
