-0.0879366 0.0444954 0.146524 -0.0723697 -0.00851355 0.0833652 -0.0740404 0.0976425 -0.1085 0.108749 -0.0529666 -0.0664564 0.0363895 -0.115768 0.157524 0.0172177 -0.0433898 -0.0851533 0.0482109 0.0207267 0.0730633 -0.123777 0.111914 0.0640294 0.0745009 0.0752647 -0.0409453 -0.166313 0.0847979 -0.152523 0.190139 -0.055713 -0.0270631 0.0699914 0.0215331 0.0429607 -0.0440758 0.166139 0.0194786 -0.0492491 0.00136013 -0.113004 -0.0757973 0.0235811 0.0191127 0.0117568 0.0744352 0.0585438 -0.149743 -0.0349873 -0.0156696 0.00650429 -0.000945693 -0.104345 0.0335971 0.0142687 0.0314453 0.0572053 0.00534851 -0.141224 -0.0291005 -0.0188707 0.00371989 -0.0406301 0.137054 0.0109064 -0.0376001 0.0865015 -0.0361926 0.0947895 -0.0951621 0.104746 -0.156256 0.0102317 0.0438912 -0.116233 -0.0309404 0.159127 0.15136 0.155426 -0.175161 -0.0844504 0.0329142 -0.011302 -0.0435592 -0.194378 0.0865528 0.142942 0.101833 -0.0386869 0.0288115 0.0792677 0.0695349 0.0541975 -0.0357366 -0.00867947 0.0638502 0.108734 -0.0814299 -0.0717545 -0.0177273 -0.0142131 -0.164782 0.0178645 0.0369885 0.0109487 -0.0325541 -0.0226038 0.216929 -0.101844 -0.0678471 0.182916 -0.106805 -0.0194396 0.186427 0.0329617 -0.0740001 -0.132633 0.000162399 0.176999 0.0308027 0.0472594 -0.049639 0.0579141 -0.0596124 0.025156 0.0609122 0.00795595 
-0.0879366 0.0444954 0.146524 -0.0723697 -0.00851355 0.0833652 -0.0740404 0.0976425 -0.1085 0.108749 -0.0529666 -0.0664564 0.0363895 -0.115768 0.157524 0.0172177 -0.0433898 -0.0851533 0.0482109 0.0207267 0.0730633 -0.123777 0.111914 0.0640294 0.0745009 0.0752647 -0.0409453 -0.166313 0.0847979 -0.152523 0.190139 -0.055713 -0.0270631 0.0699914 0.0215331 0.0429607 -0.0440758 0.166139 0.0194786 -0.0492491 0.00136013 -0.113004 -0.0757973 0.0235811 0.0191127 0.0117568 0.0744352 0.0585438 -0.149743 -0.0349873 -0.0156696 0.00650429 -0.000945693 -0.104345 0.0335971 0.0142687 0.0314453 0.0572053 0.00534851 -0.141224 -0.0291005 -0.0188707 0.00371989 -0.0406301 0.137054 0.0109064 -0.0376001 0.0865015 -0.0361926 0.0947895 -0.0951621 0.104746 -0.156256 0.0102317 0.0438912 -0.116233 -0.0309404 0.159127 0.15136 0.155426 -0.175161 -0.0844504 0.0329142 -0.011302 -0.0435592 -0.194378 0.0865528 0.142942 0.101833 -0.0386869 0.0288115 0.0792677 0.0695349 0.0541975 -0.0357366 -0.00867947 0.0638502 0.108734 -0.0814299 -0.0717545 -0.0177273 -0.0142131 -0.164782 0.0178645 0.0369885 0.0109487 -0.0325541 -0.0226038 0.216929 -0.101844 -0.0678471 0.182916 -0.106805 -0.0194396 0.186427 0.0329617 -0.0740001 -0.132633 0.000162399 0.176999 0.0308027 0.0472594 -0.049639 0.0579141 -0.0596124 0.025156 0.0609122 0.00795595 
-0.0879366 0.0444954 0.146524 -0.0723697 -0.00851355 0.0833652 -0.0740404 0.0976425 -0.1085 0.108749 -0.0529666 -0.0664564 0.0363895 -0.115768 0.157524 0.0172177 -0.0433898 -0.0851533 0.0482109 0.0207267 0.0730633 -0.123777 0.111914 0.0640294 0.0745009 0.0752647 -0.0409453 -0.166313 0.0847979 -0.152523 0.190139 -0.055713 -0.0270631 0.0699914 0.0215331 0.0429607 -0.0440758 0.166139 0.0194786 -0.0492491 0.00136013 -0.113004 -0.0757973 0.0235811 0.0191127 0.0117568 0.0744352 0.0585438 -0.149743 -0.0349873 -0.0156696 0.00650429 -0.000945693 -0.104345 0.0335971 0.0142687 0.0314453 0.0572053 0.00534851 -0.141224 -0.0291005 -0.0188707 0.00371989 -0.0406301 0.137054 0.0109064 -0.0376001 0.0865015 -0.0361926 0.0947895 -0.0951621 0.104746 -0.156256 0.0102317 0.0438912 -0.116233 -0.0309404 0.159127 0.15136 0.155426 -0.175161 -0.0844504 0.0329142 -0.011302 -0.0435592 -0.194378 0.0865528 0.142942 0.101833 -0.0386869 0.0288115 0.0792677 0.0695349 0.0541975 -0.0357366 -0.00867947 0.0638502 0.108734 -0.0814299 -0.0717545 -0.0177273 -0.0142131 -0.164782 0.0178645 0.0369885 0.0109487 -0.0325541 -0.0226038 0.216929 -0.101844 -0.0678471 0.182916 -0.106805 -0.0194396 0.186427 0.0329617 -0.0740001 -0.132633 0.000162399 0.176999 0.0308027 0.0472594 -0.049639 0.0579141 -0.0596124 0.025156 0.0609122 0.00795595 
-0.0879366 0.0444954 0.146524 -0.0723697 -0.00851355 0.0833652 -0.0740404 0.0976425 -0.1085 0.108749 -0.0529666 -0.0664564 0.0363895 -0.115768 0.157524 0.0172177 -0.0433898 -0.0851533 0.0482109 0.0207267 0.0730633 -0.123777 0.111914 0.0640294 0.0745009 0.0752647 -0.0409453 -0.166313 0.0847979 -0.152523 0.190139 -0.055713 -0.0270631 0.0699914 0.0215331 0.0429607 -0.0440758 0.166139 0.0194786 -0.0492491 0.00136013 -0.113004 -0.0757973 0.0235811 0.0191127 0.0117568 0.0744352 0.0585438 -0.149743 -0.0349873 -0.0156696 0.00650429 -0.000945693 -0.104345 0.0335971 0.0142687 0.0314453 0.0572053 0.00534851 -0.141224 -0.0291005 -0.0188707 0.00371989 -0.0406301 0.137054 0.0109064 -0.0376001 0.0865015 -0.0361926 0.0947895 -0.0951621 0.104746 -0.156256 0.0102317 0.0438912 -0.116233 -0.0309404 0.159127 0.15136 0.155426 -0.175161 -0.0844504 0.0329142 -0.011302 -0.0435592 -0.194378 0.0865528 0.142942 0.101833 -0.0386869 0.0288115 0.0792677 0.0695349 0.0541975 -0.0357366 -0.00867947 0.0638502 0.108734 -0.0814299 -0.0717545 -0.0177273 -0.0142131 -0.164782 0.0178645 0.0369885 0.0109487 -0.0325541 -0.0226038 0.216929 -0.101844 -0.0678471 0.182916 -0.106805 -0.0194396 0.186427 0.0329617 -0.0740001 -0.132633 0.000162399 0.176999 0.0308027 0.0472594 -0.049639 0.0579141 -0.0596124 0.025156 0.0609122 0.00795595 
-0.0879366 0.0444954 0.146524 -0.0723697 -0.00851355 0.0833652 -0.0740404 0.0976425 -0.1085 0.108749 -0.0529666 -0.0664564 0.0363895 -0.115768 0.157524 0.0172177 -0.0433898 -0.0851533 0.0482109 0.0207267 0.0730633 -0.123777 0.111914 0.0640294 0.0745009 0.0752647 -0.0409453 -0.166313 0.0847979 -0.152523 0.190139 -0.055713 -0.0270631 0.0699914 0.0215331 0.0429607 -0.0440758 0.166139 0.0194786 -0.0492491 0.00136013 -0.113004 -0.0757973 0.0235811 0.0191127 0.0117568 0.0744352 0.0585438 -0.149743 -0.0349873 -0.0156696 0.00650429 -0.000945693 -0.104345 0.0335971 0.0142687 0.0314453 0.0572053 0.00534851 -0.141224 -0.0291005 -0.0188707 0.00371989 -0.0406301 0.137054 0.0109064 -0.0376001 0.0865015 -0.0361926 0.0947895 -0.0951621 0.104746 -0.156256 0.0102317 0.0438912 -0.116233 -0.0309404 0.159127 0.15136 0.155426 -0.175161 -0.0844504 0.0329142 -0.011302 -0.0435592 -0.194378 0.0865528 0.142942 0.101833 -0.0386869 0.0288115 0.0792677 0.0695349 0.0541975 -0.0357366 -0.00867947 0.0638502 0.108734 -0.0814299 -0.0717545 -0.0177273 -0.0142131 -0.164782 0.0178645 0.0369885 0.0109487 -0.0325541 -0.0226038 0.216929 -0.101844 -0.0678471 0.182916 -0.106805 -0.0194396 0.186427 0.0329617 -0.0740001 -0.132633 0.000162399 0.176999 0.0308027 0.0472594 -0.049639 0.0579141 -0.0596124 0.025156 0.0609122 0.00795595 
-0.0879366 0.0444954 0.146524 -0.0723697 -0.00851355 0.0833652 -0.0740404 0.0976425 -0.1085 0.108749 -0.0529666 -0.0664564 0.0363895 -0.115768 0.157524 0.0172177 -0.0433898 -0.0851533 0.0482109 0.0207267 0.0730633 -0.123777 0.111914 0.0640294 0.0745009 0.0752647 -0.0409453 -0.166313 0.0847979 -0.152523 0.190139 -0.055713 -0.0270631 0.0699914 0.0215331 0.0429607 -0.0440758 0.166139 0.0194786 -0.0492491 0.00136013 -0.113004 -0.0757973 0.0235811 0.0191127 0.0117568 0.0744352 0.0585438 -0.149743 -0.0349873 -0.0156696 0.00650429 -0.000945693 -0.104345 0.0335971 0.0142687 0.0314453 0.0572053 0.00534851 -0.141224 -0.0291005 -0.0188707 0.00371989 -0.0406301 0.137054 0.0109064 -0.0376001 0.0865015 -0.0361926 0.0947895 -0.0951621 0.104746 -0.156256 0.0102317 0.0438912 -0.116233 -0.0309404 0.159127 0.15136 0.155426 -0.175161 -0.0844504 0.0329142 -0.011302 -0.0435592 -0.194378 0.0865528 0.142942 0.101833 -0.0386869 0.0288115 0.0792677 0.0695349 0.0541975 -0.0357366 -0.00867947 0.0638502 0.108734 -0.0814299 -0.0717545 -0.0177273 -0.0142131 -0.164782 0.0178645 0.0369885 0.0109487 -0.0325541 -0.0226038 0.216929 -0.101844 -0.0678471 0.182916 -0.106805 -0.0194396 0.186427 0.0329617 -0.0740001 -0.132633 0.000162399 0.176999 0.0308027 0.0472594 -0.049639 0.0579141 -0.0596124 0.025156 0.0609122 0.00795595 
-0.0879366 0.0444954 0.146524 -0.0723697 -0.00851355 0.0833652 -0.0740404 0.0976425 -0.1085 0.108749 -0.0529666 -0.0664564 0.0363895 -0.115768 0.157524 0.0172177 -0.0433898 -0.0851533 0.0482109 0.0207267 0.0730633 -0.123777 0.111914 0.0640294 0.0745009 0.0752647 -0.0409453 -0.166313 0.0847979 -0.152523 0.190139 -0.055713 -0.0270631 0.0699914 0.0215331 0.0429607 -0.0440758 0.166139 0.0194786 -0.0492491 0.00136013 -0.113004 -0.0757973 0.0235811 0.0191127 0.0117568 0.0744352 0.0585438 -0.149743 -0.0349873 -0.0156696 0.00650429 -0.000945693 -0.104345 0.0335971 0.0142687 0.0314453 0.0572053 0.00534851 -0.141224 -0.0291005 -0.0188707 0.00371989 -0.0406301 0.137054 0.0109064 -0.0376001 0.0865015 -0.0361926 0.0947895 -0.0951621 0.104746 -0.156256 0.0102317 0.0438912 -0.116233 -0.0309404 0.159127 0.15136 0.155426 -0.175161 -0.0844504 0.0329142 -0.011302 -0.0435592 -0.194378 0.0865528 0.142942 0.101833 -0.0386869 0.0288115 0.0792677 0.0695349 0.0541975 -0.0357366 -0.00867947 0.0638502 0.108734 -0.0814299 -0.0717545 -0.0177273 -0.0142131 -0.164782 0.0178645 0.0369885 0.0109487 -0.0325541 -0.0226038 0.216929 -0.101844 -0.0678471 0.182916 -0.106805 -0.0194396 0.186427 0.0329617 -0.0740001 -0.132633 0.000162399 0.176999 0.0308027 0.0472594 -0.049639 0.0579141 -0.0596124 0.025156 0.0609122 0.00795595 
-0.0879366 0.0444954 0.146524 -0.0723697 -0.00851355 0.0833652 -0.0740404 0.0976425 -0.1085 0.108749 -0.0529666 -0.0664564 0.0363895 -0.115768 0.157524 0.0172177 -0.0433898 -0.0851533 0.0482109 0.0207267 0.0730633 -0.123777 0.111914 0.0640294 0.0745009 0.0752647 -0.0409453 -0.166313 0.0847979 -0.152523 0.190139 -0.055713 -0.0270631 0.0699914 0.0215331 0.0429607 -0.0440758 0.166139 0.0194786 -0.0492491 0.00136013 -0.113004 -0.0757973 0.0235811 0.0191127 0.0117568 0.0744352 0.0585438 -0.149743 -0.0349873 -0.0156696 0.00650429 -0.000945693 -0.104345 0.0335971 0.0142687 0.0314453 0.0572053 0.00534851 -0.141224 -0.0291005 -0.0188707 0.00371989 -0.0406301 0.137054 0.0109064 -0.0376001 0.0865015 -0.0361926 0.0947895 -0.0951621 0.104746 -0.156256 0.0102317 0.0438912 -0.116233 -0.0309404 0.159127 0.15136 0.155426 -0.175161 -0.0844504 0.0329142 -0.011302 -0.0435592 -0.194378 0.0865528 0.142942 0.101833 -0.0386869 0.0288115 0.0792677 0.0695349 0.0541975 -0.0357366 -0.00867947 0.0638502 0.108734 -0.0814299 -0.0717545 -0.0177273 -0.0142131 -0.164782 0.0178645 0.0369885 0.0109487 -0.0325541 -0.0226038 0.216929 -0.101844 -0.0678471 0.182916 -0.106805 -0.0194396 0.186427 0.0329617 -0.0740001 -0.132633 0.000162399 0.176999 0.0308027 0.0472594 -0.049639 0.0579141 -0.0596124 0.025156 0.0609122 0.00795595 
-0.0879366 0.0444954 0.146524 -0.0723697 -0.00851355 0.0833652 -0.0740404 0.0976425 -0.1085 0.108749 -0.0529666 -0.0664564 0.0363895 -0.115768 0.157524 0.0172177 -0.0433898 -0.0851533 0.0482109 0.0207267 0.0730633 -0.123777 0.111914 0.0640294 0.0745009 0.0752647 -0.0409453 -0.166313 0.0847979 -0.152523 0.190139 -0.055713 -0.0270631 0.0699914 0.0215331 0.0429607 -0.0440758 0.166139 0.0194786 -0.0492491 0.00136013 -0.113004 -0.0757973 0.0235811 0.0191127 0.0117568 0.0744352 0.0585438 -0.149743 -0.0349873 -0.0156696 0.00650429 -0.000945693 -0.104345 0.0335971 0.0142687 0.0314453 0.0572053 0.00534851 -0.141224 -0.0291005 -0.0188707 0.00371989 -0.0406301 0.137054 0.0109064 -0.0376001 0.0865015 -0.0361926 0.0947895 -0.0951621 0.104746 -0.156256 0.0102317 0.0438912 -0.116233 -0.0309404 0.159127 0.15136 0.155426 -0.175161 -0.0844504 0.0329142 -0.011302 -0.0435592 -0.194378 0.0865528 0.142942 0.101833 -0.0386869 0.0288115 0.0792677 0.0695349 0.0541975 -0.0357366 -0.00867947 0.0638502 0.108734 -0.0814299 -0.0717545 -0.0177273 -0.0142131 -0.164782 0.0178645 0.0369885 0.0109487 -0.0325541 -0.0226038 0.216929 -0.101844 -0.0678471 0.182916 -0.106805 -0.0194396 0.186427 0.0329617 -0.0740001 -0.132633 0.000162399 0.176999 0.0308027 0.0472594 -0.049639 0.0579141 -0.0596124 0.025156 0.0609122 0.00795595 
-0.0879366 0.0444954 0.146524 -0.0723697 -0.00851355 0.0833652 -0.0740404 0.0976425 -0.1085 0.108749 -0.0529666 -0.0664564 0.0363895 -0.115768 0.157524 0.0172177 -0.0433898 -0.0851533 0.0482109 0.0207267 0.0730633 -0.123777 0.111914 0.0640294 0.0745009 0.0752647 -0.0409453 -0.166313 0.0847979 -0.152523 0.190139 -0.055713 -0.0270631 0.0699914 0.0215331 0.0429607 -0.0440758 0.166139 0.0194786 -0.0492491 0.00136013 -0.113004 -0.0757973 0.0235811 0.0191127 0.0117568 0.0744352 0.0585438 -0.149743 -0.0349873 -0.0156696 0.00650429 -0.000945693 -0.104345 0.0335971 0.0142687 0.0314453 0.0572053 0.00534851 -0.141224 -0.0291005 -0.0188707 0.00371989 -0.0406301 0.137054 0.0109064 -0.0376001 0.0865015 -0.0361926 0.0947895 -0.0951621 0.104746 -0.156256 0.0102317 0.0438912 -0.116233 -0.0309404 0.159127 0.15136 0.155426 -0.175161 -0.0844504 0.0329142 -0.011302 -0.0435592 -0.194378 0.0865528 0.142942 0.101833 -0.0386869 0.0288115 0.0792677 0.0695349 0.0541975 -0.0357366 -0.00867947 0.0638502 0.108734 -0.0814299 -0.0717545 -0.0177273 -0.0142131 -0.164782 0.0178645 0.0369885 0.0109487 -0.0325541 -0.0226038 0.216929 -0.101844 -0.0678471 0.182916 -0.106805 -0.0194396 0.186427 0.0329617 -0.0740001 -0.132633 0.000162399 0.176999 0.0308027 0.0472594 -0.049639 0.0579141 -0.0596124 0.025156 0.0609122 0.00795595 
-0.0879366 0.0444954 0.146524 -0.0723697 -0.00851355 0.0833652 -0.0740404 0.0976425 -0.1085 0.108749 -0.0529666 -0.0664564 0.0363895 -0.115768 0.157524 0.0172177 -0.0433898 -0.0851533 0.0482109 0.0207267 0.0730633 -0.123777 0.111914 0.0640294 0.0745009 0.0752647 -0.0409453 -0.166313 0.0847979 -0.152523 0.190139 -0.055713 -0.0270631 0.0699914 0.0215331 0.0429607 -0.0440758 0.166139 0.0194786 -0.0492491 0.00136013 -0.113004 -0.0757973 0.0235811 0.0191127 0.0117568 0.0744352 0.0585438 -0.149743 -0.0349873 -0.0156696 0.00650429 -0.000945693 -0.104345 0.0335971 0.0142687 0.0314453 0.0572053 0.00534851 -0.141224 -0.0291005 -0.0188707 0.00371989 -0.0406301 0.137054 0.0109064 -0.0376001 0.0865015 -0.0361926 0.0947895 -0.0951621 0.104746 -0.156256 0.0102317 0.0438912 -0.116233 -0.0309404 0.159127 0.15136 0.155426 -0.175161 -0.0844504 0.0329142 -0.011302 -0.0435592 -0.194378 0.0865528 0.142942 0.101833 -0.0386869 0.0288115 0.0792677 0.0695349 0.0541975 -0.0357366 -0.00867947 0.0638502 0.108734 -0.0814299 -0.0717545 -0.0177273 -0.0142131 -0.164782 0.0178645 0.0369885 0.0109487 -0.0325541 -0.0226038 0.216929 -0.101844 -0.0678471 0.182916 -0.106805 -0.0194396 0.186427 0.0329617 -0.0740001 -0.132633 0.000162399 0.176999 0.0308027 0.0472594 -0.049639 0.0579141 -0.0596124 0.025156 0.0609122 0.00795595 
-0.0879366 0.0444954 0.146524 -0.0723697 -0.00851355 0.0833652 -0.0740404 0.0976425 -0.1085 0.108749 -0.0529666 -0.0664564 0.0363895 -0.115768 0.157524 0.0172177 -0.0433898 -0.0851533 0.0482109 0.0207267 0.0730633 -0.123777 0.111914 0.0640294 0.0745009 0.0752647 -0.0409453 -0.166313 0.0847979 -0.152523 0.190139 -0.055713 -0.0270631 0.0699914 0.0215331 0.0429607 -0.0440758 0.166139 0.0194786 -0.0492491 0.00136013 -0.113004 -0.0757973 0.0235811 0.0191127 0.0117568 0.0744352 0.0585438 -0.149743 -0.0349873 -0.0156696 0.00650429 -0.000945693 -0.104345 0.0335971 0.0142687 0.0314453 0.0572053 0.00534851 -0.141224 -0.0291005 -0.0188707 0.00371989 -0.0406301 0.137054 0.0109064 -0.0376001 0.0865015 -0.0361926 0.0947895 -0.0951621 0.104746 -0.156256 0.0102317 0.0438912 -0.116233 -0.0309404 0.159127 0.15136 0.155426 -0.175161 -0.0844504 0.0329142 -0.011302 -0.0435592 -0.194378 0.0865528 0.142942 0.101833 -0.0386869 0.0288115 0.0792677 0.0695349 0.0541975 -0.0357366 -0.00867947 0.0638502 0.108734 -0.0814299 -0.0717545 -0.0177273 -0.0142131 -0.164782 0.0178645 0.0369885 0.0109487 -0.0325541 -0.0226038 0.216929 -0.101844 -0.0678471 0.182916 -0.106805 -0.0194396 0.186427 0.0329617 -0.0740001 -0.132633 0.000162399 0.176999 0.0308027 0.0472594 -0.049639 0.0579141 -0.0596124 0.025156 0.0609122 0.00795595 
-0.0879366 0.0444954 0.146524 -0.0723697 -0.00851355 0.0833652 -0.0740404 0.0976425 -0.1085 0.108749 -0.0529666 -0.0664564 0.0363895 -0.115768 0.157524 0.0172177 -0.0433898 -0.0851533 0.0482109 0.0207267 0.0730633 -0.123777 0.111914 0.0640294 0.0745009 0.0752647 -0.0409453 -0.166313 0.0847979 -0.152523 0.190139 -0.055713 -0.0270631 0.0699914 0.0215331 0.0429607 -0.0440758 0.166139 0.0194786 -0.0492491 0.00136013 -0.113004 -0.0757973 0.0235811 0.0191127 0.0117568 0.0744352 0.0585438 -0.149743 -0.0349873 -0.0156696 0.00650429 -0.000945693 -0.104345 0.0335971 0.0142687 0.0314453 0.0572053 0.00534851 -0.141224 -0.0291005 -0.0188707 0.00371989 -0.0406301 0.137054 0.0109064 -0.0376001 0.0865015 -0.0361926 0.0947895 -0.0951621 0.104746 -0.156256 0.0102317 0.0438912 -0.116233 -0.0309404 0.159127 0.15136 0.155426 -0.175161 -0.0844504 0.0329142 -0.011302 -0.0435592 -0.194378 0.0865528 0.142942 0.101833 -0.0386869 0.0288115 0.0792677 0.0695349 0.0541975 -0.0357366 -0.00867947 0.0638502 0.108734 -0.0814299 -0.0717545 -0.0177273 -0.0142131 -0.164782 0.0178645 0.0369885 0.0109487 -0.0325541 -0.0226038 0.216929 -0.101844 -0.0678471 0.182916 -0.106805 -0.0194396 0.186427 0.0329617 -0.0740001 -0.132633 0.000162399 0.176999 0.0308027 0.0472594 -0.049639 0.0579141 -0.0596124 0.025156 0.0609122 0.00795595 
-0.0879366 0.0444954 0.146524 -0.0723697 -0.00851355 0.0833652 -0.0740404 0.0976425 -0.1085 0.108749 -0.0529666 -0.0664564 0.0363895 -0.115768 0.157524 0.0172177 -0.0433898 -0.0851533 0.0482109 0.0207267 0.0730633 -0.123777 0.111914 0.0640294 0.0745009 0.0752647 -0.0409453 -0.166313 0.0847979 -0.152523 0.190139 -0.055713 -0.0270631 0.0699914 0.0215331 0.0429607 -0.0440758 0.166139 0.0194786 -0.0492491 0.00136013 -0.113004 -0.0757973 0.0235811 0.0191127 0.0117568 0.0744352 0.0585438 -0.149743 -0.0349873 -0.0156696 0.00650429 -0.000945693 -0.104345 0.0335971 0.0142687 0.0314453 0.0572053 0.00534851 -0.141224 -0.0291005 -0.0188707 0.00371989 -0.0406301 0.137054 0.0109064 -0.0376001 0.0865015 -0.0361926 0.0947895 -0.0951621 0.104746 -0.156256 0.0102317 0.0438912 -0.116233 -0.0309404 0.159127 0.15136 0.155426 -0.175161 -0.0844504 0.0329142 -0.011302 -0.0435592 -0.194378 0.0865528 0.142942 0.101833 -0.0386869 0.0288115 0.0792677 0.0695349 0.0541975 -0.0357366 -0.00867947 0.0638502 0.108734 -0.0814299 -0.0717545 -0.0177273 -0.0142131 -0.164782 0.0178645 0.0369885 0.0109487 -0.0325541 -0.0226038 0.216929 -0.101844 -0.0678471 0.182916 -0.106805 -0.0194396 0.186427 0.0329617 -0.0740001 -0.132633 0.000162399 0.176999 0.0308027 0.0472594 -0.049639 0.0579141 -0.0596124 0.025156 0.0609122 0.00795595 
-0.0879366 0.0444954 0.146524 -0.0723697 -0.00851355 0.0833652 -0.0740404 0.0976425 -0.1085 0.108749 -0.0529666 -0.0664564 0.0363895 -0.115768 0.157524 0.0172177 -0.0433898 -0.0851533 0.0482109 0.0207267 0.0730633 -0.123777 0.111914 0.0640294 0.0745009 0.0752647 -0.0409453 -0.166313 0.0847979 -0.152523 0.190139 -0.055713 -0.0270631 0.0699914 0.0215331 0.0429607 -0.0440758 0.166139 0.0194786 -0.0492491 0.00136013 -0.113004 -0.0757973 0.0235811 0.0191127 0.0117568 0.0744352 0.0585438 -0.149743 -0.0349873 -0.0156696 0.00650429 -0.000945693 -0.104345 0.0335971 0.0142687 0.0314453 0.0572053 0.00534851 -0.141224 -0.0291005 -0.0188707 0.00371989 -0.0406301 0.137054 0.0109064 -0.0376001 0.0865015 -0.0361926 0.0947895 -0.0951621 0.104746 -0.156256 0.0102317 0.0438912 -0.116233 -0.0309404 0.159127 0.15136 0.155426 -0.175161 -0.0844504 0.0329142 -0.011302 -0.0435592 -0.194378 0.0865528 0.142942 0.101833 -0.0386869 0.0288115 0.0792677 0.0695349 0.0541975 -0.0357366 -0.00867947 0.0638502 0.108734 -0.0814299 -0.0717545 -0.0177273 -0.0142131 -0.164782 0.0178645 0.0369885 0.0109487 -0.0325541 -0.0226038 0.216929 -0.101844 -0.0678471 0.182916 -0.106805 -0.0194396 0.186427 0.0329617 -0.0740001 -0.132633 0.000162399 0.176999 0.0308027 0.0472594 -0.049639 0.0579141 -0.0596124 0.025156 0.0609122 0.00795595 
-0.0879366 0.0444954 0.146524 -0.0723697 -0.00851355 0.0833652 -0.0740404 0.0976425 -0.1085 0.108749 -0.0529666 -0.0664564 0.0363895 -0.115768 0.157524 0.0172177 -0.0433898 -0.0851533 0.0482109 0.0207267 0.0730633 -0.123777 0.111914 0.0640294 0.0745009 0.0752647 -0.0409453 -0.166313 0.0847979 -0.152523 0.190139 -0.055713 -0.0270631 0.0699914 0.0215331 0.0429607 -0.0440758 0.166139 0.0194786 -0.0492491 0.00136013 -0.113004 -0.0757973 0.0235811 0.0191127 0.0117568 0.0744352 0.0585438 -0.149743 -0.0349873 -0.0156696 0.00650429 -0.000945693 -0.104345 0.0335971 0.0142687 0.0314453 0.0572053 0.00534851 -0.141224 -0.0291005 -0.0188707 0.00371989 -0.0406301 0.137054 0.0109064 -0.0376001 0.0865015 -0.0361926 0.0947895 -0.0951621 0.104746 -0.156256 0.0102317 0.0438912 -0.116233 -0.0309404 0.159127 0.15136 0.155426 -0.175161 -0.0844504 0.0329142 -0.011302 -0.0435592 -0.194378 0.0865528 0.142942 0.101833 -0.0386869 0.0288115 0.0792677 0.0695349 0.0541975 -0.0357366 -0.00867947 0.0638502 0.108734 -0.0814299 -0.0717545 -0.0177273 -0.0142131 -0.164782 0.0178645 0.0369885 0.0109487 -0.0325541 -0.0226038 0.216929 -0.101844 -0.0678471 0.182916 -0.106805 -0.0194396 0.186427 0.0329617 -0.0740001 -0.132633 0.000162399 0.176999 0.0308027 0.0472594 -0.049639 0.0579141 -0.0596124 0.025156 0.0609122 0.00795595 
-0.0879366 0.0444954 0.146524 -0.0723697 -0.00851355 0.0833652 -0.0740404 0.0976425 -0.1085 0.108749 -0.0529666 -0.0664564 0.0363895 -0.115768 0.157524 0.0172177 -0.0433898 -0.0851533 0.0482109 0.0207267 0.0730633 -0.123777 0.111914 0.0640294 0.0745009 0.0752647 -0.0409453 -0.166313 0.0847979 -0.152523 0.190139 -0.055713 -0.0270631 0.0699914 0.0215331 0.0429607 -0.0440758 0.166139 0.0194786 -0.0492491 0.00136013 -0.113004 -0.0757973 0.0235811 0.0191127 0.0117568 0.0744352 0.0585438 -0.149743 -0.0349873 -0.0156696 0.00650429 -0.000945693 -0.104345 0.0335971 0.0142687 0.0314453 0.0572053 0.00534851 -0.141224 -0.0291005 -0.0188707 0.00371989 -0.0406301 0.137054 0.0109064 -0.0376001 0.0865015 -0.0361926 0.0947895 -0.0951621 0.104746 -0.156256 0.0102317 0.0438912 -0.116233 -0.0309404 0.159127 0.15136 0.155426 -0.175161 -0.0844504 0.0329142 -0.011302 -0.0435592 -0.194378 0.0865528 0.142942 0.101833 -0.0386869 0.0288115 0.0792677 0.0695349 0.0541975 -0.0357366 -0.00867947 0.0638502 0.108734 -0.0814299 -0.0717545 -0.0177273 -0.0142131 -0.164782 0.0178645 0.0369885 0.0109487 -0.0325541 -0.0226038 0.216929 -0.101844 -0.0678471 0.182916 -0.106805 -0.0194396 0.186427 0.0329617 -0.0740001 -0.132633 0.000162399 0.176999 0.0308027 0.0472594 -0.049639 0.0579141 -0.0596124 0.025156 0.0609122 0.00795595 
-0.0879366 0.0444954 0.146524 -0.0723697 -0.00851355 0.0833652 -0.0740404 0.0976425 -0.1085 0.108749 -0.0529666 -0.0664564 0.0363895 -0.115768 0.157524 0.0172177 -0.0433898 -0.0851533 0.0482109 0.0207267 0.0730633 -0.123777 0.111914 0.0640294 0.0745009 0.0752647 -0.0409453 -0.166313 0.0847979 -0.152523 0.190139 -0.055713 -0.0270631 0.0699914 0.0215331 0.0429607 -0.0440758 0.166139 0.0194786 -0.0492491 0.00136013 -0.113004 -0.0757973 0.0235811 0.0191127 0.0117568 0.0744352 0.0585438 -0.149743 -0.0349873 -0.0156696 0.00650429 -0.000945693 -0.104345 0.0335971 0.0142687 0.0314453 0.0572053 0.00534851 -0.141224 -0.0291005 -0.0188707 0.00371989 -0.0406301 0.137054 0.0109064 -0.0376001 0.0865015 -0.0361926 0.0947895 -0.0951621 0.104746 -0.156256 0.0102317 0.0438912 -0.116233 -0.0309404 0.159127 0.15136 0.155426 -0.175161 -0.0844504 0.0329142 -0.011302 -0.0435592 -0.194378 0.0865528 0.142942 0.101833 -0.0386869 0.0288115 0.0792677 0.0695349 0.0541975 -0.0357366 -0.00867947 0.0638502 0.108734 -0.0814299 -0.0717545 -0.0177273 -0.0142131 -0.164782 0.0178645 0.0369885 0.0109487 -0.0325541 -0.0226038 0.216929 -0.101844 -0.0678471 0.182916 -0.106805 -0.0194396 0.186427 0.0329617 -0.0740001 -0.132633 0.000162399 0.176999 0.0308027 0.0472594 -0.049639 0.0579141 -0.0596124 0.025156 0.0609122 0.00795595 
-0.0879366 0.0444954 0.146524 -0.0723697 -0.00851355 0.0833652 -0.0740404 0.0976425 -0.1085 0.108749 -0.0529666 -0.0664564 0.0363895 -0.115768 0.157524 0.0172177 -0.0433898 -0.0851533 0.0482109 0.0207267 0.0730633 -0.123777 0.111914 0.0640294 0.0745009 0.0752647 -0.0409453 -0.166313 0.0847979 -0.152523 0.190139 -0.055713 -0.0270631 0.0699914 0.0215331 0.0429607 -0.0440758 0.166139 0.0194786 -0.0492491 0.00136013 -0.113004 -0.0757973 0.0235811 0.0191127 0.0117568 0.0744352 0.0585438 -0.149743 -0.0349873 -0.0156696 0.00650429 -0.000945693 -0.104345 0.0335971 0.0142687 0.0314453 0.0572053 0.00534851 -0.141224 -0.0291005 -0.0188707 0.00371989 -0.0406301 0.137054 0.0109064 -0.0376001 0.0865015 -0.0361926 0.0947895 -0.0951621 0.104746 -0.156256 0.0102317 0.0438912 -0.116233 -0.0309404 0.159127 0.15136 0.155426 -0.175161 -0.0844504 0.0329142 -0.011302 -0.0435592 -0.194378 0.0865528 0.142942 0.101833 -0.0386869 0.0288115 0.0792677 0.0695349 0.0541975 -0.0357366 -0.00867947 0.0638502 0.108734 -0.0814299 -0.0717545 -0.0177273 -0.0142131 -0.164782 0.0178645 0.0369885 0.0109487 -0.0325541 -0.0226038 0.216929 -0.101844 -0.0678471 0.182916 -0.106805 -0.0194396 0.186427 0.0329617 -0.0740001 -0.132633 0.000162399 0.176999 0.0308027 0.0472594 -0.049639 0.0579141 -0.0596124 0.025156 0.0609122 0.00795595 
