0.0427519 0.000653641 -0.104529 -0.00500174 0.0497995 0.181084 -0.00110718 -0.0471892 -0.072594 -0.0724554 0.0198879 0.0884377 0.0625249 -0.149433 -0.0933296 -0.0436778 -0.189982 0.0393253 -0.07408 0.128532 0.152054 -0.107246 0.104181 0.150388 0.00280231 -0.00208965 -0.0159223 -0.270943 -0.00426191 0.0629594 0.0258427 -0.0272804 -0.0888122 0.0433579 -0.00884924 0.0203995 -0.145605 0.0706552 -0.071606 -0.016238 0.0276119 -0.0974005 -0.0947498 0.20199 -0.147248 -0.0364095 0.179783 0.0287369 -0.133483 0.0885207 0.00274841 -0.0557111 -0.0147682 -0.0185387 0.0938197 0.0151649 0.0183885 0.180779 0.0299795 -0.155144 -0.0373447 0.0346035 0.264674 -0.0280856 0.0523492 -0.131886 0.0163147 -0.00423785 -0.0276124 0.116266 -0.041855 0.0941345 -0.0423292 0.0134128 -0.00112928 -0.0522103 -0.102347 0.0395235 0.0139407 0.158299 -0.0633505 0.0173021 -0.0367357 -0.0677059 -0.119814 0.0180967 0.0826253 0.0197148 0.00484997 -0.0200624 0.101197 -0.0955227 -0.0465388 -0.065833 -0.0743779 -0.0789437 -0.0277579 0.117004 0.0628494 -0.0618855 0.0231119 0.0187893 -0.0185019 0.0830035 -0.0772703 0.0384262 -0.112669 0.154287 -0.0202837 -0.044041 0.0597124 0.169416 -0.0809649 -0.0556109 0.0294694 0.127167 -0.0805428 -0.10248 0.0633298 0.154227 0.0239175 -0.0225383 -0.0246481 0.0194104 -0.11787 0.0652539 -0.0175319 0.0329754 
0.0291949 -0.0376298 -0.117733 -0.00150379 0.0809884 0.140564 -0.0245415 -0.0786909 -0.0566038 -0.0979293 0.0179192 0.111573 0.0596471 -0.0965217 -0.134506 -0.0220056 -0.191358 0.0408656 -0.0667944 0.151211 0.180928 -0.132527 0.105324 0.122591 0.0221519 0.0263781 -0.00783911 -0.249109 -0.0135284 0.078019 0.0145696 -0.0278235 -0.082464 0.0196752 -0.0125053 0.0391489 -0.166018 0.0807501 -0.0517776 -0.0465487 0.0174801 -0.0565798 -0.076699 0.189577 -0.13468 -0.0389127 0.176175 0.0210963 -0.097092 0.0659926 -0.0360087 -0.0650906 -0.0109047 -0.0119969 0.121254 0.00330746 0.0130309 0.193963 0.00226971 -0.158845 -0.0123436 0.0271616 0.288157 0.0110618 0.0545265 -0.106901 -0.0109594 0.0404511 0.00810921 0.109669 -0.0156983 0.111615 -0.0286171 -0.0183839 -0.00989292 -0.0284806 -0.0949297 0.0269705 0.0026952 0.136624 -0.0617961 0.0486799 -0.0322232 -0.0591478 -0.140759 0.0123114 0.086105 0.0728035 0.0232886 -0.0448969 0.103683 -0.0849455 -0.0416871 -0.045694 -0.0655372 -0.0906905 -0.0453879 0.120304 0.0723377 -0.0746625 0.0215493 -0.0132995 -0.0204085 0.0568183 -0.0778737 0.0648149 -0.113299 0.145436 -0.017464 -0.0501687 0.0530127 0.154732 -0.0897695 -0.0245199 0.0413095 0.13646 -0.0967328 -0.0808758 0.0438315 0.135348 -0.00657863 0.00932299 -0.0229578 -0.0011769 -0.147518 0.092255 -0.0252005 0.0407066 
0.0183428 -0.0137469 -0.121982 -0.00109028 0.0913042 0.156794 -0.0205643 -0.104033 -0.0546239 -0.0836821 0.0206896 0.0870143 0.0639659 -0.0702583 -0.109552 -0.0043315 -0.184051 0.0498908 -0.0376417 0.128826 0.195842 -0.133797 0.0939444 0.115815 0.045436 0.0166479 -0.0356222 -0.256228 0.0150614 0.108634 0.0375977 -0.0156864 -0.0779938 -0.00409207 0.0202809 0.0635519 -0.153983 0.0575238 -0.0247545 -0.064039 0.0121039 -0.0478273 -0.0536799 0.178342 -0.125263 -0.0231407 0.190979 0.0249515 -0.111709 0.0215255 -0.0597429 -0.0651527 0.0175003 -0.0245166 0.118396 0.0286279 0.0121997 0.20297 -0.00741324 -0.158849 -0.0247658 0.0401868 0.296671 -0.0212723 0.0715883 -0.0625563 -0.0148436 0.038228 0.000724645 0.102621 -0.00737197 0.123185 -0.0506195 -0.0500169 -0.0040094 -0.0169759 -0.0963715 0.0256886 0.00516746 0.120299 -0.0534628 0.0671401 -0.0454705 -0.0515703 -0.138749 0.0259604 0.0650825 0.0561467 0.0133063 -0.0335108 0.1164 -0.0729299 -0.0465238 -0.0403096 -0.0574066 -0.0898819 -0.0546808 0.148324 0.0731622 -0.0613583 0.0335782 -0.0242648 -0.0136856 0.0263038 -0.100929 0.0950205 -0.0956248 0.12648 -0.00508868 -0.0361891 0.0428982 0.126 -0.0922157 -0.0492323 0.0562634 0.144422 -0.110083 -0.0775631 0.0352734 0.133345 0.00860408 -0.0138514 -0.018019 0.00229995 -0.167757 0.118645 -0.0215833 0.0498091 
0.0202161 -0.044588 -0.118244 0.0025684 0.0918304 0.154396 -0.0149924 -0.0994817 -0.0446561 -0.0923523 0.0164249 0.0879674 0.0701604 -0.0471919 -0.104292 -0.0220248 -0.173583 0.0443002 -0.0318629 0.13657 0.191268 -0.142505 0.0921032 0.138511 0.0410629 0.0084839 -0.0358349 -0.251961 0.000468068 0.100348 0.0400409 -0.0307177 -0.0785241 -0.00455264 0.0190523 0.0790446 -0.155298 0.054358 -0.0502604 -0.0781991 0.0149513 -0.0378621 -0.0643554 0.172518 -0.124431 -0.0284726 0.174888 0.0355709 -0.0920752 0.0253133 -0.0750785 -0.0865394 0.0326286 -0.0284176 0.134202 0.0334164 -0.00509429 0.213997 -0.00310063 -0.160869 -0.0200708 0.0563019 0.289538 -0.0238047 0.0708927 -0.0488149 -0.0104062 0.0402942 -0.000842751 0.0920687 -0.00839093 0.119466 -0.0461568 -0.059285 -0.00810538 -0.00671352 -0.0858879 0.0245223 0.0226908 0.113297 -0.0562519 0.0588276 -0.0551224 -0.067489 -0.133065 0.0176136 0.0689563 0.0641526 0.0121661 -0.0306059 0.12906 -0.0706053 -0.0241993 -0.0430316 -0.060362 -0.0860996 -0.0562181 0.132713 0.0810675 -0.0575344 0.0452316 -0.022871 -0.0144018 0.00213908 -0.107065 0.0998131 -0.0978672 0.0989121 -0.0173357 -0.0262045 0.0482936 0.126367 -0.0774992 -0.0582752 0.0517351 0.152777 -0.106796 -0.073632 0.0216783 0.132202 -0.00376236 -0.0224743 -0.0287648 0.00589166 -0.178818 0.130861 -0.0319084 0.0447049 
0.0191408 -0.0121557 -0.106951 -0.00375118 0.0829954 0.157815 -0.015215 -0.103819 -0.0494483 -0.0942627 0.0200204 0.0856434 0.0746799 -0.0696005 -0.114495 -0.0189467 -0.192816 0.0329548 -0.0565639 0.136093 0.198781 -0.14465 0.0814356 0.127475 0.0451008 0.00692435 -0.0439363 -0.239976 0.0104188 0.110234 0.034268 -0.0217854 -0.0866058 0.00962893 0.0125142 0.0590213 -0.156794 0.0576748 -0.0305935 -0.0697178 0.0161469 -0.067551 -0.0486858 0.167161 -0.109076 -0.0313722 0.179121 0.0344369 -0.109727 0.0314467 -0.0613651 -0.0658538 0.0227185 -0.0229391 0.126915 0.0261615 -0.0128426 0.20291 -0.0123076 -0.168948 -0.0205364 0.0498227 0.288332 -0.0144378 0.0567494 -0.0459427 -0.00989008 0.0341691 -0.0152737 0.0838362 -0.0151834 0.109133 -0.0512998 -0.0476827 0.00626993 -0.00949655 -0.083347 0.0075602 0.0235882 0.144622 -0.0479612 0.0451112 -0.037875 -0.0515531 -0.137841 0.0226509 0.0681145 0.0580517 0.0207403 -0.0205614 0.117743 -0.089192 -0.0290468 -0.0258693 -0.0824815 -0.0908375 -0.0578302 0.131799 0.0810188 -0.0660027 0.0480346 -0.0137719 -0.0236459 0.0332424 -0.0989805 0.0993319 -0.09963 0.140057 -0.0135833 -0.0404801 0.0505073 0.127095 -0.105367 -0.0402441 0.0497649 0.15301 -0.116961 -0.052269 0.0336021 0.141957 0.000344727 -0.0206805 -0.027374 0.00255288 -0.163614 0.124552 -0.0221376 0.0386747 
0.0261641 -0.0357527 -0.129999 -0.00473608 0.101239 0.141463 -0.0284225 -0.102478 -0.054342 -0.0873443 0.0198501 0.0970498 0.0736979 -0.0636077 -0.115918 -0.00342543 -0.173548 0.0339176 -0.0484203 0.155899 0.187972 -0.140459 0.0924917 0.129992 0.0435665 0.0244626 -0.021688 -0.242477 -0.000184677 0.100112 0.0270916 -0.0191591 -0.0857238 0.00417239 0.000922285 0.0678981 -0.160832 0.0574845 -0.0358759 -0.0697908 0.0118087 -0.0481616 -0.0536185 0.180684 -0.11455 -0.0221859 0.181806 0.0431137 -0.0949866 0.035025 -0.0552815 -0.0827992 0.00900092 -0.0319714 0.129135 0.0151791 -0.0171815 0.207891 0.00279678 -0.158905 -0.0133001 0.0402282 0.289301 -0.00252006 0.057153 -0.0667506 -0.0205966 0.0556621 0.00717049 0.0820382 -0.0114177 0.122408 -0.0403049 -0.056919 -0.0072916 -0.0086835 -0.0831755 0.0307363 0.0149556 0.132741 -0.0395573 0.0548465 -0.0490492 -0.0606674 -0.141348 0.0167347 0.0715639 0.0691814 0.0219765 -0.0360318 0.110767 -0.0713122 -0.0420516 -0.0289378 -0.067774 -0.0824133 -0.0536564 0.12312 0.0759296 -0.0803198 0.0348436 -0.0293832 -0.0189366 0.0254452 -0.107485 0.0910279 -0.115047 0.130115 -0.0157319 -0.0362062 0.055391 0.138976 -0.0898049 -0.0316884 0.0440176 0.141752 -0.122525 -0.0646025 0.0164484 0.129792 -0.0100076 -0.000733671 -0.0185037 0.0104207 -0.174034 0.112902 -0.0404232 0.0308816 
0.0239748 -0.0268504 -0.127497 -0.00724107 0.0972456 0.155168 -0.0291197 -0.104268 -0.0559085 -0.0875419 0.0161262 0.0916017 0.0699008 -0.0698978 -0.109175 -0.0108934 -0.178309 0.0332189 -0.0437274 0.150729 0.181283 -0.134767 0.0894874 0.131614 0.043208 0.0206308 -0.026109 -0.243182 -4.23935e-05 0.0968365 0.0357317 -0.0239587 -0.0911813 0.00446673 0.00848939 0.0720794 -0.157888 0.0486446 -0.0342348 -0.0663863 0.0149116 -0.0534676 -0.053982 0.180805 -0.114794 -0.0211892 0.184889 0.0482636 -0.101027 0.039759 -0.0577501 -0.0802885 0.0140111 -0.0333845 0.12673 0.0183129 -0.0192309 0.210978 0.0029056 -0.162374 -0.0190818 0.0514105 0.292256 -0.012766 0.0574144 -0.0629936 -0.0131975 0.0473752 -0.000274439 0.0862076 -0.0131237 0.121779 -0.0418669 -0.0498807 -0.00458843 -0.0129336 -0.0863727 0.0274719 0.0208289 0.134466 -0.0375511 0.055862 -0.0491353 -0.0616315 -0.138689 0.015617 0.0672824 0.0639503 0.021262 -0.028567 0.117776 -0.071783 -0.0370841 -0.0292084 -0.0674184 -0.0826995 -0.0515246 0.126048 0.0712027 -0.0782309 0.0350969 -0.0231572 -0.0220366 0.0221854 -0.110235 0.0964536 -0.111659 0.125144 -0.0199479 -0.0270353 0.0622045 0.137633 -0.0874852 -0.0346864 0.0401258 0.140081 -0.119515 -0.0661283 0.0217871 0.130391 -0.00105778 -0.0107631 -0.0157125 0.0087632 -0.174772 0.112741 -0.0371323 0.0305129 
0.0373201 -0.0546695 -0.117771 0.000186789 0.100058 0.149106 -0.0188563 -0.0874931 -0.0584301 -0.10251 0.00755078 0.104895 0.0729761 -0.0763743 -0.119305 -0.0191449 -0.175255 0.0417128 -0.0601116 0.161062 0.191735 -0.142781 0.10015 0.139963 0.031807 0.00747489 -0.027255 -0.24836 -0.0237935 0.0929319 0.0170037 -0.0264875 -0.0867009 0.0246688 0.000744058 0.0569215 -0.158062 0.0579281 -0.0562653 -0.0791368 0.0150336 -0.0522191 -0.05164 0.173469 -0.121022 -0.0342096 0.175794 0.0393024 -0.093959 0.0657544 -0.0453209 -0.0998455 0.0119234 -0.0195931 0.140315 0.00958494 -0.0101674 0.199076 0.00131856 -0.163437 -0.00331615 0.0524588 0.277363 -0.00761233 0.0596011 -0.0793049 -0.0255516 0.0466559 -0.00804987 0.0869725 -0.0177923 0.110667 -0.0400385 -0.0489614 -0.0179282 -0.00423034 -0.071804 0.0206477 0.0260312 0.132056 -0.0497356 0.042467 -0.0474788 -0.0639256 -0.139701 0.0153097 0.074764 0.0727132 0.0221951 -0.0202715 0.117537 -0.0836255 -0.0358949 -0.0331871 -0.0750196 -0.0715301 -0.0538664 0.120306 0.0718109 -0.0701667 0.0452364 -0.0182968 -0.026749 0.0318771 -0.0906442 0.0779613 -0.119115 0.125444 -0.0307041 -0.033964 0.0518357 0.141702 -0.0807945 -0.0335512 0.0414755 0.1479 -0.105468 -0.0622894 0.0183656 0.140967 -0.0115638 -0.000861592 -0.0190403 0.00654569 -0.1609 0.106995 -0.032236 0.0219047 
0.0264774 -0.0431702 -0.125925 -0.00999088 0.102782 0.143123 -0.0233545 -0.0894124 -0.0572217 -0.0924598 0.00728102 0.106784 0.0704019 -0.0840796 -0.127051 -0.0121073 -0.182911 0.0404398 -0.0635475 0.160204 0.184857 -0.141295 0.0976681 0.124682 0.0296385 0.0218471 -0.0230157 -0.245151 -0.0152043 0.0879119 0.0184379 -0.0216842 -0.089973 0.017362 -0.00405779 0.0547526 -0.161891 0.061004 -0.0458364 -0.066667 0.0195032 -0.0524121 -0.0528725 0.18139 -0.121149 -0.0302016 0.17902 0.0405846 -0.0945833 0.0556495 -0.048608 -0.0921433 -0.00166693 -0.0231792 0.130409 0.00768797 -0.00927711 0.200439 0.00033678 -0.160391 -0.0044671 0.0440888 0.283553 0.00463788 0.0593304 -0.0872543 -0.0257146 0.0539247 0.00523654 0.0864661 -0.0137161 0.117607 -0.0328553 -0.0426031 -0.0146213 -0.00672228 -0.0829662 0.0296266 0.0165967 0.125219 -0.0479532 0.0523214 -0.0432532 -0.0533041 -0.146006 0.0162667 0.0808504 0.0800057 0.0268818 -0.033663 0.109567 -0.0791211 -0.0401629 -0.0353181 -0.0701376 -0.0764979 -0.0525263 0.119565 0.0672769 -0.0741731 0.0335428 -0.0248535 -0.0257512 0.0395895 -0.0909948 0.0765786 -0.122531 0.136653 -0.0277218 -0.0335331 0.054862 0.144056 -0.0869228 -0.0233722 0.0369053 0.139947 -0.114062 -0.0648337 0.0213665 0.131534 -0.00978666 0.00764072 -0.0159082 0.00533429 -0.166457 0.100545 -0.0465182 0.0235809 
0.0286366 -0.0474415 -0.115856 -0.00510164 0.0937709 0.144186 -0.0258171 -0.0912518 -0.0514179 -0.101072 0.0119241 0.105621 0.071263 -0.0792915 -0.126436 -0.0227048 -0.186641 0.0328666 -0.0618048 0.163177 0.185883 -0.140134 0.0945861 0.137204 0.0297141 0.0175517 -0.0220588 -0.239972 -0.0179266 0.0898357 0.020362 -0.0343489 -0.0898913 0.0176066 -0.00261917 0.0573046 -0.164503 0.0602707 -0.0504842 -0.0686774 0.0141806 -0.0560567 -0.0622438 0.177731 -0.117445 -0.0382172 0.170892 0.0446164 -0.0859592 0.0633038 -0.0494903 -0.0843328 0.00927173 -0.021919 0.136426 0.00652803 -0.0142577 0.200538 -0.0016776 -0.165243 -0.00707111 0.0469816 0.284187 0.00642868 0.0491619 -0.0817554 -0.0152969 0.0469879 -0.000462372 0.0849307 -0.0154224 0.11178 -0.0339856 -0.042363 -0.0118826 -0.00871319 -0.0805963 0.0185554 0.0261416 0.145052 -0.0427054 0.0424758 -0.0389478 -0.0576606 -0.137113 0.0101398 0.0788242 0.0798597 0.0299163 -0.0287452 0.113394 -0.0803993 -0.028858 -0.0258425 -0.0805111 -0.0852252 -0.05513 0.113815 0.0729291 -0.0786517 0.0444637 -0.0146588 -0.0291158 0.0300411 -0.0895267 0.0818238 -0.114427 0.128201 -0.0249843 -0.0310107 0.0600736 0.14404 -0.0882174 -0.024212 0.0350859 0.150379 -0.109824 -0.0560809 0.0186169 0.134427 -0.0146787 -0.0021515 -0.0222907 0.000799344 -0.165909 0.110531 -0.03468 0.0291872 
0.0504874 -0.0624908 -0.124111 -0.00321968 0.120134 0.114667 0.0145833 -0.0460439 -0.0154287 -0.106685 0.0280471 0.133969 0.0829464 -0.0895425 -0.166952 -0.0286203 -0.132235 0.0449348 -0.14977 0.182289 0.182547 -0.1568 0.073175 0.159408 0.00428832 -0.0133423 -0.018415 -0.198294 -0.0127139 0.0600125 0.0132899 -0.00408806 -0.0961923 0.0502727 -0.0690568 0.0273964 -0.177123 0.0740778 -0.100467 -0.0544139 0.0442391 -0.0352705 -0.0821285 0.179191 -0.106288 -0.0617247 0.123296 0.0459263 -0.0700959 0.0625302 -0.0472352 -0.0877603 -0.0495485 -0.0460138 0.104149 0.00419874 -0.0603345 0.212249 0.00147688 -0.133128 -0.00899987 0.033947 0.258921 0.0218757 0.0189904 -0.113212 -0.0199416 0.0588677 -0.0115406 0.0757193 -0.00360233 0.090951 -0.00644668 -0.0248041 -0.0306878 0.00288036 -0.0489378 0.0527741 -0.0050389 0.0973078 -0.0734222 0.0449965 -0.0398024 -0.0669781 -0.137718 0.0292827 0.110053 0.0819522 0.0141091 -0.0418184 0.102286 -0.112055 -0.0484975 -0.0389125 -0.0450204 -0.0673658 -0.0595841 0.0410695 0.0493729 -0.066657 0.0236801 -0.0342358 -0.0309783 0.0894833 -0.0852214 0.0585176 -0.145291 0.145054 -0.0270366 -0.0671662 0.0562029 0.16673 -0.0914403 0.023447 0.0290198 0.119213 -0.125142 -0.0575509 0.0366863 0.141291 -0.0514084 0.0458623 -0.0583431 0.0389458 -0.142755 0.0774085 -0.0895205 -0.0202663 
0.0302463 -0.0337336 -0.125453 -0.0209822 0.101873 0.145778 -0.0187864 -0.0872152 -0.0511889 -0.0922405 0.0127655 0.0982828 0.0743532 -0.0783465 -0.114808 -0.0186311 -0.182498 0.018725 -0.0715579 0.163872 0.172753 -0.137144 0.0914871 0.119311 0.0271266 0.0265715 -0.0241486 -0.23485 -0.00603752 0.076781 0.027957 -0.0206557 -0.0947503 0.0185155 -0.0116896 0.0612297 -0.157782 0.0749437 -0.0442906 -0.0584117 0.0278299 -0.0536162 -0.0649746 0.177384 -0.121366 -0.0225094 0.169562 0.0496366 -0.0952189 0.0534075 -0.0632573 -0.0804383 -0.00756197 -0.0243284 0.128078 0.00501385 -0.0266582 0.212639 -0.00594431 -0.16111 -0.0177853 0.0429606 0.289738 4.12415e-05 0.0519403 -0.0726004 -0.0131682 0.0638156 0.00646105 0.0809541 -0.008021 0.119247 -0.0304826 -0.0308927 -0.00132639 -0.00921618 -0.0871595 0.0259912 0.0213314 0.130376 -0.0439318 0.0499462 -0.0418393 -0.0576089 -0.140608 0.0100402 0.0857786 0.0818587 0.0303093 -0.0340064 0.119144 -0.086068 -0.033774 -0.0331929 -0.0700673 -0.0881069 -0.0446963 0.106855 0.0688745 -0.0793683 0.0245969 -0.0253629 -0.0276092 0.0405658 -0.108492 0.0871871 -0.126456 0.140797 -0.0195635 -0.0385364 0.0690561 0.152713 -0.0976164 -0.0129362 0.0403 0.134849 -0.124108 -0.0670447 0.0234862 0.131727 -0.00739386 0.00772769 -0.0136043 0.0211172 -0.163114 0.0952877 -0.0465688 0.0218955 
0.0543484 -0.0556571 -0.133721 -0.00535911 0.1123 0.119716 0.00469632 -0.0486508 -0.0282377 -0.109625 0.0295402 0.12635 0.0882909 -0.0905053 -0.17567 -0.0253092 -0.128325 0.0396666 -0.142473 0.185885 0.185605 -0.15953 0.0833142 0.140776 0.00387589 -0.00380732 -0.0146525 -0.203263 -0.0108874 0.0581653 0.0122207 0.00254958 -0.0931423 0.0498463 -0.0705777 0.0209191 -0.172335 0.0892984 -0.0868126 -0.0591841 0.0342534 -0.0425309 -0.0799093 0.18096 -0.110185 -0.0636742 0.13013 0.04259 -0.0768135 0.0654754 -0.0438718 -0.0791803 -0.0452501 -0.0347905 0.0970141 -0.00661378 -0.0432824 0.201459 0.00743207 -0.147621 -0.00827274 0.0314539 0.26448 0.0184154 0.0183561 -0.113015 -0.0161034 0.0610237 -0.00349079 0.0750317 -0.0107532 0.0855523 -0.0109402 -0.0204661 -0.0297582 -0.00965594 -0.0483816 0.0470137 -0.00712979 0.110501 -0.0743519 0.0380366 -0.0356181 -0.0688465 -0.133025 0.027236 0.104463 0.0837534 0.0237023 -0.0494326 0.103886 -0.113862 -0.050203 -0.0352397 -0.0455992 -0.0742407 -0.0517529 0.0610016 0.0410993 -0.070255 0.0223999 -0.0247255 -0.0307691 0.103969 -0.080077 0.0561635 -0.139936 0.158137 -0.0211819 -0.0728559 0.050569 0.170263 -0.0977629 0.0301687 0.0296467 0.113364 -0.125209 -0.0623327 0.0438337 0.137528 -0.0561538 0.0447344 -0.0470702 0.0309332 -0.135305 0.0663252 -0.0809278 -0.0144152 
0.0410277 -0.0259194 -0.118439 -0.0230958 0.0975781 0.120063 0.00106137 -0.0529859 -0.0396095 -0.101394 0.0195447 0.121548 0.0850644 -0.0968255 -0.149737 -0.0173391 -0.158331 0.00869686 -0.152209 0.176187 0.162485 -0.141957 0.0881551 0.111794 -0.00119982 0.0182772 -0.0141495 -0.197225 -0.0114437 0.049926 0.00956463 0.0134365 -0.0961039 0.0554421 -0.0728027 0.0204086 -0.165647 0.117973 -0.0775125 -0.0287284 0.0419557 -0.0563256 -0.073967 0.174676 -0.1139 -0.0372735 0.140425 0.0353411 -0.09658 0.072263 -0.0300511 -0.0711953 -0.0628838 -0.0225432 0.105134 -0.0112625 -0.0469435 0.206422 0.00562914 -0.147235 -0.0196943 0.0202522 0.261578 0.0209518 0.0332286 -0.104828 -0.0149415 0.0751798 -0.00747584 0.0819736 -0.00261893 0.0953219 -0.00322505 0.00308019 -0.00295539 -0.00564288 -0.0697476 0.0296647 -0.00567595 0.12074 -0.0579221 0.0287532 -0.024748 -0.0603156 -0.148921 0.0124238 0.113046 0.0791772 0.0229737 -0.0419769 0.0866235 -0.127967 -0.0478831 -0.0374662 -0.0618936 -0.0715423 -0.0353202 0.0608265 0.0543739 -0.0740777 -0.0013775 -0.0218274 -0.0373851 0.119417 -0.0936659 0.0507375 -0.160417 0.183349 -0.0170454 -0.088831 0.0618076 0.18393 -0.115149 0.0373823 0.0326528 0.104015 -0.135536 -0.0604289 0.0463549 0.140899 -0.0288102 0.0523122 -0.0299807 0.0386686 -0.114058 0.0553182 -0.0705953 -0.0129539 
0.042343 -0.0278044 -0.117081 -0.0262152 0.102312 0.127669 0.00668972 -0.0492926 -0.0350351 -0.111675 0.0118303 0.124599 0.0789078 -0.095465 -0.145312 -0.0276691 -0.155193 0.00352739 -0.151677 0.172012 0.158687 -0.13764 0.0886497 0.109792 -0.000900209 0.0148617 -0.0142502 -0.196814 -0.0170931 0.0441359 0.017574 0.00927279 -0.0941247 0.0591345 -0.0695909 0.0217533 -0.158663 0.12078 -0.0833685 -0.0317187 0.0513545 -0.0489388 -0.0735728 0.172838 -0.120388 -0.03463 0.13692 0.0313062 -0.0956295 0.074269 -0.0361408 -0.0755879 -0.0578385 -0.0220428 0.109393 -0.0073357 -0.0509615 0.214476 -0.000135747 -0.148939 -0.0249721 0.0238229 0.261831 0.00949107 0.0398417 -0.102822 -0.0135867 0.0756591 -0.0125298 0.0884997 0.00047425 0.0939228 -0.00376707 0.00368515 -0.00390532 -0.000709196 -0.0706316 0.0254585 -0.00390629 0.11354 -0.0675623 0.03285 -0.0219464 -0.0595882 -0.143943 0.00343621 0.116885 0.0831513 0.0200736 -0.0373464 0.0922356 -0.134396 -0.0439634 -0.042072 -0.0550313 -0.070692 -0.0296048 0.0585662 0.0508306 -0.0673926 -0.00711847 -0.0198491 -0.0390086 0.11772 -0.102106 0.0507748 -0.162201 0.17543 -0.0237469 -0.087825 0.0683008 0.18164 -0.115914 0.0399643 0.0350821 0.101565 -0.135644 -0.0665124 0.0486195 0.144855 -0.0233397 0.0538629 -0.0307544 0.0395922 -0.106758 0.0514736 -0.0675652 -0.0161619 
0.0235986 -0.0430133 -0.10942 -0.0284167 0.0931897 0.124651 -0.0164869 -0.0554311 -0.0440124 -0.0972996 0.0149259 0.109188 0.0818446 -0.0866252 -0.128349 -0.0263274 -0.173584 0.000912354 -0.111624 0.176526 0.16018 -0.150472 0.0870233 0.117021 0.0109876 0.0349513 -0.0127812 -0.209849 -0.0123559 0.0338546 0.0312103 -0.0189234 -0.0980578 0.0375395 -0.0542158 0.049396 -0.168249 0.103226 -0.0695619 -0.0388194 0.0483241 -0.0553946 -0.0792257 0.181392 -0.114623 -0.0398886 0.148221 0.0423694 -0.0902227 0.0590794 -0.0614213 -0.0896435 -0.0446622 -0.0267457 0.114355 -0.00182278 -0.052071 0.215235 0.00368179 -0.158259 -0.0164269 0.030888 0.27102 0.0243589 0.0445302 -0.0828439 -0.00675027 0.0720914 0.0120934 0.0769034 -0.00689073 0.10938 -0.00682615 -0.00980994 0.00572579 -0.0129022 -0.0830165 0.0401005 0.0139115 0.122918 -0.0639232 0.0335319 -0.0277871 -0.0621471 -0.151081 0.00498527 0.114745 0.0961481 0.0322396 -0.0528087 0.105175 -0.101837 -0.0261105 -0.0392462 -0.0663955 -0.0823311 -0.0379558 0.0736078 0.0542428 -0.0789682 -0.00568971 -0.0310057 -0.0374827 0.0742029 -0.0963501 0.0737558 -0.147088 0.159482 -0.0207383 -0.0731639 0.0632175 0.176751 -0.106298 0.0177206 0.0375911 0.111022 -0.13349 -0.0687122 0.0334236 0.129763 -0.024803 0.0349524 -0.0303792 0.0344714 -0.143577 0.0721115 -0.0703219 0.00753347 
0.0548837 -0.0597345 -0.113947 0.00306179 0.137537 0.124665 0.0381501 -0.0191781 -0.00184577 -0.111381 0.0271488 0.136989 0.0802917 -0.107263 -0.156307 -0.0539479 -0.113717 0.0627096 -0.18196 0.173628 0.170435 -0.143666 0.0726532 0.168405 0.000412392 -0.0632145 -0.0363089 -0.181786 -0.0146043 0.0402471 0.0328026 -0.00764629 -0.103431 0.0619068 -0.0757297 0.0174341 -0.181433 0.0418228 -0.129204 -0.0442103 0.0765931 -0.0257121 -0.0962764 0.18635 -0.13373 -0.0767118 0.0920109 0.0564005 -0.047403 0.0747579 -0.0341138 -0.0849854 -0.0672099 -0.0681019 0.0710035 0.00580348 -0.0684638 0.20502 0.0153437 -0.112867 -0.0255285 0.0474591 0.224577 0.0198583 0.00170631 -0.143696 -0.0120867 0.0438403 -0.0272374 0.0874808 0.00926284 0.0922436 0.0113497 -0.0218416 -0.0517193 0.00895447 -0.057952 0.0561247 -0.0134822 0.0968481 -0.0851825 0.0356761 -0.0237591 -0.0471141 -0.115166 0.0396623 0.122652 0.074842 -0.0121509 -0.0432633 0.101073 -0.114846 -0.0558986 -0.0576028 -0.0447263 -0.0780193 -0.0677664 0.0209049 0.0145739 -0.0597608 0.0226851 -0.0186932 -0.0162046 0.101854 -0.0737129 0.0429128 -0.144958 0.150935 -0.0164807 -0.0496544 0.0616239 0.152267 -0.0939777 0.0374487 0.00642945 0.107171 -0.112961 -0.050827 0.0404806 0.158033 -0.0517424 0.0469397 -0.0961174 0.0513657 -0.131341 0.0496464 -0.104334 -0.01978 
0.0460705 -0.0369809 -0.10556 -0.0160908 0.102731 0.124266 0.0245549 -0.0387161 -0.034551 -0.116823 0.0132098 0.129901 0.085132 -0.108288 -0.154986 -0.0317391 -0.156054 0.0163217 -0.171351 0.173912 0.168384 -0.141187 0.080138 0.115625 -0.010103 -0.00268005 -0.034145 -0.196104 -0.016116 0.0458283 0.00949576 0.015487 -0.103401 0.0671544 -0.072031 0.00891124 -0.169009 0.109519 -0.0926079 -0.0340376 0.0559032 -0.0526322 -0.0752785 0.172067 -0.118007 -0.0487322 0.125091 0.0295113 -0.0920357 0.0789951 -0.0320117 -0.0838158 -0.0648145 -0.0252174 0.0985629 -0.00969639 -0.054341 0.207314 -0.00118259 -0.135096 -0.0177938 0.0303625 0.249284 0.0190416 0.0340829 -0.115625 -0.0147667 0.058791 -0.0219294 0.0782177 -0.0014935 0.0871341 0.00320783 0.00843632 -0.018741 0.000396545 -0.0629751 0.0187878 -0.00533351 0.116109 -0.0669912 0.0187194 -0.0211072 -0.0560254 -0.144753 0.0142864 0.12194 0.0757442 0.00991252 -0.0376199 0.095504 -0.136933 -0.0488983 -0.0424048 -0.0635342 -0.0634214 -0.0378828 0.0477239 0.0440873 -0.0546541 0.000938844 -0.014361 -0.0403726 0.126832 -0.0839837 0.0428888 -0.154512 0.187866 -0.023299 -0.0840895 0.0600209 0.173803 -0.119134 0.0360307 0.0290637 0.10674 -0.125483 -0.0520595 0.0488337 0.149723 -0.0372033 0.0517572 -0.0443353 0.0398677 -0.103137 0.0493874 -0.0746682 -0.0228155 
0.0474912 -0.0406676 -0.110973 -0.0210521 0.112259 0.1257 0.0240639 -0.0330156 -0.0223402 -0.134501 0.00694132 0.129476 0.0804099 -0.101863 -0.16296 -0.0369104 -0.150363 0.0109079 -0.183954 0.174525 0.165789 -0.140136 0.0803858 0.113901 -0.0116864 -0.0214417 -0.0306749 -0.179213 -0.0233747 0.0380745 0.0164126 0.00488032 -0.104063 0.0688707 -0.0788737 0.0138291 -0.169895 0.097724 -0.106896 -0.0334315 0.0602018 -0.0430415 -0.0739453 0.167956 -0.111766 -0.0460995 0.112796 0.0369945 -0.0847464 0.0894207 -0.0442744 -0.0876569 -0.0642266 -0.0303259 0.0934366 -0.00950471 -0.0647777 0.2131 -0.0032951 -0.131021 -0.0193346 0.0466232 0.246073 0.0156537 0.0253545 -0.117097 -0.0179438 0.0640434 -0.026519 0.0800607 0.00453466 0.0820632 0.00823439 0.00381274 -0.0221274 0.0125906 -0.0544811 0.015669 -0.0089296 0.108069 -0.0664035 0.0174253 -0.022558 -0.0516331 -0.144794 0.022224 0.117082 0.0782181 0.0045981 -0.0316407 0.102161 -0.144294 -0.0488449 -0.0437278 -0.0519048 -0.0570905 -0.0424864 0.0378847 0.0354052 -0.0500803 0.0014534 -0.0180393 -0.044373 0.121411 -0.0877994 0.0470256 -0.161499 0.182122 -0.0352645 -0.0798637 0.0676695 0.166971 -0.112896 0.0492157 0.0196413 0.107591 -0.124286 -0.038665 0.0503248 0.153779 -0.0440241 0.0540054 -0.0501324 0.0407421 -0.104437 0.0450049 -0.0860323 -0.0314712 
0.0441136 -0.0512584 -0.103239 -0.00620069 0.103932 0.121623 0.0193516 -0.0311455 -0.0113066 -0.125664 0.0162557 0.132852 0.076436 -0.10174 -0.155812 -0.043718 -0.149897 0.0249481 -0.176524 0.174689 0.164691 -0.148071 0.0891209 0.140116 -0.0069746 -0.0262052 -0.0260642 -0.192289 -0.0279824 0.0338556 0.0231768 1.49397e-06 -0.0925055 0.0665222 -0.0819614 0.02038 -0.175065 0.0970022 -0.1208 -0.0306015 0.0604646 -0.0442259 -0.0939624 0.172633 -0.121209 -0.0577509 0.112926 0.0325054 -0.0730055 0.0896063 -0.0388727 -0.0846621 -0.060589 -0.0346641 0.0958355 -0.000813296 -0.0542848 0.207256 0.00815443 -0.130271 -0.0231099 0.0406397 0.238698 0.0178838 0.022429 -0.124139 -0.00900849 0.0548343 -0.0240839 0.0974108 0.001572 0.0850841 0.00588673 0.00472493 -0.0197212 0.000810407 -0.0615473 0.0287829 -0.0109822 0.108494 -0.0816388 0.0232922 -0.0275479 -0.0615765 -0.137853 0.0253425 0.118035 0.0755182 -0.00131171 -0.0392656 0.0990237 -0.13308 -0.0398334 -0.0555789 -0.0506007 -0.0645335 -0.0521697 0.0390886 0.0435599 -0.0548158 0.00432758 -0.0224244 -0.0344747 0.112347 -0.0748056 0.0441622 -0.156576 0.164342 -0.0267954 -0.0803303 0.0554063 0.176362 -0.101428 0.0314608 0.0221934 0.110163 -0.11306 -0.0576466 0.055302 0.159622 -0.0371263 0.0530444 -0.0658855 0.0435317 -0.111358 0.0513893 -0.0783018 -0.0147441 
0.0483885 -0.0403203 -0.105646 -0.00560894 0.107878 0.122406 0.030356 -0.035801 -0.0194291 -0.118825 0.0178235 0.135133 0.0794702 -0.100595 -0.157479 -0.0403301 -0.146511 0.0228798 -0.177892 0.179287 0.164142 -0.150331 0.0845228 0.131813 -0.00623231 -0.0228807 -0.0346579 -0.185533 -0.0157119 0.0428928 0.0167872 0.0113794 -0.0991487 0.0663667 -0.0831242 0.013686 -0.174993 0.10535 -0.108863 -0.0346458 0.0574744 -0.0448546 -0.0857459 0.165702 -0.122642 -0.0599764 0.114076 0.031513 -0.0770336 0.0877584 -0.0353094 -0.0744107 -0.0666855 -0.0327938 0.0987226 -0.00517326 -0.0577686 0.212676 0.000807094 -0.128389 -0.026547 0.035755 0.24758 0.010973 0.0249453 -0.113834 -0.0138662 0.0536529 -0.0349129 0.0926372 0.00320563 0.0913418 0.00404303 0.0167776 -0.020323 0.00119751 -0.0524019 0.0219306 -0.00854811 0.106789 -0.0785702 0.0201993 -0.0212579 -0.0585283 -0.133187 0.0170701 0.11592 0.078423 0.00971686 -0.0372298 0.0981733 -0.137725 -0.0435612 -0.0468914 -0.048373 -0.0711485 -0.0446629 0.0410542 0.0432492 -0.053281 0.00210211 -0.017067 -0.0372803 0.122625 -0.0834423 0.051916 -0.150859 0.172633 -0.013966 -0.0835334 0.0560878 0.177865 -0.107751 0.0409017 0.0295167 0.105482 -0.110316 -0.0498266 0.0573185 0.162173 -0.0401963 0.0513033 -0.058829 0.0424652 -0.10871 0.0538459 -0.0724882 -0.0185847 
0.0504433 -0.060268 -0.0972062 0.00230019 0.109064 0.12539 0.0324989 -0.025621 -0.00518176 -0.134517 0.0146722 0.133793 0.0752498 -0.106206 -0.153553 -0.0527068 -0.146705 0.0337263 -0.179379 0.166319 0.174882 -0.145473 0.0829008 0.159948 -0.00567652 -0.0498011 -0.0343707 -0.195818 -0.0299659 0.0429014 0.0236664 -0.00560308 -0.0993308 0.0687456 -0.075439 0.0152217 -0.177894 0.0731193 -0.128072 -0.0352356 0.0662808 -0.0424406 -0.0966193 0.171125 -0.119849 -0.0613607 0.101802 0.0348923 -0.0661029 0.0874205 -0.0367767 -0.0896803 -0.0480478 -0.0433255 0.0909143 0.00471346 -0.0542853 0.206615 0.00748332 -0.122304 -0.0177771 0.0515634 0.226992 0.0164158 0.013721 -0.130599 -0.00711153 0.042764 -0.0304287 0.0925993 -0.00230475 0.0802789 0.00107407 -0.00771119 -0.0302371 0.00886241 -0.0580911 0.0260081 -0.00790017 0.117709 -0.0826078 0.0184433 -0.0288521 -0.0601667 -0.129323 0.0328465 0.118875 0.0655248 -0.0186683 -0.0346178 0.104497 -0.130509 -0.0417536 -0.0564766 -0.0580998 -0.0614463 -0.0594259 0.031147 0.0438041 -0.0491181 0.0218026 -0.0184419 -0.031516 0.108668 -0.0694127 0.0367126 -0.151114 0.161094 -0.033201 -0.0697666 0.0577261 0.162613 -0.100185 0.0185683 0.0166828 0.124716 -0.110969 -0.0483296 0.0500789 0.166102 -0.0415995 0.0462661 -0.0829933 0.0436871 -0.115935 0.0568101 -0.0845222 -0.0185305 
0.0511936 -0.0582935 -0.112214 0.00172782 0.132133 0.143744 0.0354453 -0.0269273 -0.0215172 -0.100605 0.021997 0.130068 0.0866924 -0.0927999 -0.142005 -0.0504197 -0.124189 0.072204 -0.158753 0.166225 0.178751 -0.153833 0.084756 0.173921 0.00543849 -0.0659905 -0.0447594 -0.195881 -0.0180269 0.0525242 0.0326184 -0.0133511 -0.104553 0.0597814 -0.0632493 0.0317217 -0.178899 0.032684 -0.118307 -0.0475645 0.0635289 -0.0316914 -0.0836099 0.178112 -0.138697 -0.0806974 0.110862 0.0533233 -0.0600864 0.0797552 -0.0304596 -0.100204 -0.0589794 -0.0561459 0.0838271 0.0182345 -0.0515825 0.214355 0.0174091 -0.117074 -0.0219617 0.062844 0.232431 -0.00454501 0.018885 -0.127866 -0.020708 0.0397187 -0.0393775 0.103243 0.00448516 0.105539 -0.00356563 -0.0246742 -0.0480509 0.00825996 -0.0498965 0.0520919 -0.00199582 0.0845398 -0.0891283 0.0321101 -0.0280636 -0.0478132 -0.129284 0.0449765 0.112385 0.0684499 -0.00503718 -0.0336923 0.107241 -0.11765 -0.0460123 -0.061098 -0.0445982 -0.0735528 -0.0756259 0.0534168 0.0189617 -0.0440567 0.0295568 -0.0161037 -0.0196271 0.0923192 -0.0673211 0.0575015 -0.146538 0.1361 -0.0274583 -0.0488075 0.0457874 0.148292 -0.0786303 0.0209424 0.0137473 0.119332 -0.0914377 -0.0509718 0.0379075 0.168612 -0.0392152 0.0222978 -0.0845212 0.0433526 -0.147122 0.0651757 -0.0961117 -0.00552937 
0.0547304 -0.047736 -0.109597 -0.00612577 0.127347 0.139328 0.0414781 -0.023456 -0.0239804 -0.102323 0.0217168 0.130852 0.0910147 -0.0950074 -0.147029 -0.0538812 -0.12028 0.0577541 -0.175091 0.168758 0.167807 -0.146773 0.0803287 0.164061 -0.00609462 -0.0572035 -0.0461014 -0.184903 -0.00997536 0.0450998 0.0268194 -0.00239293 -0.110922 0.0621503 -0.0768875 0.0197208 -0.182091 0.0556996 -0.120561 -0.0334568 0.0654688 -0.0316508 -0.0942761 0.173888 -0.136151 -0.0738399 0.10315 0.0527489 -0.0646365 0.0788526 -0.0265152 -0.0852156 -0.066924 -0.055233 0.0753165 0.00896825 -0.0550424 0.219366 0.018017 -0.116786 -0.0264005 0.0598291 0.231521 0.00124611 0.0123875 -0.129935 -0.0113934 0.044938 -0.0402441 0.0950984 0.00777648 0.0998098 0.00559712 -0.00637831 -0.0422774 0.00828038 -0.0544058 0.0429355 -0.00325414 0.0914868 -0.0836355 0.0268005 -0.0228285 -0.0499806 -0.123917 0.0351915 0.119622 0.0674689 -0.00577854 -0.0397324 0.101051 -0.123305 -0.0431753 -0.0571967 -0.0455065 -0.0762975 -0.0608549 0.0412669 0.0197637 -0.0464165 0.0227207 -0.00868683 -0.0243845 0.114479 -0.0783244 0.0505459 -0.152174 0.151571 -0.0193174 -0.059429 0.0582394 0.160074 -0.0902127 0.0337545 0.0095249 0.114023 -0.105974 -0.0482675 0.0403817 0.16457 -0.0472017 0.0292643 -0.0847426 0.0449446 -0.134898 0.0575078 -0.105247 -0.0158296 
0.049331 -0.0518831 -0.115723 0.00347345 0.131721 0.122521 0.0377253 -0.0288796 -0.0160825 -0.092356 0.0285343 0.137564 0.0909585 -0.0931764 -0.161129 -0.0415817 -0.115673 0.0752163 -0.171898 0.174263 0.17998 -0.161179 0.079183 0.171593 0.00021127 -0.0559578 -0.0424816 -0.186749 -0.00482669 0.0579993 0.0189535 0.00594025 -0.100448 0.0563464 -0.0793646 0.0158605 -0.184451 0.0521841 -0.117005 -0.0443447 0.060321 -0.0304479 -0.085592 0.174751 -0.132174 -0.0820566 0.106971 0.0476146 -0.056995 0.0682686 -0.0238567 -0.0864548 -0.0688243 -0.0581596 0.0781481 0.014182 -0.0501667 0.208964 0.0174365 -0.114204 -0.0181521 0.0477135 0.230316 0.0117212 0.0112903 -0.130406 -0.0235298 0.0418329 -0.0357975 0.0925385 0.00366007 0.0988495 0.00180184 -0.0173919 -0.0461001 0.00956105 -0.0464564 0.0564234 -0.0106568 0.0800996 -0.0898614 0.0360366 -0.0258413 -0.0451288 -0.124092 0.0442098 0.116344 0.0726651 4.62503e-06 -0.0452963 0.0916604 -0.117815 -0.0494383 -0.056099 -0.0419598 -0.0780767 -0.0723522 0.0460394 0.0246824 -0.0508052 0.0289656 -0.0204508 -0.0179336 0.113604 -0.0665171 0.0509428 -0.145689 0.149987 -0.0145179 -0.0628089 0.0418666 0.15592 -0.0870337 0.0315882 0.0128217 0.111913 -0.10373 -0.0501852 0.0400886 0.162224 -0.0519044 0.037445 -0.0904981 0.0412265 -0.144282 0.0668018 -0.10687 -0.0125697 
0.0544887 -0.0460011 -0.119953 -0.00434986 0.133386 0.141192 0.0412161 -0.0328841 -0.0347611 -0.0942098 0.01795 0.129087 0.0939535 -0.0849983 -0.144645 -0.0527264 -0.113153 0.0659236 -0.158067 0.171269 0.169668 -0.152785 0.0801648 0.167765 0.000759911 -0.0560753 -0.0479926 -0.188268 -0.00659277 0.0576473 0.0242948 -0.00131043 -0.110771 0.0560839 -0.067632 0.0256726 -0.178083 0.046686 -0.115586 -0.0462739 0.0612043 -0.0296314 -0.0811657 0.177913 -0.141392 -0.0672469 0.115296 0.0566516 -0.0660242 0.073544 -0.0253059 -0.0898823 -0.0616412 -0.0569865 0.0832572 0.0131894 -0.0537427 0.222715 0.0235066 -0.120435 -0.0234075 0.063964 0.235507 -0.00642655 0.0189195 -0.124765 -0.0180034 0.0418506 -0.0421115 0.0935789 0.00562604 0.105149 0.0015561 -0.0149157 -0.0453926 0.0120428 -0.0492953 0.0499663 0.00258686 0.0824133 -0.0825935 0.0311246 -0.0281081 -0.0487991 -0.122626 0.0328589 0.112311 0.0672583 0.000472556 -0.0357697 0.101613 -0.117938 -0.0419978 -0.0612545 -0.0438452 -0.0793065 -0.0601162 0.0555054 0.0222941 -0.0497063 0.0262081 -0.0049906 -0.017075 0.108741 -0.0870811 0.0568925 -0.151619 0.147834 -0.0205583 -0.0507555 0.0590724 0.153498 -0.0868184 0.0298352 0.00662072 0.113595 -0.100628 -0.0534709 0.0347107 0.163789 -0.0466926 0.0223268 -0.0807177 0.0419303 -0.146891 0.0627886 -0.106552 -0.0156734 
0.0513797 -0.0577045 -0.102878 0.00815667 0.129286 0.125071 0.0371499 -0.0242455 -0.000166921 -0.116257 0.0241214 0.127966 0.0838357 -0.102143 -0.159792 -0.048742 -0.12332 0.0720383 -0.182692 0.167511 0.190031 -0.155855 0.0819766 0.178436 0.00100236 -0.0788795 -0.0472126 -0.190295 -0.0136155 0.0533348 0.0289794 -0.0101243 -0.100398 0.061742 -0.0683253 0.0153867 -0.181011 0.0437457 -0.127092 -0.0494401 0.0635387 -0.0314279 -0.0919918 0.173328 -0.12434 -0.0789508 0.0945768 0.0523567 -0.0528505 0.0767118 -0.0347468 -0.0894744 -0.053707 -0.0600031 0.0727331 0.0115702 -0.0488684 0.199246 0.0139413 -0.117655 -0.0143831 0.0584144 0.218474 0.0149129 0.00466721 -0.137618 -0.0171115 0.036208 -0.0353254 0.0916087 0.000749132 0.085796 -0.000350333 -0.0287189 -0.0496803 0.0112524 -0.049385 0.0508226 -0.00681038 0.0979806 -0.0873354 0.0285308 -0.030707 -0.0467359 -0.11893 0.0516277 0.111848 0.0685916 -0.0165266 -0.0375246 0.105341 -0.12067 -0.046191 -0.0590466 -0.0508142 -0.0738687 -0.0796672 0.0387433 0.0221676 -0.0465818 0.0420271 -0.0191943 -0.0220182 0.10347 -0.0542526 0.042072 -0.138815 0.149047 -0.0186885 -0.0543303 0.0441711 0.147228 -0.0903864 0.0257498 0.00825412 0.126623 -0.106831 -0.0404218 0.0392311 0.165773 -0.0557072 0.039803 -0.103296 0.0444188 -0.137203 0.062493 -0.103673 -0.0168724 
0.0639336 -0.0724101 -0.100285 0.0132564 0.137994 0.135679 0.0456443 -0.0210577 0.012009 -0.121837 0.0317106 0.145768 0.069677 -0.109839 -0.151977 -0.0533595 -0.118218 0.0762556 -0.183077 0.162581 0.183437 -0.139304 0.0783473 0.18705 -0.00086508 -0.0786662 -0.0394648 -0.195241 -0.0258724 0.0491323 0.0310183 -0.0119977 -0.0948857 0.0708591 -0.0659369 0.0158593 -0.177455 0.0391142 -0.127272 -0.0444554 0.0704851 -0.0216667 -0.101263 0.167149 -0.129413 -0.0871221 0.085919 0.043021 -0.0500247 0.0845729 -0.0334815 -0.094042 -0.0550771 -0.0593837 0.0773513 0.0178483 -0.0567529 0.210483 -0.00678782 -0.100049 -0.0232278 0.0521375 0.227494 -0.000874379 0.0110407 -0.140051 -0.0181812 0.0385022 -0.0463665 0.105957 0.0075361 0.086819 -0.00441667 -0.0236238 -0.0557852 0.0113531 -0.0463847 0.0418972 -0.0124669 0.088858 -0.0971793 0.0416355 -0.0285096 -0.0531346 -0.117976 0.0439596 0.118872 0.0641387 -0.0235801 -0.0283924 0.110678 -0.127371 -0.0512429 -0.0517719 -0.0361796 -0.0674408 -0.08023 0.0177623 0.0216446 -0.0372016 0.0353857 -0.0268207 -0.0293795 0.0939115 -0.054692 0.0430047 -0.134647 0.124145 -0.029354 -0.0535727 0.0501501 0.147115 -0.0754896 0.0240564 0.0223588 0.122867 -0.103524 -0.0477409 0.0448483 0.171939 -0.0413116 0.040686 -0.100564 0.0482066 -0.122094 0.0647525 -0.0880744 -0.0211907 
0.0274673 -0.0291494 -0.0925785 -0.029387 0.0709015 0.189265 0.0104335 -0.0270007 -0.0330355 -0.0739767 0.0408131 0.123719 0.057493 -0.127266 -0.0992771 -0.0883787 -0.186425 0.0566519 -0.0915192 0.112916 0.131962 -0.0791869 0.0642921 0.176418 -0.00764638 -0.00336637 0.0128902 -0.220234 0.00811206 0.0337603 0.0381347 -0.0734485 -0.103843 0.0309354 -0.0202513 0.0350989 -0.168407 0.0217124 -0.0915038 0.00750981 0.0722746 -0.0629661 -0.130844 0.227133 -0.174823 -0.0804494 0.13223 0.0443096 -0.0929539 0.0711624 -0.0256759 -0.0645151 -0.0480513 -0.0425104 0.0732451 0.0397877 -0.0432544 0.22665 0.00212732 -0.126423 -0.0542118 0.0368774 0.285432 -0.000490899 0.030778 -0.13317 0.0331964 -0.00254318 -0.0195624 0.133018 -0.00978946 0.102214 -0.0018203 0.0030453 -0.011521 -0.039144 -0.120553 0.0456637 0.00914783 0.113097 -0.0687798 0.0497796 -0.00677816 -0.0521397 -0.113166 0.00299851 0.129193 0.0436769 0.000593859 -0.0259541 0.114468 -0.101966 -0.0326603 -0.0619597 -0.0572394 -0.111606 -0.0546778 0.0586813 0.045007 -0.0566608 0.0118075 0.0116278 -0.0167915 0.0434715 -0.0833875 0.0632249 -0.111837 0.110751 -0.0463537 -0.0349185 0.0964455 0.153296 -0.0625274 -0.0220851 0.0117 0.113043 -0.0846475 -0.0899303 0.0560218 0.135622 0.0222689 -0.0443852 -0.0671843 0.0175819 -0.13323 0.079101 -0.0565116 0.041902 
0.0273493 -0.0397024 -0.0931895 -0.027552 0.0853351 0.180791 0.02257 -0.0273309 -0.0245214 -0.0952842 0.0263219 0.130582 0.054837 -0.127903 -0.111241 -0.0870861 -0.179026 0.0515569 -0.10961 0.125114 0.136658 -0.082878 0.0555284 0.175535 -0.0152547 -0.0071256 -0.00332715 -0.215712 0.00366993 0.0285548 0.0380219 -0.059001 -0.111324 0.0399122 -0.0203455 0.040087 -0.157988 0.0240657 -0.103354 -0.00310505 0.0883378 -0.0505551 -0.114986 0.220595 -0.163805 -0.0713603 0.134862 0.0454055 -0.0901835 0.0707901 -0.044348 -0.0860866 -0.0524073 -0.041847 0.0857608 0.0352102 -0.0586087 0.231981 -0.00476614 -0.123934 -0.0435601 0.0508515 0.278064 -0.000839819 0.0372972 -0.13489 0.0285571 -0.00290842 -0.018402 0.123629 -0.0106619 0.0974584 0.00876637 0.0119831 -0.0173928 -0.0321039 -0.110775 0.0553627 0.0101635 0.0888068 -0.0666028 0.0640578 -0.0193681 -0.0562716 -0.116129 0.00755971 0.130041 0.0536595 -0.0100417 -0.0230468 0.129041 -0.107254 -0.0326328 -0.0733553 -0.0483963 -0.0936041 -0.0489382 0.0485086 0.0411039 -0.0462888 0.0029136 0.000637275 -0.0189201 0.0489301 -0.0896663 0.0605462 -0.121471 0.117285 -0.0595715 -0.0264592 0.095217 0.151039 -0.0684146 -0.0171446 0.00445334 0.106588 -0.0852274 -0.0944166 0.0502878 0.132052 0.0128217 -0.0193106 -0.0637402 0.0272512 -0.142164 0.0698579 -0.0770297 0.0180739 
0.0254441 -0.0443267 -0.10745 -0.0100109 0.0934378 0.14851 0.0183436 -0.037831 -0.00809968 -0.103161 0.0201338 0.117923 0.0658735 -0.0954758 -0.12762 -0.0565946 -0.178642 0.0437172 -0.120553 0.13503 0.16969 -0.141264 0.0859198 0.164106 0.0116699 -0.0288217 -0.0149085 -0.219659 -0.00969536 0.0509772 0.0422163 -0.0357621 -0.0890191 0.0372827 -0.0400898 0.040319 -0.17257 0.0539515 -0.107678 -0.0352223 0.0614829 -0.0505449 -0.0955889 0.201817 -0.138386 -0.0631832 0.130641 0.0368637 -0.0769611 0.0649235 -0.0555132 -0.0846075 -0.032879 -0.0437879 0.100436 0.0332789 -0.0436712 0.221546 0.00532717 -0.137708 -0.0343925 0.0423601 0.265121 0.00412511 0.0332112 -0.108605 -0.00346135 0.0286006 -0.0177283 0.118756 -0.00979549 0.10177 -0.0147894 -0.0203664 -0.0149423 -0.013432 -0.0839022 0.0411912 -0.00203981 0.102227 -0.0852251 0.0402809 -0.0344462 -0.0602994 -0.134334 0.0254001 0.109483 0.0615446 0.00206911 -0.0326617 0.116941 -0.111853 -0.0359374 -0.0760571 -0.0455425 -0.0821504 -0.0656401 0.0717021 0.0593022 -0.0510126 0.0190918 -0.0244931 -0.013626 0.0568236 -0.0818139 0.0624495 -0.134826 0.130476 -0.032666 -0.0568246 0.0589985 0.156718 -0.0838403 -0.0189058 0.0331345 0.128633 -0.0886286 -0.0763182 0.0652194 0.160273 -0.000477985 0.00474216 -0.0698666 0.0363717 -0.151203 0.0769253 -0.0642702 0.025908 
0.0425167 -0.0284946 -0.109202 -0.000392572 0.0995712 0.143632 0.0200136 -0.0544968 -0.0283186 -0.115922 0.0138256 0.121974 0.070658 -0.121282 -0.14045 -0.0315591 -0.17801 0.0392983 -0.141642 0.162838 0.180951 -0.140916 0.0978542 0.13875 0.00264862 -0.0286273 -0.0352153 -0.228511 -0.016411 0.0711588 0.0161686 0.000578104 -0.0883288 0.059385 -0.0369776 0.0187505 -0.155785 0.0802063 -0.0916246 -0.0471452 0.0478353 -0.0672043 -0.0656145 0.178507 -0.132596 -0.0468464 0.149235 0.031387 -0.0967799 0.090706 -0.0308599 -0.0847724 -0.0401496 -0.0232651 0.112535 0.00475055 -0.0287498 0.193777 -0.00338668 -0.13595 -0.0236933 0.0367998 0.258254 -0.00498642 0.0459883 -0.121831 -0.0207586 0.0269348 -0.0366782 0.102142 -0.0163411 0.0909995 -0.0225548 -0.00129172 -0.0170097 -0.00967463 -0.06534 0.027855 -0.00144315 0.121676 -0.0666204 0.0244306 -0.0359997 -0.0526556 -0.135732 0.0326601 0.0933799 0.060222 0.00120429 -0.015569 0.109878 -0.129815 -0.055375 -0.0574781 -0.0632261 -0.0683706 -0.0561769 0.0828201 0.0579767 -0.0521117 0.0231832 -0.0165838 -0.0289292 0.0960972 -0.06976 0.0492183 -0.133189 0.172502 -0.0235359 -0.0600888 0.0442001 0.159391 -0.0993881 -0.00117762 0.031057 0.124896 -0.0948492 -0.0602455 0.0578729 0.170386 -0.00942947 0.0297619 -0.0451738 0.0351753 -0.121153 0.0639673 -0.046295 -0.000398291 
0.0394994 -0.03991 -0.110292 -0.00396296 0.106477 0.142041 0.0129225 -0.0535634 -0.0282481 -0.0996353 0.0168665 0.117449 0.0728382 -0.0892378 -0.131091 -0.0400117 -0.173505 0.0495027 -0.120675 0.15975 0.178396 -0.152126 0.111371 0.148708 0.0167131 -0.0354474 -0.0267474 -0.217514 -0.0140753 0.0698075 0.0219206 -0.0215304 -0.0839686 0.0439465 -0.0391551 0.0333909 -0.172059 0.0742038 -0.0943042 -0.0529644 0.0358361 -0.0555613 -0.077495 0.17763 -0.143496 -0.0570928 0.138377 0.0420085 -0.0784311 0.0895714 -0.038527 -0.0736085 -0.0333361 -0.0297723 0.11567 0.00897794 -0.0203997 0.204558 -0.000142426 -0.141535 -0.0256754 0.0416796 0.266198 -0.0008941 0.0376189 -0.105201 -0.0255913 0.0441365 -0.0331688 0.119063 -0.00559459 0.110623 -0.0256864 -0.0137113 -0.0193278 -0.00703048 -0.0646797 0.0260084 0.0075729 0.113064 -0.0766633 0.0298137 -0.0323293 -0.0540703 -0.131439 0.0234735 0.0898363 0.0758056 0.0196336 -0.021308 0.112284 -0.113824 -0.0415641 -0.0557705 -0.0543944 -0.0895408 -0.0661635 0.093463 0.0609528 -0.0621228 0.0353746 -0.0176365 -0.0216348 0.0685622 -0.0741106 0.0656052 -0.131754 0.142141 -0.00605013 -0.0582437 0.0466421 0.163131 -0.0833712 -0.000481229 0.0397604 0.135159 -0.0823003 -0.0572028 0.0550772 0.175173 -0.011902 0.0124809 -0.0551423 0.0279299 -0.147182 0.0807401 -0.0424076 0.0220355 
0.0413111 -0.0135669 -0.122481 0.00222193 0.118625 0.155009 0.0273749 -0.0628811 -0.0327717 -0.100075 0.0173379 0.121161 0.0640815 -0.0909317 -0.130298 -0.0263709 -0.160428 0.0616839 -0.120041 0.146762 0.186115 -0.14601 0.10039 0.14385 0.0264833 -0.0507749 -0.0376845 -0.213268 0.00194493 0.0938187 0.0205436 -0.00306595 -0.0850004 0.043816 -0.0287239 0.0324847 -0.162825 0.0561281 -0.0848342 -0.0555465 0.0400445 -0.0462294 -0.0464771 0.173435 -0.143566 -0.045688 0.156178 0.0265581 -0.101346 0.0780118 -0.0338164 -0.0715906 -0.0392612 -0.0346798 0.114158 0.0243834 -0.0291954 0.214892 -0.00831111 -0.130191 -0.0356431 0.0446229 0.27503 -0.034495 0.0528273 -0.0983968 -0.0376507 0.0292724 -0.0559822 0.129249 0.00230239 0.116623 -0.0338495 -0.0137098 -0.023468 0.00216432 -0.0530247 0.0300919 -0.00783776 0.0837591 -0.0794832 0.0452705 -0.0355259 -0.0494575 -0.134715 0.0365353 0.076201 0.0539098 0.00987947 -0.00528459 0.111948 -0.130278 -0.0635926 -0.0615714 -0.0286479 -0.0762095 -0.06304 0.101996 0.0540888 -0.0451955 0.0223952 -0.0200239 -0.0190856 0.0801729 -0.0933882 0.0783167 -0.127206 0.146977 -0.0131025 -0.0605711 0.0411947 0.145209 -0.0835266 -0.000735264 0.0466638 0.12295 -0.0773177 -0.0594578 0.0685997 0.181868 0.000193747 0.0114261 -0.0485338 0.0329266 -0.140276 0.0825339 -0.037566 0.00884454 
0.0612485 0.00133571 -0.0969399 0.00881922 0.0767089 0.199926 0.0381861 -0.0733024 -0.0548234 -0.087609 0.0231059 0.0670205 0.0683438 -0.12131 -0.0886119 -0.0431635 -0.183001 0.0652339 -0.0930429 0.152391 0.162506 -0.122029 0.10572 0.150678 -0.00290375 -0.0565087 -0.0724087 -0.242474 0.000133873 0.0763894 0.0145974 -0.0160386 -0.0988921 0.0639929 0.0321349 0.0446916 -0.110423 0.064901 -0.0718527 -0.0814264 0.0241284 -0.0927846 -0.0511633 0.142655 -0.149324 -0.0422903 0.162453 0.0678663 -0.129116 0.126091 -0.0453598 -0.0681002 -0.00472125 0.00655302 0.128961 0.00606452 0.00180428 0.169358 -0.01122 -0.156427 -0.0384312 0.0775588 0.27857 -0.0837242 0.0588141 -0.0630119 -0.0090074 -0.00747569 -0.0733284 0.120918 -0.0390871 0.0918439 -0.0511079 0.0340578 -0.0134368 -0.0452683 -0.0475526 0.0221063 0.0474151 0.0958884 -0.0397706 0.0256523 -0.0649298 -0.0834212 -0.107113 0.0432098 0.0337 0.0375319 0.0226178 0.0500876 0.180107 -0.120669 -0.0306967 -0.0659624 -0.0641847 -0.084954 -0.0539755 0.131271 0.0688044 -0.0422868 0.0705843 0.0140166 -0.0319205 0.0398083 -0.0541335 0.0794586 -0.078615 0.129202 -0.00783422 -0.00293988 0.0379369 0.156429 -0.047387 -0.0410449 0.0433293 0.128238 -0.0413161 -0.0643784 0.0558822 0.167779 0.0192771 -0.0396296 2.52568e-05 0.0483951 -0.143193 0.0815471 0.00852013 0.00975288 
0.0428017 0.00725368 -0.0903525 0.000975582 0.0451124 0.189779 0.0139965 -0.0758844 -0.0636817 -0.0816714 0.00563238 0.0603136 0.0674997 -0.135097 -0.0885118 -0.0338668 -0.215087 0.0432542 -0.0739741 0.144482 0.156374 -0.113046 0.107458 0.144849 -0.0179535 -0.026441 -0.0595506 -0.260352 -0.00940879 0.0815223 -0.00161246 -0.0213356 -0.0921734 0.053954 0.0331977 0.0439296 -0.103939 0.0702289 -0.0728707 -0.0597887 0.0119282 -0.111822 -0.0478444 0.148532 -0.135312 -0.0212107 0.187967 0.059775 -0.137507 0.129472 -0.0301324 -0.0712893 0.00675547 0.0220393 0.145048 0.0019557 0.0279464 0.148207 0.00645687 -0.16907 -0.0235499 0.0762052 0.264709 -0.0581442 0.0612032 -0.0826252 0.00192225 -0.0144336 -0.0479081 0.110386 -0.0560284 0.0847341 -0.052323 0.0386122 0.0086135 -0.0425353 -0.0698479 0.0274743 0.0524679 0.119718 -0.0148223 0.0206649 -0.0653459 -0.0742255 -0.113453 0.0483903 0.0312304 0.0315245 0.0202534 0.0460908 0.155968 -0.105265 -0.0256547 -0.0669796 -0.0894154 -0.0722249 -0.0441203 0.145976 0.0902707 -0.0511449 0.0739582 0.0172503 -0.0304721 0.0378556 -0.0539328 0.0585615 -0.0911909 0.140393 -0.0293856 0.00139471 0.0390794 0.158879 -0.0457338 -0.0716987 0.0274945 0.143299 -0.0423884 -0.0715604 0.0420178 0.152531 0.0306129 -0.0410863 0.016112 0.0275154 -0.152021 0.0873035 0.00242933 0.0226741 
0.0644533 0.0194412 -0.138917 -0.0119544 0.0626707 0.163334 -0.0181134 -0.0516444 -0.0661138 -0.0953823 0.0339931 0.0860641 0.0573015 -0.123032 -0.120785 -0.0256164 -0.157906 0.0189891 -0.0873618 0.160619 0.135443 -0.100147 0.133794 0.141966 0.000309853 -0.0168761 0.0370475 -0.220688 0.00461688 0.0586389 -0.0111813 -0.0522128 -0.0618742 0.053567 -0.0401491 0.0216561 -0.125699 0.0917991 -0.0975502 -0.0187238 0.00100278 -0.0822029 -0.0686888 0.19268 -0.153833 -0.00819309 0.183128 0.0433165 -0.134654 0.138448 -0.000764921 -0.0272265 -0.0384274 -0.000689756 0.113293 -0.0113998 0.018199 0.167874 0.034983 -0.159776 -0.049137 0.0304665 0.284355 -0.029849 0.03178 -0.132495 -0.0065824 0.0188127 -0.0276181 0.137571 -0.0349974 0.0844736 -0.0391155 0.0273818 0.0256887 -0.0416535 -0.0715181 0.0604462 0.0020986 0.129054 -0.0440388 0.0213604 -0.038848 -0.0768903 -0.107361 0.0387474 0.0427887 0.0348029 0.0173505 0.00717946 0.11176 -0.116703 -0.0680686 -0.0645678 -0.0327814 -0.0884023 -0.0281829 0.122399 0.0718229 -0.0936705 0.0177419 0.0179078 -0.00776259 0.0812318 -0.102509 0.0466198 -0.122954 0.158595 -0.009676 -0.0668363 0.0769377 0.18895 -0.0434145 -0.00669616 0.0184551 0.111728 -0.0761458 -0.0877648 0.0666964 0.160524 0.00310074 -0.000665242 -0.00686777 0.030211 -0.122964 0.0574191 -0.00280037 0.0169164 
-0.0149771 0.0511494 -0.125495 -0.0128001 0.0448532 0.182248 -0.0431212 -0.126902 -0.042371 -0.071797 0.0140492 0.0236725 0.034258 -0.0450733 -0.0512232 -0.0310626 -0.173807 0.0364323 0.0315582 0.0854401 0.121428 -0.0941336 0.128336 0.0987738 0.0349324 0.0094826 -0.0165495 -0.242995 0.0293995 0.0755557 0.0882589 -0.048364 -0.0347312 -0.0323892 0.0705554 0.110707 -0.105178 0.0660433 -0.0535751 -0.0409205 -0.0118046 -0.0484557 -0.0667698 0.189883 -0.148693 0.0305451 0.203842 0.0452324 -0.122971 0.0425205 -0.0872904 -0.0219662 0.0522487 -0.0302184 0.102544 0.0525389 0.033798 0.190549 0.0262913 -0.165197 -0.08023 0.0620602 0.304761 -0.0819493 0.0996495 -0.057215 0.0232999 -0.00633623 -0.0219787 0.167643 -0.014815 0.10345 -0.0666575 -0.0168051 0.0271636 -0.0555596 -0.120547 0.0420965 0.0077183 0.0810285 -0.0517396 0.0718497 -0.0833877 -0.0651708 -0.100528 0.00276438 -0.000890872 0.00620344 0.00492966 0.00113355 0.13716 -0.051181 -0.014293 -0.105543 0.0120878 -0.0970508 -0.0315101 0.199298 0.0764757 -0.0546371 0.0115508 0.016861 0.00161653 -0.0329678 -0.122874 0.102996 -0.0565206 0.0604099 0.0257628 -0.000771594 0.0486243 0.113531 -0.0419231 -0.085412 0.0413898 0.122173 -0.0422905 -0.12909 0.0748249 0.137015 0.0676921 -0.0632189 -0.00766702 0.0143536 -0.170244 0.0991587 0.0250816 0.0867941 
