{
  "descriptor": [
    -0.09803761541843414,
    0.07690587639808655,
    0.08470666408538818,
    -0.07599207013845444,
    -0.18434235453605652,
    0.05225466564297676,
    -0.1099635437130928,
    -0.027279257774353027,
    0.16823624074459076,
    -0.17226262390613556,
    0.16071200370788574,
    -0.015598436817526817,
    -0.20054210722446442,
    0.10091149806976318,
    -0.017081478610634804,
    0.14449505507946014,
    -0.16564732789993286,
    -0.15738055109977722,
    -0.038048479706048965,
    -0.053968291729688644,
    -0.04891609773039818,
    0.11028650403022766,
    -0.004698566626757383,
    0.07100969552993774,
    -0.17866143584251404,
    -0.37916553020477295,
    -0.0890914797782898,
    -0.046858567744493484,
    0.03597453236579895,
    -0.054921045899391174,
    -0.0753854289650917,
    0.1125948503613472,
    -0.10214188694953918,
    0.048440445214509964,
    0.10669764876365662,
    0.09948654472827911,
    -0.08798865228891373,
    -0.13595375418663025,
    0.22326426208019257,
    0.09939873963594437,
    -0.22861547768115997,
    -0.03234511613845825,
    0.07926870882511139,
    0.24785175919532776,
    0.2211829572916031,
    -0.011904880404472351,
    0.04974251985549927,
    -0.08140899240970612,
    0.17064177989959717,
    -0.2687760889530182,
    0.0052407835610210896,
    0.2340361326932907,
    0.024387503042817116,
    0.07370517402887344,
    0.10976012051105499,
    -0.11697307974100113,
    -0.004667449276894331,
    0.140559121966362,
    -0.09301559627056122,
    -0.004132525995373726,
    0.059020332992076874,
    -0.05116929113864899,
    -0.014033895917236805,
    -0.08916101604700089,
    0.19812577962875366,
    0.11551662534475327,
    -0.11981489509344101,
    -0.1251857578754425,
    0.233366921544075,
    -0.12888884544372559,
    -0.10643073916435242,
    0.05632506310939789,
    -0.12959502637386322,
    -0.18596011400222778,
    -0.16588839888572693,
    0.03713466227054596,
    0.3500007092952728,
    0.17918983101844788,
    -0.10310409218072891,
    0.07326570153236389,
    0.0273165050894022,
    -0.04565366730093956,
    0.011531530879437923,
    0.15230794250965118,
    -0.13056442141532898,
    -0.03684467822313309,
    -0.010559667833149433,
    0.03491220250725746,
    0.2636907994747162,
    0.03949025273323059,
    0.050596535205841064,
    0.1884981244802475,
    0.020979266613721848,
    0.022364968433976173,
    0.10492581874132156,
    0.0719219222664833,
    -0.15071940422058105,
    -0.07493267953395844,
    -0.1968434900045395,
    -0.036935485899448395,
    0.014931406825780869,
    -0.05836232379078865,
    -0.013165175914764404,
    0.17525790631771088,
    -0.19470743834972382,
    0.1738831251859665,
    -0.06863164901733398,
    -0.0981798991560936,
    -0.016576817259192467,
    -0.0005934674409218132,
    -0.05372051149606705,
    0.006157932337373495,
    0.12752322852611542,
    -0.1927746832370758,
    0.09232166409492493,
    0.10150296986103058,
    0.04033904895186424,
    0.1664346158504486,
    0.1222572848200798,
    0.053727686405181885,
    -0.005933200009167194,
    -0.04693195968866348,
    -0.14472126960754395,
    -0.14192569255828857,
    0.0576418936252594,
    -0.03686016425490379,
    -0.016341792419552803,
    -0.030539989471435547
  ]
}