{
  "descriptor": [
    -0.005543848965317011,
    0.11876221001148224,
    0.08752550184726715,
    0.012533523142337799,
    -0.13229696452617645,
    0.019105572253465652,
    -0.01839429698884487,
    -0.05426868051290512,
    0.14205458760261536,
    -0.08232717216014862,
    0.2275635302066803,
    0.02069181576371193,
    -0.2573404908180237,
    0.02510916069149971,
    -0.020787563174962997,
    0.1199469342827797,
    -0.16124574840068817,
    -0.11137596517801285,
    -0.15288108587265015,
    -0.06381581723690033,
    -0.00744156539440155,
    0.07266712933778763,
    0.07309446483850479,
    0.04765992611646652,
    -0.18377861380577087,
    -0.28754693269729614,
    -0.04815749078989029,
    -0.09341756254434586,
    0.07288523763418198,
    -0.1057048812508583,
    -0.02838124893605709,
    0.006635961122810841,
    -0.13815346360206604,
    0.017705390229821205,
    0.041212357580661774,
    0.03264429420232773,
    -0.05668770149350166,
    -0.09102817624807358,
    0.20014604926109314,
    0.022530829533934593,
    -0.2592737674713135,
    -0.006432292051613331,
    0.03567118942737579,
    0.25028446316719055,
    0.23144154250621796,
    -0.007433390710502863,
    0.010087808594107628,
    -0.08787475526332855,
    0.100433349609375,
    -0.2819890081882477,
    0.01876920275390148,
    0.1837327927350998,
    0.090796560049057,
    0.08555368334054947,
    0.052159570157527924,
    -0.16846737265586853,
    -0.013798177242279053,
    0.1414795070886612,
    -0.15156739950180054,
    0.005566330626606941,
    0.056320469826459885,
    -0.017911911010742188,
    -0.024093681946396828,
    -0.06867098808288574,
    0.17279721796512604,
    0.07138683646917343,
    -0.16549891233444214,
    -0.1279127150774002,
    0.14033599197864532,
    -0.19254222512245178,
    -0.03415796533226967,
    0.13050666451454163,
    -0.10179349035024643,
    -0.223153755068779,
    -0.20340511202812195,
    0.053311388939619064,
    0.43341270089149475,
    0.1649019420146942,
    -0.17178569734096527,
    -0.014603552408516407,
    -0.07906588166952133,
    -0.0021538138389587402,
    -0.0014949716860428452,
    0.06591937690973282,
    -0.11276981979608536,
    0.005613343324512243,
    -0.09426695108413696,
    0.05007358640432358,
    0.18730579316616058,
    -0.07121600955724716,
    0.03254948928952217,
    0.24881350994110107,
    0.016352783888578415,
    -0.005381046794354916,
    0.04402639716863632,
    0.08318480104207993,
    -0.13624264299869537,
    0.0325232669711113,
    -0.14829179644584656,
    0.008528521284461021,
    0.043023061007261276,
    -0.10726114362478256,
    0.03260306268930435,
    0.07341493666172028,
    -0.17271406948566437,
    0.18010082840919495,
    -0.0061516291461884975,
    -0.06159400939941406,
    0.05236838385462761,
    0.017241230234503746,
    -0.11425121128559113,
    -0.06348568201065063,
    0.2126980721950531,
    -0.26513832807540894,
    0.1805449277162552,
    0.17979435622692108,
    0.029332155361771584,
    0.1366506963968277,
    0.09462781250476837,
    0.11489317566156387,
    -0.02115161344408989,
    -0.025608593598008156,
    -0.12234748899936676,
    -0.0819147452712059,
    0.04085461422801018,
    -0.10753955692052841,
    0.0023313243873417377,
    -0.03558177873492241
  ]
}