{
  "descriptor": [
    -0.10280780494213104,
    0.11014212667942047,
    0.07102306932210922,
    -0.04850970581173897,
    -0.07148019969463348,
    0.016503283753991127,
    0.033534303307533264,
    -0.15694688260555267,
    0.18457506597042084,
    -0.08976823836565018,
    0.15578927099704742,
    -0.04066075012087822,
    -0.2829752564430237,
    0.11791537702083588,
    -0.09398380666971207,
    0.16079634428024292,
    -0.19063258171081543,
    -0.20713327825069427,
    -0.09039513021707535,
    -0.007576410658657551,
    -0.04045446962118149,
    0.09905463457107544,
    -0.03202288597822189,
    0.023004837334156036,
    -0.11364080756902695,
    -0.28108343482017517,
    -0.026798442006111145,
    0.004371849354356527,
    0.06418264657258987,
    -0.01863737404346466,
    -0.017592182382941246,
    0.1438501924276352,
    -0.1568993777036667,
    0.05906160920858383,
    0.08805115520954132,
    0.05490253493189812,
    -0.035768527537584305,
    -0.0950302854180336,
    0.1813628226518631,
    0.11830080300569534,
    -0.2152409553527832,
    -0.028683215379714966,
    0.03513763099908829,
    0.3019764721393585,
    0.20463666319847107,
    -0.036932725459337234,
    0.00922982208430767,
    -0.17332960665225983,
    0.09590184688568115,
    -0.3512607514858246,
    -0.03139040246605873,
    0.1839239001274109,
    -0.0006280126981437206,
    0.11462131142616272,
    0.06710457056760788,
    -0.24411921203136444,
    -0.018514718860387802,
    0.05900004506111145,
    -0.11373593658208847,
    0.0969390943646431,
    0.05478778854012489,
    -0.04648652300238609,
    0.023204568773508072,
    -0.1316593587398529,
    0.14108765125274658,
    0.0487755611538887,
    -0.1352023184299469,
    -0.08027531951665878,
    0.17967844009399414,
    -0.1253916472196579,
    -0.05127221345901489,
    0.06652567535638809,
    -0.08127128332853317,
    -0.19870536029338837,
    -0.21528664231300354,
    -0.022064877673983574,
    0.3896044194698334,
    0.1416986882686615,
    -0.1063559353351593,
    0.046324171125888824,
    -0.02678254432976246,
    -0.018723012879490852,
    0.02520458959043026,
    0.10076379030942917,
    -0.10475299507379532,
    -0.01901846006512642,
    -0.03501515835523605,
    0.033929791301488876,
    0.2664678990840912,
    0.01169777475297451,
    -0.006570896599441767,
    0.25067463517189026,
    -0.07354390621185303,
    -0.020362675189971924,
    0.02173513174057007,
    0.12995634973049164,
    -0.08341526985168457,
    -0.00971604697406292,
    -0.13209839165210724,
    -0.04708775877952576,
    -0.006923820357769728,
    -0.12180932611227036,
    0.043172743171453476,
    0.16808727383613586,
    -0.2102528214454651,
    0.16328777372837067,
    -0.015931326895952225,
    0.011341659352183342,
    0.039543550461530685,
    -0.008337778970599174,
    -0.009485999122262001,
    0.047520242631435394,
    0.15405772626399994,
    -0.25109025835990906,
    0.21341001987457275,
    0.17434215545654297,
    0.006737919058650732,
    0.11405771970748901,
    0.0010384110501036048,
    0.04027825966477394,
    -0.02349235489964485,
    -0.0036074696108698845,
    -0.09194298833608627,
    -0.10266627371311188,
    -0.0001361274189548567,
    -0.02565050683915615,
    -0.0493253618478775,
    0.027496665716171265
  ]
}