{
  "descriptor": [
    -0.0686006247997284,
    0.020810887217521667,
    0.10941935330629349,
    -0.05253836512565613,
    -0.15964940190315247,
    0.027088776230812073,
    -0.08196575939655304,
    -0.031078752130270004,
    0.14085203409194946,
    -0.12359005957841873,
    0.13997074961662292,
    -0.03091154806315899,
    -0.24036012589931488,
    0.10128218680620193,
    -0.0274344552308321,
    0.1492377370595932,
    -0.17881429195404053,
    -0.192909374833107,
    -0.028788872063159943,
    -0.0529114305973053,
    -0.019268648698925972,
    0.11245761066675186,
    -0.0104074040427804,
    0.08925944566726685,
    -0.1595717966556549,
    -0.3763394057750702,
    -0.07643426954746246,
    -0.0988939180970192,
    0.07798106968402863,
    -0.08858418464660645,
    -0.07750638574361801,
    0.06138260290026665,
    -0.13064296543598175,
    0.020838305354118347,
    0.11469428241252899,
    0.06780047714710236,
    -0.10080987960100174,
    -0.20338594913482666,
    0.2724873721599579,
    0.12321971356868744,
    -0.2523341774940491,
    -0.036880213767290115,
    0.04835249483585358,
    0.2557685077190399,
    0.20143435895442963,
    -0.0018123822519555688,
    0.07579729706048965,
    -0.08243680745363235,
    0.17274977266788483,
    -0.27595436573028564,
    0.026173900812864304,
    0.2236083745956421,
    0.05986495688557625,
    0.057898662984371185,
    0.05851644277572632,
    -0.17528311908245087,
    -0.012349674478173256,
    0.12726153433322906,
    -0.1728036105632782,
    0.08401692658662796,
    0.0650043934583664,
    -0.09291566163301468,
    0.013835440389811993,
    -0.0611463226377964,
    0.18989770114421844,
    0.07225610315799713,
    -0.12443260848522186,
    -0.11956251412630081,
    0.264167845249176,
    -0.1572178155183792,
    -0.08225315809249878,
    0.05755900219082832,
    -0.1301669031381607,
    -0.19737733900547028,
    -0.18636779487133026,
    0.014850904233753681,
    0.4003337621688843,
    0.12738001346588135,
    -0.10732900351285934,
    0.07602787017822266,
    0.013819310814142227,
    -0.03707105666399002,
    0.014282005839049816,
    0.20503081381320953,
    -0.10068245232105255,
    -0.001295530586503446,
    -0.00909082219004631,
    0.02933669090270996,
    0.26683542132377625,
    0.030354244634509087,
    0.011114997789263725,
    0.18792986869812012,
    -0.007755151484161615,
    0.019372498616576195,
    0.12978985905647278,
    0.07856487482786179,
    -0.12969084084033966,
    -0.07605550438165665,
    -0.15145328640937805,
    -0.020208600908517838,
    -0.019503213465213776,
    -0.07431882619857788,
    0.011581998318433762,
    0.15990757942199707,
    -0.17163772881031036,
    0.14539776742458344,
    -0.06274838745594025,
    -0.11198336631059647,
    -0.034460511058568954,
    -0.017306620255112648,
    -0.08789561688899994,
    -0.021289296448230743,
    0.1489420384168625,
    -0.22509664297103882,
    0.12415938079357147,
    0.14988107979297638,
    0.07538080215454102,
    0.160910964012146,
    0.08654193580150604,
    0.0344693586230278,
    0.022439705207943916,
    -0.05336309224367142,
    -0.18379434943199158,
    -0.12141327559947968,
    0.0531759113073349,
    -0.01562831737101078,
    0.01418215874582529,
    -0.013922393321990967
  ]
}