{
  "descriptor": [
    -0.14083115756511688,
    0.06447400152683258,
    0.03394954651594162,
    -0.07393819093704224,
    -0.12814363837242126,
    -0.0012704775435850024,
    -0.032702405005693436,
    -0.10447467863559723,
    0.17706499993801117,
    -0.10014123469591141,
    0.27524039149284363,
    -0.014005094766616821,
    -0.2665056586265564,
    -0.06420250982046127,
    -0.03130653500556946,
    0.1966523975133896,
    -0.17871016263961792,
    -0.11152703315019608,
    -0.07841087132692337,
    -0.0007765092304907739,
    0.06890624761581421,
    0.025786977261304855,
    -0.006028004921972752,
    0.07358305901288986,
    -0.12898482382297516,
    -0.3744598925113678,
    -0.07935390621423721,
    -0.06086283549666405,
    -0.013554008677601814,
    -0.06752315908670425,
    -0.008348065428435802,
    0.06958822160959244,
    -0.1842418909072876,
    -0.10173263400793076,
    0.03448639065027237,
    0.09426852315664291,
    -0.03836958855390549,
    -0.10794468969106674,
    0.18522773683071136,
    0.027635468170046806,
    -0.2198859304189682,
    0.006907201837748289,
    0.05274214223027229,
    0.26345574855804443,
    0.11022629588842392,
    0.006003541871905327,
    0.050785262137651443,
    -0.08054555207490921,
    0.07361672073602676,
    -0.25648996233940125,
    0.020351501181721687,
    0.12924180924892426,
    0.08669853955507278,
    0.06419733911752701,
    0.020373808220028877,
    -0.11891784518957138,
    0.04071204736828804,
    0.14279057085514069,
    -0.23298156261444092,
    0.013192273676395416,
    0.06403574347496033,
    -0.06503289192914963,
    -0.044115930795669556,
    -0.08212154358625412,
    0.1898070126771927,
    0.10003962367773056,
    -0.13042424619197845,
    -0.14921873807907104,
    0.13297602534294128,
    -0.11206138134002686,
    -0.09066109359264374,
    0.055945806205272675,
    -0.1488926261663437,
    -0.23403139412403107,
    -0.3160504102706909,
    0.05090414732694626,
    0.4311313331127167,
    0.1409439742565155,
    -0.17237350344657898,
    0.02199685573577881,
    -0.058968435972929,
    -0.05640034005045891,
    0.053574398159980774,
    0.10751204192638397,
    0.03077220916748047,
    0.0005096314125694335,
    -0.0410107746720314,
    0.05176146328449249,
    0.19859404861927032,
    -0.007380823139101267,
    -0.02124173939228058,
    0.2814987301826477,
    0.05163442716002464,
    0.0034941385965794325,
    0.022689329460263252,
    0.07422628253698349,
    -0.03773680701851845,
    0.016400747001171112,
    -0.11574135720729828,
    0.020056694746017456,
    0.036671414971351624,
    -0.029099198058247566,
    0.022206414490938187,
    0.08993035554885864,
    -0.19614949822425842,
    0.15350155532360077,
    0.016771584749221802,
    -0.019534559920430183,
    0.03643374890089035,
    -0.0038132998161017895,
    -0.12655149400234222,
    -0.06709156185388565,
    0.1388770043849945,
    -0.27203741669654846,
    0.16835647821426392,
    0.22258694469928741,
    0.07772043347358704,
    0.13368067145347595,
    0.0730290412902832,
    0.02363879419863224,
    0.03520983085036278,
    -0.036997824907302856,
    -0.19327019155025482,
    -0.07939008623361588,
    0.09546396136283875,
    -0.053573913872241974,
    0.03862510621547699,
    0.013537494465708733
  ]
}