0.0868784 -0.0734276 -0.12581 0.018483 0.00188566 0.0743777 0.0146199 -0.00453823 -0.0721664 -0.0448167 -0.0398103 0.125259 0.0377272 -0.130178 -0.140842 -0.0238997 -0.0656065 0.0601492 -0.0447048 0.174421 0.0600594 -0.0198368 0.114469 0.178975 -0.143747 0.0490388 0.0755397 -0.247157 -0.0861592 0.078629 -0.17311 0.0201458 0.00594338 0.0847497 -0.0163721 -0.0589981 -0.00586 0.153106 -0.182832 -0.056697 -0.0611538 -0.0512467 -0.0512685 0.131709 -0.139766 0.0260035 0.172265 -0.00445431 -0.119037 0.195014 0.120559 -0.119963 0.0203489 0.0665501 0.195205 -0.0228827 0.086674 0.0523844 0.0777653 -0.147759 0.0344168 -0.00488609 0.147268 -0.0323932 0.0662354 -0.195633 -0.0253604 -0.0310633 -0.025138 0.0696861 -0.104715 -0.0498074 -0.0159671 0.047984 -0.0440033 -0.0115509 -0.00947738 0.0710076 0.0464117 0.0211091 0.00325931 0.0337517 -0.111778 -0.139973 -0.019062 -0.0427312 0.0133713 0.0113521 0.0425348 0.0882477 0.0471346 -0.0826743 -0.06922 -0.0597939 -0.0332695 0.0577856 0.0354587 0.0693721 0.106836 -0.0512471 0.0930808 0.0580499 -0.00325485 0.0681977 -0.0718063 -0.115655 -0.124513 0.0314271 -0.114523 -0.00549327 0.0795168 0.201068 0.0482172 -0.089935 -0.0296422 0.0723513 -0.0172465 -0.173155 -0.0184165 0.0540917 -0.0133313 0.0458805 0.074984 -0.0111048 -0.0240945 0.0266037 0.00815798 -0.102864 
0.0807285 -0.0733689 -0.117744 0.0142056 -0.00390843 0.0619735 0.0121711 -0.0198532 -0.0813447 -0.0641251 -0.0515803 0.118238 0.0477049 -0.107972 -0.152215 -0.0259358 -0.0876173 0.0564186 -0.0491123 0.177215 0.0684475 -0.0276615 0.133458 0.161689 -0.149626 0.0487259 0.0569301 -0.24236 -0.0876958 0.0860421 -0.179793 0.0246136 -0.000158123 0.0703569 -0.0122228 -0.0603217 -0.0193004 0.175137 -0.174507 -0.0506624 -0.0823594 -0.0394026 -0.0551513 0.123512 -0.14138 0.0278266 0.174493 -0.00715851 -0.110813 0.206679 0.106576 -0.114519 0.0258806 0.0844942 0.190951 -0.0379702 0.108931 0.0583492 0.0738892 -0.150947 0.0451845 0.013782 0.150741 -0.0178797 0.0594728 -0.19041 -0.018606 -0.0327785 -0.0209936 0.061632 -0.09755 -0.0435153 -0.00272225 0.0681279 -0.0462955 -0.0152448 -0.0170411 0.0343003 0.0522671 0.0316357 0.0188602 0.0221263 -0.120335 -0.139619 -0.0271748 -0.0397526 0.0019243 0.0126879 0.0438393 0.0730294 0.0539722 -0.0783535 -0.0509609 -0.0678604 -0.0364267 0.0448606 0.0274923 0.096847 0.114726 -0.0411679 0.0909061 0.0586007 -0.00247928 0.0782997 -0.0645981 -0.111669 -0.122495 0.0494575 -0.0968743 -0.00407921 0.0770636 0.200791 0.0388885 -0.0829344 -0.0417828 0.0926374 -0.0043631 -0.155025 -0.0175077 0.0538074 -0.0287844 0.0444501 0.0718673 -0.0243477 -0.0416499 0.0257901 -0.000896651 -0.0906833 
0.0881074 -0.0740806 -0.11202 0.0223615 0.00258192 0.0682942 0.0214416 -0.00210645 -0.0730074 -0.0503188 -0.0355 0.13354 0.0354507 -0.136453 -0.143363 -0.0182241 -0.0711787 0.060876 -0.0645772 0.178836 0.0520632 -0.00707839 0.11633 0.186329 -0.154107 0.0406628 0.0743458 -0.234559 -0.0848218 0.0744255 -0.185677 0.0219818 0.00438184 0.0918801 -0.032184 -0.0665586 -0.0138507 0.146295 -0.193457 -0.03198 -0.0583988 -0.0476984 -0.0524786 0.122514 -0.140134 0.019042 0.167372 -0.0101879 -0.117219 0.211911 0.129585 -0.127623 0.00627581 0.0689594 0.184901 -0.0236245 0.0838869 0.0565561 0.0773146 -0.123773 0.0309748 0.00318427 0.138137 -0.0272799 0.0592363 -0.198792 -0.0246946 -0.0456284 -0.0379892 0.0666011 -0.103992 -0.0506854 -0.000973473 0.0697872 -0.0387783 -0.0080246 -0.00500611 0.0607318 0.0408079 0.0150415 0.0181602 0.0263163 -0.112564 -0.137471 -0.0235918 -0.0296353 0.0118997 0.00146052 0.025783 0.0925109 0.0464611 -0.0863643 -0.0751216 -0.0560567 -0.0300853 0.0685086 0.026378 0.0579688 0.109322 -0.0406327 0.085537 0.0518399 -0.00378733 0.0758715 -0.0653978 -0.118297 -0.124792 0.0365088 -0.118336 -0.0113498 0.0826013 0.207654 0.0620255 -0.0828953 -0.042694 0.0712026 -0.0112275 -0.151957 -0.0224701 0.0553645 -0.0173225 0.045865 0.0665501 -0.0110502 -0.0223168 0.0296906 -0.00327962 -0.110863 
0.0865712 -0.0619159 -0.111347 0.0176488 -0.00472259 0.0742956 0.0195816 -0.00168867 -0.0698403 -0.0521363 -0.0361336 0.121971 0.0364886 -0.147454 -0.145774 -0.0158117 -0.0877481 0.0524573 -0.0713723 0.173573 0.0548788 -0.0112498 0.122895 0.170882 -0.158522 0.0389525 0.0664322 -0.242489 -0.0836229 0.0690002 -0.182242 0.019322 0.00454202 0.0910401 -0.0290779 -0.0687206 -0.0128376 0.15656 -0.190079 -0.0272025 -0.064323 -0.0574668 -0.0579603 0.120953 -0.136422 0.0233872 0.169059 -0.0105296 -0.12647 0.214976 0.122337 -0.122116 0.00530512 0.0751085 0.176397 -0.0266181 0.0917796 0.0501634 0.0720162 -0.125872 0.0312536 0.00442746 0.142672 -0.0277026 0.0646912 -0.199909 -0.0228736 -0.043891 -0.0346354 0.0666877 -0.106586 -0.0529732 -0.00236393 0.0761974 -0.03403 -0.0120044 -0.0111805 0.0541971 0.0385995 0.0210564 0.0199219 0.0168733 -0.117138 -0.133928 -0.0293633 -0.0206001 0.00890558 -0.00238231 0.025407 0.0921205 0.0502381 -0.0928286 -0.0740296 -0.0596166 -0.0331326 0.0665312 0.0258761 0.0627906 0.110865 -0.0314659 0.0852081 0.0510933 -0.0090124 0.0762099 -0.057277 -0.119709 -0.120992 0.0489982 -0.115163 -0.0132082 0.0787872 0.208056 0.0591342 -0.0856264 -0.0388522 0.0776657 -0.0142357 -0.145401 -0.0153205 0.0565442 -0.0169499 0.0453483 0.0705274 -0.00756329 -0.0141755 0.0255141 1.76888e-05 -0.106396 
0.0878773 -0.0754958 -0.114342 0.0163045 -0.00459429 0.0732827 0.0119149 0.00328749 -0.0703847 -0.0532943 -0.0349446 0.124076 0.0369827 -0.135322 -0.140382 -0.0232958 -0.0762269 0.0567833 -0.0627946 0.177064 0.0500206 -0.00853412 0.123537 0.181641 -0.155557 0.0416866 0.0787165 -0.237089 -0.0894456 0.0635593 -0.177121 0.0128982 0.00688069 0.0910179 -0.0311947 -0.060725 -0.0129665 0.151418 -0.193814 -0.0319438 -0.063089 -0.050326 -0.0619526 0.127103 -0.140758 0.0153449 0.164445 -0.00544929 -0.116512 0.21853 0.120993 -0.124904 0.0100788 0.0731703 0.180289 -0.0260242 0.0888116 0.0528201 0.0793895 -0.135754 0.0284134 0.00616199 0.141588 -0.0251039 0.0528685 -0.196602 -0.0177193 -0.0397528 -0.0297178 0.0701712 -0.105772 -0.0537392 -0.00153102 0.070398 -0.0355247 -0.0180025 -0.0118907 0.057098 0.0431582 0.0217466 0.01634 0.0236891 -0.114596 -0.143385 -0.023301 -0.0273849 0.0104048 0.00410086 0.0326693 0.0901191 0.0530308 -0.0860453 -0.0689235 -0.0603998 -0.0294099 0.0644353 0.0245339 0.0644025 0.104819 -0.0426368 0.0861924 0.0521137 -0.00342825 0.0696923 -0.0613065 -0.116927 -0.125377 0.0328081 -0.116463 -0.0107717 0.0829819 0.212146 0.0623402 -0.0830025 -0.0418274 0.0733088 -0.00887091 -0.157308 -0.0146397 0.0531175 -0.0144283 0.0423779 0.0707102 -0.00915441 -0.0237457 0.0216355 0.00118842 -0.101607 
0.0822395 -0.0628474 -0.117092 0.0196547 -0.00630663 0.0579367 0.00723167 -0.0088205 -0.0696548 -0.0601553 -0.0455585 0.123279 0.0383383 -0.130828 -0.155684 0.00194914 -0.079666 0.0408717 -0.0750256 0.181566 0.0575924 -0.0231422 0.129067 0.149741 -0.155615 0.058532 0.0603954 -0.238737 -0.0885227 0.0672465 -0.180357 0.0504086 0.0107022 0.0890545 -0.0423091 -0.0645997 -0.0136818 0.18688 -0.178189 -0.0280303 -0.0744421 -0.047252 -0.051441 0.104488 -0.118923 0.0298014 0.176016 -0.0249194 -0.123397 0.210612 0.119304 -0.119176 0.00765535 0.0837952 0.18145 -0.035012 0.101937 0.0465805 0.0763719 -0.136148 0.0349241 0.000327443 0.138617 -0.0275636 0.064318 -0.190285 -0.0238293 -0.0252804 -0.02723 0.0624265 -0.0988126 -0.0508706 -0.00248548 0.0837378 -0.0310575 -0.0121305 -0.00726147 0.0423511 0.0280791 0.0172599 0.0163696 0.0272239 -0.118744 -0.139388 -0.0358238 -0.0231161 0.00603435 0.00676809 0.0345428 0.0750891 0.0380722 -0.0917413 -0.0706728 -0.0568566 -0.0209038 0.0777025 0.0353374 0.0725103 0.108973 -0.0311786 0.069056 0.037408 -0.014643 0.0999209 -0.0638391 -0.116735 -0.132804 0.050105 -0.108542 -0.0274178 0.0651611 0.215475 0.0437212 -0.0776603 -0.0316562 0.0712451 -0.0203406 -0.155189 -0.0113218 0.0514963 -0.020544 0.0678876 0.0894229 -0.0120126 -0.0103315 0.0180264 0.00134358 -0.108197 
0.0881712 -0.0747 -0.105364 0.0164298 -0.00738686 0.0770381 0.00952463 0.00537318 -0.0694327 -0.0633909 -0.0397609 0.121296 0.0313475 -0.143354 -0.140445 -0.0124336 -0.0868656 0.0461088 -0.0709336 0.172183 0.054803 -0.0068254 0.126554 0.16652 -0.157715 0.0433585 0.0720302 -0.243079 -0.097825 0.0585488 -0.176405 0.0153087 0.00772443 0.0972107 -0.0297965 -0.0610892 -0.0101164 0.156854 -0.189452 -0.0278066 -0.065938 -0.0533295 -0.0575339 0.116142 -0.128326 0.0202923 0.166248 -0.0158328 -0.125132 0.223079 0.119304 -0.133583 0.0102583 0.0807271 0.179441 -0.0271344 0.0913189 0.0498661 0.0697392 -0.129122 0.0318401 0.00753122 0.137877 -0.0308924 0.0660711 -0.195393 -0.0241059 -0.0369916 -0.0334459 0.0692642 -0.105667 -0.0560751 -0.00249334 0.0706972 -0.0342608 -0.0139974 -0.00889604 0.0474243 0.0391467 0.0237074 0.019756 0.0148736 -0.116425 -0.140647 -0.0353884 -0.0222469 0.00912501 0.00114043 0.0250401 0.0949863 0.0531982 -0.095165 -0.073409 -0.0531787 -0.0306427 0.0813352 0.0263961 0.0603672 0.104195 -0.0261278 0.081397 0.0457759 -0.0174443 0.0703275 -0.0516853 -0.11886 -0.12593 0.035239 -0.125087 -0.0170353 0.0752044 0.209434 0.0626353 -0.0831631 -0.0333723 0.0776059 -0.012246 -0.14555 -0.0153828 0.0548928 -0.0139022 0.0469914 0.0797363 -0.00995993 -0.00544337 0.0216663 0.00869997 -0.107604 
0.0922918 -0.0698891 -0.113075 0.0187478 -0.00835049 0.078191 0.0136131 0.00252728 -0.0653602 -0.064172 -0.0411236 0.114826 0.0262917 -0.145586 -0.135759 -0.0145366 -0.0805989 0.0435321 -0.0612197 0.166778 0.0508772 0.00214989 0.115742 0.165194 -0.154245 0.0418723 0.0785604 -0.243999 -0.097613 0.0654585 -0.176477 0.0135257 0.0083714 0.0963323 -0.0171136 -0.0611059 0.00496096 0.147853 -0.188303 -0.0380542 -0.0618436 -0.0554776 -0.0458642 0.122246 -0.127619 0.0307021 0.168875 -0.0116715 -0.126225 0.215709 0.118085 -0.133852 0.0214097 0.0792408 0.185989 -0.0258508 0.0860357 0.0420502 0.0723762 -0.135158 0.0311113 0.00337845 0.137013 -0.0361552 0.0651529 -0.192012 -0.0207012 -0.0416454 -0.0288402 0.0622305 -0.109247 -0.0630494 -0.00584308 0.0592043 -0.0334765 -0.0127058 -0.00881671 0.0539172 0.0388477 0.023795 0.0270115 0.0215015 -0.120743 -0.142095 -0.0248392 -0.0231687 0.00222971 -0.00261667 0.0231398 0.10538 0.0568457 -0.0930894 -0.0812295 -0.0565625 -0.0340434 0.0841056 0.0327092 0.057395 0.108038 -0.0319075 0.0853074 0.0496538 -0.0093005 0.0611071 -0.0638688 -0.122696 -0.1223 0.0334682 -0.133251 -0.00584756 0.0848934 0.201901 0.0614485 -0.0900813 -0.0359426 0.0724881 -0.0160195 -0.152312 -0.0203206 0.0450428 -0.00837224 0.0464368 0.0877264 -0.00707385 -0.000151206 0.0170505 0.0139036 -0.112957 
0.0885498 -0.0766479 -0.111808 0.0161513 -0.0114358 0.0755618 0.00182543 0.00857119 -0.0682391 -0.0414324 -0.025775 0.120623 0.0370485 -0.13303 -0.136508 -0.00500579 -0.0703485 0.0562579 -0.0626935 0.164191 0.0587809 -0.00617693 0.120856 0.181994 -0.153175 0.050892 0.0921554 -0.240837 -0.0901139 0.0636974 -0.178582 0.0156806 0.0178833 0.100036 -0.0361885 -0.0580591 -0.0100357 0.152301 -0.18844 -0.0307844 -0.0713939 -0.0569941 -0.0622427 0.121215 -0.125525 0.0192309 0.164724 -0.0131629 -0.127727 0.202359 0.132738 -0.121392 0.0131647 0.074051 0.179539 -0.0148395 0.0975245 0.0425167 0.0834443 -0.136718 0.0285119 -0.00645217 0.134539 -0.025407 0.0579079 -0.190662 -0.0279043 -0.0210413 -0.0220759 0.0791613 -0.110234 -0.0619621 -0.0165753 0.0466849 -0.0288016 -0.0117668 -0.0100753 0.0681926 0.0339016 0.018494 0.0128825 0.0241992 -0.110868 -0.145166 -0.0322581 -0.0228027 0.014619 -0.000534936 0.0281959 0.0983558 0.0419375 -0.0878572 -0.0781083 -0.0457059 -0.033019 0.0844229 0.0229842 0.0605489 0.112146 -0.0411298 0.095855 0.0483363 -0.0115336 0.0692947 -0.0532595 -0.123993 -0.132278 0.0197944 -0.124264 -0.0286115 0.0704021 0.21418 0.06638 -0.091423 -0.0227497 0.0765303 -0.0223885 -0.161676 -0.0177937 0.053059 -0.00464753 0.0393046 0.079204 -0.0120355 -0.010518 0.0305822 0.012257 -0.100022 
0.0896862 -0.0711558 -0.101401 0.012978 -0.0121334 0.0831244 0.00146378 0.0158468 -0.0728225 -0.0471293 -0.0314746 0.11537 0.0306632 -0.141938 -0.12583 -0.00275522 -0.0771972 0.0458738 -0.0654654 0.162543 0.0582703 -0.000286104 0.121479 0.17058 -0.150491 0.0524227 0.0847915 -0.242651 -0.0889601 0.0542879 -0.171774 0.0175746 0.0164888 0.107135 -0.033928 -0.057375 -0.00502358 0.157028 -0.185497 -0.0302499 -0.0674473 -0.0614465 -0.0560957 0.118463 -0.121859 0.0209473 0.169382 -0.0178551 -0.137603 0.209843 0.131037 -0.125737 0.00877804 0.0773021 0.181168 -0.0179127 0.0923647 0.0437459 0.0770639 -0.138761 0.0249132 -0.00688934 0.133801 -0.0328078 0.0662286 -0.186627 -0.0286263 -0.0257028 -0.0285882 0.0830571 -0.111071 -0.0597188 -0.0166176 0.0561733 -0.0270828 -0.0190706 -0.00915221 0.063296 0.036094 0.0203948 0.0151234 0.0202035 -0.109214 -0.146119 -0.0310416 -0.0278663 0.0137149 0.00108096 0.0305171 0.105474 0.0488376 -0.0945505 -0.0847019 -0.0447822 -0.0307662 0.0919291 0.0306488 0.0616423 0.105418 -0.0334138 0.0838314 0.0472702 -0.0179705 0.0692421 -0.0568055 -0.119604 -0.132515 0.0228756 -0.121163 -0.0346752 0.0696245 0.216991 0.0595732 -0.0900653 -0.0122461 0.0703542 -0.0175077 -0.161869 -0.0128504 0.0557361 0.00308247 0.0433853 0.0904742 -0.00729846 0.00210371 0.0219355 0.0271416 -0.10324 
0.0855377 -0.0770396 -0.116344 0.0207295 -0.00339911 0.0786373 0.00474836 0.00383713 -0.0525278 -0.0460603 -0.0288895 0.127416 0.0314708 -0.141104 -0.139131 -0.00641449 -0.0796298 0.0521599 -0.0672361 0.162786 0.0614541 -0.00853525 0.11788 0.183552 -0.147549 0.0417825 0.0926325 -0.246516 -0.0977463 0.071311 -0.172147 0.0147628 0.0204555 0.0997976 -0.033873 -0.0542534 -0.00979202 0.141318 -0.19472 -0.0342531 -0.0617325 -0.0617177 -0.0603292 0.122948 -0.124698 0.0226336 0.161958 -0.0111933 -0.122714 0.199126 0.130299 -0.12486 0.0185778 0.0655025 0.18692 -0.00924522 0.0864848 0.0436213 0.0764699 -0.129993 0.0250949 -0.00991955 0.136359 -0.0282047 0.0644297 -0.195095 -0.0347177 -0.0184408 -0.0261811 0.0810921 -0.1088 -0.0594118 -0.0212141 0.033823 -0.0296459 0.00103337 -0.007768 0.0701532 0.0284866 0.0222714 0.0100601 0.0232266 -0.111946 -0.136261 -0.0358925 -0.0206396 0.0177311 0.00110313 0.0211863 0.10267 0.0384262 -0.0940649 -0.0829296 -0.0433364 -0.0385871 0.0882913 0.0177577 0.0478632 0.11795 -0.0395156 0.100913 0.0428921 -0.0163202 0.0598841 -0.0546142 -0.123721 -0.135473 0.0199128 -0.133862 -0.0222434 0.0717547 0.207757 0.0645462 -0.0940449 -0.0220444 0.0814239 -0.0282018 -0.153196 -0.0176177 0.0624942 0.000587924 0.0433871 0.0732117 -0.00864535 -0.00485941 0.0364879 0.0125225 -0.101932 
0.0893712 -0.0785748 -0.117277 0.0211995 -0.00586532 0.0772865 0.00576926 0.00508481 -0.0535715 -0.0482981 -0.0274928 0.127659 0.0318148 -0.134578 -0.139136 -0.0149105 -0.0694652 0.0533218 -0.063673 0.164387 0.0554628 -0.00437272 0.116768 0.188655 -0.149769 0.0403188 0.0966664 -0.239081 -0.0998195 0.0705219 -0.174062 0.00725773 0.0212569 0.0989251 -0.0340904 -0.0560572 -0.00906718 0.143945 -0.199184 -0.0336526 -0.065668 -0.0541913 -0.0637577 0.124063 -0.127513 0.0205378 0.157737 -0.0106394 -0.118539 0.204938 0.131872 -0.120095 0.021076 0.066269 0.186671 -0.0110952 0.0848358 0.0459998 0.0806518 -0.134532 0.023391 -0.00761395 0.136409 -0.0302949 0.0572669 -0.195632 -0.0274327 -0.0194844 -0.0286007 0.080073 -0.104242 -0.0634797 -0.0171842 0.0364632 -0.0318503 2.87762e-05 -0.00834484 0.0656411 0.032167 0.0233359 0.00885589 0.0241868 -0.109906 -0.141173 -0.0286145 -0.0273068 0.0158715 -0.000978184 0.0257114 0.102684 0.037726 -0.0934367 -0.0765943 -0.0440949 -0.0340165 0.0821097 0.0225477 0.0456493 0.114269 -0.043796 0.100487 0.0519868 -0.0120748 0.0596769 -0.062041 -0.123904 -0.13272 0.0125156 -0.132793 -0.0199203 0.0805472 0.207771 0.0672649 -0.0900996 -0.0272951 0.080232 -0.0266112 -0.156875 -0.0185863 0.0584521 -0.00369546 0.0407469 0.0706476 -0.0107791 -0.00401171 0.0341045 0.014474 -0.103298 
0.0838042 -0.0711925 -0.11076 0.0166386 -0.0127008 0.0714185 0.000667537 0.0102387 -0.0715423 -0.047119 -0.0335345 0.117356 0.0378118 -0.145247 -0.141121 0.00773194 -0.0838206 0.0466777 -0.0703095 0.17225 0.0630911 -0.016889 0.126397 0.160266 -0.156137 0.0536949 0.0752016 -0.248143 -0.0898886 0.0603558 -0.176798 0.0307641 0.0162459 0.0995315 -0.0397191 -0.0587812 -0.0114036 0.163028 -0.181193 -0.0280753 -0.0745458 -0.0633324 -0.0546892 0.112749 -0.115665 0.0204707 0.173081 -0.0203983 -0.134789 0.209657 0.125194 -0.129827 0.00722794 0.0805232 0.175119 -0.0231036 0.0999874 0.0361889 0.0748886 -0.131834 0.0326896 -0.0046019 0.134794 -0.027296 0.0661242 -0.191651 -0.0327578 -0.0263191 -0.0255964 0.0680536 -0.110866 -0.0584042 -0.0156533 0.0614108 -0.0288503 -0.014167 -0.0048878 0.060679 0.0299512 0.0200179 0.0154398 0.0156294 -0.117549 -0.138692 -0.0413195 -0.0114339 0.00885033 0.00119149 0.0310412 0.0913331 0.0422403 -0.0921628 -0.0839205 -0.0442009 -0.0299865 0.0935111 0.0241911 0.0671931 0.106966 -0.028221 0.0823875 0.0345923 -0.0211978 0.0784751 -0.0466705 -0.11859 -0.131285 0.0366774 -0.120394 -0.0310556 0.0552618 0.214289 0.0588904 -0.0908229 -0.020622 0.0745813 -0.0183706 -0.151883 -0.012776 0.0553268 -0.00997027 0.0490379 0.0908359 -0.0085492 -0.00570808 0.0237944 0.0116537 -0.103742 
0.088339 -0.0666718 -0.107108 0.0254056 -0.0159875 0.0717196 0.00351097 0.00538136 -0.0640052 -0.0600285 -0.0325354 0.117244 0.0321095 -0.151144 -0.145583 0.00608513 -0.0858776 0.0436305 -0.0762158 0.172003 0.0649807 -0.0110301 0.12683 0.158209 -0.156089 0.0486407 0.0689829 -0.250151 -0.0913453 0.06364 -0.174477 0.0335465 0.0170859 0.0987744 -0.0362137 -0.0632409 -0.00968979 0.168633 -0.181403 -0.0252542 -0.0758293 -0.059227 -0.057725 0.10924 -0.114401 0.0208283 0.171865 -0.0280181 -0.130625 0.215321 0.126223 -0.12229 0.0112365 0.0834416 0.173763 -0.027234 0.103762 0.0328015 0.0719234 -0.13118 0.0290138 -0.00603067 0.133534 -0.0309314 0.0636732 -0.196224 -0.0253723 -0.0349674 -0.0294616 0.0679541 -0.107453 -0.0611921 -0.0124434 0.0693672 -0.0303975 -0.0166844 -0.00771264 0.0500338 0.0252945 0.0303776 0.0182482 0.0153443 -0.117994 -0.13943 -0.0337072 -0.0104385 0.00478302 -0.00369444 0.0233264 0.0893092 0.0426296 -0.0952178 -0.0843885 -0.045283 -0.0291934 0.0899272 0.0272171 0.0650523 0.106238 -0.0243266 0.0794959 0.0384183 -0.0198124 0.0832486 -0.0474501 -0.121465 -0.122767 0.0408509 -0.115243 -0.0279973 0.0564986 0.211852 0.0539711 -0.0900885 -0.0217538 0.0767537 -0.0174739 -0.150017 -0.0105641 0.0553371 -0.0117227 0.0554341 0.0900348 -0.00911383 0.00556326 0.0211466 0.0205958 -0.103141 
0.0905233 -0.0597293 -0.0986132 0.0127127 -0.0113873 0.0813546 0.00602544 0.0114888 -0.0811139 -0.0558612 -0.0386995 0.103462 0.0396074 -0.150603 -0.133037 0.0202382 -0.0877062 0.0424118 -0.0794474 0.165193 0.0769761 -0.0128429 0.130563 0.151642 -0.153963 0.0475503 0.0571044 -0.252434 -0.0786571 0.0613327 -0.170332 0.0393185 0.00813189 0.106172 -0.0318386 -0.0653497 -0.00527497 0.172864 -0.164264 -0.026795 -0.0809718 -0.0633076 -0.0430829 0.100942 -0.105508 0.0200394 0.178159 -0.0252333 -0.14585 0.212493 0.124179 -0.134389 0.00877404 0.0875247 0.16806 -0.0262565 0.111647 0.0403125 0.0692116 -0.137061 0.0325507 0.00181915 0.133558 -0.0410702 0.0715161 -0.181615 -0.0343404 -0.0331598 -0.0365269 0.0632947 -0.11603 -0.056232 -0.022135 0.0707838 -0.0303286 -0.0218934 0.000736088 0.0485997 0.0339478 0.0262941 0.0254301 0.00920554 -0.117901 -0.138463 -0.0401676 -0.00935875 0.00133316 -0.00282718 0.028002 0.09656 0.0537421 -0.0985525 -0.090169 -0.0408369 -0.0269287 0.102881 0.025856 0.0827921 0.0998396 -0.0111016 0.0781558 0.0318765 -0.0301286 0.095438 -0.0451632 -0.116603 -0.127016 0.0434271 -0.108156 -0.0394891 0.0473491 0.215225 0.050453 -0.0863072 -0.00983068 0.0809366 -0.0164947 -0.140778 -0.0148351 0.0582599 -0.00806347 0.050783 0.100738 -0.00821266 -0.00240311 0.0175078 0.0162423 -0.110074 
0.0900628 -0.0627929 -0.101264 0.0146872 -0.0129725 0.0815593 0.00918812 0.0131934 -0.0684261 -0.0628976 -0.0373536 0.106515 0.0320667 -0.152829 -0.136146 0.00667144 -0.0858022 0.039559 -0.0819986 0.162382 0.0674494 -0.00642194 0.118243 0.156529 -0.155271 0.0441611 0.066176 -0.247266 -0.088423 0.0560217 -0.170003 0.0305368 0.00827302 0.107894 -0.0303922 -0.062781 -0.000816504 0.161573 -0.180481 -0.0295008 -0.0675347 -0.0626476 -0.0456777 0.110016 -0.107054 0.0246666 0.173532 -0.022621 -0.144996 0.210467 0.118552 -0.137459 0.0116446 0.082659 0.17295 -0.021616 0.0933565 0.0401403 0.0707414 -0.137965 0.0316154 0.00282809 0.133432 -0.0383486 0.0692398 -0.182557 -0.0273543 -0.034146 -0.0324599 0.0660806 -0.114085 -0.0652562 -0.0144991 0.063969 -0.0283552 -0.017059 -0.00327251 0.0537108 0.0311674 0.020001 0.0221469 0.0164133 -0.120364 -0.144152 -0.0388585 -0.00947067 0.00595502 -0.00466604 0.0205554 0.103645 0.0575917 -0.101785 -0.0898567 -0.0481133 -0.0293397 0.104992 0.0298644 0.0635982 0.10217 -0.0163146 0.0785551 0.0353739 -0.0257084 0.0817553 -0.0524862 -0.119654 -0.129497 0.0397742 -0.127308 -0.0325273 0.0625546 0.211426 0.0525876 -0.089846 -0.0163313 0.0738807 -0.023527 -0.148002 -0.0132683 0.0510651 -0.0060993 0.0528124 0.096684 -0.00235221 0.00687528 0.0154423 0.0151094 -0.115886 
0.083276 -0.0625089 -0.101247 0.0137378 -0.0198711 0.0735795 -0.00217679 0.00957984 -0.0676563 -0.058898 -0.0420182 0.110675 0.0312907 -0.1424 -0.135238 0.00463278 -0.0869108 0.0318795 -0.0740137 0.167249 0.0562003 -0.00636101 0.126673 0.153592 -0.155628 0.0563532 0.0741982 -0.241805 -0.0911449 0.0538851 -0.169297 0.0309583 0.0180858 0.101422 -0.0383316 -0.0592938 -0.00372787 0.177628 -0.183358 -0.0213375 -0.0746949 -0.0600876 -0.0527348 0.107453 -0.109957 0.0269074 0.174107 -0.025809 -0.135464 0.216721 0.124787 -0.123808 0.0134967 0.0858191 0.180189 -0.0255864 0.100103 0.0389807 0.0773839 -0.143569 0.0256016 -0.00361743 0.131286 -0.0322836 0.0640609 -0.184476 -0.0227183 -0.0270035 -0.0299561 0.0715428 -0.10709 -0.0622443 -0.0121973 0.0720581 -0.0206799 -0.018249 -0.0104196 0.0478001 0.0319649 0.026271 0.020726 0.0179348 -0.114174 -0.143162 -0.0341986 -0.0223451 0.00608388 0.00177243 0.0312407 0.0952659 0.0421823 -0.097601 -0.0789759 -0.0476326 -0.0264871 0.096059 0.0345238 0.0687594 0.106154 -0.0262172 0.0726814 0.0395211 -0.0219889 0.084278 -0.0596787 -0.119767 -0.134205 0.0333998 -0.117119 -0.0368565 0.064512 0.219961 0.0499862 -0.0867215 -0.018902 0.072757 -0.0196236 -0.155536 -0.0107324 0.052097 -0.00254087 0.0553968 0.0986301 -0.010265 0.00658308 0.0160504 0.0235745 -0.105221 
0.08774 -0.0662051 -0.116464 0.0179484 -0.00947509 0.0703872 0.00554411 0.00803706 -0.0659415 -0.0433167 -0.030722 0.120543 0.0394892 -0.139108 -0.137084 -0.000783698 -0.0712137 0.0475719 -0.0704543 0.173157 0.0571514 -0.0115358 0.122568 0.169139 -0.15201 0.0486392 0.081077 -0.24252 -0.0861823 0.0681978 -0.175268 0.0326312 0.023199 0.099647 -0.0410273 -0.0614643 -0.00784264 0.164618 -0.189834 -0.0311959 -0.0711249 -0.0621979 -0.0569058 0.119453 -0.124013 0.0269327 0.169614 -0.0171749 -0.131518 0.204442 0.131461 -0.118005 0.0119249 0.0721748 0.178378 -0.0193422 0.091883 0.0377141 0.0818143 -0.135723 0.0233448 -0.0122194 0.132057 -0.029633 0.0598276 -0.193446 -0.029063 -0.0234855 -0.0301107 0.0693158 -0.106754 -0.063168 -0.0181709 0.0518384 -0.0270666 -0.00850914 -0.0079172 0.0628291 0.0295442 0.0246003 0.0113329 0.019973 -0.114321 -0.139685 -0.0286627 -0.0200718 0.010829 -0.00250907 0.0301713 0.0952597 0.0352439 -0.0941494 -0.0847791 -0.0462015 -0.032074 0.0844116 0.0282387 0.0611568 0.110286 -0.040809 0.0860195 0.0442271 -0.0123715 0.0808268 -0.0637996 -0.121722 -0.133422 0.0355792 -0.114406 -0.0317961 0.0665843 0.214811 0.052224 -0.090012 -0.024047 0.0716962 -0.0263521 -0.16145 -0.0123163 0.0601528 -0.0055042 0.0492248 0.0819058 -0.00365548 -0.00082239 0.0222045 0.0161622 -0.105071 
0.0862621 -0.059872 -0.118164 0.0144423 -0.00750113 0.0727829 0.00290761 0.00258416 -0.0703321 -0.0467495 -0.0355155 0.119492 0.0361157 -0.133579 -0.135584 -0.00377313 -0.0716856 0.0442996 -0.0633379 0.171839 0.0553078 -0.0091506 0.122598 0.166167 -0.14532 0.0523883 0.0833357 -0.238299 -0.0825404 0.0695869 -0.172477 0.0285522 0.0211235 0.0971724 -0.0363074 -0.0590512 -0.0055215 0.16813 -0.186189 -0.0345348 -0.071119 -0.0587355 -0.0488485 0.123229 -0.125847 0.0310394 0.176198 -0.0161187 -0.133244 0.204818 0.128955 -0.114416 0.0132625 0.0729906 0.186484 -0.0209611 0.0898061 0.0452937 0.081167 -0.14523 0.0215142 -0.0106836 0.140421 -0.0320829 0.0623303 -0.187734 -0.028038 -0.0222394 -0.0316903 0.074871 -0.104083 -0.0575978 -0.0179429 0.0557899 -0.0239307 -0.0111164 -0.00972988 0.0603321 0.0326464 0.0229054 0.0121604 0.0266954 -0.110386 -0.140294 -0.0274182 -0.0302713 0.00858523 0.00284925 0.0369634 0.0972512 0.0379692 -0.0945411 -0.0824924 -0.0498487 -0.0268038 0.0790595 0.0340285 0.069179 0.109348 -0.0445124 0.0795593 0.0485888 -0.00973647 0.080406 -0.0759989 -0.116557 -0.13516 0.034362 -0.111037 -0.0329203 0.0754747 0.216012 0.0477719 -0.0850222 -0.0222588 0.0693009 -0.0243809 -0.165288 -0.0106316 0.0602095 -0.00233764 0.050199 0.0868662 -0.0074226 -0.00468969 0.0212882 0.0214936 -0.104264 
0.0837209 -0.0551237 -0.121745 0.0106522 -0.0135442 0.0714575 0.00186789 -0.00134869 -0.0852937 -0.0537187 -0.0485155 0.112392 0.0413426 -0.129235 -0.142583 -0.00361384 -0.0747645 0.0402223 -0.0524377 0.171708 0.0612468 -0.0186479 0.128998 0.144079 -0.146865 0.0590805 0.0697816 -0.243162 -0.08309 0.0711643 -0.173111 0.0362779 0.0151999 0.0842364 -0.0271335 -0.0643368 -0.00588204 0.1809 -0.1694 -0.0395927 -0.0811449 -0.0565396 -0.0407142 0.120037 -0.125035 0.0361709 0.186068 -0.0240553 -0.137739 0.206666 0.123416 -0.113389 0.0182534 0.083885 0.183661 -0.0336032 0.105895 0.0445977 0.0804195 -0.155364 0.0320544 -0.00377952 0.144352 -0.0356746 0.066583 -0.187082 -0.0262071 -0.0265237 -0.0292292 0.0637093 -0.102336 -0.0539877 -0.0183037 0.0649556 -0.0305827 -0.0164345 -0.0108733 0.0460328 0.0379808 0.0310023 0.0111481 0.0199841 -0.111368 -0.137886 -0.0280808 -0.0318759 0.0004153 0.00365958 0.0456973 0.0826908 0.0355738 -0.09083 -0.0780207 -0.0552972 -0.0239015 0.0719812 0.0443168 0.0931371 0.100591 -0.0387667 0.071205 0.0516067 -0.0109516 0.0943397 -0.0749113 -0.112751 -0.128867 0.0503526 -0.10565 -0.0305921 0.0676141 0.207215 0.037805 -0.0853928 -0.0243443 0.069693 -0.0178218 -0.16456 -0.00682804 0.0565489 -0.0115809 0.0483146 0.097751 -0.0174189 -0.00655735 0.0123582 0.0205369 -0.0996524 
0.0838271 -0.0549775 -0.117768 0.0175649 -0.0071966 0.0659859 0.00777975 0.00457542 -0.0748917 -0.0529696 -0.0452559 0.112657 0.040194 -0.147552 -0.142566 0.00217038 -0.0754264 0.0457759 -0.070331 0.177808 0.063361 -0.0195357 0.127042 0.149309 -0.151696 0.0459091 0.0605311 -0.250202 -0.0829045 0.0683975 -0.171805 0.0402794 0.0173307 0.0908388 -0.0301705 -0.0673765 -0.00629515 0.174216 -0.180808 -0.0359715 -0.0741559 -0.0595302 -0.0438734 0.119418 -0.121968 0.0350517 0.181277 -0.0227121 -0.137082 0.206995 0.123238 -0.124354 0.0129168 0.0760776 0.173083 -0.0305878 0.10058 0.0345946 0.0810941 -0.141529 0.0306074 -0.00500234 0.131779 -0.033489 0.0679428 -0.200055 -0.0288002 -0.0344617 -0.0321176 0.0555601 -0.104199 -0.0598032 -0.0146323 0.0623162 -0.034276 -0.0119924 -0.0104076 0.0560501 0.0310547 0.0277227 0.0120439 0.0174232 -0.12097 -0.132315 -0.0287896 -0.0156858 0.00121012 -0.00147652 0.0320904 0.0855716 0.0362323 -0.0904337 -0.0869429 -0.0563231 -0.0272466 0.083075 0.035873 0.0789649 0.0970649 -0.0328356 0.0731315 0.0416642 -0.0125114 0.0928714 -0.0659262 -0.120805 -0.126987 0.055381 -0.105536 -0.0253078 0.0602995 0.205916 0.0403352 -0.08865 -0.0299911 0.070021 -0.0245305 -0.159052 -0.0123531 0.0570926 -0.0163432 0.0579121 0.0879182 -0.0052014 -0.00135521 0.00963127 0.0103905 -0.109811 
0.0835516 -0.0640076 -0.110659 0.0143268 -0.0102213 0.0675666 0.000703353 0.00264618 -0.07344 -0.0520716 -0.0438732 0.121815 0.0323572 -0.126058 -0.136766 -0.010195 -0.0695044 0.040141 -0.0625169 0.175436 0.0451027 -0.00940492 0.129095 0.158402 -0.15226 0.0602762 0.0775544 -0.232589 -0.0900801 0.0567771 -0.173845 0.0286433 0.0190869 0.0932491 -0.0379491 -0.0594562 -0.00819777 0.184712 -0.188976 -0.0288734 -0.0745774 -0.0453408 -0.0570818 0.113902 -0.127857 0.0305844 0.17137 -0.022423 -0.126229 0.216599 0.12695 -0.112462 0.0101053 0.0793435 0.187571 -0.0296734 0.0945038 0.0498916 0.082496 -0.146052 0.0233722 -0.00546652 0.137479 -0.0335946 0.0646929 -0.189449 -0.0209463 -0.0205788 -0.0330345 0.0785645 -0.0950073 -0.054248 -0.00512459 0.0746985 -0.0285576 -0.0156968 -0.01349 0.0488708 0.0368566 0.0183699 0.00918049 0.0265587 -0.109163 -0.145205 -0.0255436 -0.0444195 0.00911607 0.00791435 0.0436371 0.0885461 0.0359533 -0.0924452 -0.0676654 -0.0547479 -0.0167343 0.0743944 0.0441906 0.0689138 0.102443 -0.0406199 0.0694962 0.0533326 -0.0122241 0.0835468 -0.0757447 -0.116915 -0.132771 0.0276613 -0.105927 -0.0317541 0.0770425 0.220263 0.0508053 -0.0771512 -0.0237183 0.0657162 -0.0173635 -0.168276 -0.00951375 0.0531379 -0.00895918 0.0562744 0.0895242 -0.0125462 -0.000506466 0.0155336 0.0227213 -0.104702 
0.0824069 -0.0530205 -0.116835 0.00669387 -0.0169572 0.0740197 -0.0035032 -0.000397696 -0.085471 -0.0441949 -0.0449423 0.113599 0.0416495 -0.116003 -0.135937 -0.00684416 -0.0644265 0.0445133 -0.0495129 0.166729 0.0527099 -0.00833888 0.128162 0.151675 -0.149475 0.0660733 0.0786676 -0.233227 -0.083292 0.0679075 -0.172987 0.0305169 0.0179867 0.0862707 -0.0280436 -0.0605338 -0.00313484 0.185556 -0.173223 -0.0337147 -0.0861403 -0.0478607 -0.0472532 0.119426 -0.127039 0.0333651 0.181394 -0.0222154 -0.135321 0.208511 0.134241 -0.105407 0.013976 0.0836475 0.187209 -0.0283124 0.105543 0.0490785 0.089841 -0.161124 0.025479 -0.00773046 0.142358 -0.0390903 0.0638746 -0.186177 -0.0215123 -0.0178973 -0.0310463 0.0777748 -0.0955175 -0.0537 -0.0138975 0.0637202 -0.0310987 -0.017768 -0.0162643 0.048805 0.0409346 0.021895 0.0107373 0.0274707 -0.104187 -0.141618 -0.0252878 -0.0475037 0.00493815 0.00361242 0.0546979 0.0875877 0.0286248 -0.0917941 -0.069248 -0.0537828 -0.0179652 0.0698515 0.0479395 0.0899932 0.0979474 -0.0439349 0.0728726 0.0641153 -0.00978105 0.0920741 -0.0818758 -0.114579 -0.132886 0.0291254 -0.102764 -0.0332779 0.0739207 0.212726 0.0428267 -0.0787378 -0.0214698 0.0658887 -0.0162807 -0.174672 -0.0101884 0.0509004 -0.0040185 0.0456459 0.098594 -0.0205908 -0.00444191 0.0131773 0.0274946 -0.0971098 
0.0794703 -0.0499263 -0.101112 0.00384914 -0.0170493 0.0750249 0.00535334 0.0100591 -0.0830909 -0.0540204 -0.0455346 0.102134 0.0471047 -0.152235 -0.14115 0.00479838 -0.100238 0.0390254 -0.0819357 0.169677 0.0700098 -0.0231706 0.13115 0.132407 -0.160747 0.054888 0.0478529 -0.251895 -0.0819428 0.0536263 -0.171559 0.0380205 0.00603705 0.097345 -0.0293429 -0.0686526 -0.0106095 0.185905 -0.167237 -0.0260872 -0.0765528 -0.0686789 -0.0492816 0.112102 -0.115328 0.0272905 0.181122 -0.0244885 -0.149449 0.212552 0.113355 -0.130523 -0.0005458 0.0904097 0.163044 -0.0330151 0.10649 0.0375923 0.0706606 -0.141795 0.0375588 0.00176594 0.137592 -0.0287104 0.0752277 -0.192362 -0.0267395 -0.0308166 -0.028441 0.0583195 -0.108121 -0.0577328 -0.0108019 0.0780545 -0.0308526 -0.0229333 -0.0147748 0.0442111 0.0364304 0.0284423 0.0156316 0.00550606 -0.117704 -0.130729 -0.0471778 -0.0123173 0.00885369 -8.94497e-05 0.0363237 0.0847055 0.0478985 -0.0998774 -0.0792735 -0.0548465 -0.0350585 0.0843547 0.0313518 0.0855055 0.096374 -0.0170531 0.0694198 0.039662 -0.0264467 0.0983404 -0.0450977 -0.116845 -0.127402 0.0664787 -0.106312 -0.0339435 0.0516348 0.210396 0.035829 -0.0842983 -0.0202067 0.0762809 -0.0198245 -0.14833 -0.00672323 0.0548131 -0.0141304 0.0542271 0.09547 -0.00461347 0.000825144 0.00705994 0.00970332 -0.103712 
0.0804369 -0.0546765 -0.107652 0.0147066 -0.0141728 0.0712247 0.00221383 0.00353748 -0.075637 -0.0507351 -0.0419564 0.117009 0.0326003 -0.140906 -0.138825 -0.0022904 -0.0794279 0.0372766 -0.0669569 0.17382 0.0524814 -0.0145452 0.124731 0.147701 -0.151896 0.0634211 0.0685128 -0.241117 -0.0878149 0.0550986 -0.171986 0.0338154 0.0164139 0.0968751 -0.0347174 -0.0614711 -0.00421068 0.184838 -0.179092 -0.0297835 -0.0713094 -0.0575532 -0.048491 0.113588 -0.121454 0.0301213 0.180833 -0.027669 -0.137628 0.212005 0.125839 -0.117841 0.00327984 0.0839327 0.185657 -0.0294532 0.094707 0.0434824 0.0763249 -0.145167 0.0262427 -0.0101905 0.139463 -0.0364195 0.0741761 -0.190313 -0.0249893 -0.0267164 -0.032545 0.0745445 -0.100473 -0.0546971 -0.00916652 0.0778166 -0.0253315 -0.0190623 -0.0122652 0.0551002 0.0335418 0.0187806 0.00823102 0.0228052 -0.10898 -0.13819 -0.0335832 -0.0334566 0.00965013 0.00708619 0.0420193 0.0887748 0.0367283 -0.097421 -0.0755482 -0.0538523 -0.0222096 0.080327 0.0443599 0.0719142 0.0999995 -0.0327543 0.063528 0.0489821 -0.0183173 0.0886944 -0.0652206 -0.114933 -0.129477 0.0423098 -0.108604 -0.0346994 0.0648837 0.215805 0.0448371 -0.0803965 -0.0179327 0.0626427 -0.0184364 -0.165774 -0.00759617 0.0534115 -0.00625794 0.0587802 0.0972052 -0.00947736 0.0062836 0.0139255 0.025471 -0.104451 
0.0757631 -0.045754 -0.100272 0.00602862 -0.00970873 0.0750425 0.00217982 -0.00684699 -0.0876224 -0.0535812 -0.0449519 0.111253 0.045509 -0.145614 -0.140611 0.00326546 -0.107746 0.0431538 -0.075249 0.173323 0.0696535 -0.023079 0.138271 0.133281 -0.153663 0.0568687 0.04776 -0.250497 -0.0857499 0.0641786 -0.174761 0.0310707 0.00905903 0.0963094 -0.0234404 -0.0655346 -0.0107328 0.183672 -0.158698 -0.0272134 -0.0789117 -0.0651296 -0.0392812 0.112268 -0.126566 0.0239994 0.189986 -0.0247978 -0.145265 0.218921 0.116833 -0.130289 -0.00459912 0.0962744 0.173573 -0.0344204 0.107086 0.0457118 0.0629672 -0.1378 0.0368012 0.00241952 0.144935 -0.029994 0.0825927 -0.192306 -0.0327581 -0.0298291 -0.0353831 0.0643126 -0.102945 -0.0464222 -0.00929644 0.0815754 -0.0267067 -0.0201036 -0.0167863 0.0377769 0.039197 0.0281174 0.0182805 0.00915815 -0.112087 -0.120161 -0.0530227 -0.0178753 0.00648006 0.00283929 0.0392343 0.0854223 0.0454749 -0.102434 -0.0724022 -0.0541196 -0.0375981 0.074519 0.0232581 0.0950496 0.0994119 -0.0176454 0.0646318 0.0441719 -0.0237743 0.0951523 -0.0435437 -0.109759 -0.127154 0.0693217 -0.102917 -0.0298344 0.0533945 0.20673 0.0396567 -0.0750552 -0.0250828 0.0799232 -0.0111553 -0.141601 -0.00936261 0.0632244 -0.00926015 0.0516809 0.092192 -0.0134963 -0.00698863 0.0151536 0.0138781 -0.0960957 
0.0833598 -0.0400065 -0.0969914 0.00350391 -0.0107474 0.0939731 -0.00272896 -0.00683143 -0.0981215 -0.0545673 -0.0401277 0.103799 0.0434203 -0.140921 -0.132285 0.00911533 -0.103438 0.0401169 -0.0669609 0.163501 0.0773821 -0.0209341 0.138779 0.132271 -0.143922 0.0581342 0.050104 -0.251853 -0.082726 0.0617426 -0.16761 0.0237004 0.00541646 0.102149 -0.0182171 -0.0585524 -0.00764626 0.181473 -0.146581 -0.0304388 -0.083537 -0.0673985 -0.0342068 0.107509 -0.120399 0.0261597 0.195246 -0.026268 -0.160248 0.21616 0.118349 -0.125538 -0.00247599 0.0987273 0.176502 -0.0304217 0.110688 0.0543068 0.0600378 -0.144321 0.0328886 0.00566391 0.15478 -0.0475973 0.0908967 -0.178631 -0.0367854 -0.0209565 -0.041108 0.0800132 -0.103445 -0.0417114 -0.02164 0.0740497 -0.0231671 -0.0240931 -0.0130261 0.0392492 0.0423201 0.0291794 0.0135807 0.00817018 -0.105207 -0.125641 -0.0595876 -0.0215599 0.00462561 0.000794831 0.0404912 0.0946586 0.0531661 -0.109846 -0.0741018 -0.0464257 -0.0330094 0.0773082 0.0297973 0.102841 0.0967175 -0.0144549 0.0649455 0.0507867 -0.0313122 0.093555 -0.0453868 -0.100074 -0.126748 0.0605903 -0.10437 -0.0414899 0.0518876 0.205899 0.0423549 -0.074959 -0.00547358 0.0821456 -0.0130748 -0.141642 -0.00583581 0.0695161 -0.00126758 0.0398849 0.101436 -0.0158332 -0.00182025 0.0211252 0.030974 -0.0930351 
0.082689 -0.0545063 -0.110952 0.0132455 -0.00169149 0.0757131 0.0020459 3.53128e-05 -0.0820085 -0.0474968 -0.0432433 0.106405 0.041681 -0.144005 -0.138014 0.00415239 -0.0833097 0.0565578 -0.0651235 0.171666 0.0779937 -0.0234117 0.133123 0.153354 -0.142655 0.0470198 0.0587572 -0.256239 -0.0773819 0.069095 -0.167326 0.031189 0.00842403 0.0909808 -0.0155439 -0.0635953 -0.0099774 0.171396 -0.168033 -0.0466647 -0.0791801 -0.0595892 -0.0443883 0.123468 -0.12327 0.0287641 0.185095 -0.0152207 -0.141118 0.202746 0.120595 -0.125573 0.0114854 0.075727 0.175182 -0.0289714 0.106584 0.0414758 0.0766016 -0.151985 0.0371993 -0.00408367 0.141322 -0.0311531 0.0742557 -0.195092 -0.0345983 -0.0287375 -0.0275057 0.0687945 -0.107816 -0.0487606 -0.0192573 0.0543255 -0.0420205 -0.0221919 -0.0134865 0.0611861 0.0398177 0.0281598 0.0121109 0.0219704 -0.118857 -0.134475 -0.0341357 -0.025029 0.00210035 0.00730831 0.0401668 0.0878737 0.0478322 -0.0870108 -0.0840317 -0.0554438 -0.0310337 0.0768832 0.0285962 0.0921289 0.0963592 -0.0335954 0.0822382 0.0438127 -0.0162571 0.0848241 -0.055517 -0.115881 -0.124537 0.049357 -0.0962351 -0.0239768 0.0567591 0.208902 0.039569 -0.0847901 -0.0166633 0.0765984 -0.022197 -0.160042 -0.0140442 0.0573856 -0.0126148 0.0547315 0.0890186 -0.00886384 -0.0122734 0.0154587 0.0157308 -0.103761 
0.0796169 -0.044128 -0.113525 0.00777133 -0.00610079 0.0787802 0.00652658 -0.00999604 -0.078676 -0.0565779 -0.0448014 0.104162 0.0429846 -0.146017 -0.139487 -0.000119945 -0.0996445 0.047207 -0.0695577 0.170043 0.0716027 -0.0174172 0.131158 0.138234 -0.149329 0.0469242 0.0537422 -0.254605 -0.0837871 0.0725248 -0.169486 0.0264538 0.00737843 0.090107 -0.0072059 -0.0608608 -0.000564914 0.170094 -0.164765 -0.0410947 -0.0760209 -0.0632316 -0.0348325 0.125992 -0.12921 0.0356904 0.19115 -0.0141338 -0.142623 0.210558 0.110664 -0.129632 0.00710761 0.0876713 0.177541 -0.0323125 0.101174 0.0408415 0.0688304 -0.147405 0.034725 0.000633765 0.1479 -0.0340707 0.0785414 -0.196317 -0.0307253 -0.0322356 -0.0278499 0.0620603 -0.104418 -0.0504227 -0.0130125 0.0609428 -0.0339659 -0.0183374 -0.0200209 0.0512741 0.0386719 0.0284887 0.0237611 0.0179716 -0.120485 -0.123894 -0.043251 -0.01537 -0.00115585 0.000763428 0.0345064 0.0928804 0.0518983 -0.0984199 -0.0810058 -0.0626411 -0.0390239 0.072634 0.0247547 0.0947272 0.101098 -0.0274012 0.0749482 0.0464768 -0.0147278 0.0826324 -0.0549746 -0.113215 -0.124929 0.0654646 -0.107481 -0.0134524 0.0618418 0.198837 0.0381362 -0.0820607 -0.0293217 0.0797409 -0.0173786 -0.151055 -0.0147417 0.0569449 -0.00774917 0.0512628 0.0941905 -0.00615951 -0.0103814 0.0107082 0.0135631 -0.100048 
0.0826435 -0.0412529 -0.0846319 0.00680059 -0.0224888 0.0954177 0.00188784 -0.0044719 -0.0998431 -0.051443 -0.0369607 0.101121 0.0449817 -0.14092 -0.12716 0.00876903 -0.105823 0.0376238 -0.0650209 0.160445 0.0772185 -0.0188229 0.130293 0.136577 -0.14876 0.0620597 0.0462852 -0.251626 -0.0815762 0.0618032 -0.169759 0.0258034 0.00296487 0.105027 -0.014094 -0.057224 -0.00177505 0.180827 -0.144513 -0.0317078 -0.0846428 -0.0735017 -0.0324631 0.102183 -0.114661 0.0200732 0.194972 -0.0283109 -0.162423 0.214296 0.122096 -0.129444 -0.00203443 0.104215 0.182101 -0.0273079 0.105996 0.0511155 0.0587979 -0.144629 0.0333721 0.0039269 0.149853 -0.0515388 0.0935646 -0.171011 -0.0313347 -0.0319594 -0.0450342 0.0758258 -0.109288 -0.0465366 -0.0220551 0.078791 -0.0213011 -0.0287024 -0.00716752 0.0398294 0.0485647 0.0297835 0.0196689 0.000894801 -0.104579 -0.130133 -0.0562543 -0.0241117 0.00449275 -0.00228683 0.04125 0.101652 0.0549214 -0.111067 -0.0703804 -0.0409208 -0.0415623 0.083396 0.0309244 0.0997932 0.100847 -0.00863047 0.068114 0.0559805 -0.0359812 0.0910289 -0.0385046 -0.0979707 -0.12151 0.0561696 -0.106777 -0.0424403 0.0446915 0.206944 0.0434224 -0.0800005 -0.00250928 0.0816483 -0.00522117 -0.139844 -0.0103395 0.0649718 0.000605792 0.0333753 0.107402 -0.0160895 0.0032773 0.0250215 0.0375703 -0.0937486 
0.0849355 -0.0628231 -0.100351 0.0120244 -0.00840738 0.0813771 0.00188495 -0.00822834 -0.0834857 -0.0562324 -0.047479 0.110226 0.0358493 -0.131906 -0.134214 0.000705634 -0.0901381 0.0476341 -0.0590143 0.163727 0.067223 -0.00959261 0.134729 0.146681 -0.152972 0.0557258 0.0613626 -0.251968 -0.0936548 0.0667948 -0.173877 0.0215942 0.0061195 0.091689 -0.00677123 -0.0569703 -0.0036809 0.17249 -0.165699 -0.040086 -0.086193 -0.0513577 -0.0456158 0.112123 -0.123237 0.0316837 0.18076 -0.0186107 -0.137006 0.214419 0.122284 -0.130264 0.0143424 0.0900272 0.184874 -0.0316789 0.107427 0.0487055 0.0669729 -0.141372 0.0395521 0.00375055 0.142532 -0.0386335 0.0858714 -0.191446 -0.0320526 -0.0255571 -0.0316746 0.0752856 -0.102297 -0.0494597 -0.0114804 0.0606448 -0.0422989 -0.018388 -0.0119662 0.0433277 0.0454235 0.02495 0.0250211 0.0144449 -0.118023 -0.136717 -0.042303 -0.0367031 0.00141047 0.00327484 0.034355 0.0969229 0.0502052 -0.0929442 -0.0711496 -0.0491803 -0.0332124 0.0831369 0.0329062 0.0859397 0.103215 -0.0194484 0.0821544 0.0534675 -0.0253234 0.0724288 -0.0482154 -0.117103 -0.123601 0.0352512 -0.110416 -0.0180572 0.0617548 0.204673 0.0538505 -0.081978 -0.0171772 0.0839316 -0.0119407 -0.147548 -0.0217464 0.0528992 -0.0104802 0.0452061 0.0978458 -0.0191305 -0.001542 0.0214565 0.0237686 -0.10363 
0.0819965 -0.0538546 -0.101993 0.0102002 -0.0100802 0.0827777 0.000307177 -0.00626286 -0.0850318 -0.0519845 -0.0490213 0.10227 0.0409616 -0.13714 -0.131717 0.0123471 -0.0932507 0.0469043 -0.0611313 0.16166 0.0781037 -0.0150469 0.134297 0.141531 -0.147626 0.0544695 0.0545013 -0.258364 -0.0880862 0.0722812 -0.169314 0.0309336 0.0076971 0.0939157 -0.00500013 -0.0585144 0.00151674 0.173375 -0.154806 -0.0434147 -0.089048 -0.0594667 -0.0332502 0.110462 -0.114556 0.0300965 0.189786 -0.0202945 -0.143134 0.208136 0.124005 -0.134242 0.0158081 0.0924911 0.18269 -0.0290133 0.11353 0.0407678 0.0688865 -0.150472 0.0403318 0.000580166 0.138389 -0.0419056 0.0848895 -0.186632 -0.03575 -0.0262017 -0.0304279 0.0664445 -0.108285 -0.0487764 -0.0209993 0.0548362 -0.038646 -0.0195028 -0.0105985 0.0467402 0.0447165 0.0289346 0.0270085 0.0144592 -0.118213 -0.130154 -0.0439222 -0.0258968 -0.00302152 0.00223969 0.0375905 0.0961351 0.046638 -0.0943286 -0.0782345 -0.0472181 -0.0378653 0.0901292 0.0288617 0.0982531 0.100264 -0.0170306 0.0821999 0.0462404 -0.0269302 0.0822984 -0.0468096 -0.116284 -0.12646 0.0431067 -0.10771 -0.021255 0.0504546 0.202785 0.0447332 -0.0846897 -0.0140455 0.084961 -0.0149804 -0.147327 -0.0230143 0.0550161 -0.00503182 0.0476909 0.105249 -0.0183476 -0.00464368 0.0181151 0.0234061 -0.102331 
0.0875842 -0.0631107 -0.104148 0.00937764 -0.0107173 0.0825417 0.0050176 -0.000729832 -0.0809071 -0.0558011 -0.0394433 0.102568 0.0387742 -0.140119 -0.141101 0.00196173 -0.0881973 0.0516777 -0.0686732 0.160659 0.0733005 -0.0133101 0.126158 0.155687 -0.15292 0.0547341 0.0633503 -0.252576 -0.0818088 0.0588336 -0.172097 0.0248128 -0.00369231 0.0928794 -0.0140578 -0.0632409 -0.0109363 0.170631 -0.165665 -0.0386512 -0.0796362 -0.0554543 -0.0530838 0.117295 -0.115892 0.0254898 0.17679 -0.0139967 -0.143425 0.20295 0.115743 -0.129299 0.0147115 0.0832547 0.172379 -0.0292826 0.107936 0.0500185 0.0723032 -0.150418 0.0421837 0.00568466 0.147528 -0.0299378 0.0724554 -0.184177 -0.026516 -0.0260276 -0.0218503 0.0700495 -0.110745 -0.0526453 -0.0111271 0.0628695 -0.040866 -0.0264839 -0.0140656 0.0518001 0.0416094 0.0242498 0.0232732 0.0214117 -0.121024 -0.147753 -0.0413965 -0.0259412 0.00650266 0.00370184 0.0315403 0.0905316 0.0601082 -0.0890218 -0.0758829 -0.0528229 -0.0312045 0.0846207 0.0321437 0.0815133 0.103076 -0.0234739 0.0863321 0.0450136 -0.0236071 0.0809061 -0.0476181 -0.119227 -0.123257 0.0413983 -0.111406 -0.0236024 0.065711 0.212786 0.0510801 -0.0856435 -0.014404 0.0812974 -0.0261918 -0.151141 -0.0167561 0.0443601 -0.0149447 0.0468421 0.0953474 -0.0139408 -0.0107145 0.0197615 0.00835694 -0.107942 
0.0840053 -0.0636007 -0.109326 0.0164949 -0.00737898 0.0678372 0.00358976 -0.00314858 -0.0796063 -0.0397698 -0.0382813 0.114292 0.0410471 -0.130238 -0.142183 0.0094552 -0.0727349 0.0525666 -0.0638485 0.169707 0.070428 -0.0248065 0.129275 0.152742 -0.149028 0.06403 0.0659627 -0.249935 -0.0807088 0.0664976 -0.178136 0.0427007 0.0131986 0.0926876 -0.0258855 -0.0633948 -0.00928479 0.186642 -0.167755 -0.0452245 -0.0826764 -0.0554471 -0.0515252 0.108564 -0.118047 0.0299179 0.177144 -0.0218929 -0.138796 0.193423 0.127338 -0.119011 0.0104809 0.0801004 0.182139 -0.0274737 0.108142 0.0431307 0.0746903 -0.143987 0.0386811 -0.0126562 0.139716 -0.0315701 0.0814755 -0.185677 -0.0381292 -0.0153403 -0.0254671 0.0740936 -0.106345 -0.0524461 -0.0183355 0.0572376 -0.0390166 -0.0165545 -0.00572256 0.0605563 0.0354403 0.0152246 0.00786139 0.0227975 -0.11596 -0.143174 -0.0378045 -0.0361054 0.00944319 0.0098351 0.0408557 0.0864749 0.0398955 -0.0889439 -0.0759334 -0.04668 -0.0276255 0.0833831 0.0373132 0.0791164 0.108121 -0.0313517 0.0847701 0.0452741 -0.0216151 0.0882787 -0.0509331 -0.119725 -0.127118 0.0372968 -0.0990672 -0.0364075 0.0524317 0.21569 0.0469952 -0.0840803 -0.00643521 0.0737632 -0.0263203 -0.161363 -0.0159601 0.0524985 -0.0143502 0.0560806 0.0935102 -0.0125616 -0.00256777 0.0249049 0.0182459 -0.107215 
0.0862569 -0.0659011 -0.113754 0.0170668 -0.00275236 0.0764064 0.00723542 -0.00450599 -0.0736231 -0.0474319 -0.0400502 0.119971 0.0339666 -0.139888 -0.145172 -0.00366033 -0.0735097 0.0572105 -0.0590539 0.165007 0.0677993 -0.0150067 0.122393 0.157373 -0.148275 0.0596176 0.0703025 -0.254047 -0.0855528 0.0676881 -0.173479 0.0306073 0.00842955 0.0893319 -0.0134897 -0.0653076 -0.00767821 0.171679 -0.169684 -0.0484919 -0.0729466 -0.0520369 -0.0543423 0.120778 -0.126227 0.0299078 0.175191 -0.0193354 -0.136493 0.193352 0.123882 -0.120109 0.0156306 0.074402 0.181345 -0.026617 0.100611 0.0474637 0.0698362 -0.144028 0.0391486 -0.0115952 0.146886 -0.0333607 0.0808229 -0.197409 -0.0326412 -0.0207568 -0.0246644 0.0762106 -0.104192 -0.0535876 -0.0159436 0.0499915 -0.0473118 -0.0159772 -0.0130524 0.0618649 0.0360596 0.0196942 0.0056423 0.0308399 -0.113755 -0.14133 -0.0324732 -0.0416748 0.0131215 0.0079818 0.0351416 0.0880299 0.0436635 -0.0881029 -0.0783349 -0.050166 -0.028275 0.0756361 0.0396353 0.0714097 0.103806 -0.0346182 0.0855305 0.0505527 -0.019254 0.0789894 -0.0552992 -0.122883 -0.121194 0.0357488 -0.110241 -0.0211388 0.0662078 0.206046 0.0478314 -0.0857028 -0.01265 0.0731261 -0.0306076 -0.165706 -0.0165294 0.049548 -0.0121498 0.0541208 0.0881913 -0.0144389 0.000191773 0.0226263 0.016775 -0.109035 
0.0794034 -0.0630528 -0.110011 0.0178102 -0.0057974 0.0714364 0.00175202 -0.00691687 -0.0850799 -0.0383015 -0.0380808 0.127458 0.0369232 -0.124172 -0.138191 -0.00681782 -0.0677128 0.0524276 -0.0432787 0.173606 0.0619493 -0.0185691 0.120413 0.167481 -0.140302 0.0659811 0.0783769 -0.242036 -0.0821698 0.0759829 -0.177349 0.0253985 0.017489 0.0870849 -0.0214223 -0.0578956 -0.00630272 0.170018 -0.172985 -0.0487885 -0.0748015 -0.0546231 -0.0421233 0.121677 -0.132159 0.0301205 0.186528 -0.0222334 -0.1358 0.194417 0.134955 -0.11587 0.012649 0.0760252 0.200199 -0.021314 0.092233 0.0518493 0.0766132 -0.147621 0.0323365 -0.0153373 0.145247 -0.0354158 0.0812571 -0.189041 -0.0333627 -0.024687 -0.033162 0.079479 -0.100859 -0.0481372 -0.0202624 0.0505266 -0.0327795 -0.0107076 -0.00790428 0.0686605 0.0441494 0.0188527 0.00278485 0.0292934 -0.102641 -0.136143 -0.0280506 -0.048648 0.0120025 0.0123929 0.0469829 0.0917817 0.0318706 -0.0884313 -0.0730554 -0.0457603 -0.0311827 0.0681481 0.0416727 0.0800087 0.108276 -0.0460977 0.0797209 0.0603559 -0.013145 0.0771235 -0.0694001 -0.109533 -0.125654 0.0307195 -0.106941 -0.0304369 0.0647352 0.206713 0.0465414 -0.0846165 -0.0151503 0.0682522 -0.0196702 -0.17139 -0.0190243 0.0581765 -0.00747518 0.0455841 0.0870614 -0.0208312 -0.00737562 0.0339261 0.027831 -0.0991173 
0.0838955 -0.0596514 -0.0946431 0.00232409 -0.00898856 0.0843768 -0.00257217 0.000190287 -0.0831288 -0.0628854 -0.0469903 0.0914594 0.0436975 -0.136975 -0.138706 0.0117764 -0.103854 0.0456031 -0.070479 0.156805 0.0942711 -0.0212336 0.136149 0.147175 -0.142618 0.053169 0.0564289 -0.257819 -0.0777017 0.0621187 -0.164636 0.0208461 -0.0024267 0.0946045 -0.00660068 -0.0631465 -0.0102683 0.178978 -0.151828 -0.047219 -0.0868032 -0.0609773 -0.0432419 0.113106 -0.107472 0.0229272 0.181859 -0.0140841 -0.145676 0.20085 0.107678 -0.132378 0.021388 0.0900705 0.176394 -0.0315082 0.119523 0.047545 0.0662403 -0.164059 0.0472515 0.00595504 0.147068 -0.0250699 0.0754838 -0.174625 -0.0342826 -0.0194128 -0.0180705 0.0672283 -0.115477 -0.0487561 -0.020938 0.053015 -0.0365952 -0.0286165 -0.0140559 0.045705 0.0477999 0.0367051 0.0263487 0.0160638 -0.117068 -0.140712 -0.0461943 -0.0254308 0.00338375 0.0141651 0.0382079 0.0910296 0.066288 -0.0898231 -0.0778072 -0.0482564 -0.0404484 0.0859339 0.0240266 0.101442 0.103741 -0.0191104 0.090877 0.0386082 -0.0282405 0.0823996 -0.04128 -0.115679 -0.126234 0.0468235 -0.0995586 -0.0329215 0.0563788 0.213289 0.0372439 -0.0833597 -0.00378204 0.0953457 -0.0268945 -0.142063 -0.0193652 0.0501329 -0.0128011 0.0502855 0.0989599 -0.0198412 -0.0169462 0.0218151 0.0157026 -0.100525 
0.0854261 -0.0655968 -0.10448 0.0194198 -0.00176073 0.078179 0.00526021 -0.00827377 -0.0768288 -0.0654736 -0.0435184 0.116456 0.0305029 -0.133916 -0.140973 -0.00775261 -0.0860762 0.0511621 -0.0566153 0.167256 0.0743523 -0.0154492 0.131121 0.161201 -0.141186 0.0472372 0.0658726 -0.252265 -0.0879998 0.072564 -0.17164 0.0192618 0.0113386 0.0911155 -0.0105343 -0.0611571 -0.00534794 0.1666 -0.172315 -0.0484669 -0.0728791 -0.0519292 -0.0437657 0.115897 -0.129798 0.031144 0.182444 -0.0226713 -0.134157 0.205418 0.116524 -0.123865 0.0230256 0.0834166 0.190391 -0.0263625 0.105453 0.0506821 0.0642547 -0.145632 0.03768 0.00104499 0.145557 -0.035292 0.0788493 -0.187757 -0.0317007 -0.0319248 -0.0307448 0.078319 -0.106057 -0.0514403 -0.0182916 0.0559087 -0.035426 -0.0149123 -0.0115748 0.0502088 0.0418668 0.0270415 0.0104626 0.0252313 -0.113803 -0.138462 -0.0318349 -0.0306713 0.00342416 0.00814652 0.0281983 0.0948699 0.0561469 -0.092302 -0.0738606 -0.0537727 -0.0333157 0.0724529 0.0297606 0.086119 0.109232 -0.030213 0.0837142 0.0501891 -0.0156533 0.0744299 -0.0545311 -0.114041 -0.119669 0.0422786 -0.109732 -0.022815 0.0656988 0.203133 0.0475718 -0.0868152 -0.0171924 0.0832073 -0.017817 -0.156991 -0.0140311 0.0609032 -0.00997687 0.0503243 0.0831561 -0.0184077 -0.0080071 0.0285136 0.0246601 -0.101218 
