0.0357829 0.0872004 0.109586 -0.117137 0.0792881 0.138937 0.0366195 0.0265959 -0.140562 0.035172 0.0069161 0.0267503 0.0134123 -0.000703796 0.110105 -0.0408946 -0.0217436 0.0219715 0.0149609 0.0196777 0.114181 0.0411375 0.0347305 0.0542833 0.0118299 0.101685 -0.0550574 -0.112819 0.173645 -0.0134076 -0.00271008 -0.0274412 -0.0867758 0.0405405 0.0479362 0.0375889 -0.0433436 0.182388 0.0707279 0.0277391 0.000884099 0.0275848 -0.107168 0.0107651 -0.115303 0.0974366 0.104974 -0.0462474 -0.20468 -0.0333019 -0.0214223 0.128815 -0.117082 0.0175603 0.0685987 0.00773798 0.0497057 0.200305 -0.138844 -0.0438987 -0.0165292 -0.0290092 0.19116 -0.0883999 0.150179 -0.0733672 0.00927592 0.0854768 -0.0307962 0.211925 0.0572754 0.132257 -0.0797781 0.0477592 0.0403848 -0.0430292 -0.0757065 0.106452 0.103361 -0.0197274 -0.124494 0.125891 0.0647276 -0.00351971 -0.022429 -0.165989 0.114702 0.0889905 0.0384648 0.0244622 0.0940498 -0.0580669 0.00207394 0.0499577 0.0268195 -0.137116 0.0888688 0.0792728 0.0124628 -0.0115641 -0.0601785 0.0737445 -0.135521 0.091138 -0.11121 0.075396 -0.0242338 0.00303175 0.143925 -0.155136 0.0515906 0.114501 -0.116848 0.0326971 0.192301 0.0566619 -0.0798221 -0.209768 -0.00404897 0.129832 0.047742 0.0168965 -0.000846363 0.0322963 -0.00579485 0.0882381 0.0865839 -0.0174248 
0.0640159 0.13015 0.0448939 -0.142098 0.0936303 0.155482 0.0229119 0.0108701 -0.192694 0.0559847 0.0346726 0.0223449 0.0466828 0.0231016 0.0809161 -0.00901993 0.0610785 0.0424111 0.0131622 0.0195536 0.089494 0.105542 -0.0292672 0.0535314 -0.0135751 0.125264 0.00538039 -0.0554882 0.206014 0.0380263 -0.0572057 0.0235861 -0.0917039 0.0480656 0.0223283 0.0417163 -0.00454736 0.103937 0.0846327 0.0460061 0.00553709 0.0121279 -0.0342916 0.0453436 -0.0942907 0.131589 0.152296 -0.0188416 -0.249238 -0.0758661 0.0360773 0.107373 -0.146735 0.0139956 0.0532911 0.0285433 -0.0154615 0.216815 -0.104081 -0.0213568 -0.0232504 -0.0302823 0.199374 -0.0996015 0.129326 -0.0719814 0.0154332 0.0617661 -0.038672 0.173339 0.0382553 0.0809994 -0.0612616 0.00846587 0.0424831 -0.0281897 -0.0426749 0.14963 0.0637829 -0.0876755 -0.0460578 0.158114 0.0521538 -0.00906017 -0.0351113 -0.124126 0.103147 0.0282226 0.0139212 0.0786325 0.0809537 -0.0925989 -0.0599534 0.0742217 0.0480081 -0.0781706 0.0966794 0.0636654 0.0105161 -0.0153149 -0.0779302 0.106657 -0.108218 0.13564 -0.161636 0.0926919 -0.0670506 0.0174529 0.0671526 -0.164968 0.0862487 0.0794745 -0.118748 0.0613535 0.142305 0.00601891 -0.105623 -0.219075 -0.0166113 0.0829738 0.0533151 -0.0202458 0.0401666 0.0312852 0.0127356 0.0818169 0.0258292 -0.071815 
0.0518347 0.106818 0.0741706 -0.132711 0.097931 0.206853 0.0362608 -0.0165323 -0.144576 0.0057242 0.0336964 0.067656 0.036174 0.00638573 0.071588 -0.0700469 0.0202455 0.0590239 -0.00528661 -0.0119448 0.0933285 0.121628 -0.0597096 0.0725463 -0.0178035 0.11258 -0.00326987 -0.0536094 0.168451 0.0467206 -0.0168159 0.0163686 -0.0976955 0.0577483 0.059934 0.0488859 -0.00860576 0.0528999 0.0816775 0.0305801 0.0662695 -0.000545491 -0.0370903 0.0513379 -0.129221 0.0682232 0.129015 -0.0236577 -0.229801 -0.0867716 0.0204566 0.0728413 -0.106595 0.0148334 0.0560441 0.0597065 -0.0580428 0.245734 -0.15931 -0.0150586 -0.0542407 -0.0106804 0.223667 -0.120951 0.153857 -0.0506149 0.0349479 0.0208874 -0.0951202 0.18354 0.0435178 0.0565042 -0.0600419 -0.00738041 0.0331478 -0.0123358 -0.0568071 0.0810481 0.0627888 -0.0714786 -0.061355 0.155394 0.0897585 0.00906936 -0.0383574 -0.144217 0.137735 0.0241393 -0.0169007 0.10311 0.0977098 -0.124668 -0.0348105 0.0845057 0.0205224 -0.0893081 0.0716911 0.0413176 0.00466676 0.0155748 -0.0629914 0.117968 -0.125531 0.118297 -0.128641 0.110057 -0.0367337 0.00226787 0.0128404 -0.137321 0.0864497 0.0410021 -0.124338 0.0609274 0.135898 0.0116233 -0.105619 -0.184025 0.00840521 0.107257 0.0919719 -0.0712337 0.0114002 -0.00733673 0.0471048 0.1075 0.0372288 -0.0582954 
0.0520953 0.139851 0.0785056 -0.0861188 0.06487 0.147773 0.050059 -0.00591661 -0.125328 0.0156204 0.0508813 0.0477129 0.0143749 0.00942713 0.0676544 -0.060347 0.0425934 0.0367308 0.00884789 0.0230829 0.083526 0.0882616 -0.0251574 0.0713364 -0.0169352 0.0845155 -0.00883226 -0.0530293 0.184942 0.0458727 -0.0485853 0.0228064 -0.0499063 0.0708995 0.0493484 0.0409599 0.0384681 0.132973 0.0507582 0.021711 0.026071 -0.00851619 -0.0604531 -0.0050232 -0.12542 0.126447 0.129478 -0.050409 -0.225697 -0.0565886 0.00939925 0.157707 -0.119425 0.042538 0.0828314 0.0375502 -0.00298642 0.166719 -0.159354 -0.00315098 -0.0469952 -0.046316 0.194451 -0.148668 0.167262 -0.0710952 0.0336654 0.0224273 -0.0890548 0.21918 0.0289678 0.0412046 -0.0878545 0.0369366 0.0715815 -0.0218188 -0.0161315 0.138529 0.0584781 -0.0832184 -0.110712 0.140101 0.0642344 0.000243509 -0.00252012 -0.127155 0.0875155 0.0286925 -0.00826055 0.11056 0.0987463 -0.125175 -0.0208542 0.0694502 0.0334326 -0.122234 0.0888213 0.0466311 0.0516605 -0.0036729 -0.0587721 0.121365 -0.126654 0.13452 -0.105749 0.0976594 -0.00113018 0.0137809 0.0663572 -0.156048 0.0385349 0.0645688 -0.1057 0.0474523 0.155912 0.0073482 -0.0698299 -0.217538 0.0273396 0.133135 0.0625997 -0.0192001 0.00955879 0.0381893 0.0696453 0.110365 0.0977677 -0.0601952 
