0.079427 0.0008136 -0.111407 0.0144908 0.0559472 0.170029 0.0283679 -0.00281639 -0.0588263 -0.0811948 0.0666007 0.11155 0.102652 -0.124303 -0.12638 0.015846 -0.109536 0.052512 -0.135817 0.137182 0.217811 -0.103757 0.0761019 0.171741 -0.00309773 -0.0521573 -0.0145997 -0.24031 0.000657096 0.130336 -0.0395201 0.022574 -0.0331479 0.0959234 -0.0686033 -0.00462138 -0.114611 0.0623308 -0.0884071 -0.0219704 0.00671263 -0.0958678 -0.0327429 0.131334 -0.101457 -0.0518564 0.171937 -0.0282539 -0.173085 0.0669438 0.0526471 -0.0691197 -0.0392097 0.0119593 0.114477 0.0429345 -0.00149395 0.147155 0.00165221 -0.120518 -0.0403232 0.00398936 0.223038 -0.0754103 0.0490407 -0.106183 -0.0386028 0.0224485 -0.0738498 0.0804779 -0.040302 0.045637 -0.0883452 -0.0459812 0.0186433 0.0272615 -0.0173852 0.0474101 -0.0265304 0.11322 -0.0785682 -0.000136133 -0.0201577 -0.0659812 -0.145503 0.114602 0.0829721 -0.0210463 -0.0208487 0.0297341 0.060001 -0.184994 -0.116767 0.00088434 -0.0709185 -0.0113781 -0.0626754 0.0720663 0.0612986 -0.0264483 0.0582669 0.00362222 -0.0335729 0.133737 -0.0744204 0.0380404 -0.134149 0.155738 -0.0685007 -0.125754 -0.00910824 0.128663 -0.0787972 -0.0557115 0.0589376 0.131243 -0.102256 -0.0688334 0.0561665 0.186933 0.00209112 -0.0126867 -0.0216969 0.0433572 -0.0557978 0.100961 -0.00156972 -0.016767 
0.0695865 0.0168207 -0.112562 0.00923116 0.0445078 0.184782 0.0257471 -0.0151543 -0.0713481 -0.0624309 0.0733119 0.10616 0.107104 -0.113014 -0.125653 0.00942826 -0.109162 0.0582382 -0.116565 0.124248 0.210749 -0.104771 0.059755 0.192438 0.00409152 -0.0398879 -0.0100082 -0.230328 0.0232276 0.135323 -0.0316058 0.0124103 -0.0481309 0.0827175 -0.0668918 0.00527607 -0.123568 0.0442126 -0.0741345 -0.0104455 0.00207404 -0.100035 -0.0330511 0.140302 -0.0965335 -0.0651265 0.18364 -0.0200084 -0.179392 0.0506831 0.0576663 -0.0597469 -0.0383228 0.00348998 0.108625 0.0577172 -0.00848824 0.170046 0.0129102 -0.129298 -0.047333 0.0163213 0.24083 -0.0807249 0.0428487 -0.089352 -0.0255289 0.00525933 -0.0814084 0.0838178 -0.0460597 0.0554237 -0.0874374 -0.0364731 0.0279344 0.0150025 -0.0185353 0.054909 -0.017961 0.10821 -0.072663 0.00583793 -0.0125455 -0.066552 -0.142353 0.103881 0.0812101 -0.0289749 -0.0109737 0.0235715 0.0572963 -0.17507 -0.101511 0.0026689 -0.0644275 -0.0185231 -0.05884 0.0842244 0.0627669 -0.0254349 0.0535403 0.0157674 -0.0322055 0.133831 -0.0877946 0.0573566 -0.131386 0.143466 -0.0702546 -0.123917 0.00266113 0.132037 -0.071895 -0.0581809 0.0520757 0.129843 -0.0983133 -0.0675523 0.0568654 0.178604 0.0049703 -0.0435551 -0.0216344 0.0253389 -0.0820272 0.119456 -0.0160666 -0.00805076 
0.0669186 0.0182531 -0.122735 0.0138545 0.0435516 0.171689 0.0250585 -0.0203525 -0.0715258 -0.0627762 0.0665333 0.106078 0.103146 -0.121159 -0.137924 0.012269 -0.121268 0.0473924 -0.107464 0.134181 0.211199 -0.121361 0.0682991 0.173615 0.00434619 -0.0358071 -0.00960514 -0.237129 0.0201939 0.139855 -0.0461547 0.0112402 -0.0403933 0.0789851 -0.0625408 -0.00364509 -0.116865 0.0543505 -0.0717024 -0.0268006 -0.000740572 -0.11095 -0.0236118 0.136013 -0.0982445 -0.051749 0.188911 -0.0229003 -0.17799 0.0558724 0.0500697 -0.0553227 -0.0328056 0.0122678 0.11914 0.0485833 0.00312739 0.150571 0.00521365 -0.130181 -0.0351614 0.00884469 0.243252 -0.0707927 0.0505591 -0.0902671 -0.0367698 0.00593259 -0.0716171 0.0750819 -0.0545773 0.0518346 -0.0932418 -0.0355309 0.0334985 0.0217951 -0.0118155 0.0561592 -0.0160515 0.113931 -0.0778244 -0.00446163 -0.0159529 -0.0576632 -0.140023 0.1076 0.0723479 -0.0164535 -0.00257605 0.022843 0.0568766 -0.172575 -0.102615 0.00260603 -0.0738866 -0.0272762 -0.0544994 0.0927512 0.0739662 -0.0318318 0.0611994 0.0123919 -0.0287886 0.129549 -0.0787222 0.0535373 -0.123372 0.164171 -0.0690032 -0.11931 -0.00237322 0.128476 -0.0716661 -0.0615469 0.0523015 0.133016 -0.0977951 -0.0605554 0.0593164 0.178638 -0.00332708 -0.0341889 -0.0155991 0.0228265 -0.0788101 0.120318 -0.009081 -0.00613906 
0.0725197 -0.00931379 -0.115608 0.0159155 0.0551541 0.161969 0.0239286 -0.0124216 -0.0756381 -0.0632012 0.0612988 0.116459 0.104178 -0.110357 -0.129701 0.0141622 -0.110085 0.050139 -0.112446 0.141838 0.210675 -0.116162 0.0726038 0.187439 0.003733 -0.024343 -0.00743328 -0.242945 0.0143004 0.12969 -0.04579 0.0227102 -0.0461542 0.0792593 -0.0742825 0.0017885 -0.131853 0.0638303 -0.0819166 -0.0260206 0.00216209 -0.093673 -0.0415821 0.139928 -0.100015 -0.0505289 0.182166 -0.0222927 -0.16737 0.0496456 0.057115 -0.0639295 -0.0344218 0.00170025 0.124832 0.0436594 0.000352481 0.165646 0.014807 -0.12879 -0.0316852 0.00674089 0.234302 -0.0566755 0.0464571 -0.0953343 -0.0372699 0.0233557 -0.060507 0.0796415 -0.0482521 0.0633143 -0.0838723 -0.037663 0.022763 0.0191056 -0.0191009 0.0584015 -0.0150279 0.112838 -0.0757927 0.0064178 -0.0212088 -0.0749704 -0.139344 0.0904718 0.0863099 -0.00464936 -0.00772491 0.0110021 0.0559766 -0.156036 -0.103573 0.00339008 -0.0738078 -0.0175993 -0.049472 0.0809304 0.0745518 -0.0384607 0.0566554 0.00512266 -0.0280079 0.127076 -0.0896145 0.0452812 -0.139109 0.148091 -0.0569938 -0.12545 0.00395759 0.148316 -0.0747504 -0.0633 0.0593787 0.132383 -0.105754 -0.0758563 0.0482103 0.177363 -0.00739127 -0.019999 -0.0187711 0.0248351 -0.0837222 0.120286 -0.0164927 -0.0121607 
0.0666765 0.00315798 -0.109104 0.0186463 0.0458197 0.1626 0.00443407 -0.0370876 -0.0833815 -0.0710875 0.0716019 0.112721 0.102913 -0.0864498 -0.14189 0.0202426 -0.113806 0.0544163 -0.0979986 0.147846 0.220769 -0.117832 0.0714441 0.179623 0.0124218 -0.0101715 -0.00644686 -0.227902 0.0273555 0.141262 -0.0459864 0.0146959 -0.0428463 0.0662767 -0.0631632 0.0151772 -0.131922 0.073661 -0.0604705 -0.0313087 -0.0184793 -0.0822746 -0.0316745 0.134948 -0.0949816 -0.0580864 0.199599 -0.0310114 -0.173202 0.0491896 0.0463657 -0.0472928 -0.0323758 0.0180058 0.132392 0.0423326 0.00407102 0.167765 0.00801854 -0.143907 -0.0329242 0.00880603 0.255663 -0.0602512 0.0477141 -0.075863 -0.0289728 0.0176482 -0.0631325 0.0891691 -0.0392933 0.0635954 -0.0810847 -0.0316954 0.0313055 0.00748178 -0.0176495 0.0490023 -0.0122073 0.1117 -0.0683729 0.0160585 -0.0171478 -0.0767851 -0.136524 0.0860543 0.0697076 -0.000391325 0.00611638 0.0124767 0.0617329 -0.158391 -0.0944315 0.0149887 -0.0664174 -0.0351573 -0.0503251 0.105901 0.0756547 -0.0409398 0.0489414 0.0130101 -0.0299118 0.122392 -0.0923064 0.0747284 -0.121637 0.143483 -0.0429925 -0.131612 -0.00128545 0.14283 -0.0775002 -0.048386 0.0652593 0.131111 -0.0971972 -0.0738283 0.0501645 0.167393 -0.0113423 -0.0272784 -0.00794058 0.00539812 -0.0910997 0.135985 0.00636356 0.00265569 
0.0551268 0.00630041 -0.0954057 0.0205203 0.0430853 0.163659 -0.00972355 -0.0388803 -0.0726915 -0.0538268 0.0840654 0.104801 0.105627 -0.0732499 -0.131034 0.0251893 -0.105817 0.062645 -0.0873329 0.143957 0.23045 -0.133462 0.0788856 0.184845 0.0251234 -0.00806064 -0.00845177 -0.225658 0.0401818 0.135877 -0.0241688 0.00770097 -0.0253905 0.0602706 -0.0577043 0.0303868 -0.133887 0.0858136 -0.0508136 -0.0426924 -0.0255617 -0.0841907 -0.0431469 0.122283 -0.0906195 -0.0733124 0.192793 -0.0306158 -0.1708 0.0312493 0.035775 -0.031919 -0.0278516 0.0132797 0.129412 0.0550975 0.00890331 0.161938 -0.00183365 -0.148593 -0.0424388 -0.00254201 0.255771 -0.0696055 0.059815 -0.0558123 -0.0332218 0.0273455 -0.0684952 0.105055 -0.0374852 0.0645689 -0.0994616 -0.0435426 0.0389278 0.00108811 -0.0149093 0.0610655 -0.00570532 0.105393 -0.0932224 0.0158917 -0.0100739 -0.0726233 -0.135858 0.0784961 0.0683166 0.0122349 0.0193341 0.0104976 0.0591139 -0.153761 -0.0795902 0.0262602 -0.058459 -0.0496009 -0.0600143 0.114208 0.0711716 -0.0399862 0.0580154 0.00863579 -0.0398444 0.106718 -0.0727002 0.0918212 -0.104981 0.116672 -0.0156237 -0.143391 -0.0265673 0.142895 -0.0727529 -0.0468359 0.0903336 0.132172 -0.0979251 -0.0796277 0.0561175 0.177786 -0.00544741 -0.0377389 -0.0189931 0.00310512 -0.0924795 0.153417 0.0244525 0.0210727 
0.0513612 -0.00191206 -0.096756 0.00435675 0.0432824 0.145826 -0.0150941 -0.0268798 -0.0922338 -0.0229957 0.0825714 0.11344 0.110176 -0.0620827 -0.111124 0.0288165 -0.105058 0.0457536 -0.0675905 0.142892 0.211477 -0.131502 0.0907872 0.172784 0.0256132 0.0221899 0.0131406 -0.226115 0.0437615 0.124403 -0.035135 0.0061371 -0.0204456 0.053934 -0.0786555 0.0284265 -0.145269 0.107125 -0.0468711 -0.0227297 -0.0289711 -0.0852207 -0.0633989 0.122971 -0.1033 -0.0548279 0.186549 -0.0350135 -0.167102 0.0211202 0.0492392 -0.0205162 -0.0461531 0.00537402 0.128744 0.0515371 0.0139595 0.176183 -0.00154416 -0.127137 -0.0430682 -0.026196 0.254666 -0.0523123 0.0716202 -0.0646632 -0.0449221 0.0534297 -0.0524968 0.110282 -0.0331928 0.0838347 -0.101985 -0.0391491 0.0463393 0.00473835 -0.0208378 0.0676353 -0.00475958 0.105905 -0.103318 0.00251928 -0.000416608 -0.066847 -0.146975 0.0529837 0.0884074 0.0238637 0.0295878 -0.00961519 0.0357373 -0.136538 -0.0756077 0.0337674 -0.0575034 -0.0557278 -0.0457112 0.105202 0.0845818 -0.0503953 0.0418536 0.00626263 -0.040251 0.106576 -0.0797176 0.0829424 -0.120542 0.113556 0.0039652 -0.16269 -0.0199414 0.158596 -0.0713409 -0.0463904 0.101215 0.133003 -0.0987574 -0.0860591 0.0524206 0.182847 -0.00418579 -0.0352427 -0.0243393 0.00446825 -0.0903133 0.155412 0.0195707 0.0295964 
0.0523012 0.00222382 -0.0955567 0.00628377 0.0501498 0.138494 0.00415987 -0.0158207 -0.0892839 -0.0249504 0.0684134 0.115422 0.110836 -0.0932817 -0.111332 0.0298915 -0.112864 0.0409371 -0.0896899 0.15869 0.210637 -0.131684 0.0916126 0.153566 0.00997705 0.013677 -0.00748513 -0.236922 0.0277275 0.126871 -0.0504704 0.0235999 -0.0146821 0.073956 -0.0688421 0.00974825 -0.122834 0.12351 -0.0582828 -0.0369428 -0.0161005 -0.101707 -0.0445321 0.115442 -0.110034 -0.0422887 0.189681 -0.0351208 -0.175038 0.0367962 0.0553313 -0.036065 -0.0486459 0.0162336 0.144935 0.0387505 0.0098931 0.146384 -0.00930996 -0.132234 -0.0388593 -0.0364941 0.235788 -0.055295 0.0848313 -0.0771982 -0.0545404 0.0527664 -0.0584763 0.0884667 -0.0383741 0.0725145 -0.102115 -0.0335674 0.0420215 0.0189024 -0.0183101 0.0665952 0.00123038 0.108766 -0.100661 -0.0048804 -0.00399578 -0.0574618 -0.144914 0.0590285 0.0897989 0.0322222 0.0358336 0.00886864 0.035093 -0.151481 -0.087267 0.0289136 -0.0802403 -0.045168 -0.0404067 0.0970162 0.0820091 -0.0536286 0.0523775 0.00762863 -0.0421783 0.116067 -0.0729807 0.0618292 -0.123595 0.138703 -0.0029483 -0.149009 -0.0259686 0.156768 -0.0858323 -0.0480658 0.0964992 0.126954 -0.104626 -0.0881163 0.0452539 0.187824 -0.00059814 -0.0118287 -0.0121605 0.0215029 -0.0672711 0.138013 0.0264197 0.00783642 
0.0454624 0.0251892 -0.0818693 -0.00815665 0.0295669 0.14291 0.00260032 0.00785321 -0.0758332 -0.0131195 0.0829106 0.113584 0.113477 -0.112582 -0.100866 0.0131947 -0.114815 0.0308732 -0.107042 0.162791 0.18855 -0.121366 0.0944758 0.13971 -0.013493 0.0160572 -0.00385993 -0.22184 0.0315634 0.0979163 -0.0449502 0.0103852 0.00925972 0.0906372 -0.0766543 0.00492991 -0.10035 0.157365 -0.0705103 -0.0185913 -0.00804561 -0.116286 -0.0604977 0.105964 -0.126099 -0.0600998 0.177263 -0.037743 -0.182067 0.0640738 0.0492899 -0.0199454 -0.0760356 0.0318748 0.137032 0.0387926 0.00465238 0.127459 -0.0279288 -0.133183 -0.0672478 -0.0561477 0.236095 -0.0687126 0.0888918 -0.0798818 -0.0450695 0.0483712 -0.076868 0.094664 -0.0342874 0.0527117 -0.101309 -0.00109994 0.0637492 0.00768855 -0.0240843 0.0670507 0.00831464 0.0995071 -0.12251 -0.0174689 0.0137167 -0.0461808 -0.136333 0.0579738 0.0965346 0.0357622 0.0584058 0.0206455 0.0310704 -0.176915 -0.0778834 0.0266616 -0.0722987 -0.0644804 -0.039067 0.0879904 0.0654034 -0.0513378 0.0397995 0.0177053 -0.0506885 0.121654 -0.0566191 0.0662461 -0.111771 0.133946 0.0088333 -0.162495 -0.0327418 0.162122 -0.0811393 -0.0312672 0.100978 0.110104 -0.0875472 -0.0994314 0.0644961 0.199498 0.0139328 -0.0190687 -0.0106536 0.0369462 -0.0364518 0.120328 0.0531418 0.0190963 
0.0515561 -0.0158459 -0.066446 0.00606114 0.0482386 0.111585 0.00592856 0.00343026 -0.0555187 -0.063094 0.0644452 0.114328 0.112215 -0.0846392 -0.111801 -0.00487794 -0.112259 0.0296034 -0.121066 0.18432 0.216898 -0.143083 0.108733 0.14531 -0.00230397 -0.00147121 -0.0271437 -0.226514 0.0165556 0.100591 -0.0297516 0.0195846 0.00585901 0.0896162 -0.0766859 0.00898475 -0.118801 0.179794 -0.0898266 -0.0482868 -0.00381878 -0.0842226 -0.0757942 0.102749 -0.120643 -0.0605905 0.156447 -0.0434155 -0.144518 0.0654055 0.0102648 -0.0284276 -0.0485726 0.0276876 0.145335 0.022616 0.00541249 0.131793 -0.0297234 -0.148456 -0.0472809 -0.0397788 0.217679 -0.0417805 0.0680248 -0.0764585 -0.0362674 0.057845 -0.0603305 0.0867901 -0.0240412 0.0521438 -0.0896882 -0.0104471 0.0400864 0.00563675 -0.0254569 0.0381939 0.0129586 0.119768 -0.132835 -0.00697757 -0.0028421 -0.0639544 -0.119751 0.0465474 0.095039 0.0586255 0.0498552 0.000976812 0.0576295 -0.162732 -0.0623145 0.0128611 -0.0752617 -0.0729327 -0.050237 0.0912871 0.0694424 -0.0565149 0.0446888 0.0039217 -0.042327 0.11854 -0.065409 0.0617277 -0.113341 0.133895 0.034463 -0.158019 -0.0330295 0.167173 -0.115157 -0.0285543 0.100095 0.129242 -0.0850971 -0.110021 0.0598783 0.20436 -0.0144946 0.0207014 -0.0365792 0.0448841 -0.055201 0.109147 0.0487088 0.0170434 
0.0516155 -0.0317374 -0.0568168 0.0218568 0.0487625 0.112403 0.0183608 0.00473204 -0.047744 -0.0661968 0.0721397 0.125203 0.111176 -0.0998405 -0.120646 -0.00712382 -0.127223 0.0468011 -0.135535 0.191415 0.221833 -0.15512 0.104199 0.14151 -0.00721071 -0.0152442 -0.0444668 -0.227225 0.00523485 0.10453 -0.0377152 0.0228741 0.00358725 0.0969214 -0.0711164 0.00445065 -0.123446 0.164913 -0.0885513 -0.0624603 0.00167886 -0.0944799 -0.0717779 0.0932326 -0.125549 -0.0912305 0.142224 -0.042583 -0.130046 0.080529 0.00827686 -0.0416592 -0.0530417 0.0349379 0.145505 0.0203867 -0.000811579 0.11219 -0.0468695 -0.133989 -0.0421613 -0.0408996 0.214692 -0.0372721 0.0686532 -0.0749572 -0.0428616 0.0408525 -0.0736261 0.0797125 -0.0265988 0.0502481 -0.0840041 -0.00592663 0.0271975 0.00581077 -0.0130097 0.0253386 0.0121371 0.119084 -0.131066 -0.0196088 3.28754e-05 -0.0549865 -0.120915 0.0591313 0.0955766 0.064241 0.0545113 0.00914761 0.0643824 -0.169742 -0.0616735 0.0217483 -0.0903223 -0.0750507 -0.0683898 0.0793025 0.066439 -0.0463054 0.0586121 0.00219721 -0.0493376 0.107125 -0.0273312 0.0646 -0.0949488 0.138795 0.0299588 -0.143673 -0.0521746 0.156847 -0.107428 -0.026156 0.0971847 0.131955 -0.0649243 -0.0855044 0.061848 0.209137 -0.0187657 0.0139037 -0.0411702 0.0440917 -0.0488482 0.113677 0.0585994 0.0214285 
0.038363 -0.0111142 -0.0462316 0.0175661 0.0493268 0.132539 0.0241496 0.00472803 -0.0519603 -0.0447175 0.0723897 0.100909 0.106911 -0.107141 -0.0921853 0.00226807 -0.141818 0.0414294 -0.110574 0.179358 0.227197 -0.162161 0.0989974 0.1319 0.0112171 -0.0155944 -0.0665921 -0.233491 0.0277324 0.100222 -0.0146976 0.00892876 -0.00248802 0.0891669 -0.0421356 0.0162699 -0.108083 0.154737 -0.0597893 -0.0742937 0.0123268 -0.109495 -0.0537157 0.0861645 -0.123642 -0.0948603 0.153448 -0.0360899 -0.140039 0.0600186 -0.00726135 -0.0409186 -0.0497322 0.0354387 0.15065 0.0302944 -0.00192512 0.109557 -0.0615338 -0.141076 -0.0526576 -0.0412731 0.221835 -0.0619008 0.0922444 -0.0430124 -0.0473797 0.0285317 -0.0784422 0.0753757 -0.0300226 0.0722801 -0.101133 -0.00652531 0.041378 -0.00197661 -0.0121648 0.0402323 0.0307806 0.120975 -0.132767 -0.0234957 0.0117831 -0.0370908 -0.115605 0.0574655 0.0895612 0.0765111 0.0658968 0.0137478 0.075895 -0.161139 -0.0595726 0.0247367 -0.0969892 -0.0888804 -0.0634472 0.10229 0.0574092 -0.0391835 0.0607149 -0.00136325 -0.0543379 0.0875502 -0.0221702 0.0896108 -0.0697171 0.136315 0.0464351 -0.134508 -0.0665489 0.143358 -0.10703 -0.0349488 0.118158 0.12831 -0.0637628 -0.0771974 0.0543368 0.212562 -0.00318586 -0.00558608 -0.0306375 0.0450899 -0.0593955 0.127747 0.0730895 0.0359769 
0.050472 0.0406525 -0.0588215 -0.00259589 0.0899917 0.150441 0.0338967 0.0122012 -0.0769724 -0.0132096 0.0796383 0.078202 0.124565 -0.123018 -0.0712939 0.0252673 -0.0679873 0.0709237 -0.109642 0.182229 0.24605 -0.135917 0.057354 0.127052 0.019425 -0.0116503 -0.0977262 -0.225588 0.0960704 0.121736 0.00299686 0.039809 -0.0166601 0.0883384 -0.0130903 -0.00416961 -0.0692828 0.146501 -0.00326599 -0.0889327 0.0204162 -0.0839641 -0.0154414 0.0894923 -0.114014 -0.0908852 0.177078 -0.0219159 -0.173691 0.00805392 -0.00800503 -0.0319976 -0.0679632 0.0133059 0.109539 0.0342142 -0.0212894 0.108666 -0.0671757 -0.162625 -0.0642421 -0.0512121 0.220487 -0.098713 0.0903053 -0.0337133 -0.0405421 0.0143423 -0.087903 0.0234975 -0.0188414 0.0687366 -0.107654 -0.0305775 0.0237979 -0.00710099 -0.0169299 0.0775446 0.0468628 0.106313 -0.123537 0.0304124 0.0170126 -0.018602 -0.0653498 0.050593 0.084373 0.0722942 0.0827385 0.0163521 0.0753319 -0.153506 -0.0929919 0.0476233 -0.0724099 -0.104449 -0.0411066 0.117033 -0.0053913 -0.043482 0.0390562 -0.00251167 -0.0522186 0.132469 -0.075237 0.108655 -0.0505799 0.140259 0.0803568 -0.123138 -0.056145 0.118943 -0.144207 -0.000823041 0.117398 0.0839521 -0.122302 -0.107478 0.0232926 0.179705 -0.0121879 0.00928611 -0.0176856 0.0572535 -0.0608844 0.105183 0.0483226 -0.00918446 
0.0452358 0.00686426 -0.0302868 0.00885089 0.0730266 0.144638 0.0265981 0.0257447 -0.0353042 -0.0491089 0.0812154 0.112706 0.0938494 -0.14194 -0.102316 -0.00509285 -0.115273 0.0673755 -0.132191 0.193011 0.242364 -0.136273 0.0543108 0.150431 0.00851704 -0.0332897 -0.0631922 -0.208004 0.0495715 0.106911 -0.0134195 -0.0268381 -0.001767 0.097141 -0.0204331 0.000822421 -0.0900356 0.127756 -0.0623783 -0.0936002 0.017423 -0.0897711 -0.0313123 0.103582 -0.114366 -0.118244 0.154509 -0.0329224 -0.154427 0.0760374 -0.0117508 -0.0552299 -0.0782982 0.0243359 0.141109 0.0335439 -0.0604251 0.10827 -0.0927755 -0.152724 -0.053644 -0.0548878 0.236367 -0.073232 0.0867175 -0.0602633 -0.0553908 -0.00044836 -0.112689 0.0581091 -0.00958594 0.0557493 -0.0889162 -0.023359 0.013153 0.0023927 0.00336895 0.0641229 0.0488864 0.0976678 -0.129247 0.0104736 0.0161682 -0.0187371 -0.0792717 0.0425687 0.0830719 0.0884367 0.0975414 0.0492018 0.0799206 -0.181087 -0.0901873 0.0519208 -0.0705099 -0.0909429 -0.067007 0.0732744 0.0104278 -0.0370452 0.0467095 -0.00484057 -0.0719711 0.0724474 -0.0491739 0.110978 -0.0491521 0.107159 0.0414926 -0.124833 -0.0433836 0.124985 -0.107508 0.00693408 0.119209 0.0967336 -0.0732919 -0.073417 0.0376488 0.196135 -0.0183758 0.00978025 -0.0255763 0.0509548 -0.0372302 0.118124 0.0907131 -0.00875613 
0.0584243 -0.0288676 -0.076736 0.00991943 0.0701826 0.145291 0.034647 0.042049 -0.0482089 -0.0686649 0.0658181 0.124476 0.0931453 -0.156678 -0.119129 -0.0138083 -0.109065 0.0631158 -0.134572 0.210455 0.211529 -0.137416 0.0669086 0.145655 -0.0212087 -0.0260389 -0.0442853 -0.229195 0.00324453 0.0752939 -0.0345584 -0.0236328 -0.00798104 0.110651 -0.0379452 0.00246683 -0.0794868 0.121294 -0.0986025 -0.0906591 0.0357056 -0.0810186 -0.0247565 0.13014 -0.139086 -0.114393 0.163061 -0.0340632 -0.149912 0.114149 -0.0126572 -0.111498 -0.0877558 0.0426934 0.15113 0.0209184 -0.0545536 0.11187 -0.0630316 -0.153363 -0.0427618 -0.034209 0.239439 -0.0769891 0.0848963 -0.0897687 -0.0546726 -0.0056978 -0.0899014 0.0479786 -0.0212411 0.0464818 -0.0618031 -0.00349007 0.00388194 -0.00227243 -0.000799632 0.0757309 0.0334751 0.0651806 -0.131367 0.012601 -0.00727132 -0.0431794 -0.104234 0.0664052 0.0896898 0.077611 0.0842758 0.03537 0.0925165 -0.188723 -0.0952522 0.000860216 -0.055567 -0.0638973 -0.0548828 0.0711385 0.00219274 -0.030717 0.0237938 -0.00771472 -0.0509844 0.0832739 -0.048199 0.0859416 -0.0778632 0.120489 -0.0215286 -0.109659 -0.0307294 0.133001 -0.0752727 -0.00385376 0.0868186 0.0783922 -0.0531893 -0.101592 0.0421142 0.179205 -0.0200933 0.0168093 -0.00384308 0.0636725 -0.0414804 0.0831814 0.052786 -0.0184965 
0.0589065 -0.0289698 -0.0823904 0.0110716 0.0586889 0.14285 0.0207169 0.0337837 -0.0471877 -0.0585091 0.0724388 0.131161 0.0944558 -0.151681 -0.130664 -0.00165432 -0.104417 0.0640204 -0.13381 0.209636 0.20986 -0.135908 0.0702761 0.1357 -0.0275723 0.0041695 -0.0315781 -0.231391 -0.000848265 0.076751 -0.0444759 -0.00351872 0.00208039 0.108399 -0.0446171 -0.00191168 -0.0752245 0.145174 -0.0819362 -0.089285 0.0224108 -0.0820962 -0.0302822 0.119703 -0.136561 -0.124295 0.165512 -0.0468308 -0.15196 0.111142 0.00525149 -0.0989364 -0.087026 0.0570338 0.153901 0.0175519 -0.0374386 0.10009 -0.0599744 -0.163988 -0.0429926 -0.0538204 0.243173 -0.0764028 0.0840808 -0.0874354 -0.0532184 0.0090882 -0.081892 0.0551203 -0.0216868 0.0381044 -0.0633921 -0.00169792 0.00783587 -0.00806853 -0.00366863 0.0696784 0.0248254 0.0654178 -0.131901 0.0209122 0.00171677 -0.0465457 -0.103259 0.0567208 0.0945794 0.0833748 0.097425 0.028072 0.0729563 -0.191142 -0.0926034 0.0114137 -0.0553356 -0.063728 -0.0470889 0.076477 0.00384549 -0.033979 0.0245284 -0.00399251 -0.0561629 0.0967762 -0.0375134 0.0785264 -0.0781604 0.112708 -0.0211312 -0.121425 -0.0404869 0.142246 -0.0739265 0.00102627 0.0956223 0.0698067 -0.0615701 -0.111204 0.0432816 0.166671 -0.0140608 0.0216317 0.0155234 0.0488331 -0.0252284 0.0832085 0.0651986 -0.0108013 
0.0579516 -0.033589 -0.0780658 -0.00582047 0.0556415 0.147724 0.013015 0.0517814 -0.0639746 -0.0490829 0.067315 0.11846 0.107078 -0.152623 -0.114556 -0.00270616 -0.0989731 0.0605728 -0.133652 0.212726 0.204026 -0.128957 0.0732608 0.132906 -0.0374158 0.0167625 -0.0338195 -0.234738 0.00352541 0.0548459 -0.0357596 -0.00992242 -0.00483941 0.108966 -0.0470257 0.00321218 -0.0761084 0.151637 -0.0821734 -0.082681 0.0266118 -0.0803686 -0.0388598 0.131039 -0.140809 -0.124784 0.166437 -0.0351372 -0.15724 0.109891 0.0056679 -0.108958 -0.096993 0.0579122 0.144879 0.0100034 -0.0377952 0.102085 -0.0469709 -0.176556 -0.0453667 -0.0491477 0.235604 -0.0696788 0.0824919 -0.0917717 -0.0459042 0.0159248 -0.0710123 0.0446675 -0.0208271 0.0405326 -0.0547614 -0.00284458 0.00859965 -0.0186988 -0.0189793 0.0785395 0.0373964 0.0709643 -0.127497 0.0169484 0.00506734 -0.0480154 -0.103621 0.0513656 0.105403 0.0896922 0.102786 0.0196533 0.0721145 -0.182978 -0.089032 0.00574034 -0.0619128 -0.0660524 -0.0369731 0.0842924 -0.0153689 -0.0376064 0.0172848 0.00175336 -0.055558 0.100909 -0.0408847 0.0771656 -0.0870414 0.115058 -0.0152874 -0.123819 -0.0361218 0.149234 -0.0798679 0.00341583 0.091188 0.0637953 -0.0687689 -0.124037 0.032618 0.159388 -0.0155381 0.0169937 0.0214108 0.0507675 -0.0295993 0.0701888 0.0529178 -0.00885971 
0.0429033 -0.01675 -0.0859093 -0.00610488 0.047057 0.135146 -0.00832153 0.0406912 -0.0653287 -0.0059399 0.0893919 0.113348 0.110401 -0.131071 -0.121405 0.0286136 -0.0858089 0.083268 -0.110735 0.199656 0.215262 -0.141533 0.0819465 0.113088 -0.0254322 0.0446117 -0.0183745 -0.229306 0.02781 0.0687688 -0.0430933 0.00891273 0.0188871 0.0891521 -0.0460625 0.000485043 -0.0782915 0.170764 -0.0476151 -0.0888657 -0.0066557 -0.0830336 -0.0409375 0.118785 -0.135524 -0.137984 0.168425 -0.045377 -0.159969 0.0768679 0.0212206 -0.0759836 -0.102661 0.0595313 0.133064 0.0187436 -0.0086076 0.0832478 -0.0512181 -0.17526 -0.0476984 -0.0849297 0.246047 -0.0672451 0.0926481 -0.0760708 -0.0638873 0.0370508 -0.0620021 0.0597289 -0.0207493 0.044764 -0.0723495 -0.0206493 0.010348 -0.0281742 -0.011794 0.0881438 0.0225614 0.0555463 -0.140917 0.0202146 0.0148683 -0.0383994 -0.104842 0.0416607 0.0990887 0.0983113 0.129835 0.00608837 0.0426296 -0.170044 -0.0949643 0.0267879 -0.0459844 -0.0762333 -0.0422243 0.108576 -0.0136018 -0.0395795 0.0255865 -0.00226154 -0.0602711 0.099062 -0.0164731 0.0845598 -0.0684677 0.0960459 0.0201604 -0.14695 -0.0682313 0.146511 -0.0733338 0.00796779 0.121057 0.0565799 -0.0702539 -0.125743 0.0409162 0.153664 -0.0105825 0.0103698 0.0286853 0.0326966 -0.0241618 0.0888933 0.0743735 0.0128043 
0.0467812 -0.0248243 -0.10335 0.00035582 0.0492345 0.106773 0.000153836 0.025263 -0.0457775 -0.0138111 0.0839084 0.115761 0.116918 -0.119477 -0.134193 0.0365877 -0.0962465 0.0644727 -0.126425 0.206052 0.215145 -0.160487 0.0888628 0.0844591 -0.0273177 0.0467566 -0.0219889 -0.2337 0.00411207 0.0824003 -0.0517099 0.0428774 0.0222095 0.0905559 -0.0554656 -0.00597094 -0.0767687 0.196992 -0.0464551 -0.0953345 -0.00867378 -0.0899065 -0.040346 0.106733 -0.13042 -0.120337 0.155873 -0.0422713 -0.140239 0.0702841 0.0166054 -0.0725522 -0.0926066 0.062468 0.143693 0.00665352 -0.00388375 0.0670404 -0.0508045 -0.169733 -0.0375861 -0.0997408 0.233276 -0.0518009 0.088031 -0.0753494 -0.0694846 0.0670921 -0.0406764 0.0437603 -0.0203008 0.0435262 -0.0692669 -0.0283651 0.0100427 -0.0127079 -0.0116037 0.0694352 0.00688605 0.0744492 -0.131948 0.00739294 0.00446184 -0.0377345 -0.115644 0.0478421 0.10093 0.101279 0.128033 -0.00384393 0.0320784 -0.172567 -0.0920864 0.0245269 -0.0686251 -0.0735401 -0.0435405 0.0949545 0.0131453 -0.0523646 0.0394484 -0.0144352 -0.0527683 0.107789 -0.00962949 0.0636562 -0.0837956 0.124922 0.0204123 -0.141558 -0.0750706 0.150912 -0.0928768 0.00567543 0.117593 0.0665318 -0.0847791 -0.116339 0.0383359 0.152005 -0.013419 0.0397943 0.0302356 0.0473962 -0.0154568 0.076936 0.0633437 0.0124444 
0.052041 -0.00591202 -0.0993714 0.00105768 0.0560685 0.121159 -0.00133502 0.0233473 -0.0543125 -0.0164672 0.091712 0.109257 0.107426 -0.122826 -0.12268 0.034222 -0.0817859 0.0759876 -0.118094 0.199833 0.21537 -0.14739 0.0901964 0.0934052 -0.0140096 0.0331424 -0.0126409 -0.226726 0.0154685 0.0839851 -0.0430029 0.0311814 0.029208 0.0985417 -0.0442075 -0.00490623 -0.0620282 0.184366 -0.041634 -0.0992417 -0.00462211 -0.0931755 -0.0274036 0.108278 -0.135774 -0.111224 0.166358 -0.0416148 -0.159623 0.0700268 0.0165185 -0.0671357 -0.0922636 0.0588799 0.139617 0.0139709 -0.00769294 0.0703297 -0.0554555 -0.167954 -0.0487734 -0.0963273 0.235594 -0.0740338 0.0954731 -0.0682991 -0.0739056 0.0561212 -0.0575573 0.0604057 -0.0246545 0.0369571 -0.0825348 -0.0321525 0.0159225 -0.0182506 -0.0060304 0.0835857 0.00827824 0.0634045 -0.140683 0.0143621 0.00474947 -0.0384136 -0.108678 0.0487952 0.088458 0.091338 0.118407 0.0157409 0.0464803 -0.179469 -0.101617 0.0242943 -0.0533619 -0.0732574 -0.0465166 0.103752 0.0064808 -0.0526059 0.0333658 -0.00941836 -0.0527804 0.108231 -0.0115525 0.0719033 -0.0738234 0.118733 0.0241551 -0.148626 -0.0724994 0.144013 -0.084902 0.0118865 0.12407 0.0574083 -0.0819397 -0.125792 0.0482338 0.162293 -0.00163721 0.0315391 0.0242449 0.0529312 -0.00870706 0.074755 0.0801329 0.00501411 
0.0434564 -0.00862589 -0.0798308 0.00895458 0.0512399 0.120901 0.00527457 0.0330386 -0.0678528 -0.0110034 0.0833421 0.0978321 0.103518 -0.122811 -0.107386 0.0305256 -0.0910259 0.073438 -0.0995337 0.186265 0.224491 -0.16597 0.101304 0.104048 0.00604561 0.0149947 -0.019912 -0.234935 0.0223057 0.0805065 -0.0322761 0.0121356 0.0279515 0.0934747 -0.0418296 -0.0100604 -0.0749078 0.176598 -0.0464688 -0.104001 -0.00492927 -0.10243 -0.0242465 0.106511 -0.131219 -0.111222 0.167975 -0.0461389 -0.161054 0.0590914 0.0189114 -0.0684561 -0.077447 0.0478937 0.137431 0.0202513 0.00633993 0.0708668 -0.0477601 -0.166852 -0.0434045 -0.0861903 0.219633 -0.0710321 0.106615 -0.0544736 -0.0829552 0.0423335 -0.0628079 0.0667231 -0.0364152 0.0494619 -0.0988933 -0.034833 0.0215604 -0.0193167 -0.000417425 0.0860647 0.0186248 0.0776373 -0.157324 -0.00951904 0.00893828 -0.0357249 -0.108328 0.0470944 0.0839812 0.0909813 0.109415 0.00886701 0.0487674 -0.162004 -0.0943117 0.0194526 -0.0588287 -0.073455 -0.0478214 0.120663 0.0127825 -0.0469781 0.0396253 -0.00880875 -0.0479228 0.0994379 -0.00119839 0.0698409 -0.06357 0.12113 0.0409798 -0.157975 -0.0854238 0.144252 -0.0808686 -0.00895534 0.136038 0.0744759 -0.0698376 -0.113035 0.0520059 0.181647 -0.00595735 0.0199427 0.00217945 0.0448896 -0.0216731 0.0892788 0.0857319 0.0170182 
0.0418881 0.0104891 -0.0887248 0.0181647 0.045244 0.130977 0.0189235 0.0210938 -0.0653007 -0.000368746 0.0873272 0.095837 0.103303 -0.138422 -0.116335 0.0408625 -0.105616 0.0770198 -0.0976355 0.181203 0.223105 -0.173855 0.0931067 0.0959576 0.00172182 0.00118283 -0.0364391 -0.238455 0.0228501 0.098342 -0.0421691 0.0197484 0.0261674 0.0922822 -0.0306401 -0.0130292 -0.0661283 0.15526 -0.0375278 -0.106696 -0.0111555 -0.124147 -0.0077311 0.0929914 -0.12111 -0.106445 0.175492 -0.0418743 -0.172955 0.0611896 0.0225282 -0.0709354 -0.0742928 0.0511399 0.135917 0.0286404 0.00719047 0.0572794 -0.0548224 -0.150368 -0.0412372 -0.0782058 0.223611 -0.0907682 0.115829 -0.048164 -0.0902208 0.0252812 -0.079773 0.0568121 -0.0455348 0.0479344 -0.108746 -0.0318392 0.0233678 -0.00859612 0.0164733 0.0855168 0.0162416 0.073103 -0.148503 -0.022946 -0.000119518 -0.0226972 -0.114579 0.070776 0.0668838 0.073618 0.106867 0.0238224 0.0494175 -0.168766 -0.0978046 0.0260348 -0.0666121 -0.0638663 -0.0542928 0.120597 0.0226968 -0.0340645 0.0571636 -0.0101454 -0.0546676 0.0929247 0.0134865 0.0764093 -0.0493022 0.131226 0.0215407 -0.139566 -0.0977261 0.129741 -0.0646185 -0.0240773 0.12898 0.0791755 -0.0629882 -0.0851001 0.0539876 0.183204 -0.00343947 0.00191842 0.0112272 0.0459993 -0.0200501 0.103615 0.0835215 0.0110346 
0.0505789 0.00930625 -0.0892181 0.0212573 0.0329073 0.145736 0.0125035 0.00535294 -0.0805853 -0.0219218 0.0756237 0.0813566 0.115551 -0.10943 -0.105544 0.0397283 -0.118829 0.0533396 -0.0862601 0.159234 0.233783 -0.17162 0.108928 0.112117 0.0145179 -0.0160048 -0.0495184 -0.248757 0.00982489 0.120051 -0.0431437 0.0195068 0.00788978 0.0896181 -0.0398328 -0.00130908 -0.0843953 0.139438 -0.0341417 -0.0827604 -0.0264031 -0.122656 -0.012208 0.076379 -0.108522 -0.0883474 0.180927 -0.0430636 -0.171226 0.0617913 0.0304502 -0.062002 -0.0391363 0.0552895 0.13945 0.0311687 0.0335382 0.0793011 -0.032615 -0.155513 -0.0388493 -0.0386579 0.215902 -0.0999975 0.0970946 -0.0319751 -0.0712088 0.0387016 -0.0753969 0.0575438 -0.0494672 0.0616101 -0.12032 -0.0367451 0.0391261 0.00718914 0.0103431 0.0460289 0.0161747 0.110631 -0.125785 -0.0380014 -0.000463285 -0.039134 -0.13261 0.0904993 0.0619649 0.0414379 0.0758237 0.0165405 0.0512381 -0.166788 -0.0806913 0.0273013 -0.0871862 -0.0536455 -0.0590176 0.135732 0.0468832 -0.0287327 0.0737494 -0.00292964 -0.0484541 0.102797 -0.00922029 0.0757615 -0.0741044 0.139266 0.00181698 -0.139391 -0.0824768 0.131169 -0.0683737 -0.0506098 0.114948 0.121244 -0.0705521 -0.064582 0.0518403 0.191519 -0.00556553 -0.0212936 0.00833986 0.0331004 -0.0420248 0.123838 0.0688266 0.0234703 
0.0415064 -0.003457 -0.0752831 0.0177241 0.0519047 0.134522 0.00172688 0.00485061 -0.0793691 -0.0195051 0.0621407 0.0917995 0.091435 -0.12136 -0.0954195 0.0378335 -0.123096 0.0552813 -0.0639891 0.170127 0.229929 -0.163492 0.115589 0.111978 0.0235781 0.00625556 -0.0353226 -0.258555 0.020722 0.104948 -0.0307673 0.00589847 0.0192551 0.078521 -0.0205964 0.00206314 -0.0829153 0.147466 -0.0357198 -0.101647 -0.0162111 -0.11442 -0.0171577 0.0962825 -0.120372 -0.071272 0.18724 -0.0440621 -0.169512 0.0553127 0.0186042 -0.0569033 -0.0363374 0.0405753 0.153463 0.0258023 0.0359957 0.0774025 -0.0457595 -0.154395 -0.0345248 -0.0570503 0.221557 -0.0775713 0.118031 -0.0530415 -0.0831296 0.0371655 -0.0628122 0.0765796 -0.0476327 0.0679988 -0.123969 -0.0405475 0.0322445 -0.00317536 -0.00299938 0.0728442 0.0274105 0.107635 -0.139238 -0.017463 -0.00105329 -0.029711 -0.11412 0.054142 0.0640921 0.0756935 0.08028 0.017589 0.0575144 -0.138182 -0.0905748 0.0262483 -0.0775794 -0.0648571 -0.0473291 0.142063 0.0445366 -0.0471808 0.0655138 -0.00740916 -0.0516847 0.0763908 -0.0127643 0.0703822 -0.0602825 0.126165 0.0341325 -0.133263 -0.0784924 0.135545 -0.0745418 -0.0506762 0.132205 0.11178 -0.0709077 -0.0940872 0.0471575 0.195614 0.00485878 0.00045785 0.00424515 0.0273432 -0.0479329 0.12124 0.0906033 0.0287938 
0.0401653 -0.00711156 -0.0715508 0.0276902 0.0699752 0.131544 0.0198797 -0.00594317 -0.0695348 -0.0212505 0.0591122 0.109316 0.086121 -0.132107 -0.0989824 0.0310334 -0.140936 0.0720822 -0.077212 0.174438 0.23094 -0.161108 0.107658 0.108126 0.0217359 -0.00765986 -0.0546336 -0.256509 0.0188053 0.12048 -0.0407654 0.0202104 0.009998 0.0803781 -0.0106761 -0.00201665 -0.0839636 0.126896 -0.0360001 -0.107953 0.00382231 -0.115417 -0.00610929 0.0945293 -0.137482 -0.0747228 0.182688 -0.040811 -0.155053 0.0615569 0.0180102 -0.0615786 -0.0468284 0.0404676 0.16211 0.0258731 0.0302043 0.07037 -0.059463 -0.135368 -0.0295617 -0.0577343 0.219302 -0.0672365 0.118069 -0.0636928 -0.0890312 0.0254686 -0.0675982 0.0798226 -0.0400786 0.0775936 -0.113029 -0.0333891 0.0207064 0.00766206 -0.00665684 0.069729 0.0243208 0.0953 -0.131468 -0.00350065 0.00178488 -0.0124652 -0.112463 0.0626606 0.0682945 0.0817606 0.0744651 0.0272317 0.0654631 -0.141048 -0.0959295 0.0184931 -0.0922234 -0.0760501 -0.0617386 0.132367 0.0520312 -0.0470811 0.0727858 -0.0107198 -0.0424784 0.0707145 -0.00317738 0.0687508 -0.0566737 0.141368 0.031526 -0.109098 -0.079468 0.122052 -0.0817288 -0.0495121 0.122712 0.110016 -0.0569039 -0.0860778 0.0462522 0.199795 0.0129907 0.00809692 -0.00255639 0.0321071 -0.0552185 0.120871 0.089501 0.0326915 
0.0489261 -0.036541 -0.0808449 0.0248584 0.0726414 0.115926 0.0141294 -0.00342623 -0.0661645 -0.0469449 0.0486467 0.126484 0.0958916 -0.123525 -0.116485 0.0231971 -0.137641 0.0666456 -0.0988516 0.192414 0.230627 -0.157911 0.113348 0.125359 0.00255643 -0.00739355 -0.0453579 -0.261363 -0.00752358 0.123885 -0.0567724 0.0271822 0.00661474 0.0883994 -0.0344673 -0.00114885 -0.0996631 0.13172 -0.0632738 -0.096385 0.000288793 -0.101561 -0.0222129 0.0992876 -0.131571 -0.0681588 0.177573 -0.0406469 -0.142758 0.0794437 0.0202738 -0.083257 -0.0410277 0.0405563 0.165393 0.0179754 0.0247942 0.08354 -0.047474 -0.133815 -0.0144889 -0.0425021 0.212013 -0.0467492 0.0985943 -0.0875427 -0.083304 0.0392527 -0.0583937 0.0671137 -0.0415166 0.0647892 -0.0989922 -0.0353174 0.00996451 0.0200071 -0.00885833 0.0542116 0.0186876 0.0997336 -0.120853 -0.001041 -0.0148603 -0.0306713 -0.124254 0.0681241 0.0766183 0.0743662 0.0616165 0.0199382 0.0629302 -0.147225 -0.0906205 0.017318 -0.0943863 -0.0545204 -0.0684358 0.112696 0.0610111 -0.048121 0.0732967 -0.0175107 -0.0442255 0.0836023 -0.0144769 0.0527627 -0.0885892 0.141453 0.00433057 -0.107497 -0.0633098 0.133217 -0.0847976 -0.0486462 0.0960749 0.124181 -0.0649065 -0.0894554 0.038012 0.195392 -0.00404318 0.0249005 -0.00939618 0.0343982 -0.0626067 0.113182 0.0589825 0.0149331 
0.0465487 0.00413019 -0.0957818 0.00588931 0.0701794 0.126834 0.0246299 -0.00943698 -0.0949397 -0.0121444 0.0541576 0.099651 0.10321 -0.104693 -0.0834767 0.0277705 -0.126161 0.0435875 -0.0545035 0.168509 0.221567 -0.148181 0.10485 0.0979285 0.0222195 0.012367 -0.0481468 -0.258485 0.0401257 0.131335 -0.0474263 0.0299028 0.000728054 0.0648603 -0.0187558 0.00330137 -0.0891313 0.139443 -0.028668 -0.0906985 -0.00322616 -0.105465 -0.0233513 0.109038 -0.14165 -0.0249054 0.193357 -0.0376141 -0.171774 0.0307696 0.0125919 -0.0353286 -0.0448426 0.0304278 0.157179 0.0234128 0.0256621 0.105704 -0.0494576 -0.132446 -0.0302362 -0.055704 0.232853 -0.0637013 0.117353 -0.0635059 -0.0732035 0.0481507 -0.0456752 0.0670993 -0.0336475 0.0878446 -0.116822 -0.0356752 0.031412 0.0156421 -0.0207396 0.0671652 0.0252678 0.105495 -0.123161 -0.00444476 -0.00618339 -0.0252123 -0.116161 0.0485433 0.0750631 0.0642891 0.0628722 0.00973598 0.0653799 -0.132149 -0.09776 0.0186387 -0.0910044 -0.0844567 -0.0344314 0.132635 0.069248 -0.0579989 0.0596834 -0.000716622 -0.03194 0.0849841 -0.0602548 0.0741417 -0.0798386 0.158331 0.0394169 -0.11807 -0.0469585 0.125587 -0.103539 -0.0608221 0.118297 0.118778 -0.0838086 -0.105282 0.0443958 0.19313 0.00573556 0.00189089 -0.00221421 0.0396249 -0.0663131 0.122311 0.0633964 0.0257535 
0.0528687 0.0316892 -0.128932 0.00410488 0.0532918 0.128391 0.0143854 -0.00789915 -0.0811315 -0.0173247 0.0566684 0.0917049 0.0981827 -0.145065 -0.116034 0.0428191 -0.129013 0.0308358 -0.0783023 0.158791 0.210732 -0.139843 0.108748 0.097568 0.00721355 0.00627349 -0.0156578 -0.262004 0.0344792 0.129324 -0.0569977 0.0272807 0.00132818 0.0709069 -0.0393974 -0.0255052 -0.0844554 0.1343 -0.0412653 -0.0594367 -0.0137175 -0.122623 -0.0210859 0.128246 -0.126608 -0.0194803 0.199182 -0.030607 -0.177197 0.0491117 0.0411243 -0.0239239 -0.0477482 0.0284828 0.13484 0.0141846 0.046953 0.0817951 -0.0184075 -0.144496 -0.0319562 -0.0614806 0.230164 -0.0546714 0.0893524 -0.103559 -0.0631779 0.0408492 -0.0313081 0.0612974 -0.0525131 0.0648683 -0.113556 -0.0321666 0.0381658 0.00856812 -0.0262248 0.0839802 -0.00533206 0.126633 -0.103517 -0.00585332 -0.0102468 -0.0246963 -0.117261 0.0781469 0.0648503 0.0368583 0.0513134 0.00444679 0.0404806 -0.140447 -0.119169 0.00330931 -0.0855382 -0.0679121 -0.0316487 0.128658 0.0686338 -0.0689222 0.0607404 -0.00164125 -0.0216323 0.118674 -0.0587016 0.034608 -0.0947312 0.187067 0.0119281 -0.11581 -0.0350501 0.139001 -0.0948194 -0.0552641 0.0892053 0.116433 -0.101043 -0.100311 0.0512436 0.178959 0.00414521 0.0177531 0.00947898 0.0396848 -0.0559553 0.0960865 0.0411584 0.0158008 
0.0517983 0.0210215 -0.134112 0.00282566 0.0782003 0.139273 0.0224444 -0.0212135 -0.0950842 0.00127979 0.0515718 0.105176 0.095561 -0.147665 -0.112654 0.0469278 -0.141467 0.0569256 -0.0624446 0.153616 0.214383 -0.128385 0.0925194 0.100243 0.0118702 0.00902622 -0.0273189 -0.268708 0.0431979 0.149948 -0.0711968 0.0324298 -0.023618 0.0524118 -0.019772 -0.0207084 -0.10139 0.0831146 -0.0248832 -0.0646667 -0.00527325 -0.11862 -0.013972 0.143274 -0.13432 -0.0145464 0.207104 -0.0167686 -0.175418 0.0313309 0.0514869 -0.0326715 -0.0525356 0.0125918 0.134611 0.0212291 0.0370236 0.0970478 -0.0220484 -0.121787 -0.0152951 -0.0526415 0.243068 -0.0406624 0.0963023 -0.115964 -0.0716648 0.0333143 -0.0250929 0.0621273 -0.0464911 0.0919118 -0.104712 -0.0482573 0.0112683 0.0197903 -0.0316005 0.0903677 -0.00281079 0.115299 -0.078057 0.00978531 -0.0112372 -0.0096296 -0.12054 0.0742461 0.0720036 0.0397344 0.0435137 0.00764434 0.0424825 -0.120814 -0.133269 0.0148736 -0.0999526 -0.0681757 -0.0360382 0.123748 0.0731076 -0.0671786 0.0743442 -0.000257562 -0.0186154 0.0980437 -0.0632958 0.042651 -0.0936406 0.18609 0.00141431 -0.086431 -0.0226439 0.120397 -0.0913042 -0.0653214 0.0822958 0.119286 -0.103991 -0.0850791 0.0332163 0.16671 0.00625416 0.00328069 0.0104045 0.0261499 -0.0767276 0.114519 0.0207533 0.0136142 
0.0512596 0.0349907 -0.132853 0.0115018 0.0764651 0.146024 0.018093 -0.0418492 -0.105629 0.0072239 0.0663187 0.113208 0.103663 -0.124307 -0.125876 0.0579347 -0.127101 0.0742984 -0.0766777 0.154861 0.211266 -0.142391 0.0959691 0.111397 0.0191556 -0.00417936 -0.0313527 -0.236016 0.0539785 0.15289 -0.0749967 0.0401247 -0.0332706 0.0557991 -0.0441928 -0.0125922 -0.118346 0.0741221 -0.0150993 -0.0489915 -0.0183075 -0.111236 0.00131797 0.12233 -0.128812 -0.0443003 0.209193 -0.0190009 -0.17483 0.0452654 0.0656318 -0.0299708 -0.0757399 0.0163526 0.12096 0.025482 0.0309357 0.118559 -0.0165838 -0.106487 -0.0283104 -0.034819 0.253049 -0.0584849 0.0922925 -0.0910451 -0.0798657 0.0252384 -0.0622601 0.0812204 -0.0421164 0.104934 -0.0971667 -0.0215648 0.0189966 0.016006 -0.00605823 0.0759994 -0.0137917 0.087469 -0.0755843 0.00247671 -0.00247638 -0.0150083 -0.137951 0.0850834 0.0608139 0.0294662 0.0449951 0.00624598 0.0356188 -0.137259 -0.119917 0.0225285 -0.0750665 -0.0659 -0.0491875 0.132377 0.0642883 -0.048211 0.0580582 -0.000874067 -0.0251067 0.121613 -0.0518013 0.0702095 -0.0957014 0.183567 0.00431682 -0.109172 -0.0383181 0.127648 -0.06771 -0.0348621 0.0789482 0.107998 -0.0831573 -0.0524869 0.0471702 0.178902 -0.00157672 -0.0178225 0.00626743 0.0145256 -0.0866905 0.126997 0.0126595 0.014428 
0.0528755 0.0607725 -0.136805 0.0117038 0.0602807 0.162682 0.0142093 -0.0591981 -0.108978 0.00640612 0.0727626 0.101134 0.0940058 -0.115079 -0.118481 0.0564744 -0.126225 0.057276 -0.0456638 0.136843 0.200485 -0.132611 0.0875517 0.113528 0.0316565 0.00788445 -0.0222347 -0.231677 0.071186 0.162027 -0.0575067 0.0331254 -0.0360383 0.0421882 -0.0348945 -0.000408442 -0.110705 0.0720025 0.00904035 -0.0391743 -0.0314238 -0.114433 0.000109375 0.117684 -0.117198 -0.0338911 0.217454 -0.0249506 -0.184891 0.035915 0.0601321 0.00183251 -0.0590584 0.0166341 0.119349 0.035309 0.0376945 0.135227 -0.0215924 -0.106431 -0.043079 -0.0306281 0.275628 -0.0861606 0.0925216 -0.0738577 -0.0638643 0.0113168 -0.0724591 0.0921815 -0.0473104 0.106411 -0.115696 -0.00789389 0.0362355 0.0034492 -0.0026707 0.0712005 -0.0123255 0.0991603 -0.0750424 0.00276066 0.000919523 -0.0175486 -0.128582 0.0733726 0.0448566 0.0124917 0.0454284 0.00718481 0.0406627 -0.133799 -0.109684 0.0304728 -0.0568005 -0.0739077 -0.0333052 0.144132 0.0750772 -0.0444634 0.0469073 0.011648 -0.0324477 0.120136 -0.0693092 0.0876427 -0.079553 0.171611 0.0101197 -0.108269 -0.0320389 0.122788 -0.0644614 -0.0409611 0.0874598 0.111232 -0.0730058 -0.0559826 0.0620734 0.18139 0.0102302 -0.0414166 0.0165346 0.00256421 -0.0917491 0.138951 0.0296417 0.0258759 
0.0623172 0.0433769 -0.142617 0.0228702 0.0670887 0.160305 0.028325 -0.0531399 -0.0920365 0.00335341 0.0815171 0.119857 0.0924014 -0.140138 -0.132603 0.041596 -0.136495 0.0685387 -0.0660096 0.149141 0.199488 -0.133342 0.080814 0.126105 0.0193249 -0.0119525 -0.0209041 -0.236561 0.0488883 0.169273 -0.0761569 0.0261145 -0.0359061 0.0559515 -0.0381877 -0.0145783 -0.111118 0.0485493 -0.0108243 -0.0431555 -0.0151953 -0.125435 -0.00309084 0.125211 -0.131563 -0.0504479 0.202401 -0.0159436 -0.166869 0.0545815 0.069224 -0.0139689 -0.0679276 0.0185657 0.124102 0.0337147 0.0209005 0.12036 -0.0285873 -0.0899151 -0.0351501 -0.036439 0.270892 -0.0729628 0.0827744 -0.0983462 -0.067946 0.0015706 -0.072942 0.0811075 -0.048299 0.0990886 -0.103216 -0.0144163 0.0216688 0.0144051 0.00402949 0.0717872 -0.0173849 0.101676 -0.0707306 -0.00240326 0.000466646 -0.00910128 -0.128659 0.0923995 0.0557889 0.0106357 0.0413943 0.0169638 0.0401912 -0.148161 -0.116847 0.0284877 -0.0790623 -0.0781397 -0.0527028 0.112956 0.0794338 -0.0474318 0.0652787 0.0124742 -0.0251587 0.110885 -0.0490109 0.0743849 -0.0774972 0.180779 -0.0167834 -0.0888372 -0.0264554 0.116121 -0.0566512 -0.0403143 0.0668488 0.112085 -0.069659 -0.0396578 0.0549335 0.180096 0.00569052 -0.0378712 0.00468445 0.0133215 -0.0809155 0.136278 0.0236964 0.0208046 
0.0742216 0.0316958 -0.137128 0.0158597 0.0690769 0.151514 0.0463638 -0.0298277 -0.0719035 -0.0534419 0.0416565 0.126829 0.0820002 -0.196011 -0.14343 0.0330091 -0.143494 0.0481158 -0.124387 0.172808 0.183303 -0.0992343 0.0802485 0.108396 -0.0416636 -0.0252144 -0.0363664 -0.255331 -0.0019734 0.143164 -0.0982593 0.0426552 -0.0354424 0.0897446 -0.0300272 -0.03536 -0.0691688 0.0689171 -0.0650807 -0.0373903 0.0112094 -0.120547 0.00969207 0.123214 -0.132282 -0.0135308 0.204269 -0.0193654 -0.179691 0.107443 0.0643508 -0.0773011 -0.0703224 0.0396762 0.135985 0.00533162 0.0132978 0.088388 -0.0258346 -0.0903372 -0.0172378 -0.0185051 0.232035 -0.0717197 0.090545 -0.155082 -0.0648636 -0.0101515 -0.0740182 0.0501439 -0.0516912 0.0507917 -0.069641 0.000308647 0.00792152 0.0360384 -0.0085398 0.0684122 -0.0166324 0.0899048 -0.0456807 0.00252145 -0.0316042 -0.0115677 -0.126519 0.111064 0.0569084 0.00475088 0.00498993 0.0507051 0.0522962 -0.175694 -0.135028 -0.00170167 -0.093332 -0.0288057 -0.038997 0.0816137 0.0677508 -0.029324 0.0560305 0.00648682 -0.0357694 0.130635 -0.0494611 0.0192178 -0.102217 0.207271 -0.0732682 -0.0603172 -0.00505444 0.115105 -0.0592012 -0.0448992 0.0236801 0.102294 -0.0875404 -0.0537306 0.0287954 0.163026 0.00108337 0.0160631 0.0245557 0.0417127 -0.0356434 0.0829209 0.000793869 -0.0405853 
0.0816461 0.0376657 -0.130541 0.0171156 0.0758244 0.155977 0.0469263 -0.0308425 -0.0642491 -0.0594252 0.0531594 0.121893 0.0950933 -0.186564 -0.156478 0.0381253 -0.115059 0.0701421 -0.157058 0.177795 0.195892 -0.108203 0.0698158 0.116715 -0.0448778 -0.0425276 -0.0487822 -0.239216 0.00270291 0.136511 -0.0828548 0.0512448 -0.0449993 0.0981651 -0.0364311 -0.0319001 -0.0785608 0.0724616 -0.0663619 -0.0414825 0.00361425 -0.111752 0.00779939 0.118497 -0.111751 -0.0331198 0.189734 -0.00881315 -0.186423 0.10282 0.0629393 -0.0838951 -0.0802772 0.0285331 0.114286 0.00578852 -0.00443206 0.096385 -0.0201495 -0.0950913 -0.018948 -0.00850319 0.228763 -0.0824908 0.0853479 -0.151382 -0.0633088 -0.00399665 -0.0931176 0.0529284 -0.0416088 0.040486 -0.0635704 -0.00861312 -0.00843577 0.0316795 0.00232844 0.0733425 -0.0223714 0.0768845 -0.0507589 0.00110761 -0.0372561 -0.0228725 -0.135544 0.116471 0.0569037 -0.00126082 0.00539717 0.052751 0.0531181 -0.189281 -0.131226 0.00456036 -0.0783234 -0.0165058 -0.0460651 0.0704294 0.0409147 -0.0172157 0.0579504 0.00802585 -0.0508796 0.143528 -0.0382033 0.0272182 -0.10251 0.198377 -0.0659775 -0.0717515 -0.0169391 0.11606 -0.0618246 -0.0207638 0.0263421 0.0956406 -0.103981 -0.0405305 0.0277129 0.161476 -0.0170674 0.0186874 0.0152074 0.0507472 -0.0282965 0.0762432 -0.0119517 -0.0583939 
0.0622343 0.0446706 -0.100614 -0.0028282 0.0361051 0.188947 0.0165856 -0.0307199 -0.0979483 -0.0564777 0.0609101 0.106875 0.0909812 -0.17066 -0.130872 0.0180946 -0.160057 0.0425076 -0.107582 0.150186 0.188636 -0.0975767 0.0790405 0.128267 -0.023872 -0.0138452 -0.0217159 -0.234384 0.0203807 0.11953 -0.0658753 -0.00915383 -0.0481715 0.0885166 -0.0315906 -0.0142414 -0.0923047 0.0645378 -0.0462064 -0.017128 -0.00316367 -0.133313 -0.00380819 0.130477 -0.12119 -0.0512545 0.207479 -0.0170157 -0.196462 0.110612 0.056787 -0.0581945 -0.0688144 0.0468218 0.119534 0.0177716 0.014982 0.120942 -0.0204007 -0.11848 -0.0340262 0.00516558 0.258882 -0.0766562 0.0813372 -0.115132 -0.0418119 -0.0196112 -0.0877998 0.0785289 -0.0567509 0.053821 -0.0779981 0.0126289 0.0402241 0.00398134 -0.0208024 0.0511263 0.00611657 0.112343 -0.0477162 -0.0183099 -0.00144663 -0.0249684 -0.140243 0.0989204 0.0620109 0.00113568 0.016771 0.0478331 0.0660935 -0.179803 -0.100538 0.0126493 -0.0912858 -0.0455941 -0.0440438 0.112023 0.0589645 -0.0231491 0.0473748 0.0284603 -0.0471219 0.124243 -0.0412019 0.0569076 -0.0935356 0.190408 -0.0630944 -0.0936693 -0.00404446 0.123774 -0.0539834 -0.0332784 0.039127 0.114915 -0.0750132 -0.036357 0.0489793 0.172356 0.00841032 -0.0420793 0.0179789 0.0116671 -0.0572619 0.10461 0.0199611 -0.00213101 
0.0871893 0.0455565 -0.0976297 0.0108312 0.0552349 0.18825 0.0479222 -0.0349242 -0.0466956 -0.104909 0.0616412 0.101745 0.0915881 -0.187692 -0.143161 0.00439987 -0.143535 0.0611725 -0.168585 0.155741 0.202545 -0.079123 0.0612526 0.13551 -0.0434772 -0.0673023 -0.04978 -0.227717 0.00754772 0.128474 -0.0556114 0.0135179 -0.0593235 0.115509 -0.0148044 -0.0260227 -0.0631265 0.0597877 -0.0676238 -0.0303773 0.0180141 -0.117111 0.00121153 0.120342 -0.112549 -0.0591347 0.178254 -0.000381761 -0.179979 0.125771 0.0358571 -0.0832532 -0.0679588 0.044111 0.106317 0.010186 -0.0117438 0.10865 -0.0338341 -0.113604 -0.0319756 0.0154701 0.24089 -0.0936174 0.0645437 -0.132986 -0.0253146 -0.0340689 -0.101273 0.0675809 -0.0493465 0.0239693 -0.0619951 0.00949997 0.00677546 0.00371739 -0.00985858 0.0471089 -0.00858896 0.0979863 -0.031269 0.00171877 -0.0259325 -0.0346746 -0.121058 0.120616 0.0527933 -0.0151145 -0.0131471 0.0747697 0.10063 -0.21227 -0.111901 -0.00801881 -0.0875128 -0.0338282 -0.0627929 0.0763286 0.046239 -0.00503319 0.0586268 0.0208183 -0.0500171 0.137226 -0.0341835 0.0371501 -0.085575 0.194997 -0.0786512 -0.0627032 -0.000592243 0.106984 -0.067485 -0.0153542 0.0186328 0.110443 -0.0846195 -0.0294552 0.0357545 0.161626 -0.000327214 -0.00222279 0.00563879 0.0510027 -0.0344818 0.0670102 0.00234114 -0.0436167 
0.0788279 0.0446825 -0.0923884 0.00806561 0.0533938 0.182588 0.0490697 -0.0306259 -0.0303466 -0.0973755 0.0708544 0.0995951 0.094205 -0.186379 -0.135816 0.00240711 -0.154098 0.0609484 -0.1783 0.152261 0.203986 -0.0838893 0.0623444 0.137682 -0.042613 -0.0704737 -0.0465173 -0.224751 0.00910824 0.124155 -0.0540011 0.0131604 -0.0510989 0.119719 -0.0177516 -0.023285 -0.0617362 0.0667519 -0.0747245 -0.0297754 0.0289401 -0.123917 -0.007039 0.116777 -0.116978 -0.0670228 0.166549 0.00463492 -0.172658 0.11865 0.0275444 -0.0813846 -0.0713767 0.0431444 0.108332 0.0168871 -0.0151469 0.101987 -0.0421627 -0.11446 -0.0375811 0.00565719 0.238753 -0.0839526 0.0625328 -0.12234 -0.0260575 -0.0247183 -0.0940977 0.0730756 -0.0510181 0.0229258 -0.0638104 0.0047852 0.0174642 0.00442504 -0.0166341 0.0510085 -0.0101697 0.0937626 -0.0370883 0.00394079 -0.0217351 -0.0332955 -0.124646 0.126668 0.060794 -0.00867888 -0.0122885 0.0785757 0.103313 -0.218427 -0.107521 -0.0115181 -0.0975252 -0.0425045 -0.0757754 0.0673948 0.0570054 -0.0123677 0.0683166 0.0109259 -0.0475545 0.129542 -0.0230784 0.0366958 -0.0865662 0.19312 -0.0757647 -0.0686354 -0.00639159 0.111303 -0.069074 -0.0173407 0.0270467 0.112946 -0.0889864 -0.0308416 0.0403503 0.164953 0.00977403 0.000431416 -0.00291624 0.0623079 -0.0370619 0.0715802 0.00392247 -0.0333289 
0.077795 0.0533686 -0.0995136 -0.000112026 0.0474162 0.188805 0.0512915 -0.0254153 -0.0357145 -0.0906927 0.0779823 0.0897931 0.0991873 -0.192761 -0.126878 -0.00227632 -0.156247 0.056462 -0.180165 0.149233 0.190274 -0.0783982 0.0572135 0.134552 -0.0475392 -0.0719869 -0.0455609 -0.219606 0.0122719 0.11431 -0.0485488 0.00924128 -0.0587484 0.12316 -0.0224938 -0.0184911 -0.0586472 0.051259 -0.0749284 -0.0159233 0.0383558 -0.133266 -0.00846531 0.128014 -0.121946 -0.0687224 0.165979 0.0174779 -0.174366 0.122046 0.0239564 -0.08696 -0.0840435 0.0406699 0.0920482 0.0175661 -0.0266508 0.103819 -0.0332384 -0.107431 -0.0458952 0.0121983 0.239439 -0.0843549 0.0539683 -0.122241 -0.016978 -0.0337997 -0.0912944 0.0643505 -0.0558639 0.0233869 -0.0542401 0.0141789 0.0230228 -0.00644331 -0.0209245 0.0552477 -0.011781 0.0938513 -0.0281407 -0.00361423 -0.0230308 -0.0328058 -0.12959 0.138371 0.0623902 -0.0210283 -0.0162083 0.0776036 0.109853 -0.217481 -0.108735 -0.0208941 -0.0990218 -0.0433521 -0.0785745 0.0638229 0.0509773 -0.0134528 0.0586583 0.012075 -0.0406607 0.13115 -0.0239494 0.0388994 -0.0898407 0.204622 -0.0831478 -0.0609325 0.00175824 0.110748 -0.0663938 -0.0161453 0.0125393 0.103737 -0.0833822 -0.0290858 0.0427531 0.159714 0.0136833 -0.00920862 -0.00335705 0.0754562 -0.0448267 0.0581177 -0.01099 -0.0323623 
