0.0853431 -0.057323 -0.0966254 0.0096226 -0.015554 0.0865772 0.00250538 0.00934411 -0.080604 -0.0544414 -0.0342465 0.099318 0.0473195 -0.149412 -0.136672 0.0147004 -0.0961161 0.0463651 -0.0768681 0.158398 0.0941948 -0.024255 0.127367 0.149299 -0.14632 0.0514125 0.054246 -0.263981 -0.0801479 0.0636654 -0.165427 0.0331978 0.00869569 0.103851 -0.0201573 -0.0645162 -0.0061844 0.17354 -0.155905 -0.0389633 -0.0770391 -0.0730242 -0.0437122 0.109734 -0.108183 0.0171673 0.1831 -0.0261693 -0.153593 0.196199 0.117488 -0.134188 0.0127118 0.0905502 0.17135 -0.0216768 0.113764 0.0382974 0.0667831 -0.151276 0.0379131 -0.00456864 0.139091 -0.0361765 0.0782013 -0.179821 -0.0346181 -0.0258615 -0.024941 0.065466 -0.117189 -0.057195 -0.028779 0.0508739 -0.0291453 -0.0225188 -0.00986395 0.0553251 0.0365454 0.0346157 0.0124713 0.00932805 -0.111303 -0.13532 -0.0489154 -0.0059519 0.0117872 0.000328377 0.0291303 0.0913261 0.0547009 -0.101946 -0.0864764 -0.043757 -0.0445785 0.0920308 0.0217595 0.0912442 0.101544 -0.0159594 0.0864437 0.0378378 -0.0281298 0.0926178 -0.0341272 -0.115025 -0.124907 0.0554401 -0.110121 -0.0441458 0.0388681 0.206687 0.0370823 -0.0933679 -0.00126519 0.0877335 -0.0262656 -0.147807 -0.0123815 0.0594279 -0.00552786 0.0464778 0.0952297 -0.00903178 -0.00201903 0.022115 0.0204924 -0.0976097 
0.0832317 -0.0523941 -0.101138 0.00938342 -0.0105488 0.0870257 -0.0045696 -0.00825203 -0.081307 -0.0680382 -0.0394005 0.101299 0.0435641 -0.141814 -0.143909 0.0193199 -0.105507 0.0425803 -0.07272 0.156062 0.09822 -0.0232964 0.136346 0.137982 -0.139268 0.0528662 0.05458 -0.263965 -0.0844337 0.0726752 -0.164378 0.0316789 0.00887589 0.0978461 -0.0115937 -0.0613055 -0.00688499 0.176182 -0.143802 -0.0402708 -0.0839199 -0.0668884 -0.0354132 0.107496 -0.10858 0.0263383 0.191752 -0.0289554 -0.153792 0.197632 0.110893 -0.131228 0.0185962 0.0966741 0.174527 -0.0268053 0.120125 0.044528 0.0562963 -0.150652 0.0412946 0.00150797 0.14953 -0.0376883 0.0839021 -0.178116 -0.0379164 -0.0180305 -0.0243073 0.0693534 -0.111705 -0.0506327 -0.0294835 0.0493309 -0.0270255 -0.0190053 -0.0135608 0.0410752 0.0330537 0.0388301 0.0177628 0.0140889 -0.112291 -0.130622 -0.0598188 -0.00601351 0.00365656 0.000800556 0.0242251 0.0891337 0.0566721 -0.10527 -0.0829877 -0.0428827 -0.0419901 0.0878015 0.0185611 0.102295 0.106207 -0.0138197 0.0814161 0.0347636 -0.0312349 0.0931333 -0.0348511 -0.110712 -0.124989 0.0619996 -0.111091 -0.040504 0.0427155 0.200593 0.0361601 -0.0860506 -0.0039567 0.0951691 -0.029754 -0.139625 -0.0114199 0.063544 -0.0049647 0.0492602 0.0974104 -0.0180534 -0.00484538 0.0262305 0.0214648 -0.0948361 
0.0822913 -0.0587327 -0.0970223 0.00869929 -0.0117638 0.0885109 -2.40933e-05 -0.0082688 -0.0854349 -0.0614625 -0.0459145 0.105666 0.0440806 -0.135167 -0.140792 0.011757 -0.102383 0.0460111 -0.0627866 0.152441 0.0957045 -0.0219134 0.13234 0.143135 -0.141245 0.0600159 0.0523157 -0.266015 -0.0844965 0.075449 -0.165574 0.0328484 0.00324279 0.0921742 -0.00572827 -0.0619869 -0.00878819 0.179091 -0.141088 -0.043599 -0.0854507 -0.061101 -0.0398008 0.106207 -0.110642 0.0238867 0.189641 -0.0293404 -0.149708 0.192613 0.116883 -0.130714 0.0233569 0.0952259 0.181462 -0.0253973 0.121333 0.0531801 0.0567214 -0.154653 0.0447221 0.00186314 0.149868 -0.0394079 0.087386 -0.177503 -0.0350772 -0.0191745 -0.0269016 0.0695133 -0.109414 -0.0466958 -0.0291517 0.0501204 -0.0354432 -0.0190021 -0.0139121 0.0378212 0.0425346 0.0372659 0.0161495 0.0151143 -0.108889 -0.13316 -0.0536388 -0.0250989 0.00868116 0.00465704 0.0311057 0.0866802 0.0521326 -0.100256 -0.0739126 -0.0402565 -0.0433662 0.0853464 0.026344 0.102206 0.106821 -0.0117544 0.0847265 0.0429961 -0.0340331 0.0929707 -0.0398353 -0.112744 -0.124628 0.0496496 -0.110128 -0.0361643 0.0458526 0.200671 0.0342427 -0.0884309 -0.00173174 0.0977704 -0.0267211 -0.144112 -0.0167175 0.0607426 -0.00557518 0.0438665 0.0986668 -0.0263484 -0.00629329 0.0305007 0.0200902 -0.0953161 
0.0828294 -0.0659301 -0.0962168 0.0116807 -0.00434047 0.0879311 -0.000287348 0.00136682 -0.0872972 -0.0615029 -0.0431642 0.104877 0.046758 -0.137861 -0.137213 0.0188643 -0.0941459 0.0532482 -0.0646859 0.153831 0.106963 -0.0247165 0.128621 0.159129 -0.135671 0.0466347 0.0545264 -0.269408 -0.0792703 0.0794007 -0.163192 0.0338747 0.00414782 0.0945107 -0.010357 -0.0597159 -0.0128009 0.157369 -0.149964 -0.0454831 -0.0786879 -0.0640339 -0.0342199 0.111215 -0.105687 0.0250415 0.19146 -0.028044 -0.154016 0.183259 0.118514 -0.142908 0.0265249 0.0841376 0.176591 -0.0165588 0.116548 0.0513795 0.0656045 -0.149025 0.0461382 0.00611677 0.139504 -0.0384798 0.0832604 -0.179685 -0.0422255 -0.0258555 -0.0271185 0.0648762 -0.115587 -0.0492647 -0.0367176 0.0306661 -0.0364383 -0.0126349 -0.00780128 0.0545544 0.0393948 0.0362955 0.0153062 0.0141182 -0.112991 -0.133125 -0.05359 -0.0074357 0.00871567 -0.000533182 0.0181538 0.08985 0.0534569 -0.0952747 -0.089018 -0.0393399 -0.0453788 0.0980758 0.0168587 0.101994 0.105097 -0.0135563 0.0908864 0.0337096 -0.0314745 0.0913277 -0.039656 -0.111575 -0.128328 0.0504827 -0.116272 -0.0406605 0.0377679 0.195579 0.0352426 -0.0989636 -0.00313875 0.0989792 -0.030516 -0.144563 -0.021307 0.0654166 -0.00743598 0.0416103 0.0887574 -0.0202041 -0.0153003 0.0349693 0.010778 -0.0995803 
0.0757494 -0.0495624 -0.0957326 -0.00258838 -0.0106003 0.0937634 -0.00901171 -0.00787746 -0.0826636 -0.0577931 -0.0377174 0.110426 0.0430766 -0.137551 -0.13869 0.00933472 -0.109964 0.0472721 -0.0644935 0.153679 0.0926871 -0.0155177 0.134904 0.127563 -0.144549 0.0702428 0.056496 -0.262887 -0.0868785 0.0672156 -0.16454 0.0222007 0.015622 0.0953949 -0.00151631 -0.0560795 -0.00310561 0.184513 -0.138 -0.042091 -0.0806389 -0.0652904 -0.0391797 0.112715 -0.123572 0.0243833 0.193993 -0.0316708 -0.159407 0.198349 0.109228 -0.1255 0.00667912 0.10273 0.183471 -0.0247436 0.116483 0.0493446 0.0423804 -0.151766 0.0372678 -0.0083247 0.160595 -0.0401459 0.0985588 -0.183565 -0.0416359 -0.00768281 -0.0256938 0.0840674 -0.100103 -0.0478464 -0.0293061 0.04761 -0.0281968 -0.018862 -0.0257244 0.0416435 0.0410407 0.028329 0.00739411 0.0213741 -0.0998723 -0.120592 -0.0637285 -0.0244362 0.0153272 0.0105092 0.0393667 0.0943774 0.0518551 -0.111565 -0.0760596 -0.0412629 -0.0425442 0.0744465 0.0222201 0.104679 0.100191 -0.0165462 0.0764292 0.047013 -0.0358321 0.0827947 -0.0335868 -0.104594 -0.123094 0.0527932 -0.110288 -0.0402481 0.0441693 0.194373 0.0341906 -0.0807264 0.00410257 0.0890339 -0.0242139 -0.154283 -0.00891019 0.0667862 0.00856933 0.0418999 0.101993 -0.0213135 0.00305991 0.0270127 0.0372308 -0.083387 
0.0854789 -0.0555182 -0.0860357 -0.00567715 -0.00993995 0.113946 -0.00955775 -0.00903785 -0.0861097 -0.0733695 -0.0331761 0.10035 0.0520992 -0.137266 -0.134962 0.0162698 -0.123545 0.0438575 -0.0724487 0.142036 0.120428 -0.0147598 0.133567 0.129371 -0.134383 0.0652541 0.0451898 -0.273648 -0.081807 0.0737778 -0.150169 0.0209513 -0.00105402 0.10145 0.0061775 -0.0532828 -0.0125385 0.180676 -0.113766 -0.0437948 -0.0859921 -0.0687416 -0.0415612 0.107219 -0.109557 0.00725801 0.188996 -0.0288642 -0.162006 0.192866 0.10065 -0.12841 0.0177876 0.106844 0.177698 -0.0239356 0.12307 0.0620751 0.0304671 -0.162206 0.0382189 0.000614279 0.174093 -0.044732 0.0923364 -0.167311 -0.0378837 -0.00198871 -0.0255559 0.0802598 -0.103342 -0.0407985 -0.0406408 0.039912 -0.0326392 -0.0273752 -0.0247278 0.0211174 0.0439566 0.0543586 0.0160153 0.0123113 -0.0914132 -0.12481 -0.0719317 -0.0197627 0.0201336 0.00884805 0.0349626 0.0922826 0.0696796 -0.119477 -0.0764282 -0.0253346 -0.0527494 0.0759186 0.0124884 0.113173 0.0980718 -0.00437829 0.086517 0.0444216 -0.0498309 0.0889201 -0.0262883 -0.0957048 -0.120837 0.0538158 -0.105821 -0.0478438 0.0388305 0.192501 0.0196451 -0.0796739 0.0221225 0.110982 -0.0307241 -0.134389 -0.0095082 0.0715052 0.010018 0.0319602 0.105526 -0.0270219 -0.00401043 0.0343442 0.0409345 -0.0758859 
0.08305 -0.0651512 -0.0978438 0.00853486 -0.00407877 0.0974405 0.00108669 -0.00969365 -0.0854057 -0.0646892 -0.0323681 0.109651 0.0501568 -0.13678 -0.14712 0.013805 -0.108753 0.0584197 -0.0670212 0.153078 0.115581 -0.0307264 0.132839 0.154134 -0.134955 0.0542727 0.0480924 -0.272648 -0.0772356 0.0790316 -0.162038 0.0258918 -0.0024033 0.0937847 -0.00577125 -0.0591999 -0.0195294 0.169066 -0.131784 -0.0464365 -0.0799266 -0.0624172 -0.0415565 0.108179 -0.115162 0.00492273 0.189091 -0.0275603 -0.150771 0.187067 0.104913 -0.13497 0.0189677 0.0955695 0.178041 -0.0197966 0.124557 0.0622203 0.0440021 -0.152869 0.0453933 0.0059594 0.166295 -0.0387163 0.0853058 -0.171267 -0.0391857 -0.0182865 -0.0242174 0.0741782 -0.111494 -0.036816 -0.0363701 0.0465915 -0.0353733 -0.0214186 -0.0135261 0.0410768 0.0415496 0.0371734 0.00848312 0.0186086 -0.102481 -0.130729 -0.0646688 -0.00852353 0.0160686 0.00988467 0.0283732 0.0811098 0.0669682 -0.104769 -0.0741421 -0.0371804 -0.045452 0.0739982 0.00857527 0.108879 0.105203 -0.0102128 0.0913165 0.0343302 -0.0364771 0.0918822 -0.0252648 -0.100292 -0.118748 0.0548312 -0.10936 -0.0410379 0.0367241 0.197317 0.0365524 -0.0876196 0.00626311 0.107706 -0.0265903 -0.137087 -0.0135957 0.0692605 -0.00638051 0.0367724 0.0882914 -0.0257502 -0.0264867 0.0428487 0.0130205 -0.0844039 
0.063536 -0.058401 -0.104454 -0.016867 -0.0248259 0.126252 -0.037454 -0.00460348 -0.105146 -0.0286602 -0.00184152 0.105448 0.054452 -0.128333 -0.15902 0.00414985 -0.123706 0.0839086 -0.0291459 0.131826 0.120867 -0.0452143 0.131635 0.145072 -0.117108 0.107738 0.0767241 -0.269016 -0.046346 0.0484726 -0.133444 -0.00392231 -0.0234691 0.0615096 0.000247926 -0.0481332 -0.0653778 0.172386 -0.0791049 -0.0410677 -0.0920861 -0.0643069 -0.0810055 0.139726 -0.120861 -0.0551683 0.189128 -0.022317 -0.159624 0.162735 0.089982 -0.0880686 0.00462723 0.088568 0.146664 -0.0147648 0.138868 0.0890767 0.0333651 -0.193589 0.0378609 -0.00262285 0.235908 -0.0177786 0.0671967 -0.146562 -0.0232404 0.00372444 0.0018049 0.105677 -0.107275 -0.00563812 -0.039567 0.0550869 -0.0402267 -0.0787907 -0.0444895 0.039321 0.0455131 0.0460647 -0.0207515 0.0426668 -0.0661436 -0.137387 -0.0758827 -0.0389565 0.035348 0.0390548 0.088923 0.0392242 0.0680484 -0.0834792 -0.0554028 -0.017775 -0.0198042 0.021056 0.013747 0.142023 0.0755775 -0.0346972 0.0785499 0.0412885 -0.0469498 0.0820396 -0.015313 -0.0575851 -0.093426 0.0291617 -0.0746337 -0.0549359 0.043364 0.210816 0.0393089 -0.0748274 0.0418964 0.0953548 -0.0254584 -0.158355 0.0234005 0.0501007 0.00653323 -0.00525672 0.0997176 -0.0649226 -0.0626193 0.0576654 0.0281949 -0.0302556 
0.0922755 -0.0731462 -0.0973179 -0.0033227 -0.0101675 0.113641 -0.00695171 -0.00114048 -0.103462 -0.032886 -0.0121673 0.114583 0.0429193 -0.153829 -0.141377 0.00163014 -0.117426 0.0635766 -0.0472329 0.118174 0.110358 -0.0153401 0.120537 0.127737 -0.114675 0.114905 0.0644414 -0.290629 -0.056819 0.0487575 -0.13992 0.0356587 -0.0355641 0.0727547 -0.00427201 -0.0805664 -0.0677181 0.192493 -0.0722425 -0.0283494 -0.0732822 -0.0574438 -0.105479 0.135256 -0.12455 -0.0246053 0.165392 -0.0336257 -0.147951 0.136398 0.11673 -0.0733246 0.0124687 0.0756038 0.14117 -0.0363795 0.143578 0.0846791 0.0299314 -0.166364 0.0450189 -0.0318355 0.206797 -0.00165474 0.0702769 -0.176437 -0.0123751 0.0249282 0.0249667 0.090152 -0.100987 0.00233148 -0.0302515 0.0586088 -0.055247 -0.0732982 -0.0654248 0.0236195 0.0276717 0.0819336 -0.0098882 0.0438422 -0.0643107 -0.149482 -0.0619395 -0.0650232 0.063097 0.0313269 0.0489686 0.0236672 0.053839 -0.0678421 -0.0778937 -0.0157865 -0.0498247 0.0280837 0.0441234 0.0908345 0.0922549 -0.0370731 0.0765067 0.0423186 -0.0390745 0.104173 -0.0294604 -0.109518 -0.104312 0.0590187 -0.0618567 -0.0528978 0.0698329 0.223118 0.00482017 -0.0860264 0.0506679 0.0950481 -0.0681291 -0.167114 0.00867519 0.0426155 0.00641444 0.0343326 0.0959854 -0.0481113 -0.0152208 0.0351531 0.0247679 -0.0520691 
0.0908336 -0.0679174 -0.0969472 -0.0340616 0.0103854 0.123489 -0.00743854 -0.0138581 -0.119577 0.0125568 -0.0281353 0.0725115 0.0796058 -0.103827 -0.087119 0.0428589 -0.0794796 0.0716949 -0.0410902 0.107262 0.115748 -0.00913924 0.140218 0.132647 -0.109904 0.121539 0.0431657 -0.286861 -0.0183341 0.0453279 -0.113959 0.080057 -0.0479077 0.0694627 0.0173264 -0.0582142 -0.0420581 0.212631 -0.0422446 -0.048505 -0.0927384 -0.0455364 -0.0907403 0.115208 -0.11628 -0.0145471 0.160791 0.0134833 -0.146501 0.108514 0.118783 -0.0928846 0.0168099 0.0648581 0.134803 -0.0381911 0.161175 0.0994249 0.0549852 -0.193442 0.038068 -0.0180979 0.184498 -0.0205138 0.072549 -0.128987 -0.0237596 0.0648363 0.0288837 0.0823394 -0.110023 0.0256681 -0.0492521 0.0407435 -0.0598163 -0.0818832 -0.0617312 0.0404749 0.060129 0.0632248 0.0343373 0.0506207 -0.0782546 -0.160999 -0.0493701 -0.0893665 0.0509402 0.0474307 0.0617124 0.0297863 0.0654761 -0.0410776 -0.0686925 -0.0150295 -0.0474253 0.0446285 0.040886 0.13478 0.0788059 -0.0380726 0.10494 0.0260754 -0.0410112 0.114147 -0.0445224 -0.109637 -0.132033 0.0244966 -0.0145 -0.0518553 0.0534802 0.244326 0.00317696 -0.074894 0.0693581 0.0954754 -0.0789077 -0.169446 -0.0304953 0.0392603 0.0220357 0.0277199 0.119417 -0.0368448 -0.0655469 0.0240992 -0.0104466 -0.0603295 
0.0624522 -0.066387 -0.0729209 -0.0440397 0.051137 0.146235 -0.0444217 -0.0404918 -0.14178 0.0322742 -0.0382321 0.0731165 0.0844115 -0.0863688 -0.0411885 0.0513138 -0.0684677 0.0793259 0.0124898 0.122572 0.141437 -0.0353017 0.14277 0.170394 -0.0521177 0.118018 0.0222599 -0.29224 0.00622257 0.0588463 -0.0588817 0.0380769 -0.0493379 0.0546821 0.0485097 -0.00394216 -0.0564228 0.157214 -0.0125711 -0.0844766 -0.0885117 -0.0466875 -0.0578486 0.114438 -0.100552 -0.0126003 0.189762 0.0468423 -0.144196 0.0829091 0.100439 -0.116621 0.0323025 0.0246737 0.151057 -0.0124222 0.131441 0.13008 0.0397285 -0.19601 0.0409355 0.0106371 0.192165 -0.0393123 0.103567 -0.109408 -0.0485764 0.0649776 0.00374664 0.0856303 -0.110345 0.0704548 -0.0916295 -0.00655001 -0.0540035 -0.0715982 -0.0529331 0.0805587 0.102443 0.0767953 0.0170774 0.0639655 -0.0652812 -0.124052 -0.0526517 -0.110925 0.0463045 0.0792078 0.0719951 0.0321563 0.0718225 -0.0054794 -0.0447209 0.0200658 -0.0524031 0.0322188 0.0192764 0.169724 0.0557363 -0.0525561 0.111531 0.0137014 -0.0675549 0.063713 -0.051723 -0.0514286 -0.124807 -0.0118817 0.0147124 -0.0308472 0.0326918 0.216696 0.000852543 -0.0731899 0.0806398 0.113235 -0.0881228 -0.159161 -0.0712162 0.0805752 0.0272621 0.00645136 0.0916231 -0.0461738 -0.134185 0.0742124 -0.0156873 -0.0426326 
0.0443031 -0.0385685 -0.0581683 -0.0370663 0.0636284 0.152483 -0.051875 -0.0743894 -0.135999 0.0392826 -0.0355672 0.0833734 0.0880631 -0.0841899 -0.0256453 0.0419499 -0.0686167 0.0661191 0.0158937 0.132957 0.134753 -0.0406053 0.137257 0.194933 -0.0304448 0.109462 0.00831427 -0.285401 0.0220915 0.0800048 -0.0306308 0.0314217 -0.043008 0.0514761 0.0507405 0.0169275 -0.0588637 0.144118 -0.010231 -0.0759074 -0.0767289 -0.0567839 -0.0498117 0.109929 -0.102575 0.00243777 0.204515 0.0611458 -0.140326 0.0717941 0.103914 -0.098296 0.0401842 0.00174851 0.163855 0.00113209 0.111351 0.143222 0.039136 -0.185772 0.0172977 0.0163306 0.19163 -0.049689 0.109755 -0.108318 -0.0420793 0.058737 -0.0229537 0.0877927 -0.0995795 0.0806005 -0.104296 -0.00890564 -0.0259585 -0.0532414 -0.0608373 0.091465 0.109613 0.101879 0.0128991 0.0640844 -0.0464605 -0.095853 -0.048514 -0.113651 0.0492864 0.0773105 0.0566846 0.0375608 0.0552731 -0.0067325 -0.0211951 0.0361985 -0.0687954 0.00685806 0.0101491 0.169377 0.0633585 -0.0709218 0.111921 0.024122 -0.0717699 0.0640602 -0.0672105 -0.0303714 -0.123217 -0.00510221 0.035346 -0.0214963 0.0351107 0.209717 -0.0137848 -0.0653379 0.0648597 0.122081 -0.106532 -0.14945 -0.0810857 0.114671 0.0382384 0.000208495 0.0602269 -0.0455691 -0.154949 0.104535 -0.0155836 -0.0300744 
0.0385137 -0.0532449 -0.0640373 -0.0214902 0.0536245 0.124541 -0.0482988 -0.0549714 -0.104462 0.00877421 -0.0617263 0.0920658 0.0797005 -0.103389 -0.059842 0.0568982 -0.0883365 0.0444022 -0.0243802 0.144305 0.143292 -0.0571379 0.147057 0.184425 -0.0457525 0.092326 0.00737061 -0.295839 -0.0119403 0.0809287 -0.0449433 0.0537688 -0.0255171 0.0701986 0.0234304 -0.00145793 -0.05519 0.167532 -0.0541553 -0.072697 -0.078762 -0.0638725 -0.0388077 0.100297 -0.0762145 0.00475159 0.202341 0.0396813 -0.128772 0.0975363 0.111608 -0.123925 0.050883 0.0127288 0.180272 -0.00687113 0.119245 0.11491 0.0530767 -0.19524 0.0330879 0.0104417 0.158805 -0.0347765 0.103171 -0.12894 -0.0534672 0.0582057 -0.0184294 0.0743678 -0.112024 0.0580135 -0.0971844 -0.00502942 -0.0278156 -0.0330428 -0.0446641 0.0803689 0.0884276 0.10521 0.0151563 0.0481662 -0.0634107 -0.101138 -0.0557443 -0.0942874 0.0444538 0.0778182 0.0499588 0.0381671 0.0374724 -0.0269049 -0.0386915 0.0236868 -0.0729758 0.0551556 0.0069971 0.151041 0.0747041 -0.0557995 0.114439 0.00238652 -0.0772124 0.0846931 -0.0616299 -0.0653648 -0.151035 0.0105484 0.00273874 -0.0335537 0.0187502 0.223326 -0.0219373 -0.0748971 0.0553162 0.130461 -0.102033 -0.137008 -0.0732469 0.117336 0.0268077 0.0455316 0.0694069 -0.0434948 -0.129421 0.0864564 -0.0188139 -0.0541997 
0.0490878 -0.0399091 -0.0785994 -0.0227187 0.0647521 0.137023 -0.0419326 -0.066403 -0.110316 -0.00350674 -0.0593057 0.0887727 0.074857 -0.115817 -0.063495 0.0561721 -0.0954507 0.0467071 -0.0244339 0.147161 0.14622 -0.0420703 0.134583 0.173349 -0.0413295 0.0835648 0.000541744 -0.295716 -0.00582764 0.0936415 -0.0500846 0.0510622 -0.0363588 0.0655494 0.0411094 0.000978024 -0.0502817 0.14587 -0.0445426 -0.0812159 -0.0721128 -0.0617513 -0.0199261 0.112322 -0.0841366 0.0163451 0.213526 0.0464936 -0.139133 0.100216 0.101814 -0.121932 0.0503021 0.0138922 0.183564 -0.0118969 0.107469 0.115615 0.0455436 -0.19787 0.0297163 0.0177369 0.178591 -0.0404004 0.101059 -0.132282 -0.0529259 0.0489552 -0.0193769 0.065212 -0.103228 0.0622816 -0.0902758 -0.0091899 -0.0309295 -0.0288796 -0.0516483 0.0751982 0.085541 0.107901 0.0343487 0.0591082 -0.0671504 -0.0955355 -0.053871 -0.0802944 0.0336548 0.0713139 0.0450934 0.0521224 0.0525922 -0.031402 -0.0589936 0.0198905 -0.075202 0.0474306 0.00912892 0.15549 0.0720111 -0.0616499 0.113426 0.00699584 -0.0674679 0.0758311 -0.0825952 -0.0543239 -0.143135 0.0284791 -0.00609091 -0.0135284 0.0374882 0.209083 -0.028257 -0.0735867 0.0478304 0.12744 -0.108858 -0.132814 -0.0746657 0.108609 0.0296673 0.0399586 0.0845564 -0.0402504 -0.130318 0.0810694 -0.0148733 -0.0594905 
0.0496036 -0.0438177 -0.0904377 -0.0130663 0.0683172 0.127261 -0.0410632 -0.0672873 -0.0939929 -0.0159886 -0.061668 0.0910532 0.0766587 -0.110963 -0.0813216 0.0618648 -0.0878524 0.0544495 -0.0370184 0.151222 0.158633 -0.056173 0.139695 0.172079 -0.0397801 0.0688086 -0.00244384 -0.298176 -0.0130201 0.102457 -0.04791 0.0690164 -0.0274828 0.0655705 0.0363828 -0.00349639 -0.0487779 0.151945 -0.0523014 -0.0909099 -0.073808 -0.0574499 -0.0167548 0.107444 -0.0783459 0.0132488 0.209348 0.0405151 -0.13191 0.098206 0.0958662 -0.123433 0.0605804 0.013514 0.180244 -0.0111579 0.115496 0.105675 0.0496013 -0.202918 0.0315074 0.0171591 0.170749 -0.041779 0.093418 -0.13272 -0.057371 0.0518458 -0.019215 0.0635988 -0.105315 0.0512076 -0.0948367 -0.0200146 -0.0378013 -0.0224361 -0.0432271 0.071619 0.0721317 0.104589 0.023452 0.0619181 -0.0761085 -0.0976413 -0.0524896 -0.0639822 0.0266263 0.0692061 0.0407176 0.0473164 0.0509698 -0.0377305 -0.0645718 0.0149832 -0.0682418 0.0541717 -0.00124247 0.159307 0.0711091 -0.0600158 0.120841 -0.00447804 -0.0656116 0.087442 -0.074971 -0.0593185 -0.144587 0.0321408 -0.00843019 -0.0161762 0.0216136 0.206182 -0.0343027 -0.0733688 0.0463367 0.128997 -0.110011 -0.133718 -0.0643232 0.112705 0.0246403 0.0537438 0.0790496 -0.0371826 -0.129027 0.0749263 -0.0175818 -0.0618986 
0.0391669 -0.051368 -0.0504249 -0.0347967 0.0463712 0.125644 -0.0562682 -0.0342951 -0.108165 0.0371457 -0.0453637 0.0806247 0.071615 -0.11963 -0.0397257 0.0509551 -0.0912545 0.0514893 -0.008946 0.137774 0.138203 -0.0433875 0.15552 0.164152 -0.0458635 0.11354 0.0148339 -0.297418 0.00771023 0.050057 -0.028699 0.03882 -0.0317432 0.0614 0.0336276 -0.00516918 -0.0594965 0.186866 -0.0266415 -0.0635406 -0.0844095 -0.0636559 -0.0824889 0.109682 -0.094424 -0.0105046 0.184161 0.0430976 -0.120908 0.102196 0.106879 -0.0748351 0.0217543 0.0125099 0.156909 -0.025853 0.140699 0.100791 0.0385738 -0.195257 0.0283502 -0.0238218 0.170247 -0.0180804 0.0957649 -0.151229 -0.0403455 0.0709903 0.00804784 0.104032 -0.100176 0.0774043 -0.0975755 0.0138971 -0.0405789 -0.0750033 -0.0693887 0.0984471 0.0922505 0.118152 -0.00167573 0.058312 -0.0443192 -0.0974315 -0.0365377 -0.122286 0.0551034 0.101967 0.078611 0.0147385 0.0430045 -0.00287264 -0.0391657 0.028146 -0.0653321 0.00882234 0.0184892 0.152149 0.0504716 -0.0741513 0.105516 0.011156 -0.082073 0.0768535 -0.0368352 -0.0626062 -0.123869 -0.000204641 0.0552923 -0.0308722 0.013847 0.23518 -0.0258449 -0.0627518 0.0824077 0.114997 -0.086574 -0.168441 -0.0619704 0.11003 0.0353269 0.0510641 0.0737699 -0.036266 -0.121706 0.0664117 0.0142787 -0.0217679 
0.0243549 -0.0329089 -0.0344773 -0.0303197 0.0314306 0.0963756 -0.0819005 -0.0201527 -0.0826871 0.0487094 -0.0161189 0.0640815 0.0548158 -0.125216 -0.0464362 0.073797 -0.0621725 0.0694541 0.0141379 0.118926 0.167216 -0.0503521 0.153408 0.148148 -0.0283402 0.134082 0.0365128 -0.294 0.0403933 0.042384 -0.00830563 0.032777 0.00773181 0.0512979 0.0479424 -0.0188805 -0.0332314 0.217675 0.0177978 -0.0744293 -0.0915925 -0.0593036 -0.0854381 0.0946529 -0.0768113 -0.0363015 0.174439 0.0105011 -0.119923 0.0599643 0.0926528 -0.033951 0.0204788 0.0188209 0.131775 -0.0148001 0.17353 0.062631 0.0138601 -0.200846 0.023887 -0.0798454 0.165536 -0.0192661 0.103103 -0.149066 -0.0498198 0.0647666 0.0275834 0.118078 -0.107183 0.0559035 -0.12997 -0.00585322 -0.0344594 -0.105118 -0.0640427 0.139298 0.0755866 0.106501 -0.0520519 0.0788202 -0.0236762 -0.0808275 -0.0144807 -0.122529 0.0490758 0.117895 0.0965017 -0.00925722 0.0273108 0.00342074 -0.0430875 0.0369392 -0.031302 -0.01469 0.012487 0.171339 0.0291095 -0.0785133 0.0918851 -0.00128471 -0.0883509 0.0876387 0.0122342 -0.0610799 -0.0696215 -0.0210835 0.102038 -0.0636212 -0.0422953 0.212379 -0.0379228 -0.048711 0.124108 0.0947612 -0.0806418 -0.202264 -0.0449324 0.0969493 0.0448179 0.0733951 0.0635044 -0.0390969 -0.0994219 0.0594977 0.0524133 0.00622723 
0.0249833 -0.0431465 -0.0445617 -0.0226342 0.0428108 0.125907 -0.0716115 -0.0309305 -0.0885025 0.0332017 -0.027427 0.0821685 0.0574471 -0.131651 -0.060847 0.0669704 -0.0951492 0.0785139 -0.00606661 0.124107 0.168386 -0.0534415 0.154092 0.16828 -0.0372491 0.110784 0.0262882 -0.304407 0.0163065 0.0547315 -0.0199586 0.0290747 -0.00982834 0.0590199 0.044825 -0.00375292 -0.0512808 0.171186 -0.0186938 -0.0758244 -0.0773724 -0.0686731 -0.0664162 0.115216 -0.0911918 -0.040165 0.19227 0.0240698 -0.123317 0.0826249 0.103436 -0.0788403 0.0202389 0.0178525 0.152935 -0.00130758 0.151023 0.0787342 0.03379 -0.199443 0.0223841 -0.0420532 0.172791 -0.0212893 0.109652 -0.152229 -0.0563472 0.0484998 0.00887504 0.126082 -0.113164 0.0628367 -0.111672 -0.00773899 -0.0397415 -0.0851604 -0.0632862 0.127203 0.0742357 0.096287 -0.0244352 0.0699727 -0.03698 -0.0836639 -0.0384585 -0.10057 0.0521804 0.1054 0.0785599 0.0198444 0.0395009 -0.0101275 -0.0543763 0.0191114 -0.0509589 0.0133708 -0.00468087 0.174 0.0427111 -0.0621302 0.107451 0.00365059 -0.0790651 0.0670237 0.00292915 -0.0592231 -0.0983367 -0.0114491 0.0535379 -0.0433655 -0.0282455 0.215911 -0.0210265 -0.0669429 0.100719 0.106478 -0.0684927 -0.17721 -0.0449001 0.106232 0.0503486 0.0492351 0.0683891 -0.0469591 -0.117854 0.0747416 0.0343862 -0.00130073 
0.041804 -0.00594875 -0.0636626 -0.0434931 0.0587353 0.18995 -0.0852595 -0.0926649 -0.142749 0.0329016 -0.0189753 0.0517449 0.0686961 -0.045639 -0.000466727 0.0450343 -0.0368596 0.109355 0.0701825 0.0886975 0.138921 0.000472762 0.130385 0.194309 -0.0122206 0.0999866 0.00912561 -0.275221 0.0445736 0.0939518 -0.00577639 0.0215966 -0.029272 0.0226835 0.0852658 0.0589551 -0.034722 0.0884955 0.0246078 -0.0665662 -0.0806835 -0.0248656 -0.0380987 0.0960371 -0.110873 0.0109951 0.22503 0.0484482 -0.159998 0.0428072 0.0797644 -0.076349 0.0676142 0.00806692 0.134085 0.0391764 0.14189 0.147267 0.0415081 -0.193306 -0.0100425 0.0537912 0.205369 -0.0983224 0.102185 -0.0711676 -0.0233306 0.0422242 -0.0261963 0.128138 -0.0786656 0.0746432 -0.122511 -0.0349301 -0.0124945 -0.0610705 -0.0865846 0.0904165 0.0995724 0.04856 0.00609642 0.128861 -0.0518271 -0.0946183 -0.0327372 -0.0715375 0.0147437 0.0416994 0.0331783 0.0506537 0.0791356 -0.000114464 -0.0214895 0.0259597 -0.0193195 -0.00403765 -0.000677423 0.220787 0.0383076 -0.0570103 0.102777 0.0314013 -0.0551271 0.0380939 -0.0813717 0.0135877 -0.0909338 -0.0618726 0.0203011 -0.00503562 0.0302629 0.156469 0.0133505 -0.0883794 0.0651435 0.108382 -0.0931774 -0.18581 -0.0635082 0.0871847 0.0784091 -0.0527001 0.0704529 -0.0652807 -0.17113 0.118365 0.00501492 0.00337927 
0.0614555 -0.0198402 -0.0798083 -0.0433619 0.0588499 0.184023 -0.0602367 -0.0960639 -0.141811 0.0140613 -0.0434664 0.0564244 0.0770632 -0.0503152 -0.0186225 0.0444592 -0.0539381 0.0906468 0.0384354 0.101371 0.130289 0.000895021 0.137885 0.189475 -0.036594 0.0785358 0.00402943 -0.273558 0.00834972 0.107478 -0.0379224 0.0403205 -0.0410629 0.0416829 0.0793406 0.0382664 -0.0280678 0.0953742 0.00149346 -0.0746499 -0.0959853 -0.0378953 -0.0280742 0.0873604 -0.100972 0.0313196 0.213285 0.0648428 -0.161243 0.0838839 0.0943851 -0.094515 0.0792019 0.0196694 0.153956 0.0166446 0.14138 0.141901 0.0461973 -0.194237 0.0129182 0.0711323 0.192649 -0.0938957 0.090406 -0.0804538 -0.037255 0.0544117 -0.0368792 0.103214 -0.0898103 0.0600796 -0.111357 -0.0295993 -0.029119 -0.041067 -0.0628474 0.055577 0.107514 0.0637768 0.0427101 0.0965757 -0.0749916 -0.109746 -0.0423109 -0.0704175 0.00112648 0.0309506 0.0326817 0.0767282 0.0829023 -0.016174 -0.0269837 0.0259284 -0.0437145 0.0300983 0.000609617 0.201731 0.0600473 -0.0515076 0.133629 0.0352622 -0.0626182 0.0489772 -0.0854363 -0.0158673 -0.120463 -0.0414565 -0.0139641 0.00977843 0.0511591 0.174516 0.0174887 -0.0858094 0.0441874 0.126491 -0.0925343 -0.149761 -0.0722613 0.0899393 0.0651124 -0.0411414 0.0911149 -0.0587796 -0.158483 0.102636 -0.00860143 -0.0362991 
0.0504064 -0.0573427 -0.0976238 -0.0303621 0.0244647 0.144508 -0.0227674 -0.0339786 -0.10487 -0.00194211 -0.041979 0.0755977 0.0883041 -0.117442 -0.0999862 0.0465648 -0.132728 0.0774248 -0.0508473 0.121691 0.148387 -0.0574204 0.144418 0.143007 -0.0955582 0.0747288 0.00569509 -0.310579 -0.03921 0.0754976 -0.0836279 0.0590916 -0.0454017 0.0627524 0.027692 -0.0107973 -0.0515723 0.145815 -0.0555518 -0.0564277 -0.0710056 -0.0790617 -0.0519462 0.119835 -0.11005 -0.0114868 0.193964 0.0301594 -0.146126 0.109202 0.092541 -0.136461 0.0267908 0.0591344 0.157436 -0.00733087 0.150879 0.0911032 0.0555679 -0.191115 0.0398187 0.0233127 0.17995 -0.0291572 0.0933146 -0.140373 -0.0448475 0.0483778 0.0115004 0.076596 -0.109365 0.0379652 -0.0648693 -0.00407966 -0.0399423 -0.0402041 -0.0632629 0.0675829 0.0617694 0.0671199 0.025788 0.0377551 -0.0861906 -0.10671 -0.0952373 -0.0104095 0.0484779 0.0491243 0.0399376 0.0422321 0.0644357 -0.0583454 -0.0566791 -0.0237576 -0.0852838 0.0507091 -0.0138355 0.163836 0.0817363 -0.0221808 0.124386 0.0100647 -0.0551839 0.092331 -0.00865982 -0.0778909 -0.142832 0.0516254 -0.0557674 -0.0187615 0.00211562 0.202154 0.000659687 -0.0967059 0.036646 0.133836 -0.0752557 -0.131623 -0.0406711 0.0757969 0.0324775 0.0080489 0.0943267 -0.0340152 -0.112167 0.0585836 -0.0415883 -0.036275 
0.0643461 -0.0589092 -0.0887795 -0.0357149 0.0056555 0.147963 -0.0155226 -0.0229122 -0.110728 -0.00884359 -0.0384921 0.0731087 0.0860092 -0.116635 -0.10028 0.047077 -0.128551 0.0629574 -0.0604932 0.1136 0.134656 -0.0356811 0.140057 0.145564 -0.116262 0.0837186 0.0193005 -0.29612 -0.0390967 0.0658068 -0.100492 0.0613167 -0.0501703 0.0753085 0.0138355 -0.0224275 -0.0466425 0.161103 -0.0587492 -0.037519 -0.082929 -0.0788745 -0.0626933 0.104797 -0.0986577 -0.0139146 0.183413 0.0247033 -0.158637 0.126159 0.10232 -0.131507 0.023628 0.0720977 0.153818 -0.0126255 0.151657 0.10005 0.0508001 -0.186056 0.0379188 0.0277432 0.183019 -0.0365532 0.0852849 -0.129581 -0.0367541 0.045112 0.000717606 0.0763455 -0.115421 0.0227773 -0.059753 0.0228555 -0.0353127 -0.0490092 -0.0478611 0.0472636 0.0630278 0.0619328 0.042085 0.0254845 -0.0873576 -0.127782 -0.0918446 -0.0204801 0.0439163 0.0353111 0.0405399 0.0564934 0.0703675 -0.0708023 -0.0585067 -0.010751 -0.0744368 0.070923 -0.00164138 0.147215 0.0886722 -0.00918521 0.120856 0.0150644 -0.0677781 0.104401 -0.0143846 -0.0836339 -0.146209 0.0402849 -0.068325 -0.0369466 0.0178074 0.219789 0.0131215 -0.0913151 0.0417294 0.130115 -0.069488 -0.122654 -0.0351758 0.0671545 0.0314689 0.00122952 0.111871 -0.0378155 -0.0918561 0.0556729 -0.0346359 -0.0548668 
0.0615395 -0.067008 -0.0935321 -0.0293604 0.00152702 0.133706 -0.0141972 -0.0168352 -0.0990054 -0.0198107 -0.043658 0.0825899 0.077098 -0.132999 -0.110286 0.0386471 -0.136931 0.0589254 -0.0616641 0.122801 0.126485 -0.0350279 0.142229 0.141793 -0.12687 0.0735251 0.0297364 -0.302863 -0.0601799 0.0699985 -0.115582 0.0456957 -0.0326146 0.0798924 0.0167196 -0.0335763 -0.037262 0.157319 -0.0792629 -0.0416945 -0.0854436 -0.0840351 -0.0600128 0.109516 -0.102099 -0.00865635 0.180813 0.0166839 -0.15194 0.144938 0.101375 -0.146253 0.0326686 0.0745539 0.155675 -0.0124434 0.144223 0.0814677 0.0444774 -0.175822 0.0438664 0.0204088 0.17554 -0.029915 0.0920956 -0.149865 -0.0431599 0.0290219 -0.00457048 0.0609278 -0.121737 0.00096918 -0.0557466 0.0145764 -0.0397647 -0.0360304 -0.0411985 0.0404841 0.0604112 0.0670525 0.0373937 0.010416 -0.0988337 -0.120034 -0.0892993 -0.0167338 0.036083 0.0287219 0.0366808 0.066257 0.0635559 -0.0769025 -0.0648887 -0.0108907 -0.0792412 0.0802436 -0.00609487 0.131287 0.0949898 -0.00543201 0.12352 0.0149826 -0.0677784 0.0896005 -0.00571798 -0.097782 -0.13832 0.0413958 -0.08943 -0.0267262 0.0207533 0.209187 0.0236462 -0.0964915 0.0245412 0.134278 -0.0646377 -0.112942 -0.035809 0.065826 0.0218904 0.00604926 0.104231 -0.0367307 -0.0695794 0.0515528 -0.0300917 -0.0675086 
0.0584516 -0.0714859 -0.100846 -0.0341859 0.00795252 0.127295 -0.0198844 -0.0152714 -0.101513 -0.020431 -0.0410989 0.0942284 0.0704149 -0.127896 -0.116177 0.0245893 -0.134827 0.0638169 -0.0553041 0.127967 0.114791 -0.0302305 0.141835 0.147297 -0.127538 0.0815086 0.0512819 -0.292549 -0.0635021 0.0620194 -0.124055 0.0276832 -0.0288325 0.0753977 0.00979128 -0.0337001 -0.0432397 0.152527 -0.0933815 -0.0379756 -0.07414 -0.0748842 -0.0609115 0.128435 -0.121067 -0.007437 0.183839 0.0160179 -0.14757 0.150833 0.100101 -0.14571 0.0203889 0.0735735 0.163619 -0.0124007 0.134036 0.0907504 0.0475344 -0.177092 0.0409644 0.0154519 0.186231 -0.0141809 0.0873443 -0.15859 -0.0443605 0.0299031 0.00445686 0.0716683 -0.112929 0.00343513 -0.042409 0.0181359 -0.0349843 -0.0351639 -0.0516045 0.049586 0.057048 0.0525249 0.0294473 0.0264279 -0.0915688 -0.119085 -0.089733 -0.0222486 0.04441 0.0383484 0.0432296 0.0631261 0.0623 -0.0753784 -0.0655536 -0.0242501 -0.0711331 0.0657847 -0.00462069 0.128087 0.093743 -0.0213097 0.110727 0.0201596 -0.0519467 0.0804163 -0.01898 -0.0944629 -0.14593 0.0406587 -0.0959121 -0.0283961 0.0399321 0.212281 0.0294443 -0.0888053 0.0153148 0.123892 -0.0590651 -0.129129 -0.0302392 0.0610988 0.0227604 0.0089366 0.0979012 -0.0397952 -0.0761007 0.0511162 -0.0314376 -0.0608869 
0.0657988 -0.0834314 -0.0922263 -0.049682 0.0306982 0.138242 -0.0154408 -0.0151598 -0.118948 -0.0310631 -0.0558712 0.0869618 0.0755937 -0.0997869 -0.0859646 0.0104525 -0.125265 0.0700596 -0.0382972 0.119384 0.125063 -0.0164314 0.13843 0.151538 -0.109156 0.0713176 0.0401572 -0.288821 -0.0602599 0.0698912 -0.11592 0.014926 -0.0398245 0.0732531 0.0361767 -0.0227505 -0.039918 0.133807 -0.0847359 -0.0626884 -0.0684099 -0.0572214 -0.0457642 0.131814 -0.128909 0.00673848 0.183941 0.0292175 -0.154567 0.141323 0.0794162 -0.164111 0.0386966 0.0667232 0.170671 -0.00845487 0.118671 0.118294 0.0367346 -0.187089 0.045896 0.0381422 0.190638 -0.0205137 0.0905046 -0.132261 -0.0513076 0.042671 -0.000850484 0.0671893 -0.103763 0.014039 -0.0505388 -0.00920894 -0.0467272 -0.0266083 -0.0553319 0.030376 0.0816879 0.0490385 0.0337897 0.0363783 -0.0948027 -0.12611 -0.0862338 -0.0412113 0.0418799 0.0428771 0.0446079 0.0775854 0.0900405 -0.0685307 -0.0635845 -0.0245688 -0.0739604 0.0671283 -0.00678923 0.140694 0.0855611 -0.0229144 0.115756 0.0222146 -0.0477992 0.0548865 -0.0498455 -0.0780753 -0.153601 0.024559 -0.0954785 -0.0223873 0.0648651 0.19932 0.0176635 -0.0910955 0.0232607 0.132702 -0.0626806 -0.130664 -0.0412669 0.0636795 0.026258 -0.00494033 0.0957906 -0.0359091 -0.0926284 0.0522519 -0.0292454 -0.0686644 
0.0662052 -0.0877932 -0.110944 -0.0386389 0.0200572 0.109554 -0.003373 -0.0116183 -0.102358 -0.0272279 -0.0550804 0.0983689 0.0764928 -0.108879 -0.114683 0.0173377 -0.121497 0.0633009 -0.058524 0.127395 0.110043 -0.0229227 0.133187 0.14489 -0.130325 0.0775416 0.0503982 -0.284081 -0.0719973 0.0728905 -0.142811 0.0394846 -0.0330914 0.0735016 0.00929493 -0.0421657 -0.0433737 0.151696 -0.105003 -0.0468882 -0.0711336 -0.058811 -0.0542587 0.129855 -0.121904 0.012126 0.173136 0.0194713 -0.142258 0.141973 0.0957493 -0.160522 0.02874 0.069134 0.167889 -0.0154403 0.120112 0.101891 0.047567 -0.171694 0.0525489 0.0204628 0.177233 -0.00474024 0.0815419 -0.152903 -0.0498972 0.0403182 0.00886371 0.0495452 -0.107217 0.000158802 -0.0347606 0.00493818 -0.0474898 -0.0154266 -0.0465063 0.032912 0.0604271 0.0428151 0.0382999 0.0288934 -0.103288 -0.128428 -0.0903073 -0.0310803 0.0448342 0.0341313 0.0391969 0.0647478 0.0634454 -0.0737071 -0.0688641 -0.0308117 -0.07355 0.0794551 0.00101676 0.112542 0.101787 -0.0225728 0.113432 0.016582 -0.0425916 0.0791995 -0.0452618 -0.104852 -0.162652 0.0425035 -0.108571 -0.0248326 0.0632291 0.206696 0.021448 -0.0896929 0.00544012 0.125456 -0.0672328 -0.127298 -0.0394665 0.0533143 0.0106121 0.0156588 0.0953419 -0.0323215 -0.0745718 0.0434635 -0.0514551 -0.0844057 
0.0755282 -0.0907458 -0.075544 -0.0464407 0.025179 0.162315 -0.00316565 -0.0169379 -0.143058 -0.0209694 -0.0544414 0.0833312 0.0831231 -0.0811502 -0.063994 -0.00789722 -0.124908 0.0784322 -0.0121842 0.107549 0.128193 -0.015182 0.132402 0.164169 -0.0989903 0.0644 0.0203326 -0.286609 -0.0509291 0.0821461 -0.113992 0.0090255 -0.0565428 0.0641865 0.0482411 -0.0173266 -0.0553384 0.116273 -0.070797 -0.0707205 -0.0732294 -0.0588973 -0.0548008 0.120016 -0.134923 -0.00498383 0.176436 0.0329722 -0.157803 0.132298 0.0846807 -0.152578 0.054563 0.0646504 0.169763 -0.00150692 0.120412 0.136771 0.0293455 -0.180504 0.0448762 0.0614444 0.194918 -0.0375245 0.0928168 -0.102046 -0.0428055 0.0297499 -0.0260867 0.0704354 -0.10253 0.0310077 -0.0586932 -0.00452983 -0.0534067 -0.0269873 -0.0472986 0.000753744 0.107072 0.0632356 0.0343218 0.0169257 -0.0845829 -0.129701 -0.0772017 -0.0592024 0.0419875 0.0339345 0.0476434 0.0806425 0.100503 -0.0592573 -0.0444372 -0.0050138 -0.0867805 0.052195 -0.000879057 0.150268 0.0889115 -0.0111119 0.133859 0.044455 -0.0544317 0.0406571 -0.0531558 -0.0576432 -0.137384 0.0099002 -0.0847191 -0.0181291 0.0703725 0.189587 0.0196231 -0.106484 0.0342753 0.146137 -0.05024 -0.111765 -0.0427088 0.0769231 0.0250749 -0.0509449 0.0873243 -0.0529584 -0.100688 0.078068 -0.0165183 -0.0560236 
0.0699199 -0.0788708 -0.0641036 -0.0419009 0.0337667 0.170295 -0.00301584 -0.0253379 -0.152389 0.00013858 -0.0550508 0.0792788 0.0829634 -0.0711722 -0.0373348 -0.0126285 -0.109699 0.0969497 0.0101927 0.105701 0.131031 -0.0216283 0.128753 0.169548 -0.0775012 0.0643792 0.00249257 -0.288283 -0.0333854 0.0906017 -0.0961576 0.0195687 -0.051313 0.058564 0.0650795 -0.00742875 -0.0514852 0.109585 -0.0592417 -0.0945705 -0.0675267 -0.064634 -0.0423014 0.11775 -0.143179 -0.00500814 0.184863 0.038903 -0.163747 0.114022 0.086706 -0.139625 0.0628811 0.0521544 0.175485 0.00926393 0.117823 0.136157 0.0302975 -0.18772 0.0362508 0.0603189 0.19122 -0.0527896 0.10426 -0.0809273 -0.0490986 0.0236497 -0.0429688 0.0848132 -0.101611 0.0398899 -0.077057 -0.0110909 -0.0559671 -0.0323195 -0.0476428 0.00945714 0.119019 0.0564884 0.0184428 0.0278031 -0.08012 -0.12337 -0.0586598 -0.0767712 0.0393461 0.0400222 0.0605186 0.0898871 0.102458 -0.0449219 -0.0381997 -0.00502424 -0.085109 0.038951 0.000887352 0.171559 0.081374 -0.020709 0.139778 0.0538058 -0.0488389 0.0278349 -0.0607459 -0.0414509 -0.124418 -0.00334361 -0.0546021 -0.0149746 0.0586928 0.18202 0.00973953 -0.116292 0.0511386 0.134523 -0.0402831 -0.129671 -0.0383129 0.0904109 0.0422786 -0.0624413 0.0807596 -0.0522875 -0.111606 0.086073 0.00882134 -0.0433741 
0.0698994 -0.0677075 -0.0728128 -0.0274588 0.0448095 0.173631 -0.0116917 -0.0504339 -0.146716 -0.0118553 -0.0442728 0.0828242 0.0744445 -0.0657181 -0.0599026 0.00247422 -0.115257 0.108902 0.0193701 0.097174 0.162185 -0.0368645 0.134514 0.150096 -0.0513779 0.0676922 -0.0142052 -0.29864 -0.0239404 0.10997 -0.0872851 0.0335613 -0.0503623 0.0432135 0.0770695 -0.00684996 -0.0668815 0.110393 -0.0223906 -0.105381 -0.074221 -0.0527041 -0.0417586 0.107182 -0.138076 -0.00811546 0.192434 0.0171067 -0.165199 0.0926284 0.0734417 -0.109222 0.0719715 0.0542979 0.164724 0.00726773 0.1452 0.134513 0.00788956 -0.183197 0.0412811 0.0563225 0.212595 -0.0578403 0.110234 -0.0781788 -0.0541066 0.034293 -0.0346126 0.101352 -0.0883161 0.0547824 -0.0901992 -0.019469 -0.0629946 -0.0322151 -0.0530041 -0.00473203 0.0982159 0.0630619 -0.00197907 0.0469145 -0.0692513 -0.108737 -0.0661917 -0.0657721 0.0339832 0.0434058 0.0548945 0.0667078 0.10179 -0.0426767 -0.0419993 0.00597087 -0.0728256 0.0181087 -0.00155328 0.19522 0.0777842 -0.0168477 0.138244 0.0463772 -0.0520041 0.0366085 -0.050331 -0.0239797 -0.100396 0.00977856 -0.0352635 -0.0168529 0.0398128 0.160258 -0.00253935 -0.1152 0.0739227 0.143946 -0.0496164 -0.127189 -0.0223804 0.0971773 0.0396592 -0.0562825 0.0792753 -0.0698707 -0.115782 0.102777 0.0256734 -0.0199301 
0.0676055 -0.0773141 -0.068461 -0.0199426 0.0487408 0.171555 -0.000926472 -0.0387467 -0.132094 -0.0274574 -0.0423073 0.0917146 0.0707975 -0.0889045 -0.0716152 -0.00398328 -0.130598 0.109636 -0.00352199 0.101474 0.171753 -0.0468518 0.125712 0.16012 -0.052011 0.0561044 -0.0135146 -0.305005 -0.0338322 0.105058 -0.0852182 0.0291251 -0.0509135 0.0591827 0.0677802 -0.013584 -0.0672303 0.0996834 -0.0383989 -0.106763 -0.0497755 -0.0637889 -0.0331274 0.117006 -0.137004 -0.0226825 0.192755 0.00954044 -0.1631 0.0952488 0.0671974 -0.13313 0.0650494 0.0549499 0.170154 0.0149449 0.128236 0.131975 0.00616147 -0.18231 0.0447585 0.052623 0.208225 -0.0492006 0.109659 -0.084704 -0.0563788 0.019326 -0.0333852 0.0975271 -0.0965576 0.0473118 -0.0860212 -0.0203839 -0.0594065 -0.0293348 -0.0488643 0.00645367 0.0884933 0.0601015 -0.0122856 0.047109 -0.0677531 -0.106198 -0.0743048 -0.0474545 0.0471078 0.0445504 0.043253 0.0688382 0.109954 -0.0570804 -0.0519669 -0.00781572 -0.0808472 0.0287845 -0.0144916 0.181525 0.0816563 -0.0100084 0.131627 0.034601 -0.0477402 0.0418905 -0.0374571 -0.0303396 -0.106735 0.0268199 -0.0567471 -0.0222167 0.033541 0.159994 -0.00894932 -0.11923 0.071037 0.14339 -0.0471978 -0.127354 -0.0171019 0.101701 0.042966 -0.0412398 0.0687895 -0.0594793 -0.11213 0.0983126 0.0170911 -0.0247678 
0.0660821 -0.0987225 -0.0669761 -0.00950039 0.0166064 0.110542 0.00754031 0.00782089 -0.0690445 -0.0537917 -0.0446574 0.103816 0.0584666 -0.152642 -0.111293 0.0233455 -0.142974 0.0633334 -0.0771503 0.123854 0.156108 -0.031101 0.121189 0.160292 -0.112553 0.0508844 0.030402 -0.308981 -0.0697057 0.079034 -0.124183 0.0311005 -0.00874529 0.100432 0.0234865 -0.0524625 -0.0264452 0.141853 -0.110341 -0.0728881 -0.0477995 -0.0860089 -0.0418298 0.116191 -0.101804 -0.0126398 0.17044 -0.00599845 -0.141895 0.132255 0.0859009 -0.17253 0.0453405 0.0730206 0.177475 -2.86396e-05 0.115419 0.0655378 0.0129677 -0.159938 0.0544127 -0.000460498 0.150489 -0.0106983 0.0998372 -0.152102 -0.0588026 0.00307664 -0.00502114 0.0531284 -0.130594 -0.0232344 -0.0651134 -0.0109695 -0.0423638 -0.0164648 -0.0270131 0.0494365 0.0568278 0.0631471 0.0146292 0.0152239 -0.0947605 -0.115562 -0.0733284 -0.0129678 0.0487749 0.0374459 0.0138641 0.0861553 0.0835754 -0.0892179 -0.0876302 -0.0156225 -0.0992948 0.0946057 -0.0244275 0.101914 0.109864 4.33543e-06 0.130445 -0.000632716 -0.0563916 0.0649546 0.00385347 -0.109809 -0.128657 0.0494209 -0.103856 -0.0385574 0.0171343 0.187871 0.00333843 -0.113642 0.0372494 0.136968 -0.0554389 -0.119422 -0.0350268 0.0833179 0.0206339 0.0339947 0.072888 -0.0193006 -0.0480328 0.056221 -0.00617088 -0.0772758 
0.0641668 -0.102331 -0.0629821 -0.00821425 -0.0178786 0.101533 -0.00143413 0.0110082 -0.0661407 -0.0614078 -0.0405228 0.103675 0.0520313 -0.149788 -0.120516 0.00937845 -0.14912 0.0446848 -0.0723822 0.128424 0.129654 -0.0304751 0.121005 0.152708 -0.133493 0.0713381 0.0471234 -0.297858 -0.0861516 0.0604586 -0.133272 0.0284887 -0.000994959 0.0988319 0.00768286 -0.0516701 -0.0226212 0.165897 -0.123374 -0.0572309 -0.0565173 -0.091289 -0.0613398 0.108888 -0.0980566 -0.0149577 0.165762 -0.0167895 -0.140897 0.153611 0.0846721 -0.157565 0.0455297 0.0905111 0.180976 -0.00850131 0.119308 0.0563091 0.0188723 -0.16447 0.0511473 -0.00198673 0.150524 -0.00533347 0.0883072 -0.148685 -0.0380169 -0.00267598 5.40735e-05 0.0588985 -0.132305 -0.0431214 -0.0518863 0.0196059 -0.02785 -0.0297054 -0.0294889 0.0371568 0.0557937 0.0650494 0.0121021 0.00696147 -0.09723 -0.132049 -0.0695134 -0.0173234 0.0446493 0.0333286 0.0232377 0.0851327 0.0789469 -0.0917891 -0.0694677 -0.018186 -0.093501 0.091485 -0.0101535 0.0925682 0.119129 -0.00425815 0.118519 0.00878281 -0.0579221 0.0661565 0.00925835 -0.112052 -0.125514 0.0438633 -0.114869 -0.0452099 0.0212749 0.202733 0.0141461 -0.117476 0.0306329 0.126963 -0.0419702 -0.130857 -0.0178929 0.0684315 0.0190603 0.0294618 0.0846055 -0.0239635 -0.029221 0.0491701 0.0098837 -0.0711242 
0.0600061 -0.0923508 -0.0535679 -0.00345319 -0.0132064 0.112727 -0.0108935 0.00959612 -0.0664829 -0.0636036 -0.0329139 0.0981323 0.0537705 -0.161929 -0.114374 0.0112707 -0.160186 0.0507302 -0.0728859 0.133814 0.150525 -0.0467078 0.130452 0.143018 -0.117038 0.0652379 0.0265753 -0.313819 -0.0793713 0.0565437 -0.108188 0.0259085 0.000222959 0.0998255 0.0190061 -0.0427146 -0.0291957 0.167224 -0.109315 -0.0668586 -0.0535297 -0.100943 -0.0681693 0.114021 -0.102894 -0.0233382 0.172956 -0.0180437 -0.144746 0.149646 0.0745766 -0.148096 0.0398841 0.087125 0.172901 -0.00930485 0.123415 0.0481206 0.0131528 -0.169431 0.046446 -0.00683021 0.154754 -0.010512 0.0991231 -0.154678 -0.0381529 -0.0056353 -0.00235372 0.0715215 -0.129089 -0.0334008 -0.0605874 0.0122425 -0.0316656 -0.0444556 -0.0390404 0.0428056 0.0557772 0.0857287 -0.00525531 0.0030456 -0.0903748 -0.122034 -0.0723939 -0.0137233 0.0477522 0.0399074 0.0246976 0.0761935 0.085704 -0.0912508 -0.0708841 -0.0190892 -0.099649 0.0710972 -0.0175643 0.110796 0.103848 -0.00496867 0.114307 0.00955666 -0.0608622 0.064071 0.0271023 -0.0970453 -0.110447 0.0567687 -0.0873988 -0.0463035 -0.000643168 0.195019 -0.00276558 -0.117422 0.0455319 0.129234 -0.0404967 -0.13657 -0.00752797 0.0855776 0.022487 0.0311708 0.0741391 -0.0165907 -0.0276461 0.0468933 0.032165 -0.0511219 
0.0608568 -0.0774434 -0.0648144 -0.00642305 -0.0113738 0.120145 -0.00120561 0.00959101 -0.0695392 -0.0554141 -0.0279817 0.099924 0.0505347 -0.175387 -0.131422 0.0188544 -0.160145 0.0604236 -0.0727235 0.126999 0.152781 -0.0435189 0.123804 0.141098 -0.126809 0.0605224 0.028601 -0.308726 -0.0636609 0.0624915 -0.123651 0.0185508 -0.0023803 0.0968523 0.0209657 -0.0544755 -0.0268087 0.155214 -0.105613 -0.0616441 -0.0554775 -0.10179 -0.0573137 0.111248 -0.103658 -0.0255531 0.178507 -0.0201758 -0.158301 0.150451 0.077619 -0.143428 0.0306823 0.0901428 0.165594 -0.00534433 0.13264 0.0460341 0.004435 -0.15908 0.0493102 -0.00363833 0.169666 -0.0177084 0.103237 -0.158045 -0.0477708 -0.0155896 -0.00904964 0.0725939 -0.132103 -0.0351789 -0.0634764 0.021217 -0.0307884 -0.036477 -0.0304132 0.0515141 0.0512271 0.0619902 -0.00366889 0.00670371 -0.0891484 -0.109789 -0.0759508 0.000962337 0.0425025 0.0333594 0.0250233 0.0814557 0.0856245 -0.0965772 -0.0808185 -0.0193 -0.0856759 0.0710125 -0.0174696 0.114156 0.103384 0.00532242 0.118096 0.0102056 -0.0606832 0.0654621 0.0300642 -0.0957446 -0.100649 0.0611815 -0.0979143 -0.044834 0.000395006 0.185936 0.0156039 -0.116947 0.0444782 0.128537 -0.0368597 -0.122978 -0.00720618 0.0824631 0.0185941 0.0194102 0.0789049 -0.0264875 -0.0327148 0.055749 0.0234757 -0.0559723 
0.0576395 -0.0583764 -0.096832 -0.00242397 0.00521447 0.0983151 0.00752626 0.0060496 -0.0324533 -0.0433365 -0.0174253 0.106822 0.0498789 -0.200865 -0.155749 0.0402473 -0.166191 0.0632999 -0.11094 0.126983 0.143783 -0.0350724 0.133211 0.127558 -0.140538 0.0379267 0.0381637 -0.307393 -0.0567067 0.0777875 -0.140328 0.0419053 0.0142838 0.0952882 -0.00114864 -0.0745156 -0.025003 0.149343 -0.116993 -0.0333705 -0.0534736 -0.106667 -0.0680644 0.109752 -0.108932 -0.0126807 0.162321 -0.0159994 -0.14571 0.143451 0.0860142 -0.128263 0.0181222 0.0770964 0.134521 -0.00528577 0.141555 0.0162991 0.00123555 -0.121424 0.0390779 -0.0243239 0.16258 -0.00169383 0.0901931 -0.193389 -0.0571362 -0.00326853 0.00576957 0.0619876 -0.129459 -0.0427414 -0.0593335 0.0169501 -0.0274865 -0.011033 -0.0338589 0.0593358 0.0064649 0.0525431 0.00675423 0.0118339 -0.100482 -0.082687 -0.0783874 0.0431894 0.0408525 0.0190372 -0.000425766 0.0740304 0.0626697 -0.1044 -0.110469 -0.0191886 -0.0811119 0.0765672 -0.0394177 0.0857595 0.117823 0.00466769 0.13154 -0.0148311 -0.0514031 0.0804659 0.0387871 -0.12403 -0.104403 0.086305 -0.0986577 -0.0369511 9.21882e-05 0.185048 0.0236292 -0.110409 0.0213627 0.129687 -0.0631885 -0.102179 -0.00469441 0.0822269 0.015571 0.0455709 0.0641841 -0.00951266 -0.0211092 0.0509729 -0.00955901 -0.0655718 
0.0333581 -0.0602509 -0.050582 -0.0109504 0.00818732 0.109605 -0.00672355 0.00703935 -0.0286896 -0.022807 -0.0159557 0.0896531 0.0537453 -0.205838 -0.123663 0.0638303 -0.206126 0.0559359 -0.0972322 0.111835 0.187319 -0.0418536 0.133356 0.112767 -0.113197 0.050592 0.0150666 -0.319011 -0.0267993 0.0799295 -0.108485 0.0359159 0.0132919 0.09599 0.0348121 -0.0601732 -0.0239491 0.141833 -0.0731522 -0.0612809 -0.0528072 -0.132317 -0.0611813 0.0979328 -0.0892632 -0.038544 0.158247 -0.00409404 -0.136142 0.113847 0.0712907 -0.121773 0.0201657 0.0751512 0.147574 0.00108086 0.1471 -0.00292594 -0.0301477 -0.1327 0.0453827 -0.0454917 0.155664 0.0142454 0.111105 -0.168801 -0.0694023 0.00338299 0.0185013 0.067932 -0.144708 -0.0175731 -0.0874931 -0.00678571 -0.0277353 -0.0311791 -0.0338463 0.0730749 0.0315162 0.0843468 0.019725 0.00222195 -0.0762705 -0.0563501 -0.0711014 0.0169904 0.0509372 0.0603916 0.0224519 0.0819802 0.075991 -0.0839053 -0.112328 0.0138669 -0.120299 0.062738 -0.0603937 0.108284 0.116705 0.00691855 0.161365 -0.0266366 -0.0764241 0.0440666 0.0785495 -0.103618 -0.0816065 0.0758621 -0.0539888 -0.0341347 -0.0426594 0.176753 -0.00396821 -0.115349 0.0684311 0.145591 -0.052459 -0.0810696 -0.0224238 0.0942214 0.0370341 0.0411664 0.0737199 -0.0186372 -0.037893 0.0734403 0.0269578 -0.0328193 
0.0155494 -0.0516058 -0.0321951 -0.0137827 -0.00329919 0.115252 -0.0158771 -0.00964884 -0.031739 -0.00919556 0.00113002 0.101391 0.0641989 -0.198261 -0.142453 0.0521431 -0.214493 0.0591737 -0.0940177 0.124238 0.19209 -0.0652027 0.10819 0.142566 -0.11342 0.0712882 0.0116619 -0.300837 -0.00377378 0.0826002 -0.101233 0.025061 -0.00240103 0.0839107 0.0242773 -0.0438573 -0.050539 0.136118 -0.0664018 -0.0585021 -0.0523017 -0.141859 -0.072093 0.0982026 -0.0769599 -0.061651 0.163726 0.00505889 -0.142653 0.0967999 0.0649265 -0.103762 0.0105789 0.0646385 0.158286 0.0155149 0.124292 0.0243991 -0.0330449 -0.141764 0.0444994 -0.036457 0.18413 0.024758 0.104472 -0.150711 -0.0550323 -0.00542791 0.00558659 0.0753283 -0.141867 -0.0114836 -0.0867321 0.00560633 -0.0137182 -0.0345079 -0.031364 0.0876281 0.0444187 0.0835347 0.0111946 0.00702151 -0.0608313 -0.0543154 -0.0778193 0.00975659 0.065615 0.0750724 0.0409361 0.079297 0.0719062 -0.083385 -0.0817868 0.0359305 -0.125777 0.0382243 -0.066822 0.102765 0.124592 -0.00560025 0.162719 -0.0152659 -0.0947904 0.0463277 0.0798627 -0.0683217 -0.0731238 0.0684511 -0.0477238 -0.0452613 -0.044515 0.184618 -0.00974765 -0.105633 0.0716348 0.149238 -0.060736 -0.0750108 -0.0218561 0.0952071 0.0285425 0.0198734 0.0589585 -0.0353632 -0.0677571 0.113425 0.015783 -0.0238097 
0.00607544 -0.0432731 -0.0426682 -0.013876 -0.00276855 0.0929164 -0.0145741 -0.0284841 -0.0369121 -0.00332918 -0.00973277 0.0904418 0.0670625 -0.193541 -0.141092 0.0529252 -0.219796 0.0448773 -0.0759943 0.124833 0.185451 -0.0620556 0.0932212 0.146494 -0.0996511 0.0814811 0.0186135 -0.297963 0.0117537 0.104561 -0.108306 0.0251559 -0.0072775 0.0655367 0.0321049 -0.0512555 -0.0548247 0.128185 -0.0630679 -0.0655771 -0.0545471 -0.149622 -0.0564096 0.116846 -0.066231 -0.0281228 0.17511 0.0178458 -0.139029 0.0699711 0.0641658 -0.0922691 0.0348472 0.0473715 0.16692 0.0115822 0.116646 0.0252528 -0.01828 -0.150444 0.0552747 -0.0404475 0.180392 0.055708 0.0883825 -0.146517 -0.050383 -0.0073482 0.0244094 0.0432683 -0.147761 -0.0123537 -0.0892328 -0.00844401 -0.00312913 -0.0257482 -0.0406815 0.0903397 0.0492612 0.10794 0.035292 0.0108377 -0.0684706 -0.0501238 -0.0685419 0.000373487 0.0556887 0.0729773 0.0364317 0.0758898 0.0620392 -0.0559625 -0.084971 0.034448 -0.1473 0.038063 -0.0600234 0.105026 0.149779 -0.0347013 0.171223 -0.0110382 -0.0757618 0.0411711 0.0452493 -0.0784102 -0.078031 0.0897177 -0.03965 -0.0308088 -0.0149834 0.18234 -0.0306928 -0.118404 0.052552 0.159597 -0.0804041 -0.0757415 -0.0379012 0.0821442 0.0226165 0.0246895 0.0546812 -0.0420921 -0.0911013 0.120786 -0.00175603 -0.0299012 
