0.12249 -0.0160844 0.0262787 0.0364246 0.15477 0.202451 0.16768 -0.0400783 -0.034848 -0.0420857 0.0214559 0.132907 0.0644059 -0.065793 0.0528025 -0.0614648 -0.0385047 0.144576 -0.143597 0.0861721 0.135317 -0.0010781 0.0486918 0.199903 -0.000158406 -0.129321 -0.14465 -0.190762 -0.00213927 0.120179 -0.0103308 0.110755 -0.0995176 0.141709 0.0374588 -0.00344495 -0.0290208 0.0547544 -0.0608764 -0.0578825 0.0788986 -0.010308 -0.0315666 -0.00439501 -0.179682 -0.0642319 0.0702441 -0.00444118 -0.110798 0.0848008 0.0473498 -0.115815 -0.0395101 0.00147143 0.112622 0.0553639 -0.0468891 0.220126 -0.0733664 -0.00774932 -0.0461329 0.0496822 0.152327 -0.2229 0.133842 -0.0256636 -0.0211639 -0.0156102 -0.208355 0.143075 0.00757948 0.121074 -0.0597822 0.0471311 -0.0753663 0.0251572 0.0243469 -0.0258837 0.0493891 -0.0439054 -0.064841 0.0719043 -0.036915 -0.0823206 -0.0473038 -0.0299685 0.0840031 -0.024316 -0.0565206 0.111219 0.149001 -0.174184 -0.0338649 -0.0226439 -0.0312548 -0.0129556 -0.0653198 0.0107385 0.0695355 0.0629133 0.0465375 -0.0027035 -0.0732213 0.111207 -0.0702451 0.0406803 -0.0748777 0.0104781 -0.0369902 -0.0353913 -0.00103025 0.115257 -0.0243865 -0.0323335 0.0990966 0.0582669 -0.0263725 -0.0520261 0.00334734 0.191432 0.0720798 -0.00206267 -0.0437238 0.0975859 -0.0174494 0.0791895 0.00382361 -0.0933297 
0.104404 -0.0684809 0.0262052 -0.00441347 0.146512 0.170262 0.156445 -0.0185236 -0.057748 -0.0466679 -0.00719048 0.149511 0.0992503 -0.0160725 0.0312573 -0.0709637 -0.0956974 0.106352 -0.132904 0.120373 0.159437 -0.0354955 0.071675 0.172795 -0.0326196 -0.0858271 -0.147315 -0.198091 -0.00374751 0.128915 -0.0522326 0.0850691 -0.0839872 0.113097 0.0167927 0.00589272 -0.0765066 0.111275 -0.0798112 -0.0699106 0.0456718 -0.000268673 -0.0613337 0.00332109 -0.189585 -0.04427 0.068623 -0.00719317 -0.107254 0.0901583 0.00909108 -0.112155 -0.0291258 0.028559 0.158432 0.0356068 -0.0253896 0.233068 -0.098558 -0.0266102 -0.0220552 0.0583391 0.173737 -0.148786 0.127961 -0.0223571 -0.0382844 0.0340947 -0.170884 0.105622 0.027107 0.126388 -0.0562495 0.0394206 -0.0655702 0.0607741 0.0064654 -0.0673409 0.0884342 -0.012277 -0.0584804 0.0356634 -0.0372769 -0.0690418 -0.0684602 -0.0496407 0.105258 0.025566 -0.0105595 0.0937865 0.14204 -0.158702 -0.00903558 0.000562758 -0.0687169 -0.0390458 -0.0644037 0.030357 0.0965222 0.051421 0.0760154 0.000728045 -0.0758148 0.0757041 -0.0933377 0.0525989 -0.106672 0.0227952 -0.0135509 -0.0603579 0.0135461 0.129626 -0.0560049 -0.0428462 0.10194 0.119163 -0.0216908 -0.0430564 -0.0095201 0.206027 0.0400131 -0.0220931 -0.042573 0.0629322 -0.0580291 0.116241 0.00318783 -0.0648897 
0.114086 -0.0611823 -0.00252286 -0.00093883 0.145349 0.168257 0.14528 0.00151755 -0.0563245 -0.0279111 0.0210676 0.146551 0.0995674 -0.055797 0.0220581 -0.0624947 -0.0595117 0.128389 -0.148936 0.130828 0.158939 -0.0458437 0.0676992 0.19038 -0.0302092 -0.0765836 -0.119986 -0.214786 0.00357692 0.106229 -0.0399664 0.0948104 -0.0752165 0.132605 0.00497815 -0.00460814 -0.0709143 0.114645 -0.0848961 -0.0797421 0.0557214 -0.0162242 -0.0698011 0.0421817 -0.189201 -0.0601097 0.0773965 0.00927771 -0.125043 0.084279 0.023124 -0.113928 -0.0520746 0.00438853 0.138137 0.0410275 -0.0440564 0.224353 -0.0708635 -0.0493581 -0.0332836 0.0261277 0.182655 -0.145728 0.116752 -0.0449306 -0.0435981 0.0350107 -0.166524 0.113617 0.00300128 0.104004 -0.0612222 0.0295876 -0.0731143 0.0211211 0.00518781 -0.0149601 0.0723472 -0.0175395 -0.0869151 0.0460552 -0.0451534 -0.0960672 -0.0669004 -0.0475464 0.113084 0.0190589 0.000840196 0.0886596 0.140835 -0.163665 -0.0401479 -0.0178899 -0.0481805 -0.0279654 -0.0579139 0.0222996 0.0662259 0.0277983 0.0623468 0.000266565 -0.0668586 0.09768 -0.0834956 0.0405527 -0.111236 0.0295511 -0.00324721 -0.0775492 0.0127024 0.151649 -0.0589718 -0.0345166 0.113501 0.0851936 -0.0379484 -0.0909169 0.0153099 0.199999 0.0458414 -0.00335145 -0.0427128 0.093731 -0.0442554 0.078023 0.00381266 -0.0774828 
0.130785 -0.0630102 -0.0162755 -0.0274616 0.146542 0.157726 0.147043 0.0495931 -0.0408822 -0.0665798 0.0184267 0.145979 0.102348 -0.0820912 -0.000705635 -0.0619668 -0.0382681 0.0763123 -0.194267 0.162581 0.153871 -0.0254862 0.0410499 0.156853 -0.0668453 -0.0604268 -0.116275 -0.192107 0.00577749 0.068908 -0.0434853 0.0913909 -0.0704378 0.148393 -0.0182401 -0.013179 -0.0523106 0.14383 -0.105955 -0.0749619 0.0692015 -0.00246389 -0.0703364 0.0594596 -0.168516 -0.048643 0.0687312 0.0109141 -0.131353 0.10756 -0.0103529 -0.117822 -0.0798339 0.0124597 0.135779 0.0129832 -0.086762 0.21065 -0.0835944 -0.064402 -0.0424571 0.0142368 0.184346 -0.126855 0.0880944 -0.067034 -0.0313696 0.0521343 -0.141526 0.0682386 0.0164836 0.0617779 -0.037337 0.0371144 -0.0660504 0.0204631 0.00395253 -0.00915064 0.0679873 -0.0028454 -0.07521 0.0465381 -0.0415446 -0.0954538 -0.0522877 -0.0404317 0.12838 0.034204 0.0133889 0.0940753 0.150745 -0.18696 -0.0762441 -0.00665791 -0.0368744 -0.0198257 -0.0300241 -0.0145054 0.0183004 0.0178655 0.0355426 -0.00220342 -0.0721614 0.108845 -0.11954 0.0410939 -0.122933 0.0541339 -0.00732852 -0.0868995 0.0436197 0.155076 -0.0905176 -0.00377839 0.106486 0.0654628 -0.0632051 -0.11285 0.015318 0.181842 0.0239487 0.0385552 -0.0156581 0.123779 -0.0120259 0.029731 0.0109921 -0.104877 
0.102233 -0.0300574 -0.0227127 -0.0377275 0.14158 0.132307 0.127763 0.0442587 -0.066658 -0.0177343 0.0273919 0.0980479 0.103679 -0.0300854 0.026304 -0.0446718 -0.00621277 0.0996845 -0.156911 0.156168 0.139837 -0.0507531 0.0678293 0.163174 -0.0398153 -0.0522989 -0.104309 -0.170858 0.0751346 0.0535675 -0.0153949 0.0958262 -0.059681 0.114561 -0.0281249 0.0170278 -0.065644 0.176016 -0.10291 -0.0709951 0.0450083 0.0135905 -0.0863386 0.0686773 -0.166882 -0.0263314 0.0896251 0.0239133 -0.144906 0.0649649 -0.0422562 -0.0694849 -0.087554 -0.0187638 0.111253 0.0277873 -0.0668619 0.232775 -0.0508513 -0.0860322 -0.0731145 0.0191601 0.201535 -0.125439 0.0855777 -0.0188627 -0.0283536 0.0500668 -0.138726 0.100606 0.0171785 0.0818949 -0.0456984 0.051781 -0.044842 -0.0191231 0.00237945 0.0294999 0.0692633 -0.059488 -0.0970134 0.0708663 -0.0732631 -0.124611 -0.040646 -0.0424532 0.095159 0.0443206 0.0356979 0.0676205 0.170049 -0.147759 -0.0604047 -0.0364279 0.0250173 -0.0351448 -0.025141 0.0441599 0.0280615 0.00346903 0.0109237 -0.0176136 -0.0509641 0.11377 -0.149229 0.0841426 -0.120175 0.028732 0.0758664 -0.124292 0.0301723 0.190667 -0.0875807 0.00417717 0.132089 0.04876 -0.0429303 -0.155778 0.0513444 0.182138 0.0219433 0.0221135 -0.0222579 0.13232 -0.0702735 0.0408133 0.00610392 -0.0915355 
0.0878726 -0.0154996 -0.0143232 -0.0568232 0.121935 0.143984 0.112626 0.0359724 -0.0772164 0.0141562 0.0306438 0.108875 0.11074 -0.0518782 0.0183237 -0.0332272 -0.0511616 0.114552 -0.162241 0.146933 0.142093 -0.0398769 0.0884843 0.164036 -0.0621657 -0.0406847 -0.0846055 -0.187443 0.0686449 0.0636465 -0.0549581 0.0824578 -0.0504919 0.116903 -0.0258507 0.00130509 -0.0666769 0.180657 -0.103556 -0.0420647 0.0315995 -0.0197111 -0.0904413 0.0659531 -0.185832 -0.0290167 0.105375 0.023037 -0.168602 0.0845569 -0.00145305 -0.0749161 -0.107808 0.00905428 0.116941 0.02822 -0.0264594 0.211488 -0.0548735 -0.0823173 -0.057509 0.00725717 0.204247 -0.11145 0.103116 -0.0479919 -0.0433077 0.0601678 -0.13282 0.122893 0.00640249 0.0879788 -0.0505655 0.0555046 -0.0271858 -0.00792223 -0.0169374 0.0392719 0.073152 -0.0633287 -0.0828267 0.0668405 -0.0602219 -0.101483 -0.0657583 -0.0278462 0.101891 0.0445824 0.0377326 0.0820043 0.141131 -0.16022 -0.0576585 -0.032536 -0.00983097 -0.0427071 -0.0433319 0.0579663 0.0523962 0.00151173 0.0369814 -0.0154732 -0.0595242 0.117037 -0.1112 0.058382 -0.135714 0.0455302 0.0473851 -0.126883 0.0238069 0.201152 -0.0611363 -0.00655197 0.118969 0.0650078 -0.0499031 -0.139466 0.0348129 0.184994 0.0388001 0.00602033 -0.0155885 0.112116 -0.0692436 0.057388 -0.00525687 -0.0762574 
0.0878726 -0.0154996 -0.0143232 -0.0568232 0.121935 0.143984 0.112626 0.0359724 -0.0772164 0.0141562 0.0306438 0.108875 0.11074 -0.0518782 0.0183237 -0.0332272 -0.0511616 0.114552 -0.162241 0.146933 0.142093 -0.0398769 0.0884843 0.164036 -0.0621657 -0.0406847 -0.0846055 -0.187443 0.0686449 0.0636465 -0.0549581 0.0824578 -0.0504919 0.116903 -0.0258507 0.00130509 -0.0666769 0.180657 -0.103556 -0.0420647 0.0315995 -0.0197111 -0.0904413 0.0659531 -0.185832 -0.0290167 0.105375 0.023037 -0.168602 0.0845569 -0.00145305 -0.0749161 -0.107808 0.00905428 0.116941 0.02822 -0.0264594 0.211488 -0.0548735 -0.0823173 -0.057509 0.00725717 0.204247 -0.11145 0.103116 -0.0479919 -0.0433077 0.0601678 -0.13282 0.122893 0.00640249 0.0879788 -0.0505655 0.0555046 -0.0271858 -0.00792223 -0.0169374 0.0392719 0.073152 -0.0633287 -0.0828267 0.0668405 -0.0602219 -0.101483 -0.0657583 -0.0278462 0.101891 0.0445824 0.0377326 0.0820043 0.141131 -0.16022 -0.0576585 -0.032536 -0.00983097 -0.0427071 -0.0433319 0.0579663 0.0523962 0.00151173 0.0369814 -0.0154732 -0.0595242 0.117037 -0.1112 0.058382 -0.135714 0.0455302 0.0473851 -0.126883 0.0238069 0.201152 -0.0611363 -0.00655197 0.118969 0.0650078 -0.0499031 -0.139466 0.0348129 0.184994 0.0388001 0.00602033 -0.0155885 0.112116 -0.0692436 0.057388 -0.00525687 -0.0762574 
