0.0240725 -0.0432868 0.0629583 -0.0119657 0.0362997 0.202432 0.0349945 0.0165178 -0.0213463 -0.0244999 0.0584992 0.0891286 0.0244923 -0.118809 0.0278355 -0.067963 -0.154556 0.022001 0.0150997 0.0350797 0.185012 -0.0633797 0.0152841 0.161399 0.0640786 0.0496268 -0.0139808 -0.217338 0.0795306 0.045538 0.0754554 -0.0384727 -0.0266389 0.0846188 0.0335413 0.0320811 -0.0917519 0.0433955 0.0165027 -0.0863496 0.0841988 -0.127991 -0.086274 0.0842495 -0.104332 -0.115596 0.0857123 -0.0255112 -0.139508 -0.0431554 -0.0373263 0.0124965 0.0410033 -0.018723 0.129411 0.0874017 -0.0277472 0.168442 -0.14051 -0.101679 -0.0615596 -0.0422517 0.237822 -0.0671875 0.123022 0.0364388 -0.00793577 -0.0272713 -0.0852688 0.135203 -0.076887 0.0692388 -0.159763 -0.0227447 0.0423839 -0.0479122 -0.0186769 0.0361232 0.0719102 0.125552 -0.14116 0.0301087 0.0708935 -0.0359736 -0.0248607 -0.0964771 0.127659 0.0909425 0.0337964 0.0578458 0.142865 -0.0772824 -0.0395364 0.0884091 -0.0831901 -0.0771348 -0.0357857 0.0421964 0.0795233 -0.0133884 0.0703825 -0.00295356 -0.106526 -0.0146406 -0.0209702 0.10228 0.0051245 -0.00232624 0.0385514 -0.110303 0.00148853 0.112538 -0.0925617 -0.0906197 0.212207 0.0972785 -0.0494197 -0.10721 0.0807711 0.193248 0.102979 -0.0837462 -0.0394595 -0.0232326 -0.0428274 0.1663 0.133877 0.0560664 
0.00244967 -0.0291777 0.10053 -0.00295885 0.0329135 0.202358 0.00990157 0.00985462 -0.00555767 -0.0232548 0.0566663 0.0851423 0.00788142 -0.144613 0.0354201 -0.054468 -0.160893 0.0295034 0.00539769 0.0180568 0.184143 -0.0396388 0.0164326 0.174077 0.0673879 0.0526863 -0.0136196 -0.222446 0.085634 0.028216 0.098627 -0.0409724 -0.0191995 0.0905429 0.0458898 0.0363318 -0.0756173 0.0336555 0.0195207 -0.0680867 0.100313 -0.13462 -0.0890869 0.0743941 -0.0932495 -0.116363 0.0920955 -0.0259076 -0.132833 -0.0515847 -0.018657 0.0212442 0.0438866 -0.0249691 0.123242 0.0907336 -0.00646691 0.135759 -0.133043 -0.102376 -0.0680576 -0.0482267 0.203664 -0.0588763 0.125448 0.0114012 0.00208387 -0.0372602 -0.0754581 0.160774 -0.084164 0.0641301 -0.160137 -0.0259022 0.058945 -0.0522477 -0.0412949 0.0715316 0.0638905 0.13346 -0.1334 0.0543106 0.0921948 -0.0154563 -0.0145202 -0.0938935 0.135186 0.0998704 0.00138007 0.0586101 0.128763 -0.0622382 -0.0319682 0.0858193 -0.0980042 -0.0766707 -0.0422849 0.0475453 0.0706851 -0.0182986 0.0760916 -0.00534106 -0.111959 -0.0105159 0.0163313 0.0784656 0.0138604 -0.0125029 0.0435166 -0.0994284 -0.0185562 0.109489 -0.0933334 -0.0915033 0.209099 0.0904316 -0.0642703 -0.118429 0.0631584 0.189919 0.123562 -0.0643828 -0.04953 -0.0350226 -0.0414337 0.170291 0.133996 0.0700539 
0.00764833 -0.0351793 0.105531 -0.00535968 0.0358417 0.219734 0.00101613 0.000956527 -0.0217189 -0.0181938 0.0445472 0.0904732 -0.0012267 -0.135333 0.0676904 -0.0829563 -0.140617 0.0214606 0.0401248 0.00752475 0.150195 -0.0194878 0.0140919 0.191616 0.0767302 0.0480463 0.00396109 -0.213347 0.0682518 0.018833 0.113681 -0.0635756 -0.0239889 0.0861071 0.0545812 0.0463491 -0.0704012 -0.00174926 0.0172125 -0.0623987 0.104452 -0.130538 -0.0930777 0.0714336 -0.105107 -0.106286 0.0858328 -0.0155307 -0.126742 -0.0458949 -0.00362938 0.0131453 0.0675855 -0.0426663 0.117962 0.0973601 -0.0222217 0.153016 -0.125266 -0.0887742 -0.0741088 -0.0262732 0.192104 -0.077559 0.132868 0.0138401 0.0147937 -0.0437577 -0.0942895 0.165802 -0.0863161 0.0657075 -0.164396 -0.0338124 0.0559799 -0.0439463 -0.0435062 0.0615016 0.0770406 0.141001 -0.134189 0.0468738 0.0930605 -0.0176637 -0.0013423 -0.121196 0.131066 0.0848596 -0.0115293 0.0701743 0.124639 -0.046117 -0.0128664 0.0969049 -0.0963466 -0.072579 -0.0307073 0.0327211 0.0672759 -0.024177 0.0733021 0.00962004 -0.115538 -0.0326958 0.000743399 0.0771828 0.0145536 -0.0468725 0.0250263 -0.0768509 0.00856897 0.103614 -0.0671301 -0.0987655 0.191107 0.0841164 -0.0685023 -0.11436 0.0558493 0.193336 0.133116 -0.0920652 -0.0598168 -0.047932 -0.0332423 0.173741 0.129753 0.0642898 
0.00419707 -0.0538658 0.117548 0.00164265 0.0319755 0.206687 0.0219423 0.0060174 -0.0285102 -0.0172926 0.0393441 0.0908836 0.00588866 -0.11452 0.0794736 -0.0791878 -0.139123 0.0199015 0.0438864 -0.000691159 0.15341 -0.0365538 0.00898444 0.183328 0.0811028 0.0544159 -0.0211112 -0.213694 0.0679977 0.0186658 0.112399 -0.0323135 -0.0304618 0.0880919 0.0442422 0.0414387 -0.0806513 0.00959631 0.0288514 -0.0663562 0.109116 -0.126481 -0.0947268 0.0448053 -0.0957899 -0.114903 0.0716907 -0.0317326 -0.122812 -0.070549 -0.014315 0.00095031 0.078968 -0.0401381 0.114958 0.103053 -0.0170398 0.166794 -0.134072 -0.0771442 -0.0684944 -0.0184712 0.17988 -0.0824926 0.137777 0.0562436 0.0140788 -0.0398633 -0.0996801 0.143319 -0.0875539 0.076702 -0.166219 -0.0200379 0.0544053 -0.04094 -0.0311072 0.0288104 0.0791544 0.134916 -0.141691 0.034212 0.0927536 -0.0295128 -0.00948921 -0.126316 0.13942 0.083339 -0.0121327 0.053299 0.12548 -0.038581 0.000670892 0.103903 -0.0966598 -0.0563307 -0.0312511 0.029947 0.0725859 -0.00545377 0.0691932 -0.00699981 -0.119757 -0.0222552 0.00452306 0.0868464 0.0184021 -0.0473361 0.0289934 -0.0900456 -0.0056603 0.103608 -0.0772668 -0.11213 0.205414 0.090188 -0.0659962 -0.101666 0.0607849 0.191312 0.126226 -0.0953482 -0.0606774 -0.0495663 -0.0357724 0.184598 0.117394 0.0598878 
-0.00479611 -0.0615535 0.0892229 0.0112839 0.0430987 0.148411 0.0103614 -0.00273501 0.00206906 -0.0267305 0.0511579 0.0671227 0.000255252 -0.0904331 0.0709369 -0.0433603 -0.106691 0.0181298 0.0594361 0.025982 0.170966 -0.0480373 0.0292577 0.13099 0.0790588 0.0897218 -0.02705 -0.235037 0.096854 0.0203116 0.130715 -4.72103e-05 0.00739845 0.0649169 0.0643157 0.0671042 -0.0580979 0.0891405 0.0334366 -0.100002 0.0835759 -0.0871608 -0.104787 0.062135 -0.0915179 -0.0835368 0.0817151 -0.0341488 -0.096458 -0.0935433 -0.0726138 0.0333663 0.0699092 -0.0365564 0.126338 0.0833592 0.00390549 0.137941 -0.139627 -0.0880632 -0.074819 -0.0765041 0.196827 -0.070255 0.154417 0.0328643 0.00768293 -0.0202626 -0.0472096 0.155397 -0.0749168 0.0709931 -0.169681 -0.0205925 0.0331325 -0.0798291 -0.0342617 0.0671851 0.0525075 0.109834 -0.152104 0.0675537 0.0560452 -0.0462439 0.0103717 -0.14368 0.122667 0.116977 0.00710123 0.0205721 0.151136 -0.00845191 -0.0260148 0.0721074 -0.0441453 -0.0700676 -0.0151246 0.0649532 0.0654578 -0.0189623 0.0391127 -0.0245229 -0.106744 -0.0347548 0.000216892 0.087791 0.041153 -0.0522389 0.118488 -0.093708 -0.0416358 0.106368 -0.121427 -0.101815 0.238937 0.0785437 -0.0365308 -0.17321 0.0642822 0.177583 0.113754 -0.025725 -0.0350003 -0.00264193 -0.0499684 0.146111 0.160284 0.0762389 
0.00258361 -0.0379189 0.0951329 0.0137777 0.0517836 0.20413 0.00357939 -0.0353555 0.00793838 -0.0404036 0.0522611 0.088148 -0.011726 -0.113318 0.0551996 -0.0503353 -0.13204 0.0550392 0.0183972 0.0140848 0.172657 -0.0235884 0.0116181 0.156136 0.0786851 0.0629254 -0.0337445 -0.216842 0.0718618 0.0330014 0.130937 0.000553755 -0.0205682 0.0723517 0.0824079 0.075282 -0.0665312 0.0272931 0.0346119 -0.0880326 0.100567 -0.0941931 -0.0791253 0.067541 -0.096492 -0.10674 0.0953041 -0.0217669 -0.118841 -0.0618805 -0.0349203 0.0148083 0.0597455 -0.0321856 0.125909 0.0949681 -0.0229981 0.154107 -0.142777 -0.0959303 -0.0846105 -0.0424931 0.215103 -0.0886964 0.149332 0.0286296 0.00834113 -0.0393139 -0.0913108 0.19215 -0.0576791 0.0724512 -0.147727 -0.0229826 0.0251319 -0.0678689 -0.0506637 0.0458515 0.0480339 0.092265 -0.122174 0.0974284 0.064356 -0.0410508 -0.0138229 -0.114502 0.117906 0.0955877 -0.00974201 0.0688053 0.15021 -0.0499056 -0.0329505 0.0708057 -0.0521018 -0.0587844 -0.0360131 0.0583975 0.0563131 -0.00712927 0.053317 -0.0130422 -0.112338 -0.0333646 0.00780328 0.0988134 0.0262606 -0.0534399 0.0627764 -0.0732264 -0.0283187 0.0959782 -0.0971825 -0.0872448 0.219382 0.0674591 -0.0478278 -0.142714 0.0726298 0.175978 0.144447 -0.0574411 -0.0225092 -0.0274674 -0.0357793 0.156738 0.159464 0.06429 
0.0162395 -0.0587965 0.0862754 0.0013473 0.0512156 0.17747 -0.00355512 0.000564529 0.000650878 -0.0682837 0.054563 0.100519 0.0120899 -0.110858 0.0189161 -0.0391478 -0.13887 0.0206408 -0.00246018 0.0458225 0.208705 -0.042758 0.0315307 0.157684 0.0726906 0.0669545 -0.00373277 -0.221472 0.0662331 0.0409973 0.09184 -0.0246564 0.000313085 0.0936636 0.0418322 0.0452571 -0.0716834 0.0671315 0.0168926 -0.0919932 0.089268 -0.101462 -0.0695689 0.0821056 -0.094241 -0.105689 0.100776 -0.0423686 -0.122733 -0.0391612 -0.0336455 0.0061685 0.0434118 -0.00811194 0.148617 0.0778689 -0.0128964 0.145409 -0.137339 -0.11599 -0.0608626 -0.065931 0.212263 -0.0518447 0.129013 0.0053797 -0.0128738 -0.0115669 -0.0606886 0.166338 -0.0712596 0.0553939 -0.159244 -0.0419964 0.0435339 -0.0504008 -0.0319751 0.0569063 0.0494485 0.130929 -0.133868 0.0648819 0.0823734 -0.031984 -0.0220861 -0.100108 0.134604 0.115062 0.00611692 0.0560312 0.13871 -0.0761165 -0.0520905 0.0835572 -0.0803927 -0.0645946 -0.0422551 0.0627197 0.0680377 -0.0266566 0.0570073 -0.012126 -0.104875 -0.00172152 -0.00227809 0.0796496 -0.00308834 -0.00565237 0.0538327 -0.124745 -0.0278696 0.109911 -0.121277 -0.0702115 0.219504 0.0911595 -0.0570128 -0.140816 0.0613811 0.194148 0.115736 -0.0234222 -0.034905 -0.0229601 -0.0355346 0.150687 0.159657 0.0657425 
-0.0187246 -0.0610772 0.0650018 -0.0141934 0.0454905 0.171937 -0.0203616 -0.00806168 0.00268974 -0.0343248 0.0458797 0.0921111 0.000669959 -0.122442 0.0429602 -0.0325936 -0.169935 0.0171147 0.0382023 0.0428511 0.167732 -0.032875 0.0527534 0.129014 0.0541165 0.107588 0.0159807 -0.253666 0.0686591 0.0128815 0.101148 -0.0327991 0.0181692 0.0678757 0.0555564 0.0679703 -0.0606195 0.0759567 0.00757847 -0.0712783 0.0949392 -0.104518 -0.087469 0.109638 -0.121403 -0.0866975 0.123761 -0.0333958 -0.116453 -0.0511403 -0.0553407 -0.0217866 0.0407549 -0.0138433 0.139234 0.0917035 0.00247497 0.140431 -0.127095 -0.102713 -0.0724526 -0.0754469 0.227741 -0.0419662 0.161714 -0.00797835 -0.00928022 -0.0210228 -0.0248866 0.168178 -0.0801921 0.0681284 -0.143505 -0.0274648 0.0537383 -0.0709073 -0.0672179 0.0825839 0.0424021 0.0962855 -0.124452 0.0815687 0.0526914 -0.0256692 -0.028406 -0.103515 0.136168 0.123585 0.00681275 0.0405709 0.142427 -0.0396088 -0.0482308 0.0526974 -0.0662648 -0.0641328 -0.0395678 0.0817202 0.0810955 -0.0235551 0.0312801 -0.0359196 -0.0932125 -0.0443764 -0.000373077 0.0738314 -0.000390392 -0.025357 0.0540129 -0.0887346 -0.0235929 0.118924 -0.0913102 -0.100595 0.202926 0.0779204 -0.0438307 -0.172722 0.050424 0.170508 0.138897 -0.0278739 -0.024557 -0.0155407 -0.0626842 0.14353 0.135986 0.0897996 
-0.00491923 -0.0446982 0.0598787 -0.0145547 0.0601922 0.182002 -0.0103377 -0.00361722 -0.0116435 -0.0272143 0.0482447 0.0916116 0.00664018 -0.121604 0.0379658 -0.0344784 -0.138185 0.0374215 0.0352395 0.040021 0.181085 -0.0361174 0.0442554 0.138789 0.0675541 0.0815908 0.0147944 -0.236995 0.0824789 0.0358039 0.0959496 -0.0317607 0.0198367 0.0729523 0.0638507 0.0530497 -0.0581756 0.054125 0.0139989 -0.0946945 0.0907722 -0.108596 -0.0611915 0.113688 -0.122903 -0.0847974 0.123353 -0.027167 -0.135889 -0.0561527 -0.0395463 -0.0113723 0.0441145 -0.0262197 0.133287 0.0958636 -0.00786132 0.140064 -0.129307 -0.108069 -0.0731654 -0.074309 0.22706 -0.0559444 0.16113 -0.00297286 -0.0268081 -0.0274599 -0.0567248 0.166748 -0.0819372 0.0571633 -0.159981 -0.0553759 0.0414986 -0.0559359 -0.0474775 0.0832333 0.0492082 0.0952294 -0.135453 0.0776451 0.0584294 -0.017491 -0.0186673 -0.104424 0.123141 0.113109 0.0121264 0.0623733 0.138945 -0.0510687 -0.0666381 0.0643124 -0.0590424 -0.0642779 -0.0387844 0.0873661 0.0656461 -0.0304665 0.0479911 -0.0197416 -0.0919597 -0.0350127 -0.0102119 0.076499 0.00626367 -0.0212223 0.0594852 -0.0996494 -0.0215441 0.103351 -0.0949993 -0.0870089 0.207901 0.0740151 -0.0514669 -0.163991 0.0598764 0.185571 0.134439 -0.04273 -0.0345411 -0.0197159 -0.0505836 0.145282 0.145782 0.0704466 
-0.00930753 -0.0462174 0.0589556 -0.00375892 0.0625988 0.169476 -0.0205269 -0.0232227 -0.00486205 -0.0357733 0.0435946 0.0852048 -0.0024112 -0.109095 0.0465207 -0.0276561 -0.12805 0.029111 0.054802 0.043083 0.175997 -0.0300092 0.0494797 0.132 0.0704184 0.0898841 0.00407301 -0.245267 0.0810404 0.0368064 0.11146 -0.0204399 0.0278022 0.0678985 0.0751988 0.0749716 -0.0461985 0.0605357 0.0194188 -0.0971887 0.0832689 -0.096028 -0.0625872 0.100186 -0.114678 -0.0597233 0.129328 -0.0249214 -0.120625 -0.0584023 -0.0550173 0.0021251 0.0572731 -0.0269459 0.143288 0.0917313 0.00685881 0.128401 -0.12722 -0.0986785 -0.0743373 -0.0702868 0.217631 -0.065154 0.165315 -0.0130322 -0.0181778 -0.0236648 -0.0429893 0.176088 -0.0777835 0.058743 -0.168775 -0.0478702 0.0413059 -0.0609363 -0.0505776 0.0928217 0.0431135 0.0937406 -0.134265 0.0924458 0.0481032 -0.0190362 -0.00969071 -0.110024 0.112739 0.112352 -5.18872e-05 0.0556982 0.14787 -0.0309492 -0.0563444 0.0573609 -0.0471055 -0.0638347 -0.0350593 0.0985922 0.0686858 -0.0347529 0.0425907 -0.0208867 -0.092612 -0.0415687 -0.00959342 0.0767568 0.0151225 -0.0335426 0.0739619 -0.0803967 -0.0324088 0.0951029 -0.100668 -0.0974479 0.208766 0.0752335 -0.0394915 -0.18684 0.0521678 0.18719 0.139449 -0.0255249 -0.0270256 -0.0104571 -0.064457 0.142423 0.156777 0.0809117 
-0.018124 -0.073785 0.113526 -0.00215714 0.0591044 0.161518 -0.0264672 -0.000146709 0.00733873 -0.0353765 0.0372936 0.0963756 -0.0112702 -0.121453 0.0594043 -0.0408109 -0.141266 0.041219 0.032289 0.0452419 0.179054 -0.0220979 0.0458688 0.156677 0.066426 0.0880051 -0.00438229 -0.239527 0.0654759 0.00625301 0.118824 -0.0369647 0.0109032 0.0788787 0.0696202 0.0680061 -0.0627696 0.059123 0.0106114 -0.0843483 0.0943832 -0.0879483 -0.0913215 0.0826955 -0.106764 -0.0981941 0.104197 -0.0274317 -0.09746 -0.0432097 -0.0373595 -0.00715618 0.045934 -0.0270406 0.139702 0.0838103 0.00650417 0.122365 -0.132618 -0.0964736 -0.0596793 -0.0721698 0.18661 -0.0409326 0.152484 -0.0244827 -0.0101211 -0.0231006 -0.0415268 0.185713 -0.0695948 0.0721014 -0.150673 -0.0339176 0.0268246 -0.070134 -0.0592813 0.090632 0.0592628 0.10408 -0.134433 0.0926639 0.0680696 -0.0175056 0.000202563 -0.131118 0.137823 0.140413 0.00721658 0.0450345 0.136331 -0.0180741 -0.0318919 0.0700842 -0.0659053 -0.0619329 -0.0446148 0.0704747 0.0508642 -0.0287759 0.0466619 -0.0265098 -0.113629 -0.048578 0.0261883 0.0651111 0.015605 -0.0624583 0.0797414 -0.0782078 -0.039132 0.11142 -0.101264 -0.0845184 0.210573 0.0751127 -0.0368951 -0.17721 0.0319816 0.179347 0.132641 -0.00813004 -0.0412558 -0.0232786 -0.0592804 0.143707 0.15619 0.0815237 
-0.0123144 -0.029354 0.0466851 -0.0170587 0.0520032 0.189615 -0.0116515 -0.0143286 -0.00934474 -0.0226269 0.0469085 0.0809078 -0.010926 -0.133214 0.0380584 -0.0425228 -0.154643 0.0346443 0.0569903 0.028048 0.164192 -0.0283119 0.0439514 0.125972 0.06172 0.0847575 0.0154249 -0.241619 0.0862187 0.0287949 0.100416 -0.0497036 0.01345 0.0555295 0.0777916 0.0644236 -0.0558795 0.0376895 0.0148222 -0.0816431 0.090041 -0.107665 -0.0696823 0.123581 -0.130672 -0.0693056 0.131213 -0.0228929 -0.132777 -0.0517633 -0.0520791 0.00613372 0.0411396 -0.0258027 0.130466 0.0970181 0.00381678 0.138571 -0.128592 -0.0977388 -0.0760722 -0.0649994 0.243104 -0.0599711 0.166226 -0.0197155 -0.0175376 -0.0405471 -0.0459855 0.180546 -0.0756599 0.0640578 -0.153487 -0.0414098 0.0449039 -0.0616971 -0.0621458 0.0963837 0.0418403 0.0815536 -0.133581 0.0868647 0.053271 -0.00875762 -0.0210685 -0.0960655 0.113876 0.104808 0.00669723 0.0570589 0.146526 -0.0402333 -0.0621034 0.0444036 -0.0452727 -0.0789006 -0.0328384 0.0940098 0.0686442 -0.0251746 0.0392485 -0.0114506 -0.0872087 -0.0497246 -0.0105018 0.0809376 0.0199909 -0.0231147 0.0524826 -0.074629 -0.0115351 0.0930835 -0.0795208 -0.0998527 0.198947 0.0721081 -0.0340117 -0.173674 0.0668019 0.176548 0.141821 -0.0562211 -0.027392 -0.0214239 -0.0581967 0.147215 0.146177 0.0863763 
-0.00959365 -0.041818 0.101686 0.0109777 0.0653133 0.175575 -0.00916989 -0.0347289 0.00158565 -0.0364827 0.0444389 0.0980703 -0.0247488 -0.120625 0.05563 -0.0372949 -0.130831 0.0644439 0.0357612 0.0384144 0.165993 -0.011431 0.0259759 0.150295 0.0652634 0.0875729 -0.0187136 -0.22715 0.0828089 0.0287168 0.108848 -0.0040773 0.00620649 0.0716968 0.0906614 0.074483 -0.0421118 0.0412982 0.0257345 -0.0955364 0.100191 -0.0823946 -0.0623913 0.0755911 -0.114398 -0.0827961 0.124764 -0.0328812 -0.118053 -0.0540317 -0.0404146 -0.000272633 0.0465109 -0.0235226 0.14482 0.0952772 -0.00583652 0.133798 -0.14421 -0.0871067 -0.0739013 -0.0614356 0.209509 -0.073207 0.164377 0.00137787 -0.00892843 -0.05628 -0.0713491 0.195242 -0.0660454 0.0653071 -0.142785 -0.0183288 0.0301092 -0.0718885 -0.0557577 0.0826812 0.0507253 0.0598876 -0.119211 0.126989 0.049571 -0.0262708 0.00594996 -0.119989 0.109998 0.118743 -0.0061347 0.0763696 0.156596 -0.0299225 -0.0457466 0.0592846 -0.0412651 -0.0588522 -0.0375257 0.0810105 0.0649519 -0.0171922 0.0327036 -0.0235692 -0.103114 -0.0436716 0.0095527 0.0901925 0.035471 -0.0581872 0.0728014 -0.0668499 -0.0349247 0.0961587 -0.0886274 -0.0884926 0.209915 0.0526752 -0.0300014 -0.182709 0.0499351 0.167583 0.147998 -0.0259995 -0.0219171 -0.0240855 -0.0498284 0.151454 0.166336 0.0631561 
-0.0157489 -0.0181394 0.0869812 -0.0149224 0.0422153 0.170664 -0.0185537 -0.00354758 -0.00894874 -0.03581 0.0433668 0.0562844 -0.0203262 -0.119027 0.0700063 -0.0632642 -0.130201 0.00866869 0.0717118 0.0280916 0.154804 -0.0226313 0.0430293 0.138248 0.0717405 0.073266 0.00457647 -0.224045 0.102581 0.00862502 0.122644 -0.0706643 0.0232041 0.0630977 0.0804553 0.0726214 -0.0386944 0.0567698 0.013345 -0.0791012 0.0861886 -0.0968831 -0.0882505 0.0871417 -0.113005 -0.0449515 0.118122 -0.0228689 -0.128085 -0.0498748 -0.0804362 0.039364 0.063058 -0.0305921 0.124766 0.0889451 0.00936357 0.12713 -0.138001 -0.0992833 -0.0786446 -0.0481954 0.21143 -0.066725 0.149013 -0.00127941 0.00816145 -0.0425144 -0.049731 0.17255 -0.0764229 0.0499352 -0.16853 -0.0255238 0.0692286 -0.0680173 -0.0601569 0.0950916 0.0660808 0.102735 -0.151266 0.083867 0.0547509 -0.0143731 0.0156986 -0.112559 0.100992 0.106233 -0.00133451 0.0549987 0.165224 -0.0211092 -0.0305458 0.0555506 -0.0398948 -0.094415 -0.0240522 0.0890359 0.0619708 -0.0367496 0.0303481 -0.00759782 -0.0964126 -0.0513495 -0.0178853 0.0932181 0.040372 -0.0409777 0.0861553 -0.0800437 -0.00258207 0.0906279 -0.0924963 -0.0985604 0.200657 0.0777534 -0.0374278 -0.187453 0.0649399 0.185095 0.13101 -0.0426764 -0.0478165 -0.00809768 -0.0578751 0.145766 0.164348 0.0816154 
-0.00640577 -0.0444476 0.107821 -0.00782233 0.070665 0.193374 -0.00602688 -0.0212151 0.0043553 -0.0379647 0.0442396 0.103044 -0.00665721 -0.130272 0.0520394 -0.0469907 -0.14212 0.0577398 0.000658541 0.0382234 0.17438 -0.0126194 0.0228624 0.158289 0.0587983 0.0760853 -0.0247432 -0.223519 0.0778465 0.0181688 0.11655 -0.0134034 -0.014061 0.0839745 0.0776532 0.069065 -0.0602948 0.0395473 0.0252611 -0.0798679 0.106584 -0.0906083 -0.0824448 0.0755311 -0.108947 -0.0996143 0.106021 -0.017118 -0.120444 -0.0438952 -0.0379561 -0.00121874 0.0316087 -0.0300584 0.127052 0.0883502 -0.0199924 0.146827 -0.150946 -0.0903713 -0.0723232 -0.050767 0.212315 -0.0649407 0.149564 -0.00702794 -0.0039489 -0.029451 -0.0747483 0.191352 -0.0583399 0.0712761 -0.141071 -0.0209674 0.0257328 -0.0642595 -0.0611014 0.0739801 0.0591201 0.0832008 -0.121045 0.110509 0.0641198 -0.0219125 -0.00942899 -0.119418 0.133432 0.121929 -0.00175309 0.071953 0.151963 -0.0458941 -0.0341826 0.0739649 -0.0612563 -0.0652158 -0.0442792 0.0592509 0.0504505 -0.0183685 0.0472036 -0.0231665 -0.122451 -0.0318961 0.0164811 0.0865751 0.0142623 -0.0470931 0.0641057 -0.0732946 -0.0261589 0.107567 -0.099309 -0.0689709 0.208605 0.0651366 -0.0558389 -0.158632 0.0463118 0.180042 0.141607 -0.0287406 -0.0321661 -0.0196348 -0.049404 0.147348 0.144111 0.0565962 
0.000825968 -0.0144538 0.0887846 -0.00753951 0.0467283 0.191519 -0.00688235 -0.0206656 -0.00406134 -0.0463108 0.0483676 0.0755238 -0.0135442 -0.125995 0.0497752 -0.0651307 -0.143577 0.0213438 0.0391919 0.0244021 0.167406 -0.00923766 0.0273885 0.158501 0.0692685 0.0622903 -0.000557161 -0.218581 0.0954227 0.0341109 0.107721 -0.0526995 0.00050859 0.0718579 0.0796105 0.0605367 -0.0482452 0.0388069 0.0146267 -0.0765515 0.0935338 -0.105577 -0.0818998 0.0917994 -0.114154 -0.0601687 0.114798 -0.0191292 -0.129714 -0.0423938 -0.0469322 0.0434759 0.0553895 -0.0265075 0.136775 0.0846818 -0.00403384 0.138883 -0.138452 -0.0997524 -0.0762603 -0.0452086 0.217954 -0.0635978 0.138213 -0.0115832 0.0124433 -0.045869 -0.0644833 0.186545 -0.0725101 0.0525633 -0.158825 -0.0248096 0.0597801 -0.0598058 -0.0593707 0.0822224 0.0603762 0.115873 -0.124961 0.088125 0.0694096 -0.0161761 0.00812147 -0.112305 0.110313 0.0972142 -0.0132273 0.0752098 0.158711 -0.0460594 -0.0384862 0.0627124 -0.0665166 -0.0928704 -0.0299146 0.0735868 0.0761354 -0.0353016 0.0533973 0.00917034 -0.0950379 -0.033382 -0.0175202 0.083919 0.0263893 -0.0243744 0.0680259 -0.0779661 0.00658239 0.0953315 -0.100927 -0.089054 0.194637 0.0835119 -0.0480514 -0.164964 0.0616109 0.188565 0.137127 -0.0486916 -0.0433002 -0.0217127 -0.046639 0.155514 0.159939 0.0730394 
-0.0128792 -0.0151899 0.0897761 -0.00854159 0.0458549 0.176614 -0.0231125 -0.027223 -0.0126972 -0.0452583 0.0509711 0.0654269 -0.0175341 -0.109083 0.0635892 -0.051755 -0.128699 0.0100297 0.0655216 0.0244453 0.165715 -0.0131185 0.0279864 0.14849 0.0775681 0.0793624 -0.0021882 -0.224948 0.0994526 0.0271422 0.120357 -0.0583766 0.0112658 0.061923 0.0806624 0.08593 -0.0479889 0.0376529 0.0232854 -0.0699595 0.0856716 -0.0932872 -0.0818683 0.0825411 -0.0981063 -0.0338552 0.125088 -0.0279598 -0.135493 -0.0669933 -0.0669937 0.0364328 0.0617243 -0.0348421 0.130513 0.094959 -0.00274425 0.142924 -0.135257 -0.0854225 -0.0751119 -0.0423393 0.212994 -0.0675021 0.15346 -0.00887256 0.0107956 -0.0401228 -0.0492255 0.180527 -0.0681095 0.0556307 -0.16763 -0.0398994 0.0699595 -0.0564557 -0.0637172 0.0982883 0.053532 0.109227 -0.135141 0.0931473 0.058348 -0.0145448 -0.00557739 -0.104789 0.107361 0.0917213 -0.0272421 0.060315 0.157721 -0.027559 -0.0328923 0.0666061 -0.0532058 -0.0822051 -0.0274795 0.0773785 0.0742977 -0.0337888 0.0325595 -0.00244504 -0.101573 -0.046378 -0.0220076 0.0958443 0.0328476 -0.0351972 0.0707408 -0.0800867 -0.00390951 0.0808986 -0.100197 -0.101896 0.198508 0.0866353 -0.0559326 -0.179362 0.0518749 0.183727 0.132067 -0.0435372 -0.0472285 -0.0127982 -0.0568042 0.164466 0.154432 0.0753087 
0.0013282 -0.0687785 0.0803618 0.0044611 0.065032 0.187732 -0.00429643 -0.0244856 0.0117665 -0.0491141 0.0499666 0.111242 -0.0161711 -0.115512 0.0363894 -0.0646298 -0.147399 0.0637667 0.022619 0.0530631 0.164445 -0.0329225 0.0341813 0.160818 0.0599272 0.0716621 -0.00468025 -0.223971 0.0590333 0.0199442 0.109213 -0.0299556 -0.00346368 0.0667186 0.0742911 0.0716866 -0.0680852 0.0408841 0.00470618 -0.0960845 0.1017 -0.0797318 -0.0845043 0.09802 -0.1317 -0.120388 0.104769 -0.0265604 -0.0983182 -0.0242645 -0.0524921 -0.0185846 0.0402615 -0.0220952 0.139907 0.0914934 -0.0296996 0.158332 -0.143731 -0.0976701 -0.0736565 -0.0530525 0.236391 -0.0663777 0.147766 0.00348104 -0.0041671 -0.0481107 -0.0759919 0.190851 -0.0575373 0.0705631 -0.126018 -0.0167218 0.0164502 -0.0732127 -0.0505036 0.0564293 0.0553652 0.0676646 -0.130891 0.106819 0.0461829 -0.0389513 -0.00194666 -0.120444 0.118994 0.122297 0.0132812 0.0644944 0.161118 -0.0497166 -0.0336222 0.0513478 -0.038798 -0.075385 -0.0468775 0.0653596 0.0627548 -0.0148978 0.0348923 -0.0248052 -0.100481 -0.0556725 0.00359568 0.0990043 0.0251189 -0.0614787 0.0529546 -0.0683346 -0.0207659 0.108907 -0.0707176 -0.0764251 0.199526 0.0608629 -0.0245385 -0.15959 0.0631901 0.170595 0.13266 -0.0418221 -0.0330016 -0.0236123 -0.0535297 0.14699 0.154323 0.0685909 
0.00834101 -0.0556783 0.0982583 -0.00475002 0.0655643 0.192011 -0.000752402 -0.0196388 -0.00669964 -0.027771 0.0409491 0.106083 -0.0069193 -0.123645 0.0493172 -0.0549176 -0.144141 0.06948 0.0192673 0.0418275 0.169447 -0.0120105 0.0352456 0.150961 0.0515764 0.0818801 -0.0136089 -0.227593 0.0698797 0.0279235 0.0900393 -0.0104251 -0.00403306 0.0814055 0.0860192 0.055177 -0.0508794 0.0499605 0.0245749 -0.102112 0.0932572 -0.0949995 -0.0783788 0.0765243 -0.13072 -0.100458 0.106883 -0.0185288 -0.117949 -0.0288363 -0.0262519 0.00407769 0.0406661 -0.011868 0.142531 0.080651 0.00147773 0.131583 -0.149242 -0.0975882 -0.0636489 -0.0564197 0.214359 -0.0643654 0.150306 -0.000710599 -0.0116344 -0.0320309 -0.0755988 0.189636 -0.0694253 0.0624458 -0.143429 -0.0181115 0.0182587 -0.0689854 -0.052825 0.0570698 0.0691224 0.0777499 -0.118069 0.104877 0.0594835 -0.0266943 0.00780774 -0.132477 0.121168 0.12579 0.0172181 0.0846251 0.152901 -0.0418853 -0.038024 0.0730839 -0.0677093 -0.0714616 -0.0395498 0.0762616 0.0630518 -0.0218979 0.0633446 -0.00981052 -0.107738 -0.0391907 0.0158269 0.0773943 0.0206457 -0.0525913 0.0671943 -0.0674811 -0.0206154 0.110195 -0.0860065 -0.0781276 0.20784 0.0638452 -0.0344374 -0.163875 0.0505054 0.173382 0.144518 -0.0404695 -0.0196177 -0.0336789 -0.0407852 0.144632 0.165729 0.0615887 
-0.00586804 -0.0578939 0.105102 -0.00402222 0.0712616 0.182521 -0.0153313 -0.024817 0.00975219 -0.0537025 0.0481539 0.100551 -0.0023789 -0.0968745 0.0541935 -0.0581236 -0.136341 0.0472664 0.0137029 0.0491426 0.179178 -0.0208941 0.0323097 0.179362 0.0738719 0.0615002 -0.0100374 -0.213563 0.0688345 0.026965 0.123193 -0.0494228 -0.00227859 0.0724998 0.0716206 0.0847959 -0.0717359 0.0354919 0.00391593 -0.0832237 0.094769 -0.0744432 -0.0832666 0.0923808 -0.114704 -0.0983538 0.106218 -0.0171806 -0.103743 -0.036766 -0.0474829 -0.011523 0.0433255 -0.0364502 0.141909 0.0944796 -0.0383956 0.169718 -0.138413 -0.0954684 -0.0789296 -0.0474597 0.215689 -0.0582327 0.145013 -0.00247635 -0.00313708 -0.0307453 -0.0786324 0.184631 -0.0472447 0.0728922 -0.137073 -0.043906 0.0317803 -0.0549685 -0.0557477 0.066982 0.0642524 0.0964504 -0.11911 0.0959041 0.0599689 -0.0274733 -0.0116411 -0.12058 0.125739 0.116991 -0.00413874 0.0674665 0.1479 -0.0480129 -0.0275861 0.0682405 -0.0597044 -0.0712324 -0.0550136 0.0586361 0.0575122 -0.023263 0.042281 -0.0164163 -0.107303 -0.055304 -0.0110768 0.0989679 0.00922678 -0.0620487 0.0683346 -0.079961 -0.0118823 0.103109 -0.0951034 -0.0660561 0.195857 0.0819469 -0.0484973 -0.148386 0.0373335 0.188109 0.126668 -0.0375042 -0.0544635 -0.0200885 -0.0606898 0.161172 0.146785 0.0659471 
-0.00769144 -0.0236973 0.0861402 -0.00841083 0.0511211 0.192143 -0.0122832 -0.0117265 0.00574283 -0.0656072 0.0480697 0.0666969 -0.00517274 -0.113551 0.0563988 -0.0669067 -0.14919 0.0031385 0.0320209 0.0251171 0.175467 -0.0234551 0.0367235 0.156163 0.0866346 0.0373469 -0.00334262 -0.215215 0.0867126 0.0275579 0.130323 -0.0767913 0.00815659 0.06862 0.0711783 0.0730834 -0.0623995 0.026286 -0.00113742 -0.0758229 0.102737 -0.104216 -0.0784647 0.102205 -0.114478 -0.0650184 0.106376 -0.0189481 -0.120699 -0.0450794 -0.0696863 0.0227342 0.0657276 -0.0376252 0.126251 0.0911413 -0.0237436 0.147789 -0.131379 -0.104005 -0.0884068 -0.0374837 0.211141 -0.0583775 0.135138 0.00105892 0.00994756 -0.0376663 -0.0629452 0.16942 -0.0632266 0.056513 -0.159815 -0.0547408 0.0720983 -0.0440522 -0.0630234 0.0695394 0.053668 0.138948 -0.129592 0.0666949 0.0716503 -0.00948772 -0.0071877 -0.0882651 0.112595 0.0925712 -0.0275217 0.0635376 0.15777 -0.0513081 -0.0428388 0.0583499 -0.0746843 -0.0912355 -0.0466829 0.0721231 0.0669776 -0.036623 0.0490287 -0.00426889 -0.0846756 -0.0497852 -0.029464 0.0949502 0.0200366 -0.013158 0.0619584 -0.0851203 0.00456902 0.0845125 -0.104604 -0.0909932 0.188696 0.0968839 -0.0607927 -0.140782 0.0633515 0.202062 0.128402 -0.0549868 -0.0643651 -0.0117544 -0.0541907 0.156943 0.149538 0.0849382 
-0.00245174 -0.0460771 0.102755 -0.0058867 0.0577271 0.183792 -0.00931728 -0.0167073 0.00407688 -0.0513432 0.0431707 0.0865408 -0.0109594 -0.108011 0.0587509 -0.0636721 -0.136639 0.0320174 0.0256011 0.0371339 0.166809 -0.0242964 0.0401252 0.161957 0.0741507 0.063854 -0.00777945 -0.214129 0.0797046 0.0132727 0.123568 -0.0401648 -0.000622727 0.0774317 0.0697253 0.0703509 -0.0586145 0.0517448 0.0139836 -0.0838899 0.0977811 -0.0898313 -0.0865137 0.0782265 -0.116081 -0.0934877 0.100468 -0.0209427 -0.108437 -0.0352906 -0.0558717 0.0171042 0.0537583 -0.0271948 0.132537 0.0834377 -0.0131818 0.152595 -0.144367 -0.101042 -0.0793464 -0.0446011 0.211437 -0.0659496 0.139231 0.0116701 0.00414967 -0.0328634 -0.0745742 0.186837 -0.0657287 0.0650218 -0.151573 -0.0204157 0.0465067 -0.0676138 -0.050973 0.0611212 0.0648027 0.104342 -0.134034 0.0886183 0.0665156 -0.0285171 0.00543942 -0.125242 0.117435 0.118052 -0.000978512 0.0632503 0.159644 -0.0430614 -0.024114 0.0675339 -0.0539763 -0.0815565 -0.041482 0.0708613 0.0603051 -0.0258908 0.0409086 -0.0156479 -0.107836 -0.0360827 -0.00205753 0.09352 0.021508 -0.0482364 0.0780653 -0.0863105 -0.0138285 0.111137 -0.0948605 -0.0720534 0.206831 0.0752866 -0.0406145 -0.157182 0.0621833 0.191984 0.133985 -0.0402959 -0.0456375 -0.0218644 -0.0533908 0.149164 0.157068 0.0719571 
0.0035765 -0.0573203 0.106495 0.00781676 0.0724258 0.191106 -0.00363184 -0.0269609 0.0062294 -0.0561374 0.0390502 0.113501 -0.00960537 -0.124382 0.0400649 -0.0520498 -0.141826 0.0665946 -0.00171189 0.0500368 0.182717 -0.0223383 0.0323945 0.164737 0.0639166 0.062195 -0.0243524 -0.221928 0.0593434 0.029337 0.108167 -0.00911358 -0.00697917 0.0869809 0.0808453 0.0589784 -0.0564806 0.0410271 0.0162823 -0.101348 0.105651 -0.0891897 -0.0663617 0.0737356 -0.118971 -0.113598 0.10812 -0.0264195 -0.11282 -0.0256616 -0.0314579 -0.0167714 0.0447749 -0.0191436 0.142679 0.0861031 -0.0189268 0.143117 -0.148565 -0.102361 -0.0674124 -0.0466878 0.206881 -0.0704322 0.150051 0.0034981 -0.00996319 -0.0416899 -0.0913717 0.188036 -0.0637022 0.0639074 -0.138465 -0.0244582 0.0181794 -0.0614296 -0.0484525 0.0505732 0.06134 0.0870577 -0.122097 0.106032 0.0599726 -0.0288113 -0.00028832 -0.120644 0.121207 0.123688 0.000716309 0.080916 0.153793 -0.0548213 -0.0355196 0.0700159 -0.0639189 -0.0615327 -0.0504934 0.0709703 0.0540035 -0.0161065 0.0529326 -0.0210514 -0.112377 -0.0296979 0.016189 0.0857689 0.0197417 -0.0462573 0.0555267 -0.0735606 -0.0319713 0.105776 -0.0912855 -0.06868 0.20209 0.0638576 -0.0449898 -0.149629 0.0506352 0.18234 0.137489 -0.0281461 -0.034272 -0.0299908 -0.0417617 0.147559 0.157219 0.0532944 
0.000742866 -0.063088 0.0728971 -0.0013396 0.0800741 0.18184 -0.00183849 -0.0217189 -0.0048196 -0.0386309 0.0369633 0.114625 0.00544212 -0.114948 0.0372528 -0.0421151 -0.12244 0.0607985 0.0193815 0.0609029 0.178946 -0.0394793 0.0343332 0.164921 0.0661045 0.0738028 -0.0131421 -0.233558 0.0691749 0.0395769 0.108427 -0.0017198 0.00234165 0.0823577 0.0699409 0.0620909 -0.0570344 0.0438965 0.0195401 -0.108593 0.0975886 -0.09158 -0.0572557 0.0906934 -0.117699 -0.106417 0.117448 -0.0212515 -0.116544 -0.0427327 -0.0413609 -0.0351492 0.0479045 -0.0334258 0.13965 0.0949932 -0.029374 0.160564 -0.142106 -0.0992888 -0.0685868 -0.0542901 0.220375 -0.0760719 0.157235 0.00588901 -0.0237762 -0.0363321 -0.0852469 0.164592 -0.07529 0.0643061 -0.153683 -0.0382925 0.0136211 -0.0579709 -0.032194 0.0678509 0.0607202 0.0809977 -0.132935 0.0970553 0.0456756 -0.0321469 -0.00606 -0.123007 0.119444 0.119222 0.0123275 0.0689341 0.150809 -0.0496276 -0.0443609 0.0732576 -0.0469611 -0.0500211 -0.0478222 0.0754688 0.0553284 -0.0204676 0.044085 -0.0325033 -0.112645 -0.0283344 -0.00182061 0.0899298 0.00933896 -0.0466491 0.0556066 -0.0790327 -0.0324214 0.108488 -0.0898079 -0.0729547 0.202094 0.0628997 -0.0473824 -0.160249 0.05024 0.187959 0.128902 -0.0312408 -0.0365949 -0.0199669 -0.0632269 0.145476 0.134285 0.0440206 
0.00223536 -0.0461014 0.0735837 -0.0296682 0.0598802 0.173327 -0.00231466 0.00636175 -0.02729 -0.043422 0.0368389 0.0914494 0.0167972 -0.108341 0.0344018 -0.0425271 -0.1241 0.0218349 0.0262425 0.0546248 0.189253 -0.0489336 0.0382296 0.155078 0.0614222 0.0851946 0.00308688 -0.2256 0.0908911 0.0271223 0.0889107 -0.0340112 0.00619211 0.0868396 0.0510013 0.0480101 -0.0533924 0.0728163 0.0202279 -0.0950633 0.0854872 -0.0973947 -0.0558557 0.0892682 -0.104946 -0.0836585 0.124046 -0.0310261 -0.146055 -0.0476186 -0.0566125 -0.0174021 0.0407334 -0.0177471 0.138568 0.0874206 -0.0150032 0.16712 -0.141693 -0.116032 -0.0565293 -0.0495372 0.223985 -0.0623272 0.14992 0.0165594 -0.0240422 -0.0220025 -0.0658115 0.147788 -0.0863456 0.0510318 -0.165987 -0.0369143 0.0506277 -0.0535079 -0.0310766 0.0768982 0.076097 0.0960301 -0.145992 0.0745306 0.0595133 -0.0296586 -0.0161601 -0.113736 0.122192 0.11991 0.0210369 0.0601735 0.152291 -0.059617 -0.0428281 0.0769423 -0.0524146 -0.0633786 -0.0323495 0.0878555 0.0604932 -0.0252159 0.0342752 -0.0248906 -0.110415 -0.00645398 -0.0213487 0.0919923 -0.00163655 -0.0155069 0.0564047 -0.121261 -0.0148918 0.114554 -0.102682 -0.0708003 0.20888 0.0799117 -0.0609557 -0.162418 0.0552684 0.189977 0.113071 -0.0348928 -0.0386453 -0.018701 -0.0619155 0.147713 0.128405 0.04403 
-0.00397187 -0.0685478 0.0638181 0.0134648 0.0713574 0.171467 0.010083 -0.0235669 0.0202857 -0.0514195 0.0382897 0.124163 0.000804492 -0.128515 0.00711158 -0.0507245 -0.134671 0.07447 -0.00521467 0.0718568 0.176924 -0.0577462 0.0391002 0.169676 0.052002 0.0698392 -0.0177819 -0.23503 0.0632821 0.0356078 0.109824 0.0114468 0.00345233 0.0775761 0.0649287 0.0434041 -0.0551871 0.0723699 0.00125711 -0.112425 0.107087 -0.0853319 -0.0634854 0.102309 -0.129307 -0.148292 0.111743 -0.0286777 -0.0888873 -0.0267327 -0.0428025 -0.044789 0.0433302 -0.022646 0.144314 0.0888348 -0.0264684 0.157285 -0.138408 -0.12266 -0.0754142 -0.0668486 0.227991 -0.072927 0.148296 0.0061199 -0.0155096 -0.0592496 -0.0917231 0.162651 -0.0760814 0.0593195 -0.128474 -0.00839429 0.00762909 -0.0775893 -0.0355488 0.0588001 0.0525187 0.0697466 -0.138065 0.10449 0.0435658 -0.0405908 0.00542922 -0.12441 0.118979 0.132603 0.0252971 0.0499155 0.146082 -0.0609595 -0.0358268 0.0395063 -0.0315339 -0.0643301 -0.048333 0.0799389 0.0531534 -0.00945822 0.0345039 -0.0357386 -0.0970706 -0.00875231 0.0105725 0.0832115 0.0181933 -0.0397982 0.0581998 -0.0806677 -0.0446489 0.121638 -0.0868879 -0.0632563 0.192806 0.0549519 -0.0295456 -0.159633 0.0646363 0.178054 0.122112 -0.0181128 -0.0380283 -0.0252085 -0.0631396 0.133072 0.128957 0.051319 
0.00905408 -0.0423186 0.0606984 -0.0120157 0.0772972 0.198783 -0.000865793 -0.0142661 0.00379966 -0.0610409 0.042399 0.0996555 0.00995146 -0.119483 0.0179098 -0.0373703 -0.155334 0.0424098 -0.00559657 0.0510828 0.202574 -0.0348845 0.0419533 0.155036 0.0720921 0.0414761 -0.00269349 -0.219055 0.0746679 0.0546795 0.0939649 -0.0345424 0.00699788 0.0831301 0.0613286 0.0480901 -0.0654206 0.0343756 0.00332271 -0.102298 0.093103 -0.102916 -0.0417909 0.109543 -0.119271 -0.103868 0.120944 -0.019014 -0.127536 -0.0210941 -0.0431176 -0.023444 0.0438858 -0.0195425 0.141785 0.0889871 -0.0266709 0.153769 -0.140616 -0.119194 -0.0727933 -0.0475652 0.234466 -0.0581333 0.136954 0.00754933 -0.0299072 -0.0291989 -0.0819662 0.163571 -0.0695704 0.0579332 -0.151062 -0.0564093 0.0384537 -0.0404544 -0.037097 0.0505561 0.051148 0.101901 -0.108811 0.0803487 0.0592448 -0.0172894 -0.0188115 -0.0837232 0.11061 0.112687 0.00748697 0.0854729 0.153866 -0.0795289 -0.0743254 0.0696731 -0.0682993 -0.0630698 -0.0639533 0.0861543 0.064471 -0.0225574 0.0652369 -0.0250687 -0.0906488 -0.0304303 -0.0232267 0.0925679 -0.00764201 -0.00804066 0.0414937 -0.095648 -0.00968908 0.103676 -0.0972507 -0.0669491 0.194345 0.0866524 -0.0537796 -0.122652 0.0598524 0.199709 0.12815 -0.0432002 -0.0346773 -0.0243806 -0.0590887 0.150558 0.143819 0.0590442 
-0.0111662 -0.0573608 0.0623065 -0.00247457 0.0840198 0.173926 -0.0152105 -0.0402673 -0.00031834 -0.0623952 0.0401223 0.103085 0.0126353 -0.086011 0.0284065 -0.0300475 -0.13447 0.0377995 0.0154052 0.0676759 0.193191 -0.0580651 0.0393628 0.151394 0.078602 0.0719693 -0.0201076 -0.232107 0.0601517 0.0470085 0.116088 -0.0209556 0.00933359 0.0696948 0.0649453 0.0896112 -0.0688891 0.0505257 0.0138299 -0.104846 0.0865714 -0.0754346 -0.0505117 0.0931098 -0.101141 -0.0785709 0.130779 -0.0264289 -0.121959 -0.0543424 -0.0746071 -0.0467922 0.0534692 -0.0332205 0.147004 0.0997233 -0.0416877 0.175412 -0.136546 -0.104712 -0.0710509 -0.0390757 0.233899 -0.0699337 0.161523 0.0197715 -0.0264043 -0.0117007 -0.0690844 0.152517 -0.0530941 0.0684287 -0.147896 -0.0659843 0.0357265 -0.036221 -0.0403725 0.0612623 0.051104 0.08722 -0.129115 0.0917923 0.0343109 -0.0309612 -0.0436255 -0.0922416 0.11556 0.11423 0.000459608 0.0587394 0.152473 -0.0588524 -0.0384111 0.0677746 -0.0526768 -0.0504381 -0.0574008 0.0801287 0.0627858 -0.0183622 0.0331384 -0.0438787 -0.108128 -0.045475 -0.0257137 0.113526 -0.00362084 -0.0318176 0.0496594 -0.0876616 -0.0275672 0.0960438 -0.10156 -0.0714604 0.198316 0.0856168 -0.0715083 -0.142715 0.0434106 0.187588 0.114446 -0.0281523 -0.0434983 -0.00932206 -0.0740772 0.163742 0.12597 0.050649 
-0.0176635 -0.0451219 0.0430953 0.0335587 0.085027 0.167383 -0.0182468 -0.0580752 0.0213655 -0.0514003 0.0465478 0.102289 0.000490181 -0.100134 0.0132616 -0.00442341 -0.112568 0.0727906 0.0112954 0.0593223 0.197422 -0.0638241 0.0393238 0.16529 0.0880433 0.0595949 -0.0237452 -0.246289 0.0652728 0.0631991 0.13114 0.0249266 0.0198847 0.0603355 0.0697533 0.0884544 -0.0609903 0.0384575 0.00793708 -0.112089 0.0920156 -0.0728355 -0.0407606 0.101109 -0.0958718 -0.0891071 0.143274 -0.032255 -0.10892 -0.0792807 -0.0483526 -0.0481003 0.0610624 -0.0502909 0.141893 0.116328 -0.0280698 0.153108 -0.106053 -0.110115 -0.0846188 -0.0580137 0.218 -0.0845812 0.168104 0.00721729 -0.0257612 -0.0368239 -0.0728142 0.171662 -0.0597896 0.0676292 -0.146101 -0.0741353 0.0216637 -0.046017 -0.0429501 0.092485 0.0137114 0.0644154 -0.129577 0.121328 0.0203649 -0.0392046 -0.0349244 -0.0717809 0.101719 0.100753 -0.0223867 0.0497726 0.135494 -0.0508787 -0.062655 0.0400354 -0.027588 -0.0336843 -0.0599439 0.0932217 0.0604654 -0.0155339 0.0358686 -0.052507 -0.0880278 -0.0286671 -0.0124019 0.0961298 0.00707046 -0.0404939 0.053744 -0.0766286 -0.0634225 0.0926456 -0.0943428 -0.0900348 0.198413 0.0657138 -0.0705264 -0.16601 0.0527539 0.175831 0.126689 -0.0141283 -0.0385992 -0.00863819 -0.0726567 0.161133 0.118883 0.0523314 
-0.00855134 -0.0437246 0.0465951 0.00811837 0.0794856 0.156614 -0.0189569 -0.0292425 0.00140434 -0.0419092 0.0494855 0.0824367 0.0176092 -0.097316 0.0162501 0.00911136 -0.100969 0.0562959 0.00898535 0.058858 0.21075 -0.0613987 0.0558704 0.153307 0.0728082 0.0794903 -0.0191937 -0.253802 0.0914319 0.0445704 0.121929 0.0143491 0.0126895 0.0660309 0.0579793 0.0754821 -0.0644692 0.0878459 0.0191927 -0.100026 0.0663178 -0.0637541 -0.0695352 0.0953807 -0.0846574 -0.07716 0.134701 -0.0281736 -0.121335 -0.0796453 -0.0568106 -0.0221936 0.04161 -0.0418973 0.128169 0.0936809 0.00472008 0.154578 -0.105845 -0.117361 -0.0708811 -0.0679111 0.221964 -0.0725086 0.158575 -0.0076484 -0.0268663 -0.00253028 -0.0456918 0.166308 -0.0653848 0.0718446 -0.156819 -0.0601517 0.0209265 -0.0629025 -0.0456744 0.109299 0.0267217 0.0800439 -0.137954 0.105204 0.0268049 -0.0473808 -0.0343591 -0.0906994 0.11001 0.111882 -0.00442565 0.0257477 0.1394 -0.040014 -0.0618633 0.0459047 -0.019719 -0.0432305 -0.0440916 0.103256 0.050369 -0.0184748 0.0346381 -0.0468682 -0.102674 -0.00453446 -0.011898 0.083824 0.000250846 -0.0344185 0.0921505 -0.105647 -0.0603229 0.115875 -0.111017 -0.0766758 0.222262 0.0823878 -0.0764163 -0.180492 0.041793 0.177185 0.106046 0.00249124 -0.0320425 0.00114952 -0.078486 0.14821 0.112995 0.0521872 
-0.0208716 -0.0610201 0.0547419 0.00470348 0.065789 0.150105 -0.0366865 -0.0185821 0.00767709 -0.0591338 0.0455288 0.082254 0.0119631 -0.100452 0.00991097 -0.0027787 -0.117102 0.0496751 0.0117973 0.0691905 0.207955 -0.0698788 0.0638251 0.166414 0.0681354 0.0851136 -0.0102133 -0.263732 0.0767481 0.0205691 0.131202 -0.0135946 0.0143135 0.0603301 0.0507491 0.0804251 -0.0735631 0.0929667 0.0047749 -0.0858288 0.0737507 -0.0573801 -0.0857031 0.105025 -0.0861296 -0.092737 0.137378 -0.0341522 -0.11301 -0.0669698 -0.0720268 -0.0496788 0.0464212 -0.0366694 0.124698 0.0941253 0.00530614 0.161122 -0.0961971 -0.132434 -0.0654319 -0.0573847 0.219209 -0.0578285 0.146868 -0.0131679 -0.012336 -0.0119792 -0.0292839 0.159488 -0.0655145 0.0701176 -0.142038 -0.0535933 0.0292182 -0.0771785 -0.0630865 0.110597 0.0330118 0.0885691 -0.145993 0.110427 0.0236226 -0.0537133 -0.0364361 -0.0824942 0.115731 0.118961 -0.00394523 0.00435267 0.140331 -0.0362741 -0.0436098 0.0303667 -0.0192018 -0.0483836 -0.0501346 0.106068 0.0433438 -0.0195793 0.0165371 -0.0572547 -0.0975872 -0.0118256 -0.00766716 0.0851263 -0.00111416 -0.0403721 0.0748854 -0.104517 -0.0557056 0.12127 -0.100882 -0.0819522 0.202131 0.0853664 -0.0768152 -0.18957 0.0372754 0.163796 0.0977734 0.00771847 -0.0454079 -0.00409862 -0.0920806 0.144029 0.0950981 0.06229 
0.00542397 -0.0471418 0.0652802 0.0222076 0.0964276 0.172316 -0.0114243 -0.0529487 0.0203825 -0.0908057 0.0362279 0.0896405 0.00321281 -0.0967913 0.0128253 0.00426993 -0.100168 0.0554242 -0.015768 0.0494426 0.223892 -0.0324788 0.0335915 0.173762 0.0824753 0.0587477 -0.0477355 -0.247834 0.0782737 0.0598384 0.135554 0.0261701 -0.0111445 0.074496 0.0764467 0.0785571 -0.0588572 0.0592482 0.0282248 -0.103221 0.085 -0.0409939 -0.0541133 0.0772507 -0.0670818 -0.0726152 0.132395 -0.0328086 -0.11402 -0.0741971 -0.0609072 -0.0333759 0.0677926 -0.0413417 0.135774 0.0901276 -0.0105707 0.172098 -0.115386 -0.122749 -0.0688603 -0.0364286 0.211563 -0.0854188 0.138703 -0.00166662 -0.00700071 -0.00851066 -0.0562372 0.16646 -0.0484593 0.0709056 -0.149602 -0.0632127 0.0119957 -0.0519539 -0.0551093 0.080426 0.0239707 0.0935843 -0.109544 0.140943 0.0317379 -0.0553748 -0.0251944 -0.0854682 0.1066 0.0998489 -0.0408502 0.040603 0.158707 -0.0526792 -0.0638841 0.051045 -0.0280209 -0.0288646 -0.0488722 0.0896432 0.0446261 -0.0114988 0.0375809 -0.0511227 -0.105145 0.00305765 -0.031446 0.088715 -0.00312986 -0.037619 0.0646233 -0.0840993 -0.0394916 0.0985965 -0.126137 -0.0744508 0.211212 0.0874044 -0.0988057 -0.169196 0.0304388 0.168627 0.11208 0.0179561 -0.0267667 -0.00566137 -0.0760883 0.150385 0.110687 0.0330336 
0.00624185 -0.0449164 0.0524472 0.018757 0.0953614 0.173125 -0.0145173 -0.0439777 0.0156977 -0.0893274 0.0446437 0.0909208 0.0134756 -0.0987907 -0.000562589 0.0026544 -0.10872 0.0557575 -0.0274396 0.0702564 0.228056 -0.0520944 0.0495342 0.185677 0.0809458 0.0397663 -0.0347822 -0.24428 0.0774206 0.0589523 0.125714 0.00504572 -0.00369549 0.077094 0.0589354 0.0756963 -0.070275 0.0605278 0.00552971 -0.101389 0.0784877 -0.0522475 -0.0561008 0.0934358 -0.0778522 -0.0797043 0.138175 -0.0268537 -0.119815 -0.0518147 -0.0610584 -0.0426455 0.0529723 -0.0414542 0.134966 0.0910287 -0.0189956 0.174544 -0.10474 -0.12878 -0.0713126 -0.0336844 0.221167 -0.078008 0.132196 -0.006231 -0.0168076 -0.0103983 -0.0639712 0.162396 -0.0524764 0.0695766 -0.146223 -0.0662777 0.020981 -0.0496889 -0.0461871 0.0873696 0.0275805 0.0986556 -0.115844 0.120334 0.0243101 -0.055596 -0.0343536 -0.065384 0.100543 0.0988542 -0.0324397 0.043467 0.159076 -0.0669219 -0.0671391 0.045009 -0.031275 -0.0378161 -0.0625842 0.09498 0.0478042 -0.0199145 0.0405704 -0.0518764 -0.0983673 0.00280415 -0.0336149 0.0949994 -0.010943 -0.0218881 0.06207 -0.0977928 -0.0386487 0.111349 -0.112903 -0.0659081 0.198809 0.0927795 -0.0960972 -0.155335 0.0355054 0.183032 0.0988354 0.0108447 -0.0418679 0.00142853 -0.0851191 0.152793 0.101951 0.033993 
-0.0326621 -0.0337011 0.10203 0.0317433 0.078145 0.190705 -0.0126711 -0.063642 0.0327893 -0.0560722 0.0351371 0.0911279 -0.018553 -0.100998 0.0493762 -0.0276426 -0.134856 0.0536142 0.0180781 0.00922715 0.181765 -0.0255797 0.0270473 0.169845 0.102935 0.0365132 -0.0520952 -0.225512 0.0720285 0.0511919 0.159265 -0.0109743 -0.00388686 0.0512857 0.0884479 0.0897545 -0.0812383 0.000573759 0.0171708 -0.0803934 0.101807 -0.0690804 -0.0757311 0.0636269 -0.0834443 -0.0798586 0.101452 -0.0318114 -0.0963848 -0.0848149 -0.0471494 -0.00721298 0.0891396 -0.0703281 0.117733 0.116083 -0.0193435 0.160222 -0.128064 -0.0748627 -0.0915092 -0.024811 0.192299 -0.0830617 0.159452 0.0130319 -0.000691493 -0.0310029 -0.0918421 0.185109 -0.0377215 0.087689 -0.151436 -0.0693838 0.0306988 -0.0234271 -0.0637122 0.0520466 0.0269622 0.103829 -0.116395 0.104408 0.0613894 -0.0107705 -0.0295132 -0.0964761 0.112359 0.0883865 -0.0601388 0.0511188 0.12712 -0.0320209 -0.0281736 0.0710152 -0.0568607 -0.0450374 -0.0625371 0.0579287 0.0559325 -0.00540211 0.0617001 -0.035622 -0.109437 -0.0561586 -0.00400287 0.0975759 0.027919 -0.0678861 0.0631569 -0.0531566 -0.0309393 0.0738029 -0.0929044 -0.0972559 0.196211 0.096132 -0.0861876 -0.11151 0.0394418 0.189972 0.132652 -0.0420363 -0.066039 -0.0354815 -0.0599804 0.195124 0.121909 0.0657745 
-0.0408023 -0.0472161 0.121161 0.041713 0.0679488 0.173219 -0.0181415 -0.0436649 0.0307073 -0.0527759 0.0335711 0.0660892 -0.0216289 -0.103394 0.0629831 -0.0186567 -0.12287 0.0555712 0.022835 0.0150337 0.186433 -0.0449051 0.0341647 0.164692 0.102102 0.04532 -0.0766729 -0.235483 0.0809086 0.0150187 0.174468 -0.00245935 -0.00606772 0.0490714 0.0889627 0.0944373 -0.0752673 0.0266555 0.0223696 -0.0941421 0.103952 -0.05941 -0.0926546 0.0395346 -0.0689278 -0.0944065 0.0953929 -0.0329342 -0.0879849 -0.0977768 -0.0737926 -0.0127904 0.0998057 -0.0652689 0.107242 0.104747 0.00420232 0.137326 -0.119704 -0.0945397 -0.0864903 -0.0150889 0.170812 -0.0836824 0.150698 0.0456927 0.0108965 -0.0318055 -0.0740629 0.165327 -0.0477256 0.0900918 -0.144571 -0.0508093 0.033649 -0.0506479 -0.0673152 0.059191 0.0389518 0.101957 -0.126453 0.107339 0.052947 -0.0306917 -0.00929844 -0.0948139 0.107692 0.108747 -0.0492183 0.0260498 0.143836 0.000194319 -0.0141295 0.0647182 -0.0464193 -0.0464081 -0.0559689 0.0722765 0.0336959 -0.000972611 0.0557539 -0.0551462 -0.1116 -0.0598728 0.0167506 0.107043 0.0525611 -0.0817174 0.0944663 -0.0542821 -0.0517652 0.0853382 -0.091605 -0.108381 0.215171 0.0854201 -0.0875266 -0.127614 0.0331826 0.167889 0.115681 -0.0285888 -0.0608072 -0.030109 -0.0708906 0.190078 0.123018 0.0697292 
-0.0279394 -0.0335686 0.123221 0.0549241 0.0851495 0.173333 0.00220753 -0.0586646 0.0321023 -0.0505336 0.0320306 0.0693081 -0.017671 -0.0962686 0.0649059 -0.00719041 -0.105654 0.0656696 0.00499031 0.0117643 0.194933 -0.0412635 0.025144 0.160818 0.110044 0.0266242 -0.0966235 -0.224058 0.0832512 0.0397104 0.169693 0.0270891 -0.0111388 0.0576392 0.0970152 0.0906569 -0.0705166 0.0203568 0.0231282 -0.113298 0.101729 -0.056684 -0.0662158 0.0320216 -0.0645771 -0.0764167 0.0927118 -0.0289467 -0.09475 -0.104454 -0.0552735 -0.00749088 0.0915119 -0.0745197 0.118865 0.104829 -0.0120644 0.138835 -0.11992 -0.0821175 -0.088731 -0.0208703 0.160586 -0.097813 0.163582 0.0458849 -0.00544284 -0.026162 -0.0966097 0.176584 -0.0369689 0.0945888 -0.148803 -0.0624591 0.0160994 -0.0348743 -0.0507015 0.0576028 0.0312108 0.0902567 -0.116592 0.106336 0.0468746 -0.0304059 -0.0146417 -0.100163 0.100165 0.0996518 -0.0592752 0.0493535 0.140638 -0.0114266 -0.031545 0.0654594 -0.0477409 -0.0307479 -0.0536491 0.0671594 0.0374849 0.00213713 0.0644253 -0.0476667 -0.110584 -0.0528305 0.00756974 0.101893 0.0464872 -0.0715659 0.104296 -0.0541914 -0.0595478 0.0789785 -0.105992 -0.101062 0.227475 0.0802046 -0.0886491 -0.117098 0.0324351 0.181772 0.118337 -0.0187059 -0.0531338 -0.016917 -0.0529126 0.188731 0.136055 0.0488309 
-0.0462514 -0.0532 0.149473 0.042506 0.088183 0.189591 -0.0110643 -0.0664466 0.042407 -0.0441449 0.00789298 0.0896995 -0.0436378 -0.0917313 0.0880968 -0.0303307 -0.120258 0.0574825 0.0346835 -0.0234007 0.158045 -0.00188979 0.0129383 0.160121 0.112441 0.0359978 -0.0866085 -0.210094 0.0578681 0.0216438 0.184325 -0.00173053 -0.0261526 0.0435627 0.103322 0.095143 -0.0771635 -0.0299108 0.0385705 -0.0753016 0.118347 -0.04529 -0.0885899 0.00562838 -0.0635721 -0.0851069 0.0626893 -0.0335154 -0.0609958 -0.1029 -0.0391661 -0.0111699 0.110037 -0.083593 0.102964 0.110204 -0.00594751 0.147455 -0.142942 -0.040045 -0.0778887 0.00146734 0.141019 -0.0969477 0.166551 0.0324247 0.00980211 -0.0217177 -0.0946584 0.186601 -0.0236184 0.116153 -0.144229 -0.055069 0.012463 -0.0116503 -0.0658574 0.0338429 0.0364531 0.0903074 -0.107324 0.116156 0.0801946 0.00244167 -0.00940384 -0.129534 0.12185 0.102583 -0.0781362 0.0366889 0.115089 0.012638 0.00711024 0.0953542 -0.0550597 -0.0279189 -0.0529013 0.0282214 0.0315303 0.0171141 0.0684411 -0.0519171 -0.132282 -0.0817199 0.0240847 0.0908089 0.0493328 -0.121717 0.0628477 -0.0129888 -0.0383557 0.0547798 -0.0732106 -0.104811 0.204673 0.083018 -0.0905301 -0.0842453 0.0116636 0.171462 0.133187 -0.0332583 -0.0684038 -0.056909 -0.0555162 0.207956 0.11252 0.062689 
-0.012951 -0.0498942 0.097352 0.0108003 0.078413 0.168472 -0.00918727 -0.0188836 0.0126644 -0.0632644 0.0410826 0.0720339 -0.000317677 -0.104773 0.0355033 -0.010595 -0.115762 0.0569174 -0.00356108 0.0390197 0.217499 -0.0466863 0.0406833 0.162326 0.0774831 0.0587794 -0.0520322 -0.239989 0.0926173 0.0235511 0.141463 -0.0108483 -0.00745756 0.0682288 0.0797443 0.0774647 -0.0700285 0.0640475 0.0175775 -0.102149 0.0849179 -0.0498392 -0.0795955 0.075795 -0.0757213 -0.0907038 0.112919 -0.0313486 -0.11556 -0.0747679 -0.0766109 -0.0277511 0.0530846 -0.0427309 0.119433 0.0926633 -0.00380643 0.158912 -0.122306 -0.117471 -0.069962 -0.0383349 0.204312 -0.0715977 0.148654 0.0114469 -0.00785808 -0.0182122 -0.0588792 0.168508 -0.0500594 0.0765069 -0.143369 -0.0542636 0.0168235 -0.0649481 -0.0573511 0.0833081 0.0449292 0.0873637 -0.130867 0.109589 0.040688 -0.0449928 -0.0219156 -0.0975907 0.115045 0.115068 -0.0202203 0.0348056 0.160984 -0.0358183 -0.0447406 0.048293 -0.0299588 -0.0480861 -0.0499274 0.0916596 0.0314249 -0.00137064 0.0384482 -0.0478257 -0.111602 -0.0272905 -0.0025861 0.0974098 0.0225633 -0.0519461 0.0934135 -0.0931129 -0.0487721 0.101728 -0.112804 -0.0790096 0.227225 0.0887737 -0.0756638 -0.159646 0.0350484 0.169781 0.10411 -0.00540762 -0.0427462 -0.00759691 -0.0717623 0.157515 0.122223 0.0511243 
