{
  "descriptor": [
    -0.06746593862771988,
    0.12132125347852707,
    0.04110310226678848,
    -0.11954334378242493,
    -0.10097828507423401,
    0.026231370866298676,
    0.011826293542981148,
    -0.03286290168762207,
    0.160035640001297,
    -0.017259027808904648,
    0.18161837756633759,
    0.05313083529472351,
    -0.23112188279628754,
    -0.07374583929777145,
    -0.14083881676197052,
    0.071194589138031,
    -0.14318174123764038,
    -0.20637400448322296,
    -0.14057187736034393,
    -0.09260062873363495,
    0.04209938645362854,
    0.06311191618442535,
    -0.0659644827246666,
    -0.02781670168042183,
    -0.1769106388092041,
    -0.27750933170318604,
    -0.04218441620469093,
    -0.12466730922460556,
    0.04301181808114052,
    -0.26976317167282104,
    0.06292002648115158,
    -0.02640751749277115,
    -0.16352912783622742,
    -0.04007817804813385,
    -0.02450278401374817,
    0.0173468180000782,
    -0.051354698836803436,
    -0.08772426843643188,
    0.20746208727359772,
    0.11148345470428467,
    -0.16833101212978363,
    0.08330239355564117,
    0.03505441173911095,
    0.3992466628551483,
    0.1689222902059555,
    -0.038516074419021606,
    0.003700193017721176,
    -0.050417132675647736,
    0.15905128419399261,
    -0.24800743162631989,
    0.10362045466899872,
    0.1847141981124878,
    0.096172034740448,
    0.10525470972061157,
    0.12352205812931061,
    -0.1615835577249527,
    0.030912820249795914,
    0.12674064934253693,
    -0.27815788984298706,
    0.13653318583965302,
    0.029627501964569092,
    -0.013215597718954086,
    -0.03372303023934364,
    -0.03544480726122856,
    0.1364494264125824,
    0.058043647557497025,
    -0.14049752056598663,
    -0.14393950998783112,
    0.1223163828253746,
    -0.16762542724609375,
    -0.003339761169627309,
    0.04469884932041168,
    -0.09625718742609024,
    -0.1489679515361786,
    -0.26065611839294434,
    0.12875767052173615,
    0.3641940653324127,
    0.11460462212562561,
    -0.17516516149044037,
    0.03159058839082718,
    -0.07893363386392593,
    -0.051109679043293,
    0.039030566811561584,
    0.03786436468362808,
    -0.13124942779541016,
    0.05728762596845627,
    -0.0696888342499733,
    0.033589430153369904,
    0.13999363780021667,
    0.05337599292397499,
    -0.05735304206609726,
    0.22993038594722748,
    -0.005572326947003603,
    -0.08542076498270035,
    0.09470098465681076,
    0.08705427497625351,
    -0.1759999841451645,
    -0.007738213986158371,
    -0.06043156608939171,
    0.038320139050483704,
    0.025402890518307686,
    -0.2195652574300766,
    -0.014117209240794182,
    0.09483665972948074,
    -0.12700721621513367,
    0.13692869246006012,
    0.01463610865175724,
    -0.009776117280125618,
    -0.07981076091527939,
    -0.0039392332546412945,
    -0.12663699686527252,
    -0.07850499451160431,
    0.17897172272205353,
    -0.2945627272129059,
    0.24499616026878357,
    0.1941354125738144,
    0.042048245668411255,
    0.10175250470638275,
    0.10611073672771454,
    -0.005339217837899923,
    -0.0038299630396068096,
    0.030772484838962555,
    -0.05417247489094734,
    -0.053939420729875565,
    -0.028800390660762787,
    -0.02913537621498108,
    0.015234235674142838,
    0.028486328199505806
  ]
}