0.0798018 -0.0213985 -0.115883 0.00252463 0.154279 0.119895 0.0574132 -0.119768 -0.0672441 -0.141 -0.0414014 0.109366 0.0675432 -0.0323666 -0.0523504 -0.071768 -0.0369993 0.00101129 -0.0610088 0.236304 0.0773896 -0.0393811 0.0912605 0.0446766 -0.0434218 0.0466226 -0.10237 -0.191565 -0.00234398 0.0618551 -0.0104817 0.0967572 -0.0500052 0.0673334 0.0555721 0.0535637 0.0359845 0.206636 -0.0505452 -0.136906 0.101344 0.0193749 -0.00832087 0.062802 -0.226607 0.0726283 0.165809 0.043167 -0.0609478 0.0846464 -0.0920345 -0.0533036 -0.00017285 0.0637705 0.20741 -0.0526175 -0.0106605 0.151517 -0.0497739 -0.142243 -0.0570988 0.0423637 0.223108 -0.127685 0.125292 -0.0633932 0.0198447 0.0343349 -0.0298453 0.0502472 0.0194816 0.052679 -0.00949286 0.0763843 0.00715939 0.00891565 -0.0579656 0.0287751 0.0670667 0.0154321 -0.0365366 0.123604 -0.0321626 -0.0520536 0.00805741 -0.0666392 0.0632642 0.120578 0.00021042 0.0331116 0.182455 -0.119989 0.00610161 -0.0691906 -0.0514555 -0.140086 0.058461 0.119877 0.0576085 -0.0700065 -0.0130199 0.0477844 0.00156066 0.114637 -0.150745 0.0563665 -0.072004 0.129097 0.0131945 0.0352783 0.0600202 0.115783 -0.114329 0.03943 0.00654976 0.0287794 -0.0845005 -0.190686 -0.0258601 0.109998 0.00745631 0.0751167 0.0401713 0.057599 -0.0784446 0.0295672 -0.00380354 -0.0421421 
0.0958717 -0.0377989 -0.142107 -0.0167564 0.16386 0.121011 0.0586908 -0.114527 -0.0709528 -0.148416 -0.047828 0.11981 0.0740881 -0.0322303 -0.0747221 -0.0685781 -0.0366396 0.00672627 -0.0642239 0.221193 0.083523 -0.0210696 0.0798135 0.0403021 -0.0502 0.0523793 -0.073732 -0.196714 -0.0217079 0.0832057 -0.0399193 0.0892494 -0.0595595 0.0604764 0.0582678 0.0283471 0.0282859 0.188522 -0.0489703 -0.135567 0.0891516 0.0272508 0.00214229 0.0923098 -0.219808 0.0835703 0.164546 0.039391 -0.0697243 0.0833486 -0.0715695 -0.077393 0.00442625 0.0645228 0.205549 -0.0591408 -0.0153148 0.164249 -0.0414206 -0.145952 -0.0295797 0.0364284 0.228791 -0.106046 0.116515 -0.0887125 0.00316459 0.0523718 -0.0101544 0.0291525 0.0208733 0.0444424 -0.00146977 0.0423625 -0.0189047 0.028567 -0.063218 0.0164016 0.0577565 0.0198399 -0.0160299 0.123056 -0.0356159 -0.056024 -0.00794118 -0.0704646 0.0720184 0.109603 -0.00280312 0.0336977 0.164671 -0.125074 -0.017728 -0.0691394 -0.0555954 -0.117256 0.0609023 0.107089 0.0600096 -0.0683644 -0.00281374 0.0502548 0.00634089 0.119279 -0.168666 0.0316036 -0.10107 0.139462 -0.0261625 0.0362616 0.0951283 0.104368 -0.114348 0.0393716 -0.00995372 0.0379539 -0.108369 -0.175033 -0.0373383 0.0914765 -0.00404621 0.0765705 0.0475463 0.0443788 -0.0674193 0.0152666 -0.0291228 -0.0619809 
0.0444739 -0.0248666 -0.123467 0.0154925 0.134206 0.0302946 0.00322431 -0.133839 -0.0528175 -0.0763724 -0.0205816 0.096864 0.0514258 0.0183562 -0.0621191 -0.0360313 -0.0128789 0.0337491 0.0139051 0.233784 0.0752699 -0.0776902 0.131913 0.0705234 -0.020334 0.091413 -0.0403563 -0.20073 0.0256406 0.0670866 -0.00256023 0.0711721 -0.000693515 0.00501389 0.0474618 0.0594713 0.00940953 0.268163 -0.0466459 -0.115238 0.0171054 0.0657276 -0.045738 0.0912703 -0.208653 0.0633929 0.177114 0.0237243 -0.0125153 0.0603972 -0.0762466 -0.021205 -0.0136335 0.0419758 0.202448 -0.0471008 0.0427799 0.148789 -0.0111706 -0.140529 -0.0372734 -0.0271927 0.221285 -0.0832099 0.129756 -0.105098 0.0136888 0.0377223 0.0186025 0.0838442 0.0250376 0.0877483 -0.0151818 0.076168 -0.00830913 -0.0433445 -0.0674554 0.0963894 0.0531473 -0.0142202 -0.0673331 0.151141 -0.0603679 -0.0643139 0.0193074 -0.110036 0.0304732 0.141935 0.0558093 -0.0415979 0.11867 -0.0422044 0.0307603 -0.104092 0.0193989 -0.166306 0.0509495 0.154746 0.0756679 -0.0906693 -0.0470294 0.0230521 0.0263263 0.085718 -0.137217 0.0460933 -0.0571719 0.0558636 0.104873 0.0181572 0.0246029 0.142813 -0.0878104 0.0359033 0.0212331 0.0341294 -0.0383711 -0.24046 -0.0327776 0.0845123 -0.0116201 0.117582 0.0196136 0.0422976 -0.129659 0.033453 -0.00206443 0.00768834 
0.0624994 -0.0194568 -0.108958 0.00698419 0.136536 0.0519203 0.00163124 -0.120266 -0.0470544 -0.0946778 -0.0139167 0.0778965 0.0463629 0.0138502 -0.0477981 -0.0397231 -0.0130479 0.00346412 -0.00174837 0.234724 0.0869922 -0.0695604 0.128226 0.0579161 -0.00858554 0.0767775 -0.0564717 -0.199177 0.0284045 0.0473162 0.020117 0.0505151 -0.022813 0.0170825 0.0425487 0.0740019 -0.00499705 0.277041 -0.0319976 -0.104901 0.0145306 0.069137 -0.078569 0.0696243 -0.185529 0.076533 0.150792 0.0299398 -0.0173619 0.0638373 -0.0936793 0.0176439 -0.0182447 0.0410926 0.189181 -0.0624408 0.039826 0.156923 -0.0274286 -0.138988 -0.0412618 -0.0189706 0.227666 -0.0952512 0.117767 -0.113394 0.0278326 0.0692828 0.0248224 0.0975867 0.0466742 0.0990338 -0.0246466 0.0737207 -0.00466747 -0.0416453 -0.0701862 0.094209 0.0604227 0.023626 -0.0707861 0.137617 -0.0429957 -0.0663178 0.0154616 -0.112301 0.0394005 0.149072 0.0492299 -0.045456 0.135239 -0.0547224 0.0364933 -0.0763458 0.0115416 -0.183751 0.0641344 0.127971 0.0606377 -0.0917972 -0.0427717 0.0315901 -0.00450464 0.0875583 -0.142289 0.0575112 -0.0535944 0.0546511 0.120795 0.0122788 0.0337054 0.145215 -0.101866 0.0570825 0.043967 0.0498843 -0.0645112 -0.227676 -0.0367158 0.0944105 -0.0268591 0.12338 0.0187424 0.0570637 -0.110705 0.0341024 0.0101798 0.00422809 
0.0544665 0.0147655 -0.0935975 -0.0314242 0.129653 0.0836636 0.0582138 -0.0726938 -0.0732225 -0.0658375 -0.0161824 0.108542 0.0558588 -0.0383621 -0.0414622 -0.0686308 0.0162284 0.0249716 -0.0281469 0.215753 0.0641898 0.000155959 0.0592917 0.0760583 -0.0800908 0.0859972 -0.0444116 -0.173995 0.0908458 0.0480787 -0.0226409 0.0927704 -0.016185 0.0586904 0.0583633 0.0359829 0.0590744 0.239385 -0.0687021 -0.104482 0.0772411 0.0181139 -0.0446078 0.0945847 -0.217649 0.102818 0.164423 0.0324866 -0.0986236 0.0440492 -0.0721408 0.00896409 -0.052242 0.033687 0.183353 -0.0233593 -0.014851 0.151561 -0.0578547 -0.101793 -0.0609571 -0.0220215 0.226084 -0.119115 0.15444 -0.128202 0.0240356 -0.0036478 -0.0312583 0.0951121 0.00149278 0.0169926 -0.0326824 0.0905401 0.00762246 -0.0294338 -0.0465684 0.136226 0.0646156 -0.0513092 -0.0686813 0.143616 -0.0377144 -0.0459397 0.0478679 -0.126669 0.0684071 0.110663 0.0204163 0.0465799 0.158765 -0.0951568 -0.0171845 -0.0735909 0.0230261 -0.145823 0.0838571 0.104781 0.0566761 -0.0705145 -0.034024 0.0654497 -0.0125108 0.122 -0.150718 0.0400955 -0.0438679 0.0790177 0.0652829 -0.00871882 0.0478153 0.124053 -0.109598 0.0374279 0.0369503 -0.00202132 -0.050925 -0.274546 -0.00300849 0.110946 0.0115788 0.080957 0.023253 0.0769517 -0.0662429 0.0246674 0.00740323 -0.0555751 
0.0671577 -0.0192593 -0.102621 -0.00921995 0.142504 0.0944609 0.0584554 -0.100519 -0.0519002 -0.115841 -0.0304625 0.0955791 0.066812 -0.0148033 -0.0477358 -0.0732169 -0.0386494 -0.00144194 -0.0632509 0.226019 0.0748317 -0.0518646 0.102171 0.0666629 -0.0441089 0.0522391 -0.0824299 -0.178373 0.0396614 0.037927 0.0105037 0.0898782 -0.0510552 0.051728 0.034868 0.0521087 0.0134449 0.248858 -0.0598451 -0.1097 0.0848552 0.0313891 -0.0578073 0.0723994 -0.217818 0.0537373 0.140048 0.0515931 -0.0435115 0.0711069 -0.103846 -0.0160575 -0.0190894 0.040106 0.189495 -0.0498663 -0.00497145 0.184093 -0.0439623 -0.141708 -0.0684232 0.0234707 0.231777 -0.107247 0.110951 -0.0621741 0.0331757 0.0349535 -0.0220207 0.0723229 0.015622 0.0695167 -0.00781811 0.110435 0.00707534 -0.026176 -0.0614411 0.0499349 0.0701067 0.00503767 -0.0486997 0.117452 -0.0357454 -0.0749367 0.0227969 -0.0987471 0.065574 0.134215 0.0233677 0.00233566 0.183993 -0.097597 0.0234316 -0.0885577 -0.0123845 -0.16149 0.0579779 0.115289 0.0644988 -0.0695082 -0.0310079 0.0341129 -0.000536018 0.120267 -0.153064 0.0612956 -0.0727358 0.104691 0.0748132 0.00726007 0.0546474 0.15733 -0.120817 0.0539137 0.0306917 0.0329908 -0.0616084 -0.20087 -0.00027613 0.113306 0.00155847 0.0857241 0.0162887 0.0674409 -0.105664 0.0214404 -0.0170484 -0.0246702 
0.07951 -0.00937144 -0.113328 -0.0156145 0.129316 0.142184 0.0295268 -0.150833 -0.065556 -0.142845 -0.05169 0.0736901 0.0681842 -0.0331907 -0.0346141 -0.0758931 -0.070567 -0.00916638 -0.0142664 0.194631 0.082821 -0.00965781 0.0682344 0.0492105 -0.0318277 0.0718486 -0.1023 -0.21577 0.00351989 0.0884024 -0.000864591 0.0886163 -0.0666256 0.037333 0.10986 0.0584218 0.0400253 0.169414 0.000347035 -0.136874 0.0845441 0.000484763 -0.0204236 0.0713335 -0.197558 0.0992931 0.174922 0.0603276 -0.0758619 0.0573831 -0.0973939 -0.04458 0.0642787 0.0630412 0.196913 -0.0522729 0.011732 0.147354 -0.0464216 -0.170817 -0.0363371 0.0606815 0.229365 -0.10678 0.0976775 -0.046548 0.0497704 0.0297087 0.00216415 0.0281142 -0.00217495 0.0387419 -0.0334349 0.0475534 0.0144235 -0.00448461 -0.102206 -0.0038619 0.0892097 0.0717175 0.0113601 0.1391 -0.0354898 -0.0633184 0.0284245 -0.0777824 0.04646 0.0907395 -0.00828015 0.036219 0.193878 -0.0820388 0.0207678 -0.0636686 -0.0866968 -0.142974 0.0624739 0.143873 0.0777042 -0.0845779 0.0215677 0.0582918 0.00992597 0.0749662 -0.16679 0.0558996 -0.0596399 0.121129 -0.00026904 0.0754325 0.0984216 0.0828586 -0.13291 -0.0110511 -0.0060412 0.0613743 -0.116115 -0.188578 -0.0419633 0.0780264 0.0302033 0.038775 0.0587577 0.0326178 -0.0977472 0.0339887 0.000555694 -0.0177474 
0.0845878 0.0360492 -0.135119 0.00638479 0.149011 0.103423 0.0359004 -0.128839 -0.0845985 -0.103358 -0.02476 0.0618776 0.0591952 0.0158631 -0.0474619 -0.0421109 0.0181644 0.00464929 -0.0029663 0.205081 0.0783616 -0.040776 0.109261 0.0422989 -0.00537011 0.0480087 -0.0743367 -0.157356 0.0801459 0.0792012 0.00764894 0.101667 -0.0370453 0.0244461 0.0480562 0.0481728 0.0301905 0.231218 -0.00969985 -0.129945 0.0406808 0.0446347 -0.0193948 0.058351 -0.210182 0.0938221 0.168117 0.0470956 -0.0606734 0.053581 -0.0793072 0.0460777 0.00087141 0.0375814 0.17448 -0.0562844 0.0376481 0.162871 -0.02542 -0.149066 -0.0698705 0.0214409 0.236691 -0.140346 0.104368 -0.0474426 0.0235044 0.0362919 -0.0287478 0.0876243 0.0170734 0.0745069 -0.0382696 0.0938541 0.0109406 -0.0287868 -0.0404364 0.0592596 0.0573948 0.00676666 -0.0371123 0.129629 -0.0220167 -0.0647945 0.0549697 -0.100914 0.0125489 0.114702 0.0294488 0.00501749 0.168389 -0.0750189 0.00111659 -0.0700503 0.0228409 -0.177503 0.0830655 0.167306 0.0511435 -0.0870627 -0.0294137 0.066746 0.0195565 0.130155 -0.187723 0.0751023 -0.0434088 0.100444 0.114143 0.0101973 0.0615896 0.125615 -0.113748 0.0599861 0.0375885 0.0202711 -0.0600254 -0.206507 -0.0012485 0.111603 -0.0030525 0.0746817 0.042178 0.0426572 -0.102447 0.0307994 0.0200586 -0.0195251 
0.0624102 -0.00738121 -0.117821 -0.0194308 0.130251 0.082776 0.00736147 -0.0962828 -0.0754696 -0.0875413 -0.02614 0.0774993 0.0706187 -0.0320079 -0.0662338 -0.0401634 -0.028275 0.00839197 -0.0415519 0.231029 0.0880688 -0.0676596 0.12553 0.0504144 -0.0311493 0.0892694 -0.0541162 -0.200343 0.0398252 0.0266377 0.00576447 0.0698683 -0.0406387 0.0441176 0.0285906 0.0388256 -0.00185894 0.270143 -0.0322004 -0.106374 0.0416262 0.0251393 -0.0606586 0.0964405 -0.199655 0.0499298 0.158872 0.0469227 -0.0579447 0.0730802 -0.0764729 -0.0145842 -0.0337181 0.0441713 0.168256 -0.0688132 0.0375474 0.153509 -0.0143794 -0.170723 -0.0416605 -0.00641454 0.232122 -0.081342 0.113521 -0.10043 0.0173195 0.0591838 0.0118958 0.0690604 0.00884401 0.0746193 -0.0110773 0.0904836 -0.00267935 -0.0535664 -0.0758619 0.0869908 0.0641283 0.0275037 -0.0596374 0.118181 -0.0282924 -0.0672535 0.00696735 -0.10647 0.0591062 0.147709 0.0571947 -0.0314911 0.142861 -0.0708286 0.015286 -0.082862 -0.00615925 -0.163432 0.0641692 0.141396 0.0372464 -0.0905539 -0.0355123 0.0364051 -0.00775376 0.130711 -0.133855 0.0366641 -0.0734714 0.104852 0.095873 -0.00313313 0.0498937 0.168361 -0.112543 0.0706044 0.0288738 0.0266014 -0.0873487 -0.216972 -0.0200487 0.0873081 -0.0168749 0.104204 0.0310623 0.0503859 -0.102826 0.00607985 -0.0207647 -0.0188755 
0.062128 0.011627 -0.127361 -0.0221319 0.155802 0.0888583 0.00912616 -0.118002 -0.0748583 -0.0746537 -0.0199147 0.0740521 0.0567483 -0.00799576 -0.0311514 -0.040239 -0.0176622 0.00117156 -0.0253919 0.225531 0.0605122 -0.0283014 0.110437 0.0306838 -0.0239105 0.0775649 -0.0600495 -0.180036 0.0427394 0.0413724 0.00922336 0.0691568 -0.0374669 0.0337832 0.045483 0.0796704 0.0143793 0.231448 -0.0400327 -0.0987114 0.0565005 0.0439623 -0.0489477 0.098954 -0.217452 0.107558 0.166087 0.0653362 -0.0485809 0.0627654 -0.0780379 0.00810981 -0.0508905 0.0318281 0.185271 -0.058219 0.0111847 0.153294 -0.0151405 -0.132872 -0.0613215 -0.00366795 0.228572 -0.0922391 0.123002 -0.111234 0.0209686 0.0726388 0.0205679 0.0983637 0.0473835 0.0967737 -0.0015842 0.0728459 0.00663872 -0.025197 -0.0895109 0.106692 0.051215 -0.00602916 -0.0290849 0.145214 -0.033893 -0.0472653 0.00419803 -0.094767 0.052593 0.136834 0.0341776 -0.00178373 0.147347 -0.0708874 -0.00201599 -0.0893965 -0.00664021 -0.173079 0.0682826 0.124921 0.0509999 -0.100903 -0.0418263 0.0491292 0.0164805 0.0878421 -0.171621 0.0545279 -0.0821937 0.0905887 0.094004 0.0295204 0.0695338 0.142618 -0.110346 0.0686255 0.0216745 0.0171418 -0.0771719 -0.228722 -0.0353621 0.0850378 0.0074608 0.103544 0.0461769 0.0749546 -0.102042 0.0145583 -0.00572146 -0.0100617 
0.0746513 0.0146572 -0.131473 -0.0016759 0.176836 0.120011 0.0369582 -0.157607 -0.0585172 -0.123556 -0.0352824 0.0925494 0.0542485 0.0126162 -0.0539116 -0.0396198 0.00764365 0.00374725 -0.0393568 0.20992 0.0745592 -0.0163267 0.0953519 0.0128428 -0.0293402 0.0599518 -0.0899506 -0.162788 0.035313 0.0713467 0.000995794 0.123287 -0.0320398 0.0481269 0.0734585 0.072628 0.0605106 0.216726 -0.0160923 -0.14589 0.0825458 0.0468403 -0.00178688 0.0353292 -0.215602 0.115132 0.159949 0.0563559 -0.0613892 0.0433694 -0.0939649 0.00466729 0.00277247 0.0505371 0.197602 -0.0468761 0.0156731 0.150383 -0.0600945 -0.125898 -0.06747 0.0340384 0.229972 -0.148202 0.150339 -0.052978 0.00418522 0.069938 -0.0223128 0.0971 0.0350783 0.057158 -0.0262525 0.0589791 0.0107336 0.0183872 -0.0482499 0.0558507 0.0459214 -0.032576 -0.0271427 0.152488 -0.0206094 -0.0357771 0.0227081 -0.0881489 0.0423025 0.130092 -0.0124309 0.0419664 0.18267 -0.108084 0.00476343 -0.0553795 -0.00921098 -0.153565 0.0697514 0.137382 0.0557786 -0.0671858 -0.00776838 0.0589542 -0.00560478 0.109158 -0.153578 0.0630784 -0.0551098 0.0983428 0.0480109 0.034005 0.0447258 0.0938084 -0.103143 0.0694775 0.0316647 0.013476 -0.0972385 -0.191672 -0.029671 0.105168 0.0158215 0.0852347 0.0531226 0.0452456 -0.0724544 0.0429082 0.00435337 -0.0376526 
0.100187 -0.0538941 -0.130913 0.00418444 0.209056 0.122652 0.101148 -0.119051 -0.0322463 -0.148239 -0.061979 0.13402 0.0681656 -0.0156313 -0.0499939 -0.0777073 -0.00587856 0.003204 -0.0703911 0.207267 0.0846863 -0.0221477 0.0522472 0.0524969 -0.0328947 0.00333531 -0.116545 -0.182933 -0.0316201 0.104419 -0.00949341 0.0989401 -0.0563365 0.0628844 0.0841845 0.0461885 0.0542192 0.146888 -0.0633687 -0.170373 0.118244 0.0526282 0.0266419 0.0631856 -0.218781 0.0957535 0.131174 0.0555652 -0.0235477 0.0534453 -0.0709357 -0.0869657 0.0276808 0.0325914 0.232956 -0.0408912 -0.0557473 0.163609 -0.0571875 -0.116078 -0.0443464 0.0414143 0.182806 -0.133853 0.13184 -0.0752611 -0.0102819 0.0630692 -0.0367057 0.0269103 0.0461395 0.0568829 -0.0145108 -0.00590567 -0.0341412 0.0899464 -0.0403711 0.0237724 0.0644893 0.00821034 -0.0146487 0.124393 -0.0295163 -0.0206167 0.0185495 -0.0810425 0.0805559 0.115044 -0.0284099 0.0600312 0.159597 -0.126997 -0.0118877 -0.0570449 -0.0717332 -0.112163 0.054469 0.0709687 0.0527394 -0.0580424 0.030652 0.0563972 0.0100585 0.0807925 -0.177425 0.0297248 -0.0921373 0.105932 -0.0238827 0.0731022 0.0783464 0.05531 -0.120464 0.0338185 -0.00195411 0.0499036 -0.110109 -0.152651 -0.0793812 0.115856 0.00176094 0.086666 0.0197565 0.060332 -0.0646574 0.0363575 -0.0244786 -0.0714101 
0.0824107 -0.0199011 -0.139603 0.0165334 0.171027 0.11435 0.0623895 -0.127834 -0.0493149 -0.133355 -0.0416648 0.101413 0.0633479 -0.0415764 -0.0544494 -0.0475257 -0.02334 0.00243147 -0.0624754 0.238706 0.0860492 -0.0647492 0.0903927 0.0462481 -0.0264872 0.028024 -0.116904 -0.208556 -0.00541997 0.0721414 0.00730044 0.106749 -0.0453341 0.0602467 0.0643886 0.0615605 0.0346109 0.198602 -0.0491616 -0.159106 0.0936641 0.0246427 -4.06238e-05 0.0630092 -0.207523 0.0868273 0.164002 0.0512964 -0.0594232 0.0711887 -0.10034 -0.0636378 0.0118176 0.0389949 0.209804 -0.0520766 -0.0174218 0.143215 -0.0415857 -0.140409 -0.0588998 0.0361219 0.219613 -0.13981 0.131183 -0.0608852 0.000673295 0.0500591 -0.0317638 0.0416001 0.0225627 0.0623899 -0.0239607 0.0538619 -0.00362499 0.0203856 -0.0506692 0.0490935 0.0601789 0.0146682 -0.0455996 0.121045 -0.054981 -0.0534119 0.00287908 -0.0546194 0.0463271 0.115322 0.00215753 0.0292853 0.176303 -0.10815 -0.00555353 -0.0757842 -0.0359658 -0.124286 0.0532406 0.113254 0.047635 -0.0736094 -0.00314556 0.0290523 0.00338966 0.0937747 -0.158333 0.0573693 -0.0712326 0.122815 0.0287134 0.0464671 0.0486981 0.108464 -0.10895 0.0264376 0.0226555 0.0344026 -0.099677 -0.18241 -0.0277383 0.115604 0.00440667 0.0884173 0.0435167 0.0784138 -0.0847471 0.0294396 -0.00505017 -0.0503568 
0.0519332 -0.0342902 -0.11286 0.00332508 0.126424 0.0928221 0.0145844 -0.109954 -0.063368 -0.127961 -0.0326664 0.10776 0.0379179 -0.0213648 -0.0583484 -0.0692885 -0.060522 -0.00512138 -0.0117422 0.238794 0.0624608 -0.0685951 0.120702 0.0797525 -0.0309395 0.0676686 -0.04351 -0.199885 -0.00769719 0.0310875 -0.000810564 0.0304742 -0.0272104 0.0373262 0.0398694 0.078004 -0.000955985 0.224045 -0.0801417 -0.113831 0.0636826 0.0271086 -0.0468563 0.0920191 -0.215129 0.0711943 0.173367 0.0276611 -0.0532797 0.109171 -0.103318 -0.04636 -0.00513072 0.0528335 0.217507 -0.0420499 0.0045379 0.171365 -0.0271425 -0.143631 -0.0496544 0.0317548 0.246991 -0.106856 0.127995 -0.0869685 0.0171819 0.0267382 -0.0113984 0.101248 0.0146436 0.0726069 -0.0148767 0.0942678 0.0176737 -0.0236054 -0.0599842 0.0690535 0.0685201 0.00875926 -0.0682683 0.11207 -0.0491247 -0.0732436 -0.00299835 -0.0867653 0.0460827 0.131185 0.0332722 0.00345508 0.167739 -0.0838659 0.0275584 -0.0958735 0.00316778 -0.142619 0.0548475 0.133111 0.0767171 -0.0826635 -0.0463414 0.0346515 0.00181802 0.0699368 -0.146357 0.0687993 -0.0701293 0.0817128 0.0349172 0.012617 0.0580832 0.146708 -0.0704701 0.02609 0.0231701 0.0411398 -0.0365641 -0.21441 9.98423e-05 0.115722 0.00406358 0.0749541 0.0276725 0.0474688 -0.114779 0.0412139 0.0138259 -0.00674586 
0.0519616 -0.0279777 -0.0844959 0.0100154 0.171452 0.113975 0.0742901 -0.155154 -0.0590839 -0.12983 -0.0568979 0.133569 0.0601379 -0.00746956 -0.0446826 -0.0865359 -0.014092 0.0203989 -0.0310409 0.21627 0.0579949 -0.0161252 0.0491531 0.0666417 -0.0501284 0.0670797 -0.118324 -0.186722 0.0182125 0.0829324 -0.00021196 0.126565 -0.0456887 0.0388153 0.102114 0.0621026 0.0523264 0.186584 -0.0451466 -0.158458 0.122423 0.0378376 -0.00878748 0.0411456 -0.222131 0.102143 0.157846 0.0429357 -0.0533314 0.0183972 -0.0946328 -0.0573234 0.0510583 0.0311528 0.218244 -0.0238489 -0.0315127 0.168893 -0.0631739 -0.109614 -0.0576193 0.0580181 0.202967 -0.134568 0.160817 -0.0398132 0.0223583 0.00468766 -0.0540157 0.0461888 0.0196419 0.0336264 -0.0147653 0.0534624 -0.00019541 0.040344 -0.0631435 0.0241185 0.0816965 -0.0134036 -0.0303575 0.142837 -0.0310636 -0.0402353 0.0434401 -0.118199 0.0715213 0.116989 -0.0368617 0.0467832 0.182064 -0.081634 0.0379272 -0.0510496 -0.0499903 -0.131777 0.069274 0.115524 0.0763122 -0.0568823 0.0101349 0.0655588 -0.00115212 0.0806873 -0.151532 0.0597358 -0.0329809 0.0847432 0.0136369 0.0655338 0.0549476 0.0728752 -0.115298 0.0130784 0.00161932 0.0252953 -0.108621 -0.192835 -0.0517184 0.105313 0.0152355 0.0541515 0.0033046 0.0272215 -0.0845787 0.0749506 -0.0147188 -0.0527034 
0.0148844 0.00939526 -0.0851033 0.00589433 0.121584 0.0970533 0.0262422 -0.140773 -0.0620241 -0.0691202 -0.0200796 0.0748933 0.0443346 -0.00840993 -0.0123488 -0.0702439 -0.00693927 0.0406322 0.069595 0.196379 0.0602027 -0.0466763 0.0596598 0.0730149 -0.0312075 0.0883321 -0.109102 -0.2071 0.0880739 0.0682025 0.0430125 0.0812082 -0.00552712 -0.0121057 0.130385 0.0989712 0.0466547 0.176345 -0.00960621 -0.160066 0.064561 0.0318942 -0.0367805 0.0590253 -0.19765 0.097035 0.183204 0.0422092 -0.0743289 -0.0100745 -0.157851 -0.018272 0.0698782 0.00846384 0.170722 0.00866377 -0.000948008 0.150152 -0.0688159 -0.112942 -0.0728893 0.041299 0.246511 -0.142466 0.157558 -0.0118131 0.0352447 -0.0417429 -0.0397714 0.0594119 -0.00399425 0.0280539 -0.0641459 0.0555674 0.0148613 -0.0336203 -0.0684816 0.0744674 0.0954272 -0.0307273 -0.0740663 0.151572 -0.0744712 -0.0519494 0.0694401 -0.10701 0.010838 0.0959477 0.0175949 0.0266105 0.202824 -0.015808 0.0427937 -0.0555786 0.0279901 -0.160887 0.0566278 0.16883 0.0648306 -0.067846 -0.015878 0.0381179 0.00152861 0.00351061 -0.147263 0.119881 0.0452331 0.0208091 0.0926399 0.0622173 0.028512 0.0617772 -0.0815655 -0.0413782 0.0446028 0.020587 -0.0494981 -0.245849 -0.000465191 0.0903779 0.0259387 0.00740588 0.00698767 0.0411781 -0.135011 0.0884044 0.039069 -0.00248305 
0.0455102 0.0030915 -0.0867811 0.00690657 0.132174 0.114165 0.0541429 -0.122119 -0.0694819 -0.0720794 -0.00836649 0.0732037 0.0728325 0.0110982 -0.0178192 -0.0602084 -0.00438891 0.0222793 0.0108468 0.199173 0.0884082 -0.0554867 0.0834403 0.0944661 -0.0254079 0.060007 -0.112839 -0.190398 0.0990838 0.0662235 0.0347234 0.085227 -0.0420666 0.00771131 0.0813341 0.0782934 0.0139203 0.228068 -0.023286 -0.124647 0.0552877 0.0436176 -0.0670168 0.0428627 -0.205246 0.0584206 0.155663 0.0509734 -0.0562128 0.00946962 -0.11645 0.0163722 0.0233 0.0149716 0.1742 -0.0123867 0.00719542 0.1957 -0.065621 -0.12458 -0.0852488 0.0370006 0.247637 -0.152106 0.144695 -0.0133518 0.0384605 0.00198115 -0.0548153 0.0696456 0.0158471 0.0750723 -0.0489842 0.0903329 0.018483 -0.0251628 -0.0541901 0.0598849 0.0956898 -0.00217306 -0.0607691 0.118431 -0.0338125 -0.067918 0.0475728 -0.111386 0.0415548 0.114421 0.0160703 -0.00310681 0.187821 -0.0542938 0.046355 -0.0519689 0.0125996 -0.186189 0.06731 0.150561 0.0595719 -0.0581025 -0.00563252 0.047385 -0.0104632 0.0710166 -0.153454 0.108997 -0.00298196 0.0455296 0.120614 0.0193453 0.0277344 0.111413 -0.10091 0.00744353 0.0606851 0.0509472 -0.0649981 -0.201529 -0.0136116 0.124793 -0.000775334 0.0210861 -0.00261533 0.0468863 -0.130699 0.0965173 0.00512313 -0.00133363 
0.017755 0.0247973 -0.108531 0.0146504 0.0941326 0.0903009 0.00172024 -0.141227 -0.0405228 -0.0928767 -0.00056985 0.0477646 0.0331115 0.0303462 -0.0138688 -0.0620087 -0.0223695 -0.00556759 0.0646334 0.182706 0.0480904 -0.0500658 0.11727 0.0509419 -0.0137558 0.0694025 -0.069807 -0.178812 0.0851907 0.0432427 0.0621055 0.0568699 0.0103068 -0.0274896 0.0767199 0.111971 0.0292679 0.227125 -0.0270149 -0.0987921 0.0403485 0.0524525 -0.0750013 0.0587783 -0.214143 0.081034 0.166233 0.0251072 -0.0335303 0.0247387 -0.154881 0.0342931 0.0377908 0.0312088 0.155875 -0.00274264 0.0400863 0.166807 -0.0459242 -0.118808 -0.103047 0.0271298 0.26266 -0.152286 0.137365 -0.0216964 0.0650152 -0.0145 -0.01709 0.111886 0.0141653 0.0695444 -0.0516608 0.108541 0.0500454 -0.0563567 -0.0710034 0.0638059 0.0537398 -0.0213359 -0.0722327 0.129124 -0.0531015 -0.0646827 0.0570383 -0.0890767 0.000900729 0.0934788 0.0130264 -0.0254634 0.190656 -0.0388395 0.0528588 -0.0924312 0.0653302 -0.192707 0.0585495 0.180251 0.0737798 -0.0581464 -0.0622465 0.0352469 0.0144316 0.0321999 -0.156143 0.118667 0.0208444 0.0251174 0.121363 0.0247647 0.0199928 0.0983383 -0.071209 -0.00382739 0.0434738 0.0334651 -0.00599389 -0.231488 0.0273645 0.105731 0.0245219 0.0241763 0.0115017 0.0456665 -0.135564 0.0695961 0.0398287 0.0516197 
0.0369533 0.0459795 -0.138342 0.00158973 0.137209 0.132664 0.0127001 -0.212042 -0.0682984 -0.0769372 -0.0101448 0.0521171 0.0549861 0.0748281 0.00602377 -0.0556857 0.0151783 0.000649466 0.0878296 0.150335 0.0300375 0.00837521 0.063008 -0.00443125 -0.016506 0.0804765 -0.122787 -0.153482 0.0853403 0.108296 0.0359458 0.120539 -0.0162134 -0.0541172 0.119519 0.132684 0.045994 0.140288 0.0386798 -0.117174 0.0437659 0.0657765 -0.0487649 0.0106953 -0.209631 0.158958 0.157512 0.0611905 -0.0571549 -0.0463202 -0.137647 0.0538352 0.0783618 0.0164606 0.137419 0.00159053 0.0180698 0.173528 -0.0774676 -0.0574033 -0.0926636 0.0841919 0.255411 -0.169536 0.147807 0.0176562 0.0578592 0.0320792 -0.0210481 0.0783643 0.0568362 0.0600816 -0.056598 0.0453017 0.0314625 0.0259032 -0.0815013 -0.00121388 0.0499389 -0.039182 -0.00556392 0.154922 -0.0465622 -0.0307202 0.0527606 -0.0760942 0.00385251 0.0482691 -0.0461617 0.0137223 0.189529 -0.0362821 0.0532822 -0.0206308 0.0178859 -0.190159 0.0719761 0.15708 0.0760862 -0.0485038 -0.00197768 0.072288 0.0132003 0.000796623 -0.18818 0.142301 0.0313934 0.0264438 0.0730576 0.0935982 0.0600239 0.00367298 -0.0797527 -0.0160555 0.0148611 0.0301175 -0.0833183 -0.180252 -0.018942 0.0795182 0.0323679 -0.0275197 0.0285929 0.0207599 -0.104682 0.109708 0.0178452 0.0282117 
0.0155634 0.0139757 -0.0912861 0.000985136 0.128315 0.109133 0.0293443 -0.144705 -0.0741684 -0.0468151 -0.0156453 0.0897206 0.050976 -0.0166354 -0.016248 -0.0701419 0.00141935 0.0526721 0.0760162 0.192143 0.0597867 -0.0376875 0.044563 0.083618 -0.0346819 0.102005 -0.106293 -0.212412 0.0988172 0.0828546 0.0340089 0.0887328 -0.0164623 -0.0149128 0.130755 0.0883382 0.0424397 0.162931 0.00889399 -0.149469 0.0688664 0.0255705 -0.0410237 0.0603885 -0.20349 0.0931623 0.185309 0.0398745 -0.0804335 -0.0291817 -0.131677 -0.0110238 0.0632547 0.00297669 0.164398 0.0180213 -0.000626279 0.161652 -0.0745898 -0.0985318 -0.0676183 0.0343761 0.251174 -0.147562 0.163781 -0.0261336 0.0361957 -0.0451726 -0.043276 0.0562272 -0.00518626 0.0359317 -0.068908 0.0494751 0.0106489 -0.0258467 -0.06988 0.0841938 0.0971857 -0.0303122 -0.0736511 0.160464 -0.0580462 -0.0389718 0.0694334 -0.113601 0.0271211 0.0908988 0.0135825 0.0190989 0.185075 -0.0176811 0.0438579 -0.0401203 0.0194228 -0.170696 0.0644146 0.16002 0.0642776 -0.0656968 -0.00864001 0.0496686 -0.0060946 0.0199527 -0.142514 0.115055 0.0464735 0.0217202 0.0815649 0.0669717 0.0298887 0.0512161 -0.0811309 -0.0382663 0.0370551 0.020081 -0.0678934 -0.244854 -0.0141594 0.0889103 0.0265065 -0.00508481 -0.00207771 0.0273726 -0.132857 0.101952 0.0161673 -0.00646893 
0.000295907 0.0091026 -0.0652235 0.0401031 0.107041 0.0952172 0.0358265 -0.166569 -0.0400377 -0.068637 -0.0100561 0.078481 0.0171158 -0.0170631 0.0167104 -0.0733636 -0.0239699 0.0486478 0.0707753 0.166917 0.0261188 -0.0315877 0.0560129 0.0517857 -0.0260965 0.0929267 -0.136828 -0.211705 0.0777772 0.0534998 0.0708392 0.128826 -0.00120067 -0.0248991 0.138391 0.112777 0.0485961 0.165176 -0.00183258 -0.141831 0.0967974 0.0299236 -0.0560367 0.038863 -0.209896 0.0929648 0.165958 0.0255756 -0.0597812 -0.0327852 -0.168175 -0.0133711 0.0864298 -0.00013683 0.14739 0.0200872 0.00511374 0.138228 -0.0763869 -0.0732837 -0.101513 0.0447616 0.228849 -0.151265 0.169933 0.0134438 0.0674871 -0.065223 -0.0432445 0.0753204 0.002583 0.0335296 -0.0508641 0.0895255 0.0264979 -0.044398 -0.093068 0.0422839 0.0586307 -0.0452389 -0.0702725 0.16867 -0.0828021 -0.0543143 0.069652 -0.0914882 0.0112401 0.0686241 -0.027646 0.0180438 0.211036 0.00108767 0.0467814 -0.070599 0.030578 -0.152344 0.0523269 0.152185 0.0739553 -0.0461237 -0.0344513 0.0168851 0.0117471 -0.0134732 -0.124769 0.119236 0.0751154 0.0133625 0.101535 0.082458 0.00677607 0.0536684 -0.0723483 -0.0760148 0.0481905 -0.00269427 -0.0399159 -0.250264 0.029856 0.0803156 0.0627409 -0.00211393 0.00540641 0.0459326 -0.115807 0.0882304 0.0525441 0.0222619 
0.0598489 0.0294911 -0.130135 -0.0212446 0.147014 0.128463 0.0222979 -0.175404 -0.100036 -0.0904005 -0.0330533 0.0543401 0.0752852 0.0343628 -0.0178453 -0.0387013 -0.0314513 -0.000392133 0.0354954 0.179752 0.0794626 -0.0275082 0.079594 0.00477842 -0.00241744 0.0844478 -0.119475 -0.187825 0.0650747 0.105415 -0.00157267 0.110002 -0.0531716 -0.0122783 0.103543 0.0860962 0.0185785 0.180804 0.0427565 -0.134837 0.0397702 0.0373056 -0.0159846 0.0407885 -0.193623 0.135509 0.183952 0.0574731 -0.0930065 -1.12403e-05 -0.114795 0.0058983 0.0531944 0.0366873 0.166596 -0.0397085 0.0244692 0.175353 -0.0634278 -0.129431 -0.0463639 0.0639385 0.255796 -0.124513 0.127259 0.00591781 0.0216313 0.0638787 -0.00537392 0.0491702 0.0321391 0.0783411 -0.0474972 0.0423013 0.0174583 0.00938463 -0.0872502 -0.00379677 0.0795062 0.0169991 -0.00135064 0.142927 -0.0445275 -0.0547861 0.014326 -0.0837444 0.0225301 0.087384 0.00409871 0.0119352 0.183844 -0.0518302 0.0246312 -0.0349858 -0.0325477 -0.170314 0.0715501 0.172824 0.0741392 -0.0773034 0.00146627 0.0507127 0.00691667 0.0510772 -0.192723 0.109476 -0.0283686 0.097543 0.0659398 0.0549835 0.0807865 0.0622594 -0.118575 0.000292527 0.0334134 0.0528046 -0.115682 -0.170535 -0.0318325 0.0835199 0.0159634 0.0178017 0.0541932 0.0309835 -0.116139 0.0728354 0.00762338 -0.0043448 
0.0652456 0.0209741 -0.13544 -0.0414113 0.170543 0.123723 0.0696553 -0.114301 -0.103677 -0.0649949 -0.0256557 0.109498 0.0890718 -0.000890319 -0.0404108 -0.0728538 0.0311679 0.0253146 0.00539174 0.201185 0.0638768 0.0141124 0.0347126 0.0430863 -0.0606083 0.0860032 -0.074614 -0.164389 0.08857 0.110155 -0.0277219 0.100902 -0.0386604 0.030039 0.0926103 0.0450229 0.0523356 0.176744 -0.0125462 -0.129842 0.0747095 0.035592 -0.00608451 0.0930539 -0.231937 0.118425 0.173349 0.0572161 -0.0876086 0.00757004 -0.0639741 -0.00154601 -0.0192433 0.0227096 0.179055 -0.0179601 -0.0397814 0.181361 -0.0719889 -0.0920727 -0.060678 0.00662958 0.245287 -0.134693 0.154083 -0.0945105 0.00956646 0.0112315 -0.044174 0.0420822 0.0263089 0.0390298 -0.0332488 0.0391336 -0.0148296 0.0224205 -0.0468155 0.0769351 0.0791897 -0.0287729 -0.0286406 0.13573 -0.0180606 -0.0197173 0.0428924 -0.13105 0.0667528 0.0984162 0.0138685 0.0444446 0.15413 -0.0928387 -0.0135988 -0.036037 -0.00842692 -0.164302 0.0905628 0.117866 0.0476213 -0.066498 -0.00957221 0.0998025 0.000769016 0.102752 -0.192102 0.0693343 -0.0418427 0.0897903 0.0453543 0.0427293 0.0814961 0.0536075 -0.126382 0.0471713 0.00516029 0.0149412 -0.08535 -0.217672 -0.0428859 0.107231 0.0030626 0.030741 0.0219356 0.0447562 -0.0793663 0.0507217 -0.0215145 -0.0574494 
0.0430103 0.0383992 -0.126884 -0.00729131 0.13582 0.129614 0.016842 -0.174734 -0.086765 -0.0844109 -0.0213302 0.0548008 0.0719734 0.0398672 -0.0264926 -0.0299416 -0.0223354 0.015806 0.0283772 0.174009 0.0811523 -0.0571159 0.101519 0.0157581 -0.0032794 0.0783265 -0.118162 -0.185826 0.0810367 0.0869099 0.0284549 0.129743 -0.037484 -0.0124094 0.0846641 0.0957709 0.0119838 0.20213 0.0326318 -0.130124 0.0392465 0.0367356 -0.0294668 0.0293917 -0.193466 0.104571 0.180058 0.0476667 -0.0933085 -0.00720072 -0.130533 0.0129851 0.0463197 0.0266825 0.144946 -0.0162267 0.0360428 0.184317 -0.0630441 -0.125257 -0.0710181 0.065148 0.265707 -0.151147 0.139892 0.0266335 0.0230367 0.0482723 -0.0317431 0.0798797 0.0194072 0.075613 -0.0581211 0.0669974 0.0247681 -0.013857 -0.0696132 0.00547521 0.0625761 -0.0135201 -0.0381094 0.139783 -0.0534508 -0.0637665 0.0107 -0.0786482 0.0135537 0.0848228 0.0042594 0.00142206 0.187963 -0.0549723 0.0344454 -0.0425563 0.0149965 -0.166283 0.0579231 0.191753 0.0657269 -0.057253 -0.0155398 0.0298548 -0.00640349 0.0666544 -0.16665 0.122412 -0.0122048 0.0788385 0.0913966 0.0278913 0.0351131 0.0826106 -0.0986178 0.00474154 0.0568388 0.037806 -0.0928707 -0.181431 0.00892297 0.103565 0.0235472 0.0123228 0.038489 0.0347909 -0.125184 0.0794909 0.00823854 0.00596546 
0.0541072 -0.0128454 -0.0959302 -0.0143915 0.164937 0.152072 0.0708598 -0.13716 -0.0864222 -0.0879046 -0.0372388 0.134382 0.0748816 -0.0317454 -0.0547084 -0.0507887 -0.0522073 0.0591491 -0.0321339 0.195274 0.108825 -0.0478399 0.0588817 0.0818149 -0.0375639 0.0642205 -0.122051 -0.209219 0.0503677 0.106831 -0.0189123 0.114793 -0.0714206 0.0386607 0.101214 0.0498845 -0.00438159 0.160305 -0.00734897 -0.151592 0.0790652 0.0113054 -0.00910572 0.0588714 -0.204377 0.0605886 0.17219 0.0425907 -0.104326 0.0220072 -0.0766359 -0.0586748 0.017521 0.019416 0.189052 -0.0109507 -0.0259367 0.195738 -0.0895287 -0.111618 -0.0402324 0.0511081 0.257637 -0.134421 0.160558 -0.0340718 -0.0186201 0.0163428 -0.0792497 0.0666051 0.00707168 0.0651507 -0.048244 0.0377048 -0.0218979 0.0240489 -0.0519367 0.0181424 0.0946266 -0.00608969 -0.0407361 0.129926 -0.0360737 -0.0487859 -0.000946868 -0.107673 0.0667228 0.106944 0.00692494 0.0535408 0.173235 -0.0925831 0.00435244 -0.0211196 -0.0407013 -0.126887 0.0476536 0.132202 0.067249 -0.0467803 0.0304677 0.0403275 -0.0414927 0.0803493 -0.135791 0.0865785 -0.0370545 0.0892621 0.0238546 0.0326147 0.0450702 0.0864099 -0.098801 0.00341865 0.049593 0.0515038 -0.107088 -0.157881 -0.0237221 0.128902 0.0157119 0.0136718 0.015723 0.0242628 -0.102015 0.0963816 -0.00831101 -0.0543517 
0.0405033 -0.0207007 -0.109798 0.00461781 0.12139 0.09954 0.0201097 -0.0944611 -0.0827023 -0.106453 -0.0260092 0.0899717 0.0543057 -0.0208717 -0.0570933 -0.0571509 -0.0500159 -0.00217537 -0.0172273 0.235972 0.0690022 -0.100093 0.136398 0.0611452 -0.0291209 0.0659251 -0.0762595 -0.196194 0.0348068 0.00698177 0.0230121 0.064044 -0.0301633 0.0349363 0.0195087 0.0761404 -0.00785691 0.245192 -0.0567572 -0.110693 0.0731994 0.0220367 -0.0603077 0.0619321 -0.220208 0.0376398 0.16645 0.0302419 -0.0535229 0.078562 -0.121923 -0.0282956 -0.00969085 0.0483708 0.175156 -0.0407146 0.0351155 0.170215 -0.0321977 -0.140417 -0.0719998 0.0424617 0.24564 -0.12468 0.130934 -0.0399195 0.0214635 0.0188641 -0.0226602 0.0875207 -0.00163356 0.0819446 -0.0222007 0.12744 0.0336038 -0.0407241 -0.0510209 0.0638022 0.0659913 -0.00432114 -0.0921444 0.0936417 -0.0359223 -0.0675599 0.00432412 -0.0687521 0.0460014 0.143227 0.0365973 -0.0273744 0.180655 -0.0731305 0.0404257 -0.090128 0.0172912 -0.163122 0.0507122 0.161327 0.0532836 -0.0613485 -0.0508184 0.019131 -0.00708314 0.0998904 -0.118612 0.0900747 -0.0455442 0.0937585 0.0755137 -0.00796031 0.014348 0.158126 -0.075773 0.0357869 0.0384701 0.0315412 -0.0338322 -0.198898 0.0242583 0.124337 -0.00545577 0.0548394 0.0182603 0.0442478 -0.127847 0.0486968 -0.00745246 0.0110028 
0.0711652 -0.0311033 -0.148746 0.00740509 0.172083 0.0993764 0.0630786 -0.118891 -0.0659714 -0.0906017 -0.0312961 0.130012 0.0636863 -0.0214166 -0.053492 -0.0334923 -0.00850886 0.0388407 -0.018432 0.221712 0.0940956 -0.0703516 0.103308 0.0671803 -0.0237283 0.0574974 -0.0769084 -0.226265 0.0324485 0.0929404 -0.00687665 0.124391 -0.0241555 0.0401443 0.0517328 0.0487955 0.0124154 0.204231 -0.039454 -0.146396 0.0697648 0.0321984 -0.0160479 0.0851904 -0.222936 0.0749634 0.17096 0.0263815 -0.0682108 0.0377227 -0.077401 -0.0572731 0.00145897 0.0159176 0.193495 -0.0208801 -0.000591892 0.175909 -0.0480407 -0.108091 -0.0527058 0.000710648 0.239784 -0.136379 0.153256 -0.0759258 -0.0191498 0.035049 -0.036768 0.0757226 0.00660678 0.0734571 -0.0493896 0.0421426 -0.0225024 0.00614963 -0.0402981 0.0694069 0.047605 -0.0170188 -0.0747042 0.133408 -0.0608785 -0.0595334 0.00783587 -0.0875267 0.0542073 0.106959 0.00960236 0.0119036 0.152265 -0.0860702 -0.0249946 -0.0727191 0.00845331 -0.125082 0.0505008 0.130229 0.065066 -0.0637309 -0.0156662 0.0142009 0.00162773 0.0983158 -0.155028 0.0526035 -0.0613691 0.0900141 0.0459779 0.0117852 0.0270344 0.114744 -0.0913756 0.00844561 0.0486502 0.031963 -0.0765807 -0.215744 -0.0061726 0.131843 0.0131914 0.074924 0.0199709 0.0639378 -0.101095 0.0467961 -0.0106793 -0.0379103 
