0.041848 -0.0590084 -0.0411039 -0.0330152 0.0782855 0.119028 -0.00956452 0.0114008 0.0293662 -0.145546 -0.0284057 0.0764039 0.0461312 -0.19009 -0.109397 0.0474346 -0.214518 0.0360879 -0.152894 0.130436 0.231252 -0.0093392 0.104359 0.125831 -0.0697812 -0.0395699 -0.0135343 -0.275828 -0.0284051 0.094871 -0.0443848 -0.0123787 0.00930968 0.107339 0.0479925 -0.00785697 -0.0161923 0.0780357 -0.101939 -0.0737077 0.015542 -0.0923475 0.00242732 0.121328 -0.0752789 -0.00640653 0.158268 0.0221485 -0.134397 0.129866 -0.0335327 -0.145495 0.0311661 0.0581573 0.165247 0.000852633 0.0618486 0.0394956 -0.0796648 -0.144766 0.0135004 0.0153572 0.166756 0.0145418 0.0583237 -0.157026 -0.0656221 0.0178706 0.00333862 0.0450954 -0.077408 -0.0195527 -0.0887237 -0.0689085 0.00419458 0.0159237 -0.0499114 0.0546742 0.0231491 0.104787 0.0344719 0.058719 -0.0698244 -0.0256165 -0.0850042 0.0940467 0.0357845 0.0668016 -0.0305724 0.115931 0.146995 -0.129673 -0.143441 -0.00571702 -0.121099 0.0570329 -0.104158 0.10326 0.0745246 -0.0218831 0.135404 -0.0623648 -0.0617949 0.0191292 -0.00493282 -0.0398687 -0.111986 0.104667 -0.0771744 -0.0226914 0.00257873 0.117266 -0.073395 -0.0776097 0.0365807 0.165034 -0.0776424 -0.0741254 -0.0220239 0.139898 0.0510371 0.0716815 0.0397935 0.0268817 -0.076517 0.0596882 0.0204051 -0.0416642 
0.0497323 -0.0639529 -0.042735 -0.0241356 0.0884035 0.118784 -0.000240078 0.0152781 0.030817 -0.147671 -0.0253247 0.0829296 0.0462047 -0.18605 -0.111698 0.0479856 -0.206562 0.0503685 -0.155348 0.124847 0.243405 -0.0163525 0.113397 0.132378 -0.0609023 -0.062623 -0.0138524 -0.275391 -0.028995 0.10637 -0.0436441 -0.0100118 0.0123335 0.108614 0.0431559 -0.0179846 -0.0243044 0.0663054 -0.100719 -0.0755822 0.0126238 -0.0878253 0.00347761 0.115825 -0.0818827 -0.0182599 0.148284 0.0138948 -0.12713 0.132589 -0.0255143 -0.141516 0.0321774 0.052508 0.155557 0.00498606 0.0706936 0.0434867 -0.0824093 -0.132467 0.0117853 0.0144556 0.162427 0.00563863 0.0554771 -0.159754 -0.0764552 0.015889 -0.0106606 0.0533399 -0.0758072 -0.0144188 -0.0962512 -0.0772214 -0.0100575 0.0225699 -0.0371056 0.0477928 0.0147718 0.105257 0.021521 0.0500907 -0.0663266 -0.0212519 -0.0842461 0.0985346 0.0326946 0.0590472 -0.0359236 0.112539 0.14462 -0.134051 -0.150854 -0.00269346 -0.112618 0.0558897 -0.114528 0.106419 0.0691944 -0.0155502 0.140675 -0.0634828 -0.061501 0.026212 0.00486932 -0.0409765 -0.105909 0.102728 -0.0714447 -0.0291954 -0.00858613 0.110666 -0.0683385 -0.0740836 0.0419231 0.171282 -0.0664865 -0.0618356 -0.0138579 0.156702 0.0480582 0.0686835 0.0249345 0.0245405 -0.0746042 0.0620547 0.0233913 -0.0390698 
0.0604393 -0.0668536 -0.0294412 -0.0327647 0.0818036 0.137956 0.0147613 0.0327312 0.0356335 -0.155077 -0.0441624 0.0696814 0.0523686 -0.187362 -0.0817752 0.0376129 -0.19709 0.0295455 -0.163682 0.105956 0.229253 0.0141654 0.0970935 0.142764 -0.0776373 -0.0810008 -0.028917 -0.27856 -0.0436926 0.104552 -0.0291082 -0.0118428 -2.85178e-05 0.11527 0.0503719 -0.013738 -0.00638077 0.0503832 -0.115294 -0.0577454 0.0183241 -0.0848335 -0.000942973 0.103883 -0.0660692 -0.0045022 0.135088 0.0207056 -0.12572 0.138574 -0.0147168 -0.157491 0.0516278 0.0502347 0.154365 0.0105794 0.0634846 0.0456617 -0.0697017 -0.127314 0.0067213 0.0350801 0.130931 -0.0173388 0.0522837 -0.168006 -0.0582777 0.0115011 -0.0187792 0.0348026 -0.072862 -0.0247453 -0.0966931 -0.087369 -0.0112916 0.0395924 -0.0392922 0.0393747 0.0275698 0.116864 0.0442622 0.0363363 -0.0708048 -0.0194387 -0.0729232 0.100646 0.0370631 0.0359071 -0.062101 0.128265 0.140266 -0.137296 -0.147881 -0.00193974 -0.125834 0.0859367 -0.102079 0.0873683 0.0632455 0.00582276 0.153497 -0.0530915 -0.0702505 0.0222093 -0.0135139 -0.0589895 -0.125022 0.082246 -0.0965904 -0.0099824 0.00466253 0.0993975 -0.0696246 -0.0938774 0.0261777 0.185406 -0.0744223 -0.0543709 -0.0395136 0.15241 0.0556316 0.0579201 0.0313229 0.0310092 -0.0619591 0.0535311 0.0111208 -0.0515236 
0.0429858 -0.0624737 -0.0205973 -0.0289898 0.0794527 0.128203 0.00719853 0.0299293 0.0318386 -0.143055 -0.0493378 0.068198 0.0383139 -0.213772 -0.0859967 0.0348795 -0.21471 0.0344512 -0.153031 0.120126 0.225615 0.000948164 0.0995705 0.135085 -0.075552 -0.0600978 -0.0351327 -0.290488 -0.0310261 0.084526 -0.025536 -0.0160113 -0.00128866 0.109014 0.0636266 -0.0156049 -0.00920809 0.0650796 -0.115817 -0.0745604 0.0259155 -0.0926231 -0.00506865 0.120932 -0.0746536 -0.00267073 0.149676 0.0240016 -0.129892 0.13643 -0.02661 -0.155514 0.0408853 0.0455656 0.160777 0.00119412 0.0628103 0.0340608 -0.0704703 -0.140553 0.0140075 0.0241108 0.13783 0.00260998 0.0656135 -0.176156 -0.0581537 -0.00501274 -0.00799882 0.0435783 -0.0816412 -0.0176972 -0.088038 -0.0634853 -0.0137096 0.0135827 -0.0523102 0.0622559 0.0382773 0.11255 0.0356366 0.0484259 -0.0752573 -0.0217931 -0.0607562 0.0780042 0.0359916 0.0632813 -0.0420502 0.121885 0.149765 -0.114778 -0.145488 -0.0165965 -0.124991 0.0691177 -0.0921986 0.0979153 0.0581199 -0.00641185 0.141394 -0.0549174 -0.0666148 0.00934488 -0.00360349 -0.0554623 -0.105419 0.0915518 -0.0710007 -0.000849949 0.00288791 0.112125 -0.0749487 -0.0952954 0.0345713 0.16757 -0.0668529 -0.0776274 -0.0336896 0.143049 0.0544605 0.0742093 0.0348928 0.0310978 -0.0676814 0.047028 0.0226329 -0.0501877 
0.0511411 -0.0726368 -0.0476167 -0.0267407 0.0820898 0.118161 0.0188694 0.0255029 0.0234489 -0.134696 -0.0481653 0.0762899 0.044532 -0.204884 -0.100092 0.0317723 -0.201733 0.0453101 -0.147331 0.123935 0.213408 0.0026655 0.0941272 0.141 -0.0884103 -0.0618654 -0.024262 -0.288856 -0.0379681 0.101661 -0.0573078 -0.00768242 -0.0042392 0.103329 0.0579777 -0.0227385 -0.00851848 0.0552601 -0.124483 -0.0755932 0.0208231 -0.0874714 -0.00310608 0.120496 -0.0812092 0.00829088 0.147512 0.028052 -0.126354 0.132073 -0.0184388 -0.164292 0.0458389 0.0454008 0.16098 0.00456823 0.0645033 0.0354958 -0.0659764 -0.126611 0.0250594 0.0303344 0.141397 0.00574728 0.0615762 -0.177568 -0.0630912 -0.00337275 -0.0040548 0.0229081 -0.0858126 -0.0252958 -0.0819 -0.0695747 -0.0207109 0.0311444 -0.0431618 0.0591618 0.0342693 0.0941973 0.0422147 0.0490873 -0.0931488 -0.0290618 -0.0665521 0.0923941 0.032528 0.0503542 -0.048184 0.123391 0.145606 -0.114386 -0.145065 -0.0174716 -0.124694 0.0776913 -0.0920507 0.0833558 0.0773866 -0.00795608 0.152979 -0.0538758 -0.0587868 0.0107386 -0.0105113 -0.0668834 -0.110991 0.0916839 -0.0960285 0.0115804 0.0163289 0.109326 -0.0555714 -0.102587 0.0126249 0.171567 -0.0717634 -0.0713037 -0.0412652 0.127788 0.0412573 0.0645291 0.0330192 0.0296285 -0.0729329 0.0539692 -0.00755 -0.068313 
0.057209 -0.0638649 -0.0484647 -0.0212747 0.0831741 0.123047 0.0105543 0.0206949 0.0215442 -0.130041 -0.0416941 0.0718076 0.0444074 -0.209176 -0.0938342 0.0391819 -0.189569 0.0509193 -0.141882 0.129862 0.218309 0.00287065 0.102964 0.144862 -0.0806434 -0.0596285 -0.0242785 -0.296135 -0.029256 0.101868 -0.0443129 -0.00296469 0.00306041 0.106429 0.0638618 -0.0201797 -0.00212974 0.0647131 -0.115017 -0.0834533 0.0124802 -0.0893354 -0.00307937 0.124109 -0.0850616 0.00360227 0.154678 0.0293425 -0.128775 0.135886 -0.0133111 -0.154928 0.0454877 0.0435625 0.159919 0.000980636 0.0713529 0.030758 -0.0600977 -0.137656 0.0146409 0.0196568 0.144032 -0.00550062 0.0622631 -0.181125 -0.0632721 -0.00668548 -0.00960306 0.032579 -0.0879281 -0.0243146 -0.0916629 -0.0695462 -0.0240035 0.0141437 -0.0432326 0.0688309 0.0345725 0.103684 0.0386401 0.0531736 -0.0901049 -0.0330645 -0.0534122 0.0825481 0.0240597 0.0510185 -0.039967 0.123792 0.146038 -0.111366 -0.15215 -0.0161041 -0.116578 0.0710776 -0.0902646 0.0991259 0.064955 -0.0150015 0.149758 -0.0493776 -0.0574765 0.0165857 -0.0112524 -0.0632964 -0.102493 0.0866978 -0.072412 0.0082192 0.00735819 0.115375 -0.0595745 -0.0967258 0.0234984 0.163694 -0.0673176 -0.0868267 -0.0378274 0.134572 0.047496 0.0678222 0.0384403 0.0328334 -0.0711968 0.0458869 0.0134366 -0.0621833 
0.0397157 -0.0435187 -0.0171409 -0.035995 0.055403 0.140861 0.00747843 0.0514102 0.0312387 -0.116593 -0.0542521 0.0593117 0.04079 -0.233883 -0.0812377 0.0228291 -0.212324 0.0249948 -0.146808 0.112578 0.212106 0.0183524 0.0713565 0.140177 -0.0935033 -0.0623986 -0.0345199 -0.28781 -0.0292949 0.0911821 -0.0350624 -0.0365831 -0.00213499 0.101518 0.0715614 -0.0190994 -0.000718842 0.0450478 -0.136511 -0.0670355 0.0141536 -0.106589 -0.0107512 0.129141 -0.05927 0.00424774 0.14811 0.0306415 -0.138587 0.140167 -0.000611563 -0.149473 0.0428249 0.0376597 0.161736 0.00768082 0.0494025 0.00706536 -0.0511099 -0.151932 0.0194048 0.0181281 0.121318 0.00252271 0.0623378 -0.20127 -0.0441057 -0.0219982 -0.0114757 0.0249928 -0.0821666 -0.0356993 -0.0847349 -0.0811093 -0.0165002 0.0272887 -0.0578516 0.0753762 0.0542055 0.120424 0.0486881 0.0362635 -0.0774806 -0.00737201 -0.0398194 0.0751776 0.0336464 0.0515537 -0.029669 0.142138 0.118324 -0.111821 -0.149739 -0.00761854 -0.144261 0.077197 -0.0757082 0.0766805 0.0549442 -0.00433269 0.161168 -0.0287198 -0.0707443 -0.0122503 -0.0215464 -0.0675627 -0.107436 0.0744925 -0.0926272 0.0214589 0.0188767 0.100639 -0.0710479 -0.113667 0.0151776 0.171308 -0.074484 -0.0758273 -0.0555525 0.122188 0.0496063 0.0553295 0.0471004 0.0250609 -0.0431336 0.0485293 0.0278156 -0.0590459 
0.029826 -0.0248014 -0.0142413 -0.0324181 0.0569928 0.143325 0.00122484 0.0398557 0.0254031 -0.109668 -0.0438259 0.060046 0.0378718 -0.234203 -0.0931461 0.0289944 -0.219789 0.0366978 -0.146743 0.115368 0.222179 0.000640138 0.0760429 0.13714 -0.0825548 -0.0607029 -0.0369429 -0.285262 -0.0159215 0.0949079 -0.0375752 -0.0365558 -0.000132519 0.0982692 0.0701316 -0.0198636 -0.00808361 0.04933 -0.12659 -0.0709091 0.0122692 -0.112321 -0.00349046 0.125048 -0.0606483 0.00257264 0.161838 0.0255278 -0.153905 0.131655 -0.00183061 -0.136243 0.0344435 0.0384313 0.160786 0.0121527 0.0564812 0.00682639 -0.0525037 -0.158562 0.0209586 0.0169072 0.134223 0.00412675 0.0699779 -0.190378 -0.051421 -0.0221036 -0.015916 0.042018 -0.0810481 -0.0286464 -0.0876048 -0.0771552 -0.00661312 0.0245408 -0.0586604 0.0840805 0.0495336 0.110917 0.0352311 0.0442898 -0.0704409 -0.0014737 -0.0482475 0.0844486 0.0305256 0.0587385 -0.0225457 0.140043 0.117399 -0.116092 -0.146828 -0.00733624 -0.140899 0.0607473 -0.0824597 0.0933969 0.0586629 -0.00768826 0.159568 -0.0299006 -0.0683568 -0.00499473 -0.0111779 -0.0524949 -0.0978779 0.0880323 -0.0832161 0.00862838 0.00854361 0.101937 -0.0706089 -0.108906 0.0246363 0.16674 -0.0811516 -0.074047 -0.0436753 0.127564 0.0494794 0.0544667 0.0425724 0.0185806 -0.0479756 0.0627148 0.033272 -0.0511771 
0.0298464 -0.0343604 -0.012862 -0.0274964 0.0701765 0.148057 0.0162645 0.0360363 0.0215851 -0.106903 -0.0480179 0.0729957 0.0357627 -0.233651 -0.0824443 0.0158047 -0.221814 0.0443452 -0.139727 0.107913 0.215627 0.00613194 0.068296 0.142554 -0.0765071 -0.0714383 -0.0437338 -0.289211 -0.0272306 0.10511 -0.0414162 -0.0403057 -0.00536016 0.0943327 0.0740792 -0.0220412 -0.00903801 0.022657 -0.129189 -0.0688054 0.0296685 -0.106438 0.00147426 0.123828 -0.076977 0.00631575 0.158316 0.0198684 -0.144627 0.124264 0.00425575 -0.151306 0.0385131 0.0334762 0.162165 0.021325 0.0485828 0.0150981 -0.0546255 -0.136607 0.0241438 0.0232505 0.124664 -0.00182258 0.0797581 -0.193361 -0.0540149 -0.0287779 -0.0203018 0.0378864 -0.0736593 -0.0180602 -0.0816341 -0.0879455 -0.00952297 0.0465799 -0.0625945 0.0785781 0.0487397 0.103778 0.0324351 0.0447864 -0.066059 0.0125031 -0.050805 0.0893908 0.0411293 0.0520614 -0.04036 0.140404 0.111795 -0.115504 -0.142994 -0.011001 -0.152727 0.0574534 -0.0876761 0.0809657 0.0673207 3.81014e-05 0.159877 -0.0279696 -0.0597611 -0.0140063 -0.013348 -0.0566085 -0.0990787 0.0883582 -0.103686 0.0249219 0.0157704 0.0843201 -0.0624167 -0.119339 0.0110801 0.170449 -0.0842748 -0.064556 -0.055347 0.12886 0.054037 0.0453032 0.0269457 0.0161791 -0.0472426 0.0724813 0.0183793 -0.051578 
0.0620432 -0.0806045 -0.0358822 -0.00259195 0.117621 0.135752 0.0268642 -0.0107644 0.00603025 -0.132604 -0.0471691 0.0967422 0.0496382 -0.177486 -0.0636438 0.0314511 -0.176165 0.0733565 -0.132168 0.118152 0.217225 0.0143931 0.0969496 0.166985 -0.0496427 -0.0785797 -0.0470287 -0.29673 -0.0435192 0.137993 -0.03129 0.0232649 -0.0157597 0.106376 0.0706564 -0.00747057 -0.0141302 0.0187133 -0.0961326 -0.0801721 0.0388526 -0.0737932 0.0167276 0.111914 -0.104523 0.00321669 0.154415 0.0253146 -0.107513 0.116661 0.0133091 -0.16751 0.0596478 0.0290328 0.168588 0.0142978 0.0610645 0.0626474 -0.0554258 -0.104637 0.0102458 0.0392537 0.121995 -0.0274262 0.0712187 -0.170816 -0.0660315 -0.00490499 -0.0329975 0.0397291 -0.0687142 0.0129979 -0.0914277 -0.0894906 -0.0353319 0.0447325 -0.0432882 0.0443393 0.0316099 0.107371 0.0469826 0.0624175 -0.0724061 -0.018817 -0.0646567 0.0769036 0.0407625 0.0355322 -0.0777507 0.12145 0.13378 -0.106662 -0.141383 -0.00856277 -0.139295 0.0729813 -0.101833 0.0942615 0.0735612 -0.0107607 0.151541 -0.0429157 -0.0485943 0.0252953 -0.0201427 -0.0587108 -0.117194 0.0819776 -0.0836633 0.0279303 0.00580479 0.091581 -0.0672708 -0.0999756 0.00947804 0.170125 -0.0705291 -0.0709604 -0.0596739 0.155962 0.0672154 0.0554205 0.0159574 0.0205926 -0.0876031 0.0665431 -0.00432122 -0.0555219 
0.0803949 -0.0104095 -0.0406259 -0.0331736 0.0763084 0.175648 0.0412275 0.0391565 0.015729 -0.131445 -0.0519692 0.0589563 0.0424791 -0.218472 -0.0610855 0.0313952 -0.171951 0.0284948 -0.170087 0.0890263 0.207694 0.036885 0.0842622 0.140332 -0.0767968 -0.0825574 -0.0539892 -0.286609 -0.0141393 0.102279 -0.015709 0.0226979 -0.0269855 0.127224 0.0496587 -0.0324442 0.00784868 0.0649701 -0.108497 -0.0395292 0.0264281 -0.0857347 0.00419012 0.11853 -0.0793577 0.00411174 0.154381 0.0159791 -0.151602 0.144445 0.0279304 -0.123974 0.0251107 0.0405974 0.146141 0.00411642 0.0655438 0.0618868 -0.03362 -0.148511 -0.0194025 0.0285222 0.130572 -0.0638093 0.0532565 -0.184304 -0.0330598 -0.0121263 -0.0419661 0.0596279 -0.0670364 -0.00338913 -0.0943492 -0.0391753 -0.0185747 0.0128122 -0.0535365 0.0490276 0.0258017 0.114017 0.0476373 0.055803 -0.0603893 -0.0297131 -0.0399689 0.0700026 0.0344308 0.0147593 -0.0509503 0.133664 0.129809 -0.14603 -0.170049 -0.0260617 -0.105219 0.0785683 -0.0504605 0.0920324 0.0388218 0.0118851 0.122255 -0.0208918 -0.0582012 0.0721206 -0.0687475 -0.0701228 -0.136461 0.0954683 -0.0761167 -0.00861475 0.0310855 0.122198 -0.0853077 -0.0917119 0.0346657 0.151006 -0.0686088 -0.0960105 -0.0248534 0.150947 0.0801893 0.0654092 0.0615071 0.0401588 -0.0411088 0.0138302 0.0247306 -0.069388 
0.0608214 -0.0160243 -0.0364773 -0.0327654 0.0774047 0.195261 0.00110694 0.0251861 0.0130474 -0.131355 -0.033126 0.0696061 0.0368664 -0.197492 -0.0696833 0.0687987 -0.172892 0.0420815 -0.154445 0.0611668 0.240267 0.0128333 0.0945001 0.1389 -0.039286 -0.0733137 -0.0336852 -0.287647 -0.0236822 0.102216 0.0143862 0.0152825 -0.0173902 0.125071 0.0402315 -0.00472349 -0.022437 0.0305199 -0.0614416 -0.0250954 0.0121479 -0.0915825 0.013194 0.100166 -0.0448479 -0.0248344 0.157955 -0.00601423 -0.163779 0.11682 0.0287187 -0.123972 0.0294616 0.0351099 0.123935 0.0308772 0.080501 0.0789095 -0.0488714 -0.134765 -0.0228435 0.0327661 0.147843 -0.0777002 0.0664027 -0.165566 -0.0624659 0.0206179 -0.0474152 0.095633 -0.0620543 0.0142669 -0.127276 -0.0820563 -0.0140177 0.0212873 -0.0395539 0.0500493 -0.00539233 0.113898 0.0131751 0.0546869 -0.0321914 -0.0133619 -0.100682 0.0963784 0.0435577 0.00816952 -0.0601488 0.112456 0.107407 -0.153817 -0.165123 0.0107963 -0.0848818 0.100503 -0.0811189 0.10708 0.0255487 0.0256908 0.115125 -0.0462462 -0.0958051 0.0805234 -0.0207417 -0.0413681 -0.137159 0.0728524 -0.0991646 -0.0464902 -0.020771 0.10303 -0.070483 -0.0840338 0.0680063 0.164664 -0.0778802 -0.0689145 -0.00388135 0.176151 0.0915439 0.0447629 0.0558552 0.016431 -0.0502363 0.047394 0.0277153 -0.0389858 
0.0342035 -0.0373556 -0.0231669 -0.0213333 0.0650027 0.124809 -0.00790713 0.0258068 0.0307832 -0.117552 -0.00466435 0.0644694 0.0470272 -0.206286 -0.10802 0.0705357 -0.212817 0.0582782 -0.154487 0.108087 0.256426 -0.035368 0.105832 0.122993 -0.0504443 -0.0610195 -0.0147708 -0.277451 -0.0123183 0.101233 -0.0305497 -0.0129878 0.0255138 0.117511 0.0503276 -0.0267963 -0.0213481 0.0615456 -0.0771455 -0.0791884 -0.0035608 -0.122193 0.0135299 0.10782 -0.0513663 -0.0410625 0.148625 0.00544925 -0.14955 0.116831 -0.0177934 -0.138479 0.0263142 0.0492845 0.133333 0.0203638 0.0740431 0.0179371 -0.0821266 -0.134561 0.00984772 -0.00468331 0.154982 -0.00366007 0.0704016 -0.145736 -0.0911247 -0.00117497 -0.0256547 0.0561433 -0.097367 -0.023025 -0.11834 -0.0900414 -0.00913705 0.00457413 -0.0176843 0.066117 0.0116958 0.106633 0.0063688 0.0238439 -0.0583979 -0.00746856 -0.092055 0.10669 0.0257843 0.0511429 -0.0170053 0.118244 0.128798 -0.137297 -0.15657 0.0147225 -0.112835 0.0724606 -0.125973 0.116492 0.0593745 -0.000844821 0.146531 -0.0656096 -0.0836356 0.029549 0.0504817 -0.0334486 -0.0805366 0.100112 -0.0610777 -0.0492063 -0.0533709 0.107463 -0.0631607 -0.0770539 0.066992 0.165286 -0.0583622 -0.0451958 -0.00264055 0.157844 0.0539228 0.0559929 0.0315007 0.0250677 -0.0565437 0.0656867 0.0436768 -0.0337013 
0.0268185 0.016117 -0.0184161 -0.0200049 0.0769397 0.15139 -0.0196134 0.00144945 0.0286321 -0.121075 -0.011811 0.0577046 0.0396821 -0.17426 -0.0821881 0.10077 -0.177956 0.0390374 -0.152847 0.077796 0.266499 -0.0381216 0.104468 0.110024 -0.00945175 -0.0702039 -0.041471 -0.263195 0.00374548 0.116195 0.0208336 0.0251846 0.02203 0.122083 0.0388484 0.00551706 -0.0189549 0.0595303 -0.0405643 -0.0496879 -0.00694819 -0.110136 0.0376751 0.0709364 -0.0143876 -0.0105217 0.166551 -0.0190806 -0.172713 0.0863193 -0.00376156 -0.0965065 0.024201 0.0348446 0.125228 0.0430705 0.0779867 0.0475706 -0.0759173 -0.128836 -0.0199686 0.00421469 0.147098 -0.0672701 0.0861892 -0.129601 -0.0924957 0.0280415 -0.0565704 0.101622 -0.0686246 0.00519857 -0.152653 -0.100743 0.0105208 0.0255362 -0.0131052 0.0675453 -0.0172375 0.106892 -0.0204278 0.0441646 -0.0324727 0.00847849 -0.117649 0.109275 0.0210054 0.0245576 -0.0391463 0.113148 0.101236 -0.157655 -0.156889 0.030581 -0.0800094 0.0884437 -0.108607 0.129736 0.0407365 0.0158625 0.113889 -0.0678523 -0.113529 0.0807008 0.0179048 -0.00557082 -0.107588 0.0935468 -0.0531084 -0.0816237 -0.076906 0.0937361 -0.0928283 -0.0652909 0.100203 0.162174 -0.0784678 -0.0547063 0.0159706 0.198827 0.0798393 0.0644846 0.0381599 0.0290916 -0.0478019 0.0743326 0.0581472 -0.0271698 
0.0307108 0.00416792 -0.00169109 -0.021718 0.0640621 0.146087 0.0176061 0.0214531 0.0341619 -0.102185 -0.0251294 0.0468946 0.0520647 -0.218363 -0.0714918 0.0791712 -0.204897 0.0502366 -0.174703 0.0815622 0.244233 -0.00186676 0.0852383 0.124726 -0.0637437 -0.0858981 -0.0569007 -0.282051 0.000979259 0.119551 -0.0167073 0.00701776 0.0102085 0.119483 0.0709407 -0.0252691 0.0145974 0.0503051 -0.07802 -0.0508641 0.0064284 -0.120573 0.0309485 0.0848376 -0.0406526 -0.012884 0.157609 0.00811607 -0.157086 0.105078 0.0114269 -0.141447 0.0287099 0.0472122 0.132617 0.0348337 0.0741888 0.0105203 -0.0655403 -0.126325 -0.00807143 0.00490061 0.114884 -0.0452474 0.0848112 -0.15625 -0.0734953 -0.0151689 -0.0468088 0.0438407 -0.08545 -0.0183887 -0.118086 -0.0925549 0.00115822 0.0302129 -0.0326908 0.0767079 0.0171007 0.101589 0.0411197 0.030599 -0.0606837 0.0141824 -0.0807541 0.11869 0.0236234 0.0227373 -0.0530476 0.139698 0.106364 -0.147004 -0.158306 0.00398237 -0.13116 0.0913016 -0.110951 0.109176 0.0573506 0.0268848 0.152548 -0.0527164 -0.0856227 0.0440722 0.0274592 -0.0517501 -0.0924203 0.0972345 -0.0700668 -0.0208864 -0.0538362 0.0866975 -0.0730027 -0.0939246 0.0470382 0.173124 -0.0768446 -0.0360157 -0.041599 0.153084 0.0725223 0.0519659 0.0393079 0.0357536 -0.0419209 0.0650796 0.0241405 -0.0492648 
0.0278765 -0.0139241 0.00151438 -0.032157 0.0579397 0.135121 0.00123373 0.0367524 0.00704007 -0.0966043 -0.0499212 0.0562833 0.0460582 -0.228994 -0.0698595 0.0768769 -0.209168 0.0182196 -0.155731 0.108309 0.225818 -0.00151039 0.0883805 0.117052 -0.0755241 -0.0352018 -0.0477825 -0.291566 -0.00739162 0.0959451 -0.0294269 0.0111674 0.00788375 0.120576 0.0549681 -0.0254758 0.00569279 0.0831651 -0.0890153 -0.0548633 -0.000939086 -0.122128 0.0244229 0.0940591 -0.0345725 0.00297162 0.175808 0.00256609 -0.167542 0.122384 0.0210389 -0.150267 0.0265094 0.0513975 0.159746 0.0142314 0.0703487 0.0114543 -0.05096 -0.146774 0.0069604 -0.00109716 0.112495 -0.0229255 0.0904503 -0.168406 -0.0720161 -0.00887755 -0.0306119 0.0316399 -0.0936065 -0.0172272 -0.109685 -0.0634623 0.00490255 0.0160056 -0.0384016 0.0781037 0.0379897 0.114917 0.0446389 0.0288914 -0.0643429 -0.000477847 -0.0654851 0.0727286 0.0286061 0.0497022 -0.0191365 0.135844 0.0991438 -0.121844 -0.160183 0.0122507 -0.130873 0.110801 -0.0741561 0.10981 0.05233 0.0136033 0.132671 -0.0475988 -0.0910997 0.039261 -0.00276312 -0.0586353 -0.112048 0.0942463 -0.0628747 -0.0278146 -0.0318833 0.120417 -0.0824275 -0.0997058 0.0521104 0.156856 -0.0746191 -0.071444 -0.0473177 0.141247 0.0674959 0.0731115 0.070797 0.0246029 -0.0383937 0.0535801 0.0389025 -0.0619188 
0.00744201 -0.00193058 0.0108129 -0.0486302 0.0486681 0.1416 0.0117148 0.0548816 0.0257164 -0.0700379 -0.0408803 0.0512336 0.0571499 -0.24832 -0.0885105 0.0662857 -0.233543 0.023995 -0.160735 0.0859533 0.259142 -0.0267016 0.0395261 0.119203 -0.0691559 -0.0319728 -0.0742766 -0.287231 0.0158352 0.103931 -0.0119843 -0.00916379 -0.0153957 0.0964637 0.0563772 -0.0374701 -0.0210242 0.0500775 -0.0621101 -0.0508582 0.0105339 -0.134526 0.0132404 0.103633 -0.00361727 -0.0316441 0.156824 0.00680083 -0.15756 0.0743577 0.0112843 -0.127352 0.0173721 0.0376338 0.145436 0.0274361 0.0605405 0.0088473 -0.0614769 -0.159552 0.0249739 -0.0119979 0.118421 0.00993995 0.0655441 -0.173341 -0.0585386 -0.0119482 -0.007398 0.00895478 -0.0791806 -0.00781175 -0.114886 -0.0872911 0.00335721 0.0291144 -0.0540879 0.0972074 0.0437643 0.130889 0.0287049 0.0333166 -0.0292438 0.0421055 -0.0674392 0.0956038 0.0614542 0.0655716 -0.000432553 0.104788 0.0745504 -0.11625 -0.146253 0.0226457 -0.159893 0.0725983 -0.0852289 0.0985099 0.0418526 0.0156879 0.155537 -0.0452034 -0.0965606 0.0377223 0.0165709 -0.0440962 -0.101082 0.109497 -0.066702 -0.0225732 -0.0424364 0.0846333 -0.112394 -0.1076 0.0584761 0.178887 -0.0959219 -0.0519898 -0.0536574 0.126527 0.0549693 0.0584258 0.0514471 0.0105717 -0.0609395 0.0768898 0.0127806 -0.0316483 
0.0107316 0.0260584 0.00618736 -0.0435672 0.0319996 0.163358 0.0134743 0.0619495 0.0207511 -0.0691618 -0.0261318 0.0398114 0.0597638 -0.247532 -0.106311 0.0674585 -0.226572 0.0445017 -0.166396 0.063 0.274258 -0.0424603 0.0497403 0.109263 -0.065455 -0.0681342 -0.0760269 -0.276238 0.0213579 0.107787 -0.0105477 -0.0201606 -0.0104676 0.093422 0.0518379 -0.0524634 -0.0255896 0.0403984 -0.0552279 -0.0393301 -0.00439872 -0.13828 0.018245 0.0912985 -0.00513945 -0.0558449 0.153647 -0.0086149 -0.173019 0.0819016 0.0240146 -0.111535 0.00824378 0.0462844 0.111105 0.0352276 0.0857595 -0.00146275 -0.0566107 -0.163179 0.0189564 -0.000522597 0.120672 -0.0172293 0.0647068 -0.165383 -0.0606352 -0.024117 -0.0295054 0.0299492 -0.0738885 -0.0119485 -0.119512 -0.0886674 0.00211154 0.0311041 -0.0438714 0.0877805 0.0304839 0.120415 0.00597788 0.0163906 -0.0167456 0.0506363 -0.0781311 0.128986 0.0483137 0.0419991 -0.0039956 0.0999757 0.0635503 -0.141454 -0.146688 0.0197932 -0.142573 0.0571156 -0.0940266 0.119613 0.0243707 0.038023 0.159429 -0.0364839 -0.0948173 0.0601164 0.0422823 -0.0368368 -0.0827264 0.118386 -0.0750595 -0.0412511 -0.0668164 0.0680171 -0.0930489 -0.101359 0.0623531 0.181259 -0.0892743 -0.0237412 -0.0282989 0.138181 0.0466292 0.0336965 0.0395919 -0.00121009 -0.0436891 0.0792922 0.0181669 -0.0179979 
0.0256066 0.0075775 -0.0171468 -0.0271264 0.0652839 0.143467 0.0116257 0.0571789 0.0352971 -0.0823906 -0.0319462 0.0613533 0.0383085 -0.260674 -0.108157 0.0758426 -0.202142 0.057267 -0.169353 0.100726 0.251501 -0.0263358 0.0821069 0.108693 -0.0753679 -0.0749789 -0.056109 -0.285173 0.00932621 0.0947791 -0.0245562 -0.00442992 0.0154524 0.106854 0.0582213 -0.0471166 -0.00165714 0.0593552 -0.0877842 -0.0637104 -0.00280248 -0.117541 0.0160932 0.0967124 -0.0380679 -0.0325176 0.158974 -0.0040932 -0.163647 0.118905 0.0132889 -0.126066 -0.000684845 0.0406476 0.123611 0.0196743 0.078792 -0.0125483 -0.0734177 -0.140557 0.0101163 -0.0116539 0.12831 -0.0300529 0.0868304 -0.191025 -0.0830905 -0.0234867 -0.0379406 0.04915 -0.0801202 -0.0174011 -0.117621 -0.0713434 -0.0191487 0.021271 -0.0285691 0.104114 0.0205453 0.0875528 0.00163264 0.0382666 -0.0540993 0.0307435 -0.055816 0.107236 0.0239969 0.0553678 -0.0056646 0.122634 0.0931783 -0.133941 -0.176521 0.0116607 -0.102095 0.0723155 -0.0918921 0.1094 0.0190964 0.0260427 0.145734 -0.0565337 -0.0938414 0.0371963 0.0326785 -0.0450167 -0.0757308 0.0938305 -0.0560023 -0.0252924 -0.0603603 0.0922802 -0.066969 -0.0876211 0.0647887 0.151863 -0.0678637 -0.0583216 -0.0190946 0.14833 0.0490221 0.0733436 0.0485131 0.0242195 -0.0272858 0.0547766 0.0422973 -0.0518035 
0.010551 -0.00430807 0.010052 -0.0341493 0.0629914 0.152199 0.020716 0.0577925 0.0343648 -0.0842085 -0.0256458 0.0664802 0.0445144 -0.247641 -0.0968002 0.0538139 -0.229547 0.051768 -0.168296 0.0793196 0.264035 -0.0301855 0.0526191 0.121228 -0.0577109 -0.0664641 -0.0632672 -0.280909 0.0104238 0.0974616 -0.0140624 -0.019512 -0.00459969 0.101802 0.0547243 -0.0399766 -0.0238288 0.0315865 -0.08077 -0.055486 0.0342612 -0.124474 0.013395 0.106623 -0.0379478 -0.0444365 0.152048 -0.00594394 -0.160378 0.0780149 0.00555297 -0.129374 0.00394724 0.0350757 0.132654 0.0388433 0.0566979 0.011894 -0.0777167 -0.142432 0.0159289 -0.00736284 0.12641 -0.00382846 0.0837779 -0.168179 -0.0679737 -0.0209522 -0.0223752 0.0493712 -0.0718988 -0.00395949 -0.107641 -0.0909624 0.000603826 0.0370306 -0.0511412 0.100402 0.0249696 0.099306 -6.06026e-05 0.0425411 -0.0255417 0.0400519 -0.0757898 0.114415 0.063812 0.0642057 -0.0242742 0.113028 0.0920434 -0.134882 -0.15844 0.0100631 -0.142469 0.0532973 -0.101232 0.0947657 0.0395409 0.0234452 0.149952 -0.0538518 -0.0832949 0.0293025 0.0325071 -0.0355537 -0.086663 0.109816 -0.076622 -0.0332328 -0.0501508 0.0768204 -0.0910031 -0.102562 0.0659488 0.165477 -0.0922823 -0.047126 -0.0272362 0.144335 0.0588334 0.0542741 0.0243823 0.0157351 -0.0428328 0.0815302 0.0227495 -0.0273131 
0.00122778 0.00617597 0.0155907 -0.0424091 0.0507614 0.146172 0.0100412 0.0519659 0.038436 -0.0859052 -0.0346919 0.0513682 0.0459882 -0.249353 -0.0931842 0.0541257 -0.240188 0.0293182 -0.167325 0.0825649 0.259663 -0.0234916 0.0316636 0.123154 -0.0581127 -0.0535324 -0.069451 -0.275216 0.01534 0.104255 -0.00473285 -0.0263733 -0.0123749 0.0942935 0.0591439 -0.0301381 -0.024739 0.027047 -0.0769181 -0.0505017 0.026402 -0.133682 0.0178081 0.113936 -0.00707086 -0.0310348 0.156698 0.00769456 -0.157822 0.0725774 0.00126253 -0.121351 0.0173174 0.0302409 0.141764 0.0360629 0.0435157 0.00729356 -0.0657426 -0.159926 0.0190753 -0.00370789 0.121199 0.0136472 0.0628313 -0.170795 -0.0536308 -0.0223632 -0.0105657 0.0221403 -0.0705028 -0.0118675 -0.105897 -0.0984834 0.0108212 0.037133 -0.0599726 0.10049 0.0359966 0.126053 0.0251891 0.0419491 -0.0279386 0.0462707 -0.069957 0.112827 0.0596169 0.0638853 -0.0163634 0.114037 0.0818795 -0.125041 -0.149919 0.01677 -0.161578 0.062309 -0.0932121 0.0889677 0.0436914 0.0126951 0.1538 -0.0450427 -0.0886123 0.0238575 0.0134116 -0.0341207 -0.0962899 0.113715 -0.0780074 -0.0197258 -0.0353563 0.0731534 -0.114015 -0.106126 0.051098 0.175202 -0.103574 -0.0448326 -0.0442115 0.129385 0.0568543 0.0554494 0.0344813 0.0127378 -0.0539831 0.0808304 0.0179938 -0.0282013 
0.0349924 -0.00914493 -0.0176011 -0.0454157 0.073486 0.146132 0.00874654 0.0414609 -0.00528866 -0.0766741 -0.031538 0.0545512 0.0561767 -0.230606 -0.078892 0.0761053 -0.194954 0.0620653 -0.156556 0.107421 0.238507 -0.000993936 0.0718482 0.125465 -0.0725368 -0.0460924 -0.0440185 -0.281564 0.0126331 0.103027 -0.0362747 0.000427887 -0.00182661 0.112102 0.0676463 -0.0305792 -0.00566783 0.0504209 -0.0796918 -0.0716773 -0.00059109 -0.115488 0.0341411 0.121579 -0.047534 -0.012586 0.174344 0.0225021 -0.181089 0.110225 0.0161809 -0.15528 0.00911089 0.0372908 0.138876 0.0208024 0.0563893 0.021372 -0.0531422 -0.152631 0.010898 0.000902475 0.136975 -0.0137317 0.0759288 -0.166737 -0.0838868 -0.0124046 -0.0315515 0.0282348 -0.0853762 -0.0149956 -0.105086 -0.0856702 -0.015289 0.0131834 -0.0424923 0.093787 0.0416145 0.0890749 0.0462519 0.0451917 -0.0660704 0.00150726 -0.0689626 0.0898072 0.0284636 0.0492127 -0.00621565 0.141213 0.111961 -0.119721 -0.178295 0.00884271 -0.120436 0.0949795 -0.0909104 0.117855 0.0346256 0.00183047 0.143263 -0.0456163 -0.077947 0.0313313 -0.00589544 -0.0437833 -0.106026 0.0943429 -0.0617088 -0.021765 -0.0220665 0.10839 -0.076312 -0.0907472 0.0519301 0.148301 -0.0799599 -0.0723066 -0.0446162 0.129006 0.0641894 0.0524429 0.0640445 0.0278689 -0.0589391 0.0506824 0.0240245 -0.0640054 
0.0384879 -0.00850801 -0.0193672 -0.0477038 0.0612569 0.151204 -0.00137193 0.0411944 0.00768009 -0.0998653 -0.0300582 0.0563262 0.0438067 -0.232253 -0.0806284 0.0643651 -0.205555 0.0332397 -0.157266 0.106787 0.226018 0.00976525 0.071299 0.112903 -0.0731407 -0.0332142 -0.0257262 -0.278562 -0.00122555 0.0898568 -0.031347 -0.0105727 0.00266825 0.116648 0.0630366 -0.0206611 -0.0035316 0.0606786 -0.0891181 -0.0667294 0.00528885 -0.120685 0.0240519 0.130073 -0.0468143 -0.00106 0.171331 0.0185502 -0.183118 0.122425 0.00589167 -0.137444 0.0134231 0.0420714 0.149112 0.0133502 0.0446652 0.0218641 -0.0572459 -0.158337 0.0019202 -0.00581163 0.149319 -0.0105957 0.0748117 -0.171392 -0.07353 -0.00366321 -0.0226917 0.0445475 -0.0825863 -0.0248938 -0.102279 -0.0809675 -0.0040581 0.00800989 -0.0519475 0.0843937 0.0335184 0.10566 0.0441866 0.0435433 -0.0608345 -0.0062825 -0.0708995 0.0795036 0.0321632 0.0498816 -0.00743736 0.147502 0.116725 -0.130385 -0.178666 0.00836951 -0.121079 0.0914097 -0.0761976 0.10305 0.042578 -0.00817901 0.131521 -0.0385209 -0.0806743 0.0225035 -0.0184854 -0.044646 -0.110836 0.0974261 -0.0714826 -0.0280906 -0.00513326 0.114293 -0.0837378 -0.0894131 0.0573926 0.143295 -0.0820128 -0.0822139 -0.0272764 0.131393 0.0741381 0.0569214 0.0749699 0.0324017 -0.0381819 0.0411876 0.0505458 -0.0569007 
0.0428685 -0.000703022 -0.00978148 -0.0377519 0.0674597 0.154036 -0.00774077 0.027934 0.00180869 -0.102152 -0.0180772 0.0522873 0.0441149 -0.221559 -0.0607297 0.0770731 -0.193155 0.041572 -0.143885 0.100227 0.229652 0.0229071 0.0878503 0.122022 -0.0555741 -0.049967 -0.0190704 -0.274718 0.011455 0.103799 -0.023873 -0.0105264 0.0195786 0.121375 0.0685787 -0.0171118 0.00868271 0.0476388 -0.0780748 -0.0633621 0.00261534 -0.125324 0.0401869 0.122924 -0.0567794 0.00103879 0.179834 0.0137991 -0.18407 0.120083 0.0144462 -0.131902 0.016436 0.0440408 0.141556 0.0206604 0.0547815 0.0191129 -0.059433 -0.140808 -0.0115931 -0.0049087 0.139596 -0.0301865 0.0828766 -0.164284 -0.0795509 -0.0154684 -0.0395793 0.0577819 -0.089123 -0.0211756 -0.119851 -0.0883689 0.0050618 0.00527187 -0.040453 0.0870113 0.0264001 0.109563 0.0480834 0.0401564 -0.0547186 -0.00125253 -0.0648038 0.0864295 0.0174792 0.0337024 -0.0303574 0.157487 0.121801 -0.130528 -0.187214 0.0162215 -0.118891 0.0898682 -0.090505 0.124719 0.0468085 -0.00723549 0.128878 -0.0392547 -0.0752601 0.0281763 -0.00992357 -0.0394848 -0.0981511 0.0971736 -0.0586902 -0.0353191 -0.022417 0.104492 -0.0749832 -0.0884813 0.0591655 0.14082 -0.0683378 -0.0770459 -0.0276635 0.155383 0.0867153 0.0490075 0.0619888 0.0331082 -0.0421899 0.0486221 0.0640622 -0.0470568 
0.0473221 0.0052071 -0.0320512 -0.03037 0.0680533 0.162775 0.0184506 0.0185842 -0.0165286 -0.0729344 -0.0394675 0.0511745 0.0554493 -0.222665 -0.0686522 0.0678938 -0.177881 0.0489896 -0.141451 0.105965 0.209349 0.0126497 0.0617478 0.143652 -0.0738152 -0.048887 -0.0507673 -0.283647 0.00653873 0.116951 -0.0457699 0.012861 -0.0204662 0.109655 0.0700919 -0.0136627 0.00860752 0.0374545 -0.0911847 -0.0636216 0.00452137 -0.114933 0.0401402 0.111938 -0.0500397 0.0216026 0.189314 0.0311203 -0.187131 0.109587 0.0377524 -0.147161 0.0231987 0.0345314 0.161204 0.0230183 0.0539874 0.0301486 -0.0225229 -0.149397 0.00515373 0.0229029 0.131466 -0.0435419 0.076563 -0.163279 -0.0650805 -0.0167838 -0.0384141 0.0315922 -0.0854056 -0.0074972 -0.101452 -0.0746453 -0.00502217 0.0264244 -0.0439741 0.10001 0.0445101 0.0857519 0.0652773 0.0538062 -0.073671 -0.0116422 -0.0649201 0.0903665 0.0188638 0.0251278 -0.0290366 0.154903 0.107525 -0.119154 -0.166317 -0.00225154 -0.130767 0.0991917 -0.0650958 0.107935 0.0595945 -0.00333208 0.146543 -0.0256242 -0.0647581 0.0335862 -0.0448745 -0.0489105 -0.120358 0.0916049 -0.0861593 0.00341283 0.00610394 0.109965 -0.0619839 -0.110347 0.0322716 0.145618 -0.0905102 -0.0812578 -0.0614222 0.122723 0.0709659 0.0385764 0.076012 0.0269844 -0.0613579 0.0621503 0.0134262 -0.0767875 
0.0559762 -0.012756 -0.033444 -0.027826 0.0722451 0.160934 0.0218944 0.0212674 -0.00418848 -0.0825671 -0.0455751 0.0572823 0.0565177 -0.22627 -0.0626381 0.0705095 -0.173731 0.0440811 -0.149844 0.102199 0.208738 0.026369 0.0671203 0.151613 -0.0756608 -0.051581 -0.0495116 -0.29226 0.0022094 0.116477 -0.0323395 0.0291897 -0.0255039 0.113885 0.0639555 -0.0192145 0.0054548 0.0373538 -0.0900001 -0.0550735 0.0101538 -0.112523 0.0276487 0.116466 -0.0504023 0.0114039 0.175069 0.0343661 -0.164544 0.111261 0.0457246 -0.146693 0.028003 0.0281176 0.154062 0.01534 0.0588477 0.0361289 -0.022101 -0.137976 -0.000284337 0.0184915 0.120447 -0.0421816 0.0674814 -0.179586 -0.0579611 -0.0166028 -0.0333552 0.0294147 -0.0897628 -0.00294344 -0.104978 -0.0699827 -0.0167793 0.0189126 -0.0415763 0.0934879 0.0372523 0.106217 0.0758989 0.0490393 -0.0697584 -0.0159248 -0.0546513 0.0803721 0.0278209 0.0210292 -0.0439906 0.142622 0.105484 -0.113094 -0.172604 0.000729864 -0.132569 0.106156 -0.064544 0.0971506 0.0563102 -0.00223998 0.147884 -0.0319552 -0.0703119 0.0467896 -0.0405231 -0.0661092 -0.126112 0.0886735 -0.0789003 0.00856963 0.00184957 0.115979 -0.0696935 -0.108949 0.0303732 0.150413 -0.0842913 -0.0812682 -0.0637817 0.131691 0.0741168 0.050995 0.0723667 0.0289488 -0.0643603 0.0491115 0.00470693 -0.0746957 
0.0551194 -0.00293042 -0.0250111 -0.00909244 0.0777086 0.175404 0.0204675 0.00811576 0.00718714 -0.0998514 -0.0253298 0.0669122 0.0334746 -0.232946 -0.0712625 0.0561856 -0.181826 0.0757374 -0.140134 0.0785415 0.226348 0.0191019 0.0787226 0.151713 -0.0508008 -0.081099 -0.0382477 -0.293397 -0.00668042 0.123509 -0.0203817 0.00450649 -0.0101934 0.116767 0.0844641 -0.0294214 0.00847088 0.013992 -0.0771684 -0.0662211 0.0164833 -0.111413 0.0344474 0.112849 -0.0702425 -0.0163617 0.171996 0.0133765 -0.164345 0.114886 0.0412332 -0.139652 0.0359691 0.0309627 0.139051 0.0317524 0.0693455 0.0337737 -0.0466284 -0.132521 -0.00800372 0.0131788 0.136732 -0.0625641 0.0852632 -0.170705 -0.0677115 -0.0361612 -0.0574715 0.0696273 -0.0886505 -0.00422355 -0.113558 -0.0834018 -0.0250838 0.0149308 -0.0375545 0.0805486 0.0206738 0.0985795 0.0387119 0.0543153 -0.0583285 -0.00651338 -0.0592128 0.0891511 0.0205318 0.0152798 -0.0541893 0.148269 0.115923 -0.129114 -0.170734 -0.00485317 -0.115159 0.0824442 -0.0874086 0.112684 0.0496418 0.00971686 0.146548 -0.0292582 -0.0674728 0.0375403 -0.00133314 -0.0553649 -0.0882839 0.08216 -0.0855504 0.00359501 -0.0159625 0.0926544 -0.05111 -0.101954 0.0422094 0.149905 -0.0698658 -0.0644796 -0.0335087 0.145028 0.0846482 0.037812 0.0479349 0.0184454 -0.0448182 0.057952 0.0335094 -0.0582483 
0.0490149 -0.00775044 -0.0305082 -0.0226993 0.0782448 0.158747 0.0228623 0.0226526 0.0221831 -0.0997836 -0.0274615 0.0669671 0.0465821 -0.22299 -0.0759732 0.0843302 -0.173691 0.0484898 -0.165373 0.0784689 0.23273 0.0172354 0.0674586 0.152036 -0.056763 -0.0657341 -0.0337129 -0.284202 0.00863771 0.115438 -0.0176644 0.0304909 -0.0106261 0.12117 0.0487672 -0.0247359 0.00338942 0.0279049 -0.0765223 -0.0426053 0.0242193 -0.111377 0.0334571 0.10578 -0.0394441 -0.0077721 0.166897 0.0121583 -0.164598 0.0860434 0.0352894 -0.14036 0.0234688 0.0255512 0.135592 0.034448 0.0594334 0.0461012 -0.0450209 -0.123498 -0.00986501 0.00787504 0.126842 -0.0465774 0.0706289 -0.16655 -0.069138 -0.00957834 -0.0359754 0.0517413 -0.0901184 -0.00619049 -0.120111 -0.0876024 -0.00366602 0.0270875 -0.0303078 0.0997506 0.00232968 0.0961561 0.0479994 0.0577193 -0.0515102 -0.00601178 -0.0742646 0.104867 0.0392579 0.0174793 -0.0682425 0.13105 0.105368 -0.134292 -0.184011 0.00898571 -0.116755 0.107787 -0.0866444 0.0937318 0.0575854 0.0102634 0.137231 -0.0573016 -0.0792351 0.067832 -0.0146676 -0.058551 -0.118762 0.0949522 -0.0911077 -0.0279411 -0.0236182 0.106222 -0.0702793 -0.0990422 0.0492966 0.151288 -0.0976989 -0.0654703 -0.0413835 0.149126 0.0793872 0.0589258 0.0499162 0.0305634 -0.0555442 0.0604879 0.000100429 -0.0675075 
0.0459174 0.00399705 -0.00521543 -0.026142 0.0788609 0.171376 0.0216885 0.0274519 0.0188612 -0.095911 -0.0269307 0.0494383 0.0441227 -0.230573 -0.0447951 0.0543943 -0.190093 0.0605967 -0.156546 0.0877299 0.221703 0.0240066 0.0736914 0.151624 -0.0569359 -0.0924549 -0.0486998 -0.278366 0.00172287 0.110765 -0.00839791 -0.0107054 -0.0022529 0.125621 0.0827395 -0.0164486 0.0205567 0.0149793 -0.0920764 -0.0625731 0.0255644 -0.119039 0.0381399 0.111142 -0.0650285 -0.0124742 0.165263 0.0302815 -0.164781 0.122897 0.0186694 -0.153063 0.0267623 0.0300286 0.140036 0.0359483 0.043908 0.0256194 -0.0531476 -0.13324 -0.01855 0.0161014 0.122497 -0.0576744 0.0782579 -0.159064 -0.0653808 -0.036377 -0.0606812 0.051939 -0.0856885 -0.0088846 -0.112634 -0.0859198 -0.00808088 0.0180104 -0.0393724 0.0877737 0.0361352 0.0964745 0.0510562 0.0468181 -0.0621938 0.00485948 -0.0534704 0.0991898 0.020248 0.022253 -0.0465413 0.164468 0.128203 -0.134746 -0.169265 -0.00502925 -0.12515 0.086468 -0.101089 0.105551 0.0440933 0.00876958 0.146353 -0.0392613 -0.0690154 0.0185865 -0.00992519 -0.0432808 -0.095659 0.0779411 -0.0753069 0.0040307 -0.0142256 0.0928657 -0.0602432 -0.0972928 0.0379674 0.149158 -0.0672517 -0.0603028 -0.044826 0.150029 0.0915208 0.038974 0.043612 0.0436412 -0.0534258 0.0519318 0.034117 -0.0578141 
0.0622586 -0.00379815 -0.0401865 -0.0122971 0.080344 0.169563 0.0277467 -0.00478759 -0.00283377 -0.0862083 -0.0379359 0.0671018 0.0530127 -0.215847 -0.0657211 0.0679076 -0.162456 0.059754 -0.142486 0.0993716 0.206156 0.0285075 0.0691313 0.157661 -0.0702046 -0.067083 -0.0543938 -0.292075 -0.0063911 0.14025 -0.0360216 0.0320544 -0.0226267 0.108959 0.0754745 -0.0128812 0.0142491 0.0235129 -0.0826584 -0.0560047 0.00682114 -0.102828 0.036568 0.100355 -0.0615336 0.0166998 0.179403 0.0267277 -0.161746 0.111716 0.0548175 -0.142944 0.0355648 0.0313191 0.157352 0.0240933 0.0622117 0.0426602 -0.0278825 -0.120866 -0.00615724 0.0249443 0.127437 -0.0720987 0.0811755 -0.178176 -0.0611218 -0.0204196 -0.0546236 0.0410827 -0.0783764 0.00233483 -0.108381 -0.077466 -0.0203612 0.0369493 -0.0342306 0.0864133 0.0291401 0.0944172 0.0701484 0.0547694 -0.0711983 -0.00772141 -0.0607499 0.0900152 0.0181369 0.00527049 -0.0603773 0.149459 0.0996262 -0.126396 -0.16294 0.0027455 -0.127359 0.0982325 -0.0695891 0.0979039 0.0650769 0.00621227 0.151782 -0.0235657 -0.069833 0.0473579 -0.0372772 -0.059022 -0.115473 0.0805565 -0.0920523 0.0204763 -0.00343977 0.0966862 -0.0531584 -0.107363 0.0226074 0.154763 -0.0841901 -0.0686785 -0.0674502 0.138576 0.0763096 0.038212 0.0646391 0.0227243 -0.056894 0.0668918 0.00574651 -0.076141 
0.0716314 -0.00242023 0.00504095 0.0177432 0.0633337 0.203872 0.0735726 -0.00895875 -0.00439141 -0.0630172 -0.0420083 0.0293978 0.0742952 -0.192735 0.0112061 0.035005 -0.149423 0.0655879 -0.121942 0.0514778 0.191925 0.0266183 0.0644733 0.197715 -0.0528373 -0.116873 -0.121244 -0.311979 -0.00459255 0.142043 0.00742144 0.0531955 -0.0566666 0.107357 0.0840831 -0.011929 0.034648 0.00143177 -0.0642343 -0.028694 0.0367507 -0.106309 0.00645352 0.0429683 -0.0784848 -0.00723075 0.148773 0.0311006 -0.116672 0.0738306 0.0760913 -0.144608 0.0775324 0.0334994 0.134554 0.0433645 0.102076 0.0403679 0.0168816 -0.106455 -0.0232312 0.0631052 0.0572986 -0.13181 0.075887 -0.129087 -0.00174401 -0.0546095 -0.0696304 0.0241593 -0.086752 0.0345789 -0.111391 -0.0620933 -0.00246879 0.0387083 -0.049839 0.0684193 0.0506695 0.119114 0.0735613 0.0376758 -0.0494931 -0.00805949 -0.0260029 0.108323 0.0385502 -0.0325054 -0.117611 0.119584 0.0973973 -0.106993 -0.0977221 -0.0224305 -0.174725 0.0649657 -0.0719197 0.102544 0.0833217 0.0426473 0.178 -0.0100151 -0.0443 0.0670844 -0.0139328 -0.0738585 -0.0923199 0.0656943 -0.0856593 0.0552023 -0.0278245 0.0739919 -0.0431839 -0.157209 0.00348533 0.182951 -0.0885007 -0.0425932 -0.107608 0.137269 0.0884742 -0.00696682 0.0238277 0.0284844 -0.07491 0.0871397 -0.0367238 -0.0381463 
0.0655181 -0.00562575 -0.0310463 -0.0147111 0.0824053 0.178397 0.0482658 0.0128622 0.0147188 -0.100317 -0.0463123 0.0533405 0.0521009 -0.222254 -0.0528519 0.05982 -0.173941 0.0455433 -0.158552 0.0820514 0.214969 0.0254609 0.0717563 0.146203 -0.0693569 -0.0917685 -0.0772494 -0.299265 -0.000142335 0.126127 -0.013662 0.0391218 -0.0314555 0.114217 0.0719015 -0.020465 0.0145663 0.0287381 -0.0845262 -0.0487581 0.023456 -0.104138 0.0199751 0.0901706 -0.0592044 0.0119018 0.158863 0.0260077 -0.153245 0.104576 0.0340504 -0.136651 0.0406205 0.0289923 0.139181 0.0234018 0.0709994 0.0449995 -0.0378511 -0.116847 -0.0109106 0.0359411 0.116391 -0.0789771 0.079058 -0.167502 -0.0480511 -0.0206106 -0.0502588 0.0424622 -0.0802191 0.00673715 -0.113814 -0.0668909 -0.0192843 0.0342988 -0.0365064 0.0745377 0.025785 0.104588 0.0615435 0.0471 -0.0679808 -0.00645773 -0.0532154 0.0969086 0.0279572 0.00364124 -0.077927 0.138621 0.119685 -0.129622 -0.162375 -0.005139 -0.130009 0.0917464 -0.0700054 0.0932747 0.059754 0.0253472 0.154811 -0.0357226 -0.072954 0.0538675 -0.0312329 -0.0628662 -0.111395 0.0908174 -0.0828808 0.0162912 -0.00858568 0.0940301 -0.0674625 -0.115633 0.0340881 0.165905 -0.0854343 -0.0593389 -0.0556148 0.149911 0.078059 0.0440644 0.0525682 0.0360758 -0.0539108 0.0564086 -0.0010538 -0.0689391 
0.0509133 0.00272067 -0.0270601 -0.0192427 0.0805628 0.178454 0.0204965 -0.00563992 0.00882912 -0.105838 -0.0345503 0.0628306 0.042665 -0.213084 -0.0678359 0.0710064 -0.186075 0.0562437 -0.143252 0.0727925 0.228102 0.024721 0.0733946 0.138939 -0.0505062 -0.0762775 -0.0497749 -0.284768 -0.00284272 0.137773 -0.0201337 0.0163996 -0.0148605 0.111276 0.0818521 -0.0172597 0.0125096 0.0113135 -0.0610153 -0.0549836 0.0127277 -0.108757 0.0488304 0.0957707 -0.0539346 -0.000974803 0.175269 0.01496 -0.163886 0.104545 0.0353638 -0.137635 0.0413 0.0384924 0.144908 0.0333037 0.0691511 0.0444566 -0.0538851 -0.123557 -0.0097811 0.0262035 0.136534 -0.0685606 0.0825136 -0.157316 -0.0681781 -0.0190489 -0.0560434 0.0563816 -0.0789218 0.00226969 -0.120658 -0.0895498 -0.0104194 0.0347687 -0.0348566 0.066188 0.0181905 0.100905 0.0591618 0.0546838 -0.0515062 0.00819477 -0.0744188 0.100412 0.0202047 0.0102795 -0.0649667 0.147823 0.110729 -0.137456 -0.165073 0.00894265 -0.125109 0.0909082 -0.0880145 0.114864 0.0606902 0.0175001 0.148515 -0.0357055 -0.0758687 0.0460543 -0.0153844 -0.0458295 -0.103842 0.0882512 -0.0964018 0.0026734 -0.0158261 0.0802186 -0.0604398 -0.100059 0.0385168 0.163706 -0.0797874 -0.0454079 -0.04669 0.150472 0.0888927 0.0327382 0.0575998 0.0123782 -0.0554738 0.0714841 0.0195795 -0.0559188 
0.0485145 0.00563523 -0.0257381 -0.018248 0.069497 0.166954 0.021083 0.012217 0.012042 -0.0973536 -0.039182 0.0560244 0.0456768 -0.226544 -0.071104 0.066571 -0.191514 0.0376892 -0.152891 0.0903135 0.217679 0.0195113 0.0681978 0.132993 -0.0662257 -0.0719527 -0.0532145 -0.284527 -0.00512955 0.126355 -0.0310169 0.012086 -0.0131164 0.112659 0.0731876 -0.0178955 0.013864 0.0281886 -0.0896109 -0.0566174 0.0106552 -0.116697 0.0371339 0.100927 -0.0475739 0.0139587 0.174869 0.0200925 -0.16827 0.112659 0.0361486 -0.136835 0.032736 0.0363394 0.15502 0.0246462 0.0572488 0.0235451 -0.0408229 -0.133446 -0.00332467 0.0182025 0.124827 -0.052573 0.0818305 -0.170259 -0.0605671 -0.0193234 -0.0451455 0.0437708 -0.0812162 -0.00765258 -0.107914 -0.0834347 -0.00705153 0.0368966 -0.0382027 0.0810938 0.0260406 0.10578 0.0622566 0.0430729 -0.063462 0.00499176 -0.0648494 0.0980204 0.0204903 0.0175132 -0.0516 0.154494 0.103527 -0.134433 -0.168948 0.00486163 -0.137841 0.0943717 -0.0741996 0.0979491 0.0626492 0.0104433 0.152523 -0.0295872 -0.0731653 0.0335464 -0.027107 -0.054029 -0.110131 0.0949287 -0.0915783 0.00612571 -0.00643057 0.0928898 -0.0681068 -0.105792 0.0332733 0.159497 -0.0870679 -0.0549931 -0.0540258 0.138973 0.0753112 0.0450411 0.0648579 0.0248489 -0.0392827 0.0638908 0.0254402 -0.0660185 
0.06013 0.00836753 -0.0315681 -0.022086 0.0321484 0.203872 0.0275463 0.04997 -0.0185805 -0.0657899 -0.0194778 0.035264 0.0567516 -0.245908 -0.0673806 0.0470618 -0.185727 0.0431429 -0.12864 0.0751137 0.215027 -0.00638311 0.0466012 0.163543 -0.0620436 -0.0638715 -0.0401181 -0.295407 0.00793841 0.0994959 -0.0232407 -0.00933967 -0.0377776 0.113844 0.0493321 -0.0289535 -0.00414069 0.00925619 -0.0822084 -0.0461345 0.0193668 -0.147266 0.0151094 0.117234 -0.0422538 -0.0287635 0.175229 0.0224272 -0.190325 0.0955666 0.0513914 -0.135761 0.0318283 0.0331106 0.13173 0.0390235 0.0615685 0.0283569 0.00134205 -0.166502 -0.000391229 0.0233144 0.134652 -0.0627359 0.0602579 -0.144652 -0.034811 -0.0457533 -0.0394257 0.0333455 -0.108556 -0.00658508 -0.113346 -0.0721388 0.00652589 0.00734417 -0.0395024 0.103887 0.0416429 0.115261 0.0379234 0.0248242 -0.0441196 -0.0198303 -0.0570489 0.113375 0.038963 0.0065011 -0.0326018 0.132826 0.0978467 -0.129071 -0.159299 0.000281755 -0.141704 0.0792167 -0.0591683 0.0983294 0.0556419 0.0109081 0.149134 -0.0164973 -0.0648698 0.051298 -0.0215671 -0.0477729 -0.103493 0.0963035 -0.113054 -0.0136763 -0.00423197 0.108388 -0.0523575 -0.131709 0.0421351 0.150009 -0.0970331 -0.0666166 -0.0392826 0.118148 0.0700058 -0.00146203 0.0649171 0.0193677 -0.048517 0.0660748 0.00914505 -0.0492016 
0.0656293 0.0335357 -0.0493745 -0.0316799 0.00951658 0.178213 0.0346335 0.0682425 -0.00968773 -0.0530282 0.00231371 0.0320544 0.066098 -0.267429 -0.101473 0.0643818 -0.175865 0.0287044 -0.156159 0.0908329 0.20516 -0.00693256 0.0321038 0.136946 -0.0976156 -0.0468352 -0.0243978 -0.276246 0.027627 0.0949033 -0.0570811 0.00046573 -0.0210122 0.121676 0.0271605 -0.0563402 0.00841867 0.0448407 -0.0878503 -0.0359576 -0.00400945 -0.159281 0.011652 0.117629 -0.0230699 -0.0265837 0.168365 0.01667 -0.210948 0.102107 0.0457955 -0.119832 0.00321206 0.0444966 0.112359 0.0271882 0.0503661 0.00126588 -0.0095179 -0.160541 -0.000602942 -0.00449233 0.145578 -0.0502786 0.0486719 -0.155516 -0.0344984 -0.0496629 -0.0352214 0.00192884 -0.119911 -0.0444061 -0.108591 -0.0528034 0.010482 -0.00114884 -0.0204883 0.11334 0.02627 0.102202 0.040817 0.00936153 -0.0571408 -0.0215948 -0.0516306 0.125607 0.0271086 -0.00409964 -0.00915208 0.139102 0.0892883 -0.146526 -0.180704 0.0160293 -0.126738 0.0881515 -0.0522816 0.0783281 0.0549074 0.0100754 0.141946 -0.0196835 -0.0743707 0.0717673 -0.0212409 -0.0539666 -0.0921238 0.118362 -0.10772 -0.0355651 -0.00304741 0.119857 -0.0525135 -0.114193 0.0404152 0.13317 -0.104649 -0.0649321 -0.0274608 0.0976489 0.0456825 0.0138614 0.0806318 0.038819 -0.0193894 0.0489213 0.00893551 -0.0746147 
0.0151477 0.0114518 -0.0226406 -0.0364551 0.0356176 0.14722 -0.0103969 0.0430012 0.0267391 -0.0843124 -0.0338545 0.0544753 0.0432653 -0.238772 -0.122338 0.061977 -0.224017 0.0222828 -0.150978 0.0989966 0.237716 -0.027915 0.0651902 0.127845 -0.0731762 -0.0446863 -0.023823 -0.271991 0.00960673 0.105307 -0.0373247 -0.0240377 0.00645406 0.0949172 0.0391593 -0.0310172 -0.0218732 0.0542386 -0.104165 -0.0543957 -0.0107195 -0.138328 0.0109651 0.112159 -0.0135784 -0.013879 0.170272 0.0113973 -0.176719 0.104806 0.0182107 -0.111573 0.0283731 0.0325525 0.147697 0.0323078 0.0623445 0.00626921 -0.0417515 -0.172894 0.0180945 0.000959985 0.145654 0.00161011 0.0656828 -0.16889 -0.061843 -0.0181224 -0.0234333 0.0408173 -0.0971134 -0.0319703 -0.111279 -0.0829124 0.0121901 0.0285661 -0.0359 0.0932926 0.0294966 0.112744 0.0249457 0.029477 -0.0503917 0.0144219 -0.0654804 0.0984716 0.028832 0.052249 0.000929566 0.131892 0.080494 -0.12999 -0.155583 0.0231567 -0.128312 0.076329 -0.0813667 0.100973 0.0650898 0.000710236 0.159974 -0.038693 -0.08969 0.0279055 -0.00810636 -0.0407966 -0.103511 0.0965587 -0.0887345 -0.0342402 -0.0138627 0.111322 -0.0753087 -0.10363 0.0465877 0.167621 -0.0999668 -0.0508672 -0.0251664 0.130219 0.0475243 0.0460867 0.0533365 -0.00134719 -0.044632 0.0850362 0.0293026 -0.0494256 
0.0230883 -0.011183 -0.0370412 -0.0258287 0.06021 0.118629 -0.0221639 0.0180394 0.0456899 -0.110977 -0.0198147 0.0834471 0.0367125 -0.21993 -0.133992 0.0722686 -0.206473 0.0609108 -0.170915 0.0959625 0.245989 -0.0129637 0.10697 0.115017 -0.0642352 -0.0500139 0.00241074 -0.276541 -0.0183294 0.112792 -0.0435068 -0.00336958 0.0369445 0.10675 0.0429094 -0.0436763 -0.0191796 0.0795534 -0.0895494 -0.0528079 -0.0139024 -0.106532 0.0034701 0.113961 -0.0521246 -0.0248757 0.15508 -0.0100907 -0.146921 0.11717 0.0219397 -0.112879 0.0227393 0.0446831 0.12849 0.0198468 0.092402 0.00455923 -0.0676382 -0.145784 0.00871966 -0.0242765 0.147553 0.0061639 0.0684813 -0.193866 -0.082703 0.0147254 -0.0176809 0.0702214 -0.0796901 -0.0349974 -0.106643 -0.0972819 -0.0104192 0.026147 -0.0460043 0.067188 -0.0113847 0.104295 0.00485065 0.0498341 -0.0501348 0.00962102 -0.0849825 0.0967276 0.0316668 0.0466555 -0.0224498 0.111485 0.0780368 -0.144517 -0.162605 0.0149283 -0.107151 0.0713376 -0.110196 0.105796 0.058097 -0.00519289 0.145913 -0.053257 -0.0827963 0.0552731 0.0301636 -0.0678627 -0.099985 0.0964926 -0.0742574 -0.0470808 -0.0348553 0.109824 -0.0699606 -0.068224 0.0467578 0.161539 -0.0913307 -0.0590216 -0.00738732 0.145266 0.0574017 0.08003 0.0326476 0.00242302 -0.0262022 0.0602923 0.0363333 -0.0428291 
