{
  "descriptor": [
    -0.09856393933296204,
    0.034839507192373276,
    0.11887088418006897,
    -0.037831563502550125,
    -0.16722886264324188,
    0.04239683225750923,
    -0.06697634607553482,
    -0.020849989727139473,
    0.12052371352910995,
    -0.13014669716358185,
    0.17661221325397491,
    -0.020052211359143257,
    -0.29306331276893616,
    0.12732316553592682,
    -0.06806647777557373,
    0.15926291048526764,
    -0.16570135951042175,
    -0.2046903818845749,
    -0.041398365050554276,
    -0.09013863652944565,
    -0.014715845696628094,
    0.10332238674163818,
    0.018349874764680862,
    0.1127392053604126,
    -0.1712988168001175,
    -0.3531152307987213,
    -0.05864568054676056,
    -0.08565809577703476,
    0.03757323697209358,
    -0.12993890047073364,
    -0.041005704551935196,
    0.023090189322829247,
    -0.13141678273677826,
    0.059102997183799744,
    0.11120429635047913,
    0.06499599665403366,
    -0.09011215716600418,
    -0.17989873886108398,
    0.2745796740055084,
    0.12105643004179001,
    -0.24169176816940308,
    -0.013405690900981426,
    0.06474854797124863,
    0.26655304431915283,
    0.16383792459964752,
    -0.004305991344153881,
    0.0338999405503273,
    -0.0918368324637413,
    0.1547722965478897,
    -0.2800181806087494,
    0.038205455988645554,
    0.237315833568573,
    0.02024715207517147,
    0.05184417963027954,
    0.06396806985139847,
    -0.1498502939939499,
    -0.016295013949275017,
    0.18922924995422363,
    -0.11975427716970444,
    0.08034573495388031,
    0.046893030405044556,
    -0.0886441096663475,
    0.0006206517573446035,
    -0.06805551052093506,
    0.12932392954826355,
    0.08564458042383194,
    -0.10920678824186325,
    -0.14968878030776978,
    0.2393806427717209,
    -0.15683285892009735,
    -0.11401616781949997,
    0.08498799800872803,
    -0.1193191185593605,
    -0.17168022692203522,
    -0.1555541455745697,
    0.011397868394851685,
    0.41804608702659607,
    0.12465272098779678,
    -0.0813378393650055,
    0.06739889830350876,
    0.022484848275780678,
    -0.03430154174566269,
    -0.009576723910868168,
    0.18041644990444183,
    -0.11676773428916931,
    -0.02444986067712307,
    -0.03105246275663376,
    0.051467668265104294,
    0.23237012326717377,
    0.06480192393064499,
    0.022731838747859,
    0.19976122677326202,
    -0.00517051899805665,
    0.03339984640479088,
    0.1363581269979477,
    0.07680942863225937,
    -0.16486699879169464,
    -0.06453213840723038,
    -0.1560109257698059,
    -0.06426689773797989,
    -0.04060127213597298,
    -0.055426668375730515,
    0.014539346098899841,
    0.13755778968334198,
    -0.18421222269535065,
    0.12410029023885727,
    -0.07182740420103073,
    -0.10082713514566422,
    -0.010263312608003616,
    0.0510719008743763,
    -0.05588037893176079,
    -0.014100826345384121,
    0.12101244181394577,
    -0.22837841510772705,
    0.12579599022865295,
    0.16625456511974335,
    0.08262666314840317,
    0.1162634864449501,
    0.10236803442239761,
    0.015200845897197723,
    0.024043887853622437,
    -0.04480428993701935,
    -0.19306819140911102,
    -0.11021437495946884,
    0.0304091926664114,
    -0.03924236446619034,
    -0.004338925704360008,
    -0.033527109771966934
  ]
}