{
  "descriptor": [
    -0.071100153028965,
    0.14476513862609863,
    0.050190746784210205,
    -0.015728307887911797,
    -0.07668716460466385,
    -0.04236532747745514,
    -0.07352035492658615,
    -0.05041136220097542,
    0.13427554070949554,
    -0.027261165902018547,
    0.25748178362846375,
    -0.029732877388596535,
    -0.2555869519710541,
    -0.07198988646268845,
    -0.023099029436707497,
    0.13148164749145508,
    -0.18224026262760162,
    -0.05612148717045784,
    -0.1266641467809677,
    -0.11007092148065567,
    0.05290620028972626,
    0.008775060065090656,
    0.022277384996414185,
    0.0036554597318172455,
    -0.11903870105743408,
    -0.2987934947013855,
    -0.05869169533252716,
    -0.1381208747625351,
    0.10302188247442245,
    -0.18301993608474731,
    0.009677841328084469,
    0.06681985408067703,
    -0.13589279353618622,
    -0.04404369369149208,
    0.00576400151476264,
    0.015406426042318344,
    0.03669162467122078,
    -0.04052463546395302,
    0.1576804369688034,
    -0.05121757462620735,
    -0.15938889980316162,
    -0.0322691947221756,
    0.007861248217523098,
    0.24922974407672882,
    0.1851716786623001,
    0.022234147414565086,
    0.02639097534120083,
    -0.06743121892213821,
    0.06412434577941895,
    -0.24472546577453613,
    0.003535111201927066,
    0.14953164756298065,
    0.07390997558832169,
    0.09865325689315796,
    0.05669796094298363,
    -0.1849088817834854,
    0.01822112314403057,
    0.1039571538567543,
    -0.18868504464626312,
    0.046145249158144,
    0.045371782034635544,
    -0.10705152899026871,
    -0.06129325553774834,
    -0.061377305537462234,
    0.21613956987857819,
    0.08617019653320312,
    -0.10522257536649704,
    -0.15594962239265442,
    0.15112143754959106,
    -0.1385575532913208,
    0.0031074106227606535,
    0.10831055790185928,
    -0.10888855904340744,
    -0.1701318770647049,
    -0.24489939212799072,
    0.07085864990949631,
    0.3694859445095062,
    0.14876322448253632,
    -0.17876200377941132,
    0.03323251008987427,
    -0.10821222513914108,
    -0.04713939502835274,
    -0.0007555913180112839,
    0.023913243785500526,
    -0.10452505946159363,
    0.0024551015812903643,
    -0.0714220479130745,
    0.06277156621217728,
    0.16174395382404327,
    -0.07655645161867142,
    0.04537844657897949,
    0.22895121574401855,
    -0.033706557005643845,
    0.009473927319049835,
    -0.005166519898921251,
    0.01638704538345337,
    -0.10072100907564163,
    0.01204085722565651,
    -0.050937458872795105,
    -0.005787072237581015,
    0.09790092706680298,
    -0.16050833463668823,
    0.036291707307100296,
    0.08741379529237747,
    -0.17554354667663574,
    0.10775617510080338,
    -0.019031232222914696,
    -0.014002260752022266,
    0.01861944980919361,
    0.018769165500998497,
    -0.03991067036986351,
    -0.05821527913212776,
    0.2327287793159485,
    -0.24863798916339874,
    0.24825681746006012,
    0.23279786109924316,
    0.05846254900097847,
    0.130575031042099,
    0.03441348671913147,
    0.12575377523899078,
    -0.012268817983567715,
    -0.03697190806269646,
    -0.10899466276168823,
    -0.03145672008395195,
    0.03604331612586975,
    -0.06841348856687546,
    -0.05089147016406059,
    -0.008759896270930767
  ]
}