0.0680752 0.0130719 -0.118194 0.0274487 0.10828 0.23679 0.023285 -0.159591 -0.0780053 -0.104377 0.0151956 0.102821 0.0806999 -0.052622 -0.115391 -0.0191076 -0.0906007 0.0999434 -0.0434529 0.117338 0.195448 -0.0742269 0.0546854 0.126472 0.00603076 -0.00915445 -0.117427 -0.238252 0.00302813 0.161254 -0.000589065 0.0654672 -0.0989213 0.0413714 0.07873 0.0573001 -0.058147 0.0435903 0.0209217 -0.102318 0.0268898 -0.0316167 0.00807662 0.0623568 -0.136691 -0.0184983 0.200491 0.024186 -0.142876 0.0295988 -0.014881 -0.0512588 0.0451847 0.038201 0.149293 0.0326349 0.0439239 0.175046 -0.041465 -0.140156 -0.0274632 0.107446 0.273055 -0.156945 0.112499 -0.0330029 -0.00405649 0.0131862 -0.0815492 0.106186 0.00239747 0.0757164 -0.0767337 -0.0210795 -0.0140414 0.036447 -0.0467219 -0.00932291 0.0283907 0.048373 -0.0411873 0.113893 -0.0127175 -0.0410715 -0.104894 0.0415672 0.0514711 0.0154814 -0.0299047 0.0417198 0.140972 -0.133121 -0.00962402 0.00028549 -0.0709339 -0.0829619 -0.0168307 0.156363 0.0536862 -0.00569414 0.0920882 0.0512097 -0.0432243 0.092558 -0.0775394 0.0923616 -0.0570864 0.0980141 -0.0731222 0.024911 0.0175422 0.0530159 -0.0645802 -0.0392701 0.0315844 0.120377 -0.113989 -0.0753818 -0.00719618 0.130895 0.0244663 -0.0572961 0.0223553 -0.0323441 -0.122138 0.144377 -0.0120997 0.00316127 
0.086609 0.0206473 -0.141056 -0.00632094 0.119979 0.234355 0.0310779 -0.121618 -0.0972752 -0.0854327 0.0216228 0.096823 0.0942341 -0.0582216 -0.10095 -0.0270454 -0.0759825 0.0836128 -0.0504784 0.135598 0.183195 -0.0620746 0.0711905 0.11782 -0.00784492 -0.00563836 -0.093993 -0.231064 0.0352495 0.144763 -0.0121094 0.0498876 -0.0950182 0.0458793 0.056927 0.0456542 -0.062296 0.0716769 0.00868066 -0.0891181 0.02298 -0.0284539 -0.0154292 0.0897437 -0.168286 -0.00638448 0.192663 0.0408547 -0.146776 0.0437 -0.0175203 -0.0238775 0.00877733 0.033722 0.138569 0.0128372 0.0404239 0.187896 -0.040911 -0.142466 -0.0421191 0.0842073 0.292644 -0.144883 0.0982288 -0.0576436 -0.00671799 0.0319634 -0.0700806 0.103941 0.00522329 0.0844091 -0.0756146 -0.00530978 -0.00822624 0.0249483 -0.0541912 0.0113096 0.0389918 0.0531996 -0.0444458 0.101407 -0.00604284 -0.043966 -0.0876422 0.026574 0.0610464 0.0316299 -0.00494562 0.0358049 0.147144 -0.136819 -0.0318824 -0.00813643 -0.0560085 -0.113246 -0.0016873 0.152903 0.042809 -0.0277528 0.0769105 0.0614899 -0.0309013 0.107789 -0.112538 0.0893904 -0.0771956 0.11603 -0.0360317 0.00250645 0.0460692 0.0808493 -0.076145 -0.0163357 0.035844 0.114904 -0.111015 -0.0957595 0.00294646 0.143392 0.0171812 -0.053626 0.0243943 -0.00805689 -0.123344 0.115989 -0.0151566 -0.00054689 
0.0804295 0.0119338 -0.117114 -0.00803342 0.112605 0.228398 0.04749 -0.108629 -0.0585382 -0.10564 0.0284402 0.100581 0.104196 -0.0531517 -0.09905 -0.037714 -0.0972456 0.0748249 -0.0894152 0.124744 0.203372 -0.0674541 0.0585911 0.141642 -0.00972695 -0.0352619 -0.101314 -0.228441 0.020643 0.151761 0.00372384 0.0266549 -0.0925159 0.0600102 0.0525509 0.0491728 -0.0662918 0.0729177 -0.0134034 -0.0745412 0.0311965 -0.0277138 -0.0230967 0.0921457 -0.151974 -0.0312621 0.170146 0.0354984 -0.128221 0.0431111 -0.0242383 -0.0445837 0.00642089 0.0331234 0.14748 0.0295412 0.00963566 0.202098 -0.0507163 -0.140684 -0.0492975 0.0754718 0.278259 -0.140436 0.0901332 -0.0614237 0.000793197 0.0319082 -0.0800698 0.0942628 0.0135428 0.0775918 -0.073957 -0.02632 -0.00605305 0.0410835 -0.0533571 0.00242556 0.038058 0.071111 -0.0453822 0.0832409 -0.00262213 -0.037241 -0.105102 0.0372004 0.0796769 0.0223216 -0.0170873 0.0388906 0.13849 -0.16713 -0.0203085 -0.0134046 -0.077104 -0.103328 -0.0318015 0.121179 0.0527921 -0.0104903 0.0840926 0.0533853 -0.0395683 0.103151 -0.105606 0.0840994 -0.0937657 0.112175 -0.0507739 -0.00819911 0.0392934 0.0742 -0.0940423 -0.0149417 0.0333959 0.14396 -0.111251 -0.0733872 -0.00510628 0.156914 0.0167678 -0.0475394 -0.00396862 0.0092392 -0.120324 0.121218 -0.025357 0.00179903 
0.106867 0.0345043 -0.0853565 0.0270765 0.131658 0.266563 0.0747823 -0.142493 -0.077491 -0.10681 0.00618208 0.0750929 0.0919599 -0.0347972 -0.0537588 -0.0579176 -0.0386093 0.102456 -0.0733421 0.0751934 0.184226 -0.0202529 0.036548 0.145366 0.0208334 -0.061673 -0.152081 -0.210282 0.0222711 0.161467 0.026198 0.103572 -0.134564 0.0789505 0.0852668 0.0378666 -0.0221512 0.0333616 0.0211846 -0.09161 0.0719508 -0.0204558 -0.00490227 0.0353494 -0.156287 -0.0183722 0.150707 0.050648 -0.121927 0.00130781 0.0199555 -0.0181405 0.0520626 0.0230511 0.132184 0.0309946 0.0338995 0.187414 -0.0214207 -0.135144 -0.0478842 0.117904 0.209156 -0.19033 0.0868711 -0.0218309 0.0362451 0.0148441 -0.0991394 0.118724 0.00685817 0.082927 -0.0688581 -0.0149292 -0.0264905 0.0403491 -0.0515299 -0.0179682 0.0351935 0.0567736 -0.0202602 0.125186 0.0179281 -0.0562269 -0.0489808 0.0148705 0.0777869 -0.00776964 -0.0730031 0.058376 0.162429 -0.147636 0.00140774 -0.0173756 -0.0962208 -0.0975465 -0.00310122 0.119161 0.0487802 0.00166639 0.107856 0.0956184 -0.023561 0.142009 -0.104332 0.0568575 -0.0706498 0.09311 -0.0537353 0.0399475 0.0465247 0.0496577 -0.10365 -0.0276462 0.0288633 0.108221 -0.130201 -0.0869066 -0.0261444 0.134468 0.0471637 -0.0455091 -0.00285166 -0.00302463 -0.0909565 0.11146 -0.027505 -0.0186287 
0.0895629 0.0537218 -0.0619377 0.0331081 0.13165 0.2731 0.0643156 -0.138834 -0.0785936 -0.126525 0.00273003 0.0700858 0.0641505 -0.0534336 -0.0332981 -0.0653281 -0.0284439 0.084431 -0.0691064 0.0748238 0.155082 0.0125091 0.0130641 0.125774 0.0192622 -0.0390399 -0.154301 -0.196686 0.0361559 0.126725 0.0565829 0.128514 -0.125713 0.0870106 0.093337 0.0555336 0.00588277 0.0261127 0.0208125 -0.0897556 0.113554 -0.0221984 -0.00624738 0.0235693 -0.150132 0.0108263 0.164677 0.0431744 -0.149037 -0.0242951 -0.00736544 -0.00534453 0.063671 0.00954853 0.120763 0.0419956 0.00789109 0.182107 -0.0360842 -0.126888 -0.0727207 0.131207 0.205754 -0.200773 0.0996355 0.0060914 0.0592453 -0.00626411 -0.104552 0.126 0.00384995 0.0579029 -0.0618955 0.00781355 -0.00098217 0.0326348 -0.0647205 -0.011891 0.0214059 0.0394115 -0.0250571 0.153653 0.019609 -0.0641043 -0.0309893 0.0103047 0.0783352 -0.00722516 -0.102354 0.0753404 0.196349 -0.140237 -0.00937187 -0.00610591 -0.0797116 -0.0815983 0.0200351 0.104438 0.0337362 1.52059e-05 0.0728204 0.08781 -0.0310623 0.134397 -0.120751 0.0789138 -0.0489562 0.0905031 -0.0549342 0.0391629 0.0560514 0.0433907 -0.121748 -0.0324425 0.0402058 0.0609563 -0.150234 -0.121244 0.000642759 0.124514 0.0709145 -0.0363202 0.00864784 0.0013516 -0.05646 0.106399 -0.00401967 -0.0370707 
0.100493 0.0621791 -0.0684366 0.00679357 0.138282 0.288633 0.0568361 -0.109558 -0.0748391 -0.111059 0.0369977 0.0613159 0.0708192 -0.0507372 -0.0212057 -0.0671501 -0.0169596 0.0671237 -0.0490045 0.058839 0.181613 0.0177669 -0.00633413 0.105434 0.0437108 -0.0381747 -0.141112 -0.176576 0.0709089 0.133698 0.0728531 0.0793432 -0.116283 0.0701155 0.0904773 0.0572877 -0.00698294 0.00692564 0.0670732 -0.0854203 0.102967 -0.0147381 -0.0208067 0.0300256 -0.14429 -0.00686301 0.143016 0.0416586 -0.145148 -0.0470087 -0.0280933 0.0417335 0.0488047 0.0109921 0.0950489 0.0398832 -0.00896841 0.191297 -0.0856739 -0.12038 -0.0833172 0.105317 0.233474 -0.194234 0.0785801 0.0117672 0.0579762 0.0212883 -0.0921105 0.10638 0.0317865 0.0706142 -0.0886578 -0.0251838 0.0112011 0.0365074 -0.0669976 -0.0131162 0.0271867 0.0752742 -0.0399099 0.143122 0.0630605 -0.0356117 -0.0213624 0.0173293 0.0880987 0.00481123 -0.0736017 0.0571091 0.189928 -0.149496 -0.0272851 0.0427047 -0.0760577 -0.128812 0.00950655 0.085742 2.30663e-05 -0.00550797 0.0709278 0.0904956 -0.0373655 0.119185 -0.133004 0.121482 -0.0309965 0.0875934 -0.0276957 0.0143755 0.0688506 0.0149999 -0.14215 -0.00967887 0.0666599 0.0739089 -0.166308 -0.098643 0.0106395 0.136389 0.0654222 -0.0653761 0.00113497 -0.00394952 -0.0426987 0.117979 0.0178698 -0.0109608 
0.0777167 0.0757003 -0.0434691 0.0367892 0.118064 0.289235 0.0426601 -0.162299 -0.0770591 -0.115741 0.00586864 0.0515563 0.033497 -0.035059 0.000533951 -0.0671936 -0.0140997 0.0750084 -0.0292324 0.0329266 0.120271 0.0381567 0.0122072 0.114094 0.0392608 -0.0315671 -0.141805 -0.162124 0.0547723 0.10526 0.0938429 0.138111 -0.122484 0.0778183 0.103011 0.0828747 0.00943459 -0.00213376 0.0439584 -0.0819899 0.114409 -0.0263065 -0.0145696 -0.00179459 -0.139403 0.0209306 0.149819 0.0556766 -0.150038 -0.0392395 -0.0135098 0.0378705 0.086727 -0.00745866 0.0936281 0.0581697 0.011507 0.186138 -0.0473929 -0.0993519 -0.0977392 0.149459 0.208907 -0.222532 0.112019 0.0426442 0.0768259 -0.0175705 -0.126405 0.175146 -0.00518285 0.0599322 -0.078945 0.0355149 0.0122382 0.00935243 -0.0558018 -0.0236164 0.00805693 0.0171995 -0.0224438 0.161718 0.0247548 -0.0723859 -0.0206481 -0.0110524 0.0574861 -0.023649 -0.120552 0.0903332 0.21761 -0.113866 0.00390334 0.00906065 -0.038699 -0.0717978 0.0290874 0.108027 0.0344039 0.00451827 0.0626407 0.0889555 -0.0456749 0.110406 -0.108842 0.0995722 -0.0194255 0.0475725 -0.0352236 0.0429958 0.056343 0.0447266 -0.0969011 -0.0359671 0.0604898 0.034531 -0.125431 -0.120414 0.0400103 0.129881 0.102993 -0.0657142 0.0212901 -0.00912782 -0.0476415 0.115921 0.0269312 -0.0249198 
0.082462 0.0858847 -0.0463732 0.0389572 0.122995 0.283534 0.0365415 -0.187897 -0.0819268 -0.115111 0.000553484 0.0563653 0.0321243 -0.0198298 -0.00650556 -0.0545038 -0.001053 0.0800899 -0.0249126 0.0252998 0.120452 0.0573369 0.00181754 0.104759 0.038794 -0.0281124 -0.143521 -0.14641 0.0478454 0.127144 0.0719844 0.152529 -0.12253 0.0761184 0.111576 0.0823558 0.0228186 -0.0199828 0.0542631 -0.0846518 0.106251 -0.0218982 0.0149341 -0.0140562 -0.12766 0.0420243 0.157218 0.058233 -0.150099 -0.037505 0.0108643 0.043205 0.0874393 0.00236092 0.109568 0.0521044 0.0147251 0.171962 -0.0427208 -0.0920509 -0.084029 0.15377 0.193988 -0.218662 0.109663 0.0362536 0.0658536 -0.00843891 -0.123063 0.182581 0.0012014 0.0526741 -0.0762867 0.0223448 0.00798125 0.0261988 -0.0476443 -0.0251502 -0.000876507 0.00360771 0.00498855 0.175418 0.027449 -0.0632349 -0.0224657 -0.0079319 0.0491903 -0.0337302 -0.132139 0.110175 0.205072 -0.117368 -0.00193919 0.0163594 -0.0478169 -0.0588894 0.0297108 0.111307 0.0426651 0.0010625 0.0776235 0.101715 -0.0407417 0.111523 -0.110156 0.0901966 -0.0274943 0.0484181 -0.0526951 0.0546909 0.0600535 0.0261417 -0.0949432 -0.0315924 0.051864 0.0301708 -0.123759 -0.112536 0.0231537 0.121067 0.107013 -0.0577948 0.0385171 -0.0201686 -0.0450682 0.1188 0.0338688 -0.030131 
0.0834871 0.0740698 -0.0150179 0.0693484 0.12182 0.275521 0.0584245 -0.212931 -0.0633197 -0.110815 -0.0080242 0.0604194 0.0221757 -0.0217965 0.0081853 -0.0514812 -0.00877522 0.102017 -0.0392578 0.00370504 0.110626 0.0565891 -0.00340517 0.12795 0.0499096 -0.0518373 -0.167776 -0.14834 0.0213476 0.13378 0.0773468 0.175127 -0.14036 0.0851136 0.123059 0.0685303 0.0204194 -0.0356702 0.054264 -0.083859 0.117685 -0.023269 0.0233583 -0.0434203 -0.115729 0.0282154 0.131143 0.0558679 -0.127126 -0.0403873 0.0370951 0.0189768 0.109246 -0.00530377 0.103683 0.0550407 0.0198849 0.163557 -0.0280161 -0.0709767 -0.0716559 0.163484 0.1483 -0.223146 0.111713 0.0488634 0.0658861 -0.0218741 -0.142369 0.184329 -0.00137578 0.0638152 -0.0688203 0.0252119 -0.00797078 0.0295114 -0.0425461 -0.0482649 -0.00319177 0.00421587 0.0187957 0.175621 0.0195882 -0.0689279 -0.0235241 -0.0123052 0.0463338 -0.0537684 -0.160747 0.11382 0.189356 -0.104733 0.0205934 0.00520489 -0.0703941 -0.034342 0.0187818 0.0925849 0.0629844 0.0115065 0.0976714 0.0898095 -0.039097 0.112507 -0.0809953 0.0607312 -0.0189593 0.0362988 -0.0630934 0.0773731 0.0452392 0.0227355 -0.0740211 -0.0500575 0.0447147 0.0342141 -0.125026 -0.0777466 0.00187966 0.112926 0.114081 -0.0497544 0.023224 -0.0229296 -0.0437019 0.12401 0.0206979 -0.0394384 
0.105481 0.0642924 -0.00904569 0.0626289 0.110708 0.276947 0.072189 -0.183944 -0.0698615 -0.115842 -0.0198829 0.0641814 0.0543131 -0.0421287 0.00928229 -0.0540711 -0.00187909 0.111262 -0.0646582 0.0236778 0.120179 0.0573457 0.0316019 0.153609 0.0195564 -0.0712356 -0.15545 -0.184647 -0.0168084 0.136419 0.0532162 0.15703 -0.124392 0.117559 0.111788 0.0303299 0.062352 0.00904381 0.0376471 -0.0614289 0.114593 -0.0349732 0.033769 -0.044571 -0.14565 -0.00154597 0.140795 0.0323113 -0.116286 0.00841175 0.0806597 -0.0435578 0.0932869 0.0406265 0.109959 0.0451721 0.0638548 0.139004 0.0064734 -0.0905725 -0.0601654 0.14225 0.109266 -0.251178 0.114937 -0.00347618 0.0695189 -0.0335972 -0.146205 0.15327 -0.019367 0.0519939 -0.0698582 0.0193286 -0.00548652 0.0357039 -0.0408862 -0.0326933 0.0143229 0.0253779 0.00313821 0.146788 0.0284488 -0.0508297 -0.0191841 0.0016548 0.0624678 -0.0634701 -0.162871 0.0988613 0.149225 -0.140711 0.0377363 -0.0236809 -0.102396 -0.0342412 0.0116023 0.117437 0.0613068 0.0264789 0.0950805 0.100484 -0.0350257 0.177041 -0.0518888 0.00270107 -0.0453525 0.050719 -0.0966647 0.0671855 0.0178013 0.0283641 -0.0583912 -0.0393629 0.00694962 0.0535816 -0.120707 -0.0844615 -0.0515803 0.116494 0.106499 -0.0317745 0.00544434 -0.0166319 -0.0304018 0.0904304 -0.017089 -0.037184 
0.0611374 0.0489711 0.0719352 0.111991 0.113144 0.203201 0.0773 -0.226225 -0.0178492 -0.0523351 -0.0398191 0.109164 0.0381121 -0.0210724 -0.0113118 -0.0465409 0.0355067 0.126438 -0.0700294 0.0245374 0.0711156 0.0412324 0.00307502 0.196395 0.012056 -0.0280963 -0.144365 -0.144257 -0.00120317 0.134142 0.0385973 0.190416 -0.100883 0.0615516 0.109798 0.00568335 0.0469842 0.0683111 0.0030521 -0.0803079 0.112164 -0.00895581 -0.000758438 -0.113554 -0.124254 0.00487534 0.0793514 0.00920613 -0.050344 -0.080058 0.144991 -0.0109161 0.139365 0.00179376 0.135757 0.0459059 0.0578819 0.109893 0.0258431 -0.0662252 -0.0425195 0.093914 0.0276459 -0.210657 0.159963 0.00671965 0.0644639 -0.0338758 -0.178207 0.141565 -0.00803471 0.0519695 -0.045439 -0.00418536 0.00904685 0.0948613 -0.0401295 -0.00374054 0.0384018 0.00440976 -0.000559161 0.151274 0.0492697 -0.018952 0.0531598 -0.104362 0.0812933 0.00918337 -0.168124 0.0830703 0.0318876 -0.067311 0.111601 0.0262722 -0.134457 -0.0373108 0.0506537 0.0550034 0.115918 0.0185048 0.153289 0.11024 -0.0534211 0.160342 -0.021708 -0.0463907 -0.00590925 -0.031444 -0.0419277 0.0602533 -0.0123143 0.0466195 -0.0179265 -0.0463589 0.0142266 0.0493192 -0.202483 -0.0367835 -0.131702 0.0842855 0.0670766 -0.0154026 -0.0500863 -0.10091 0.00584234 0.186591 -0.0523964 -0.0598143 
0.0139969 0.0815692 0.127752 0.096427 0.114259 0.206612 0.0516812 -0.220807 -0.0090442 -0.0521589 -0.0142293 0.132803 0.01546 -0.0256081 0.0155264 -0.108463 -0.0129626 0.162218 -0.0960676 0.0452356 0.0574818 0.0196171 0.0166193 0.173235 0.0372085 -0.0632476 -0.136142 -0.0937575 -0.0244448 0.104235 0.0724817 0.135783 -0.080748 0.0938478 0.120913 0.0406558 0.0212209 0.0504027 -0.0187446 -0.080233 0.129636 -0.0479031 0.0004073 -0.0762879 -0.164362 -0.0338689 0.0735038 0.0101566 -0.0754786 -0.0168534 0.115951 -0.0160091 0.047337 -0.00955277 0.116307 0.0689101 -0.0408051 0.129482 -0.0468062 -0.0389703 -0.0645768 0.0705096 0.0608341 -0.216713 0.203897 -0.0167117 0.0490932 -0.0557982 -0.251777 0.237074 0.0297389 0.0603127 -0.0335535 0.0167652 -0.0130089 0.0480991 -0.017657 -0.018057 0.0411858 -0.0275653 -0.0826891 0.134295 0.0518854 0.00536336 0.0047624 -0.130851 0.0764635 0.0203746 -0.115391 0.126682 0.0449928 -0.129996 0.130674 0.0116916 -0.103888 -0.0708902 -0.00938185 0.0335706 0.0748672 0.0254956 0.0817497 0.117141 -0.0961124 0.126995 0.0332598 0.0233313 0.00627488 -0.0269327 -0.0320267 0.038709 -0.0410515 0.0409341 -0.0335801 0.0315667 0.0303353 -0.00513668 -0.114503 -0.0421796 -0.0416649 0.150684 0.0944858 -0.00934191 -0.0974498 -0.0499415 0.0622951 0.148504 0.0213114 -0.0537233 
0.033889 0.0618339 0.0151374 0.0331666 0.0813931 0.249653 0.0931911 -0.121825 -0.0331625 -0.00643025 0.0294228 0.128768 0.100903 -0.109365 -0.0217637 -0.0900754 -0.0729053 0.182635 -0.115047 0.0700132 0.127632 -0.0183845 -0.0198951 0.179092 -0.0308629 -0.0743177 -0.161418 -0.198382 -0.0381823 0.159207 0.0201702 0.0740349 -0.0867506 0.110356 0.105929 0.0289275 -0.00665219 0.00799224 -0.0117566 -0.0562177 0.087073 -0.0910931 0.0072579 0.0255462 -0.164744 -0.0951397 0.113281 0.0251204 -0.135109 0.0267202 0.093046 -0.102341 -0.0134856 0.0198221 0.112132 0.0873312 -0.0553306 0.134681 -0.0552403 -0.0607253 -0.0511462 0.0579711 0.145664 -0.220396 0.160297 -0.0787104 0.0128536 -0.0551979 -0.228006 0.109526 0.0212525 0.0551983 -0.0615829 -0.0224788 -0.0435628 0.0591631 -0.0340353 0.000990157 0.0706762 0.0148521 -0.0805209 0.0738366 0.0278912 0.0226616 -0.082961 -0.0173243 0.106975 -0.0343748 -0.0284729 0.115937 0.0343078 -0.186745 0.0576554 0.0116827 -0.140535 -0.0579839 -0.0594366 0.0383452 0.0321549 0.0414692 0.1102 0.104859 -0.0926189 0.108391 0.0167277 0.0404557 -0.0471098 0.0219518 -0.105628 0.0557202 -0.0284193 0.0172411 -0.0477636 -0.0188204 -0.000742963 0.067593 -0.0869096 -0.0428317 -0.0497781 0.152134 0.0821189 -0.0817577 -0.0635347 0.00762211 -0.00180131 0.124296 -0.0207881 -0.0450559 
0.0239756 0.0421213 0.0150649 0.0509735 0.107306 0.222393 0.0778645 -0.15701 -0.0306444 -0.00706354 0.0405706 0.150346 0.0940225 -0.0696655 -0.0438627 -0.0600671 -0.0531641 0.186951 -0.0999968 0.09246 0.144015 -0.0346148 -0.0160021 0.203703 -0.0150384 -0.0346789 -0.148049 -0.200291 -0.00564015 0.175716 0.0187453 0.10491 -0.0707286 0.0800158 0.0913882 0.0480723 -0.0375316 0.0289199 -0.0118382 -0.0681786 0.0837115 -0.0642511 -0.0104585 0.0111886 -0.156062 -0.0671811 0.126152 0.0116049 -0.123183 -0.0310271 0.0826307 -0.0639302 0.013156 -0.00307193 0.138554 0.0960602 -0.036139 0.154285 -0.0524934 -0.0465901 -0.059841 0.0511112 0.158301 -0.194815 0.169478 -0.0573238 0.00123836 -0.0331698 -0.206458 0.124661 0.0338245 0.0608021 -0.0694767 -0.0424647 -0.0221555 0.085177 -0.0403972 0.0255698 0.0530709 0.00050669 -0.0797673 0.102626 0.0259462 0.0127745 -0.0770724 -0.0151826 0.116118 -0.00533888 -0.0514729 0.0911902 0.0303725 -0.154768 0.0549534 0.0332643 -0.12597 -0.0663224 -0.0549702 0.0432068 0.0676309 0.023523 0.124082 0.0926277 -0.0859198 0.102708 0.000369542 0.0596352 -0.0381677 0.00887696 -0.0667598 0.0276686 -0.0446171 0.0264197 -0.0557925 -0.0315032 0.028294 0.0822673 -0.127768 -0.0567666 -0.0539124 0.154968 0.0742885 -0.07975 -0.0736882 -0.0223991 -0.0348204 0.189611 -0.0190134 -0.0314491 
0.100908 0.110462 -0.073596 0.00176788 0.0330387 0.255801 0.0826264 -0.0737636 -0.0585106 -0.0608051 0.0353553 0.0847003 0.0928435 -0.1336 -0.0886749 -0.0228764 0.0267457 0.0884205 -0.108154 0.0388092 0.128796 0.0744956 -0.0968186 0.149163 -0.0656896 -0.0135746 -0.0784079 -0.147037 0.0321769 0.184492 -0.0256854 0.156873 -0.0798236 0.144787 0.052943 -0.025233 0.0845873 -0.0186689 0.0284516 -0.047216 0.0680578 -0.107856 0.0902207 0.0433531 -0.051274 -0.0574785 0.172596 0.0186478 -0.208214 0.0131993 0.119191 -0.0427912 0.0247871 0.0526834 0.11296 0.0766146 -0.0454394 0.0903056 -0.0108561 -0.124558 -0.0644345 0.0487081 0.16134 -0.226623 0.0419032 -0.0535074 0.0462938 -0.0846852 -0.171006 0.0335854 -0.0687609 -0.0591464 -0.0916745 -0.00394695 -0.0181492 0.031862 0.0274722 0.0344907 0.00747794 0.021893 0.0223826 0.106705 0.0317792 -0.0289587 -0.0148293 0.0332991 0.0540959 -0.0925773 -0.0389277 0.154221 0.0808782 -0.204562 -0.0749138 0.0527514 -0.0773993 0.0523748 0.0292758 0.0512621 0.0155131 0.0198014 0.0946069 0.122835 -0.069024 0.202519 -0.101039 0.0113872 -0.073871 0.0659044 -0.169192 0.00958814 0.0353329 0.0200772 -0.0994456 -0.023965 -0.00197192 0.00657609 -0.0954272 -0.112756 -0.0188417 0.0805456 0.0926277 -0.0602924 0.0771759 -0.014177 0.00469384 0.0532792 -0.0104142 -0.112984 
0.0606736 0.0032689 -0.0541406 0.0157542 0.0415823 0.163696 0.0309842 0.0580666 -0.0351493 -0.0857658 0.0779181 0.115461 0.0813014 -0.245435 -0.146381 0.0482061 -0.0914207 0.0495431 -0.184767 0.125198 0.230797 -0.0714963 -0.0334731 0.139771 -0.00938304 0.006531 -0.0251556 -0.210096 0.0232391 0.0667322 0.0196886 0.0572585 -0.0666818 0.136878 -0.057422 -0.0439277 -0.0707572 0.0109035 -0.00878328 -0.0311079 0.0748358 -0.128471 0.0268763 0.159536 -0.0106458 -0.16768 0.162341 -0.04064 -0.179422 0.0273793 0.0458881 -0.13355 -0.0913113 0.00422837 0.0594457 0.0305781 -0.0981526 0.0970212 -0.0274625 -0.126952 -0.0290567 -0.0486391 0.179403 -0.0579771 0.0318661 -0.119048 -0.0206816 -0.0582116 -0.0654332 -0.00958219 -0.0818865 0.00489844 -0.0652727 -0.0249072 -0.0227565 -0.0479958 0.00902968 0.113416 -0.0388604 0.12971 -0.0582948 0.00976023 0.0264926 -0.0371177 -0.112226 0.0945411 0.1209 0.00410204 0.00493478 0.00903305 0.0569744 -0.17843 -0.167998 0.0493026 -0.0674465 0.0544822 -0.0395309 0.0139677 -0.0490711 0.00154381 -0.0174064 -0.0365186 -0.0886745 0.17782 -0.00650056 0.0324697 -0.0804838 0.179964 -0.083788 -0.116981 -0.0555314 0.0972046 -0.133811 5.88515e-05 0.0765031 0.0208202 -0.109454 -0.0739043 0.0428718 0.117184 0.00618315 0.0454888 0.0135233 0.0465491 -0.00494365 0.0153842 -0.0177642 -0.0637563 
0.0685819 0.0372537 -0.114886 0.00134048 0.0481744 0.158104 -0.00839176 0.0304352 0.0142302 -0.0852758 0.118204 0.140412 0.0238622 -0.246513 -0.207112 0.0105175 -0.0729107 0.0557516 -0.143016 0.126077 0.183892 -0.0460424 0.0117298 0.0924424 -0.0250837 0.0387369 0.080876 -0.182506 0.0326795 0.0390076 -0.00634231 -0.00836165 -0.00321932 0.110312 -0.0538156 -0.065045 -0.0423784 0.083873 -0.0128493 -0.0251694 0.0531416 -0.100276 -0.037061 0.170925 -0.0839589 -0.14056 0.137027 -0.0441238 -0.16017 0.0600016 0.0239562 -0.00240312 -0.107746 0.024071 0.0570907 0.00757904 -0.0367234 0.0727614 -0.086679 -0.125415 -0.0528801 -0.113749 0.27905 -0.0574243 0.0467898 -0.168302 -0.0236122 -0.0143128 -0.0293855 0.0937578 -0.0558084 -0.0115496 -0.0631119 0.00727895 -0.00362428 -0.067112 -0.0143492 0.141503 -0.0785611 0.0799958 -0.126766 0.0721309 0.0598696 -0.0219391 -0.0703146 0.0489986 0.109496 0.0556407 0.0467356 0.00451584 0.0652315 -0.1946 -0.154226 0.0466063 0.0182724 -0.0591605 -0.0207931 0.0122715 -0.0331964 -0.0461999 -0.0200465 -0.00605733 -0.0801775 0.152669 0.00637661 0.0218179 -0.0304899 0.145506 -0.0539514 -0.126006 -0.00796276 0.118423 -0.0812165 0.0605836 0.0989883 -0.00653915 -0.121717 -0.121626 0.104874 0.110313 0.0172957 0.0657918 0.0146033 0.0266855 0.0374583 0.020067 0.0536648 -0.0269264 
0.0344416 0.0631068 -0.0671113 -0.0115685 0.00976591 0.15041 -0.0249658 0.0323607 0.00688638 -0.0503192 0.0929121 0.11101 0.0237085 -0.285239 -0.159326 0.0278497 -0.130242 0.0260251 -0.137194 0.11349 0.170438 -0.0331419 0.0165119 0.0799488 -0.0351299 0.0705118 0.0695763 -0.215002 0.0356158 0.0251229 0.00663113 -0.0119663 0.00210129 0.110931 -0.0168491 -0.0605401 -0.0267386 0.110201 -0.00998035 -0.0118662 0.0487932 -0.149622 -0.0409242 0.184854 -0.0695206 -0.106303 0.155835 -0.0391639 -0.180042 0.0567854 0.042599 -0.0117678 -0.104878 0.0240175 0.0683079 0.00510045 -0.0230746 0.0336879 -0.0669487 -0.141745 -0.0483624 -0.139691 0.243116 -0.0298978 0.0782205 -0.193262 -0.0148453 -0.0267577 -0.0146621 0.0913797 -0.075015 -0.0152952 -0.0706128 0.00246084 0.0168553 -0.0836648 -0.0525092 0.162812 -0.0499262 0.119984 -0.094657 0.0469012 0.05438 -0.002213 -0.075202 0.0210562 0.113339 0.0545091 0.0495769 0.0212936 0.0385019 -0.171342 -0.15257 0.0378033 -0.0406022 -0.0403333 -0.00804191 0.0255895 -0.0124422 -0.0527605 -0.0113589 0.00363066 -0.0928989 0.13608 0.0251149 -0.0108343 -0.0319146 0.154605 -0.0366062 -0.11238 -0.0248474 0.132153 -0.104339 0.0268195 0.100052 0.0047656 -0.124884 -0.137191 0.077171 0.104858 0.0488237 0.0672399 0.0327925 0.0329263 0.0514669 0.0135148 0.0774779 -0.0136736 
0.0427542 0.116731 -0.0902188 0.0217064 0.000655406 0.128773 0.0170298 0.0499268 0.0419029 -0.0332619 0.0978876 0.121505 -0.00525309 -0.330494 -0.153721 -0.0262773 -0.105735 0.0245334 -0.139456 0.136536 0.0912108 -0.0189497 -0.0112689 0.0989987 -0.0507861 0.00857504 0.0578089 -0.184302 0.0293394 0.0321916 -0.0283884 -0.0293679 0.0220785 0.118595 -0.0292878 -0.0811393 0.0263312 0.0741942 -0.0827323 -0.000602411 0.0757429 -0.150429 -0.0184189 0.18507 -0.102521 -0.0911274 0.166313 -0.038381 -0.153916 0.120109 0.0555003 -0.00572492 -0.133707 0.0252713 0.0742296 0.00478306 -0.0670869 -0.0253829 -0.0499874 -0.11438 -0.0677166 -0.144188 0.205816 -0.0540603 0.0460994 -0.221519 0.0227077 -0.0989825 -0.0405055 0.0662313 -0.0745836 -0.0300986 -0.0357134 0.0657763 0.0292903 -0.0716798 -0.0446594 0.185519 -0.0489109 0.0789999 -0.0989362 0.0657481 0.0243517 0.011178 0.000205331 0.0532542 0.0725777 0.0224979 0.0600672 0.0489815 0.0279145 -0.173874 -0.154915 -0.0186501 -0.0270662 -0.0715555 0.00843091 -0.0219585 -0.0102332 -0.0670731 -0.0442769 0.0138098 -0.0313007 0.11221 -0.0263055 -0.0166031 -0.0168433 0.171919 -0.0644437 -0.046003 0.0165851 0.117546 -0.0759447 0.00971651 0.0295915 -0.0464099 -0.0790092 -0.156875 0.0869723 0.0879517 0.0408552 0.0919388 0.02505 0.0839323 0.0741885 -0.0324254 0.0841917 -0.0366663 
0.0541708 0.0530026 -0.105486 0.0308958 0.0383104 0.0977831 -0.00125989 0.0197633 0.00592469 -0.0363282 0.0589152 0.154573 -0.0272554 -0.273288 -0.169208 -0.0126718 -0.0473119 0.0551316 -0.0812021 0.154953 0.0958872 -0.0220575 0.0154085 0.128989 -0.0374945 0.06463 0.100145 -0.203246 0.0100041 0.0379253 -0.047656 -0.00794413 0.026556 0.101301 -0.0216575 -0.0763807 0.0142051 0.115647 -0.086172 -0.0439246 0.0572001 -0.0954458 -0.0116852 0.19463 -0.124745 -0.0586188 0.189266 -0.0521627 -0.135041 0.0977857 0.0875841 -0.0188564 -0.0913215 0.0142162 0.136791 -0.00287823 -0.0239828 0.0187674 -0.0193263 -0.142586 -0.0394744 -0.154584 0.212187 -0.0471043 0.0783415 -0.232079 -0.0143732 -0.0655245 -0.0202011 0.104188 -0.065842 -0.0109963 -0.0377522 0.0410338 -0.00102651 -0.0678655 -0.0377723 0.209313 -0.0434177 0.0398425 -0.115824 0.122893 0.0212698 -0.031107 0.00542556 -0.0266996 0.0792529 0.0727084 0.066453 0.0296097 0.0183787 -0.128884 -0.149908 -0.0294217 0.0149784 -0.046122 0.0445133 0.00908034 0.00574497 -0.094396 -0.0375824 0.0250593 -0.0231977 0.122876 -0.0504121 -0.0444628 -0.0412516 0.107036 -0.0466994 -0.0648942 0.0303806 0.151832 -0.0607061 0.0147474 0.0553847 -0.0444342 -0.0866754 -0.219417 0.0538434 0.0756955 0.037862 0.122865 0.0409544 0.0354534 0.04844 -0.00940539 0.0847964 -0.0561522 
0.0437459 0.035637 -0.11627 0.055751 0.0453017 0.0894136 -0.00327624 -0.00162905 0.00728851 -0.0357559 0.0774024 0.182901 -0.0157848 -0.271301 -0.179762 0.00608726 -0.0628886 0.0618339 -0.0831616 0.169486 0.110623 -0.0510703 0.0279764 0.137924 -0.0257661 0.0682391 0.0903849 -0.218122 0.00897597 0.0595407 -0.0423741 0.0200308 0.0379043 0.098989 -0.0415075 -0.0678002 -0.0117564 0.103281 -0.0725538 -0.0387245 0.0651158 -0.102201 -0.0131076 0.184995 -0.130331 -0.0858803 0.192698 -0.0640036 -0.121399 0.0819259 0.0847106 -0.0293604 -0.0908859 0.00792542 0.13454 0.0135098 -0.0246442 0.0316576 -0.0310779 -0.109497 -0.0543431 -0.156753 0.224019 -0.0446481 0.0846364 -0.217536 -0.0259203 -0.0729754 -0.0391051 0.094555 -0.0733199 0.00254955 -0.0486627 0.0428997 0.00751737 -0.0582999 -0.027097 0.194029 -0.0623966 0.0580428 -0.125527 0.103215 0.0274671 -0.0195301 -0.0188784 -0.000610389 0.0879967 0.062421 0.0481815 0.00685167 0.00718046 -0.129834 -0.149137 -0.0150724 0.00755258 -0.0492692 0.014348 0.0164377 0.0175708 -0.0895602 -0.040867 0.00220658 -0.0242905 0.132215 -0.0283744 -0.0237314 -0.0333635 0.124416 -0.0423873 -0.0755751 -0.00641911 0.143727 -0.0591643 0.00741191 0.0575724 -0.031678 -0.0756972 -0.195408 0.0688166 0.106776 0.0408047 0.109245 0.0177023 0.0260738 0.0250842 0.023311 0.0723441 -0.0312096 
0.0449074 -0.0325874 -0.145142 0.0516542 0.0713184 0.0418967 -0.0199637 -0.017442 0.0374208 -0.0722179 0.0569051 0.183823 -0.00826333 -0.216057 -0.213282 0.0231595 -0.0516079 0.0574292 -0.0888541 0.187823 0.140454 -0.0869789 0.0550926 0.0964128 -0.0188911 0.097732 0.104993 -0.228668 -0.0351597 0.0488666 -0.040227 0.0340008 0.0470324 0.0815251 -0.0403747 -0.0620473 -0.0235854 0.157068 -0.0599042 -0.0858231 0.045134 -0.0581974 -0.0213798 0.1816 -0.115496 -0.0848498 0.162956 -0.0646224 -0.0749264 0.0636324 0.037138 -0.0631189 -0.0638929 0.0166172 0.148315 -0.0138504 -0.00831194 0.0386072 -0.0357706 -0.136322 -0.0137083 -0.168221 0.226014 -0.00956819 0.0871245 -0.203539 -0.0530863 0.0010751 0.0224859 0.0706897 -0.056217 0.0067942 -0.0341319 -0.000772977 -0.0272108 -0.0525631 -0.0241077 0.172691 -0.0725906 0.0517356 -0.135951 0.117499 0.00629813 -0.0427967 -0.0441939 -0.0241562 0.0957659 0.112609 0.0679835 -0.0381804 0.0116702 -0.115172 -0.135751 -0.0204966 0.0179238 -0.0384315 0.00711456 0.0210523 0.015856 -0.0984844 -0.0343669 -0.0383462 -0.0274375 0.120355 -0.0148476 -0.0415526 -0.0508831 0.107955 -0.0349402 -0.0814187 -0.0164724 0.150296 -0.0675035 0.0314164 0.0730078 -0.0191865 -0.105669 -0.192886 0.0483655 0.0740522 0.00450885 0.165152 0.0281007 0.0248621 0.0153178 0.00648282 0.0478108 -0.0369368 
0.0465589 0.049368 -0.119502 0.0186862 0.0445587 0.111311 0.0011708 0.00438719 0.0308184 -0.0547332 0.0818174 0.137136 0.0177824 -0.258293 -0.192236 -0.0024999 -0.0720342 0.0559343 -0.121545 0.1699 0.143392 -0.0720479 0.0259234 0.104569 -0.0460042 0.050655 0.0741858 -0.209098 0.0241061 0.0486308 -0.0233348 0.0125244 0.0303944 0.110083 -0.0234244 -0.0644996 0.00573055 0.137789 -0.0668172 -0.0764918 0.0530521 -0.123535 -0.0179117 0.179806 -0.109293 -0.0890008 0.165578 -0.0275696 -0.145761 0.0780816 0.0246324 -0.0286048 -0.0883931 0.019039 0.118815 0.00635793 -0.0362496 0.0261079 -0.0554777 -0.148594 -0.0445608 -0.140879 0.247971 -0.0526919 0.0854516 -0.186572 -0.0310808 -0.044279 -0.0364162 0.0827464 -0.0810689 -0.033197 -0.0618223 0.0223498 0.00186057 -0.0690343 -0.0142955 0.1865 -0.0453536 0.0520302 -0.13111 0.0873007 0.0127112 -0.0224564 -0.0265111 0.00512146 0.0807983 0.0808513 0.0754748 0.0366084 0.0580747 -0.16657 -0.137726 -0.00657679 0.00585546 -0.0538077 0.000684368 0.0271324 0.00358039 -0.0765898 -0.00483929 0.00196097 -0.0554008 0.129401 -0.00820739 -0.010608 -0.0254285 0.133182 -0.0331805 -0.084608 -0.0126032 0.141091 -0.0758858 0.0320453 0.0773144 -0.0196479 -0.0984618 -0.177935 0.0771499 0.105025 0.0258618 0.101925 0.0259696 0.0508516 0.029816 0.006192 0.0659727 -0.0482539 
0.0983031 0.11294 -0.15398 0.0100309 0.0527767 0.185814 0.0554225 0.023768 -0.00582065 -0.0557652 0.0747151 0.0948324 0.0138397 -0.281489 -0.13453 -0.0215554 -0.0510539 0.0332674 -0.108026 0.118688 0.115769 -0.00234066 -0.0256873 0.0987727 -0.0288751 -0.0317696 0.0454504 -0.196227 0.0416391 0.0834871 -0.0310882 0.00306713 -0.0251347 0.118083 -0.00082253 -0.0638081 0.0431077 0.0166748 -0.0680332 -0.0497788 0.0779945 -0.135399 0.0336063 0.195618 -0.109534 -0.0255907 0.186669 0.000595418 -0.193312 0.0810782 0.0547137 -0.0228279 -0.0934492 0.0069825 0.089557 0.0115476 -0.0824027 0.0336029 -0.029428 -0.120787 -0.0544066 -0.0916007 0.231501 -0.112028 0.058397 -0.187132 0.00158047 -0.0767329 -0.0540547 0.0622108 -0.0722881 -0.0204275 -0.0641455 0.00261529 0.00107443 -0.0397163 -0.0169274 0.182733 -0.0494114 0.0604856 -0.0678879 0.0842371 -0.00385941 -0.0178572 -0.00591644 0.0620017 0.0491334 -0.00750264 0.0195887 0.0950088 0.0814136 -0.186013 -0.196576 -0.0238897 -0.0181935 -0.0416292 0.0324783 -0.000863363 -0.0030918 -0.058342 -0.0101311 0.0391145 -0.015177 0.116329 -0.10316 -0.00619895 -0.0475109 0.176884 -0.0996721 -0.0297827 0.0650188 0.0874981 -0.0789514 -0.0081455 0.0371928 -0.0290016 -0.109182 -0.156511 0.064704 0.0948191 0.0435888 0.0554835 0.0504938 0.0928497 0.0575126 -0.0276273 0.0518681 -0.0830842 
0.0738863 0.119048 -0.126903 0.0167597 0.0425202 0.199397 0.0369871 0.00742002 -0.0127944 -0.0324315 0.0944182 0.0952832 0.0202592 -0.284903 -0.138697 -0.00285023 -0.0735092 0.0634372 -0.0927702 0.101958 0.15186 -0.026255 -0.0169925 0.09924 -0.0132458 -0.0188664 0.0417779 -0.206799 0.0605055 0.0974907 -0.0131549 0.00457413 -0.0140485 0.113693 0.0189731 -0.0627115 0.0316835 0.0177775 -0.0268396 -0.0583769 0.0635664 -0.157316 0.0362836 0.178449 -0.100324 -0.0726511 0.194174 -0.0102723 -0.205043 0.0551812 0.0609093 -0.0134644 -0.0883412 0.0119686 0.0809559 0.0344223 -0.0573711 0.0279785 -0.053841 -0.122822 -0.0573475 -0.103182 0.248963 -0.121187 0.0893935 -0.164081 -0.0132392 -0.0911678 -0.074302 0.0883001 -0.0914213 -0.0145159 -0.0930623 -0.00617469 0.00244343 -0.0559844 -0.00452959 0.182184 -0.0495573 0.063495 -0.0877411 0.0714213 0.0157072 -0.00221103 -0.0228429 0.0573655 0.049642 0.00108793 0.0331727 0.0910692 0.0781025 -0.18439 -0.18389 0.00294827 -0.020485 -0.0488441 0.00571012 0.0377513 -0.000900304 -0.0400472 0.00750988 0.032901 -0.0416625 0.116377 -0.0406453 0.0143686 -0.0128187 0.162981 -0.0803443 -0.0496128 0.00581079 0.0808758 -0.0731509 -0.0111793 0.0719817 -0.0191035 -0.0926799 -0.138008 0.0828979 0.113588 0.0576849 0.025925 0.0429093 0.0620621 0.0504499 0.00982582 0.0746708 -0.0526121 
0.0663288 0.0649039 -0.0840886 0.0261958 0.0325507 0.196178 0.0307726 0.0294014 -0.0011704 -0.076394 0.0855111 0.115487 0.0320424 -0.287591 -0.15568 -0.0168227 -0.093886 0.0666778 -0.137752 0.132247 0.173975 -0.0544548 0.0124024 0.116207 -0.0368489 -0.0250067 0.0139915 -0.221461 0.0194973 0.0571574 0.00400412 -0.00188379 -0.00533147 0.138059 0.0013187 -0.0636007 0.00336187 0.06319 -0.055654 -0.0647054 0.0652844 -0.146253 -0.00274694 0.153805 -0.100788 -0.122934 0.163679 -0.0277483 -0.18883 0.0956914 0.0390829 -0.0543278 -0.0799351 0.0255728 0.0805288 0.0247394 -0.0428767 0.0369304 -0.0665976 -0.133343 -0.0538323 -0.075404 0.234777 -0.114579 0.0920332 -0.160388 -0.016879 -0.0849305 -0.0983017 0.0846454 -0.0858514 -0.0313352 -0.0829746 0.016935 -0.00594508 -0.0608795 0.00110127 0.13757 -0.0301952 0.0812 -0.120502 0.035725 0.0219581 -0.0157171 -0.0413231 0.056204 0.0725456 0.0226916 0.0333872 0.0739254 0.087812 -0.202403 -0.145338 0.00971087 -0.0283992 -0.0345614 -0.0172128 0.0360025 -0.0268471 -0.0136428 0.0147444 0.0230037 -0.0741323 0.128932 0.0120988 0.0140987 -0.00934819 0.147319 -0.074751 -0.0711301 -0.0265051 0.0980238 -0.0683301 0.00375076 0.0778202 0.00275571 -0.0792877 -0.118531 0.0883245 0.139365 0.0368908 0.032749 0.0171857 0.0485868 0.0574031 0.0144735 0.0780075 -0.0496315 
0.0582263 0.0592545 -0.0945047 0.0214739 0.0375162 0.184365 0.00888027 0.013671 -0.00654821 -0.0591475 0.0891776 0.119285 0.0395181 -0.267608 -0.16779 0.00427584 -0.0886164 0.0885159 -0.124137 0.124716 0.192176 -0.0672774 0.0329696 0.113007 -0.0261408 -0.0032429 0.0316407 -0.227021 0.0211911 0.0699445 0.00286658 0.00413454 0.00746161 0.125624 0.00508755 -0.0651628 -0.00946583 0.0793246 -0.0308545 -0.0734322 0.0398235 -0.140787 -0.00168009 0.159185 -0.101408 -0.134274 0.168557 -0.0300846 -0.185644 0.0829874 0.0495504 -0.0495359 -0.0729529 0.0242047 0.077444 0.0269114 -0.0133251 0.0388553 -0.0626899 -0.14633 -0.0480138 -0.0922002 0.245709 -0.104036 0.0941278 -0.159953 -0.0382898 -0.0624509 -0.0890777 0.0952667 -0.0889891 -0.0239643 -0.0954252 -0.00416196 -0.0186968 -0.0661631 -0.00105531 0.136304 -0.0365991 0.0785063 -0.129294 0.0439391 0.024899 -0.0163173 -0.0557114 0.0424625 0.0703236 0.0327625 0.054039 0.057633 0.0715191 -0.19073 -0.142742 0.014942 -0.0140651 -0.0334996 -0.0303182 0.0666295 -0.0289767 -0.0228737 0.0229049 0.0164741 -0.0770263 0.136485 0.0297192 0.00944185 -0.0126477 0.133909 -0.0551365 -0.0855383 -0.0463706 0.104089 -0.0664361 0.0150364 0.0906954 0.00875542 -0.0779419 -0.123252 0.0904224 0.140256 0.0395962 0.0335384 0.017021 0.0303642 0.0385591 0.0203799 0.0801814 -0.0336413 
0.0836774 0.0341173 -0.094885 0.0295216 0.0500002 0.198169 0.0429901 0.0279192 -0.00179202 -0.0928392 0.0624435 0.114152 0.0310031 -0.289591 -0.15545 -0.0118433 -0.0920163 0.0867743 -0.141411 0.126897 0.19119 -0.0468603 0.014048 0.123446 -0.0373259 -0.0431106 0.00288492 -0.24551 -0.00204814 0.0711725 -0.0032127 0.00943549 -0.0163184 0.141085 0.0240408 -0.0703294 0.00168445 0.0347439 -0.0610712 -0.0917783 0.0635117 -0.140841 0.0120369 0.163351 -0.0992601 -0.10987 0.159404 -0.0166353 -0.183887 0.0985452 0.0411677 -0.0887579 -0.0522339 0.01926 0.0808313 0.0188224 -0.0344513 0.0312964 -0.056419 -0.133629 -0.0301614 -0.056956 0.217712 -0.108203 0.0855901 -0.174061 -0.0324027 -0.0846187 -0.0904465 0.0730477 -0.0936235 -0.0377287 -0.0865773 -0.0166372 -0.0405677 -0.0485864 0.00238217 0.128156 -0.0267095 0.0854228 -0.0992834 0.0411587 -0.00347642 -0.0266658 -0.0412118 0.0610215 0.0642269 0.0150419 0.0141496 0.0876469 0.101279 -0.188249 -0.163531 -0.00353683 -0.0418124 -0.00500402 -0.0241936 0.0399367 -0.0259222 -0.0107274 0.0436341 0.0152672 -0.0680177 0.113054 0.0137203 -0.0120987 -0.0201042 0.14453 -0.0952289 -0.0424891 -0.0209245 0.0852692 -0.0653428 -0.0189978 0.0682991 0.0176104 -0.0806276 -0.114186 0.0700188 0.132902 0.0347166 0.037656 0.0203123 0.0494405 0.0488484 0.00200219 0.0654678 -0.0668914 
0.083209 0.0175755 -0.0886085 0.0270249 0.0572053 0.196747 0.0438585 0.0329604 -0.00250943 -0.0963305 0.0597875 0.116299 0.0332165 -0.286265 -0.153701 -0.0149527 -0.100513 0.0898037 -0.137176 0.129506 0.20396 -0.0484271 0.00817239 0.129328 -0.0322415 -0.0445344 0.000884049 -0.248281 -0.000590321 0.0753326 -0.00580205 -0.0039671 -0.0198332 0.136131 0.0329429 -0.0652384 -0.00755304 0.0190248 -0.0616118 -0.104473 0.0689942 -0.138886 0.0130263 0.17359 -0.102688 -0.109798 0.15636 -0.0116457 -0.178118 0.0923776 0.0312784 -0.0948985 -0.0480111 0.0171516 0.089743 0.0186469 -0.0408997 0.0342753 -0.0628373 -0.135997 -0.0217924 -0.0552942 0.218833 -0.0902104 0.0816259 -0.173939 -0.0387588 -0.0829849 -0.0811717 0.0677038 -0.0909968 -0.034178 -0.0868262 -0.0354885 -0.0453216 -0.0404084 -0.00189832 0.130655 -0.0162783 0.0924171 -0.0939882 0.0409392 -0.001146 -0.02164 -0.0426676 0.0609309 0.0706225 0.025954 0.0138582 0.0907373 0.108366 -0.181537 -0.166723 -0.000239519 -0.0578129 -0.0121191 -0.0324915 0.0382712 -0.0227379 -0.0172896 0.0554044 0.0141282 -0.0646922 0.0935649 0.0136944 -0.00717027 -0.0196547 0.144392 -0.0953018 -0.0377227 -0.0173511 0.0754836 -0.0723456 -0.0247539 0.0693366 0.0294411 -0.0805081 -0.110062 0.0608147 0.132966 0.0320995 0.0327511 0.0133692 0.0463662 0.0368617 0.0114658 0.0670949 -0.060645 
0.112582 0.00385812 -0.114109 0.0225646 0.0755154 0.208778 0.0800526 0.0320209 -0.0134906 -0.103137 0.0502244 0.12395 0.039837 -0.264349 -0.140184 -0.0264289 -0.0597863 0.0983987 -0.140058 0.109704 0.182877 -0.016007 -0.0150473 0.141679 -0.0464134 -0.0618957 -0.00601018 -0.245816 -0.0216734 0.0919096 -0.0283306 0.0238977 -0.038864 0.14948 0.0288364 -0.0693542 0.0115465 -0.016124 -0.0719251 -0.0926713 0.0853456 -0.113532 0.0305182 0.165426 -0.108298 -0.082628 0.150405 -0.00967678 -0.18054 0.0837797 0.0485016 -0.128742 -0.0389677 0.0164053 0.084116 0.0321712 -0.0566188 0.0599801 -0.0486155 -0.106235 -0.0142776 -0.0266947 0.199292 -0.119246 0.0721965 -0.172782 -0.0307455 -0.0743205 -0.0842205 0.0505915 -0.0839154 -0.0416812 -0.0761157 -0.0485513 -0.0611579 -0.00680073 0.00445344 0.117052 -0.0270605 0.055099 -0.0775056 0.0605631 -0.0195133 -0.0377052 -0.0509158 0.0766911 0.0793144 -0.0156416 -0.0262661 0.106909 0.114517 -0.19332 -0.174419 -0.0154476 -0.0540031 0.022472 -0.0227085 0.00788788 -0.0166978 -0.000589565 0.0554184 0.0194233 -0.0477469 0.106994 -0.0246345 -0.0273724 -0.0526405 0.136456 -0.15412 -0.020647 0.0201832 0.0584119 -0.058065 -0.0408651 0.0405369 0.0262364 -0.0948212 -0.115306 0.0379177 0.115492 0.0360583 0.0290964 0.0153257 0.0627321 0.0416348 -0.00324052 0.0190919 -0.0976868 
0.115649 0.0151729 -0.132921 0.0302306 0.0723221 0.197056 0.0764078 0.034979 -0.0112681 -0.0853732 0.0610419 0.136117 0.0352891 -0.273542 -0.141638 -0.0236207 -0.033613 0.105968 -0.132785 0.107472 0.159892 -0.00408976 -0.0194876 0.148208 -0.0440626 -0.0596841 0.014431 -0.240713 -0.0194777 0.0976866 -0.035353 0.037158 -0.0272402 0.145554 0.0112542 -0.0783847 0.012306 -0.0288215 -0.0724309 -0.0729352 0.0865074 -0.115144 0.0287887 0.175658 -0.115725 -0.0816949 0.149312 -0.016154 -0.174695 0.0786612 0.0768694 -0.116538 -0.0484702 0.00338293 0.0666168 0.0341575 -0.0596539 0.0476332 -0.0321504 -0.0877572 -0.0251083 -0.0477574 0.185752 -0.122671 0.0600914 -0.196764 -0.0269067 -0.0813763 -0.088257 0.0427914 -0.0829381 -0.0455717 -0.0753751 -0.0508951 -0.0647053 -0.00529525 0.000520498 0.128721 -0.0459345 0.059049 -0.0856808 0.0642016 -0.0142209 -0.0301827 -0.0390246 0.0796717 0.0782749 -0.0374786 -0.0303862 0.0960491 0.0789601 -0.185896 -0.187012 -0.0151106 -0.0404534 0.0212356 -0.0182064 -0.00760605 -0.0232819 -0.0140334 0.0420707 0.0235519 -0.0349754 0.124855 -0.0328898 -0.0424097 -0.0529373 0.138777 -0.156303 -0.0165747 0.0247173 0.0541586 -0.0521267 -0.0397912 0.0263013 0.00752604 -0.098693 -0.129175 0.0429053 0.114168 0.0380232 0.0314945 0.00846097 0.0664164 0.0542011 -0.0154323 0.0118742 -0.0975674 
0.108236 0.0300641 -0.111411 0.0333296 0.0805396 0.19462 0.0793021 0.0138594 -0.0140708 -0.0730294 0.0427106 0.114481 0.0473013 -0.261671 -0.126316 0.0124281 -0.0323483 0.128086 -0.147625 0.0929966 0.181555 -0.00748227 -0.00545959 0.147962 -0.0472982 -0.0747848 -0.0181158 -0.251944 -0.013564 0.118606 -0.0317833 0.0735197 -0.0300638 0.150618 0.0397762 -0.0794989 0.0347382 -0.0185016 -0.0532318 -0.0829109 0.0688675 -0.115404 0.0568584 0.138278 -0.0921037 -0.073177 0.160805 -0.00906178 -0.183517 0.0667341 0.0933456 -0.139973 -0.0317706 0.00860219 0.0689821 0.0436314 -0.0259983 0.0365387 -0.0196597 -0.0954577 -0.0128779 -0.0335014 0.153056 -0.142656 0.0814622 -0.178306 -0.0460794 -0.0815258 -0.10469 0.0426422 -0.0975862 -0.043949 -0.0897257 -0.0643333 -0.0744978 0.00284054 0.0128303 0.128881 -0.0378589 0.0404777 -0.0611121 0.0677144 -0.0320631 -0.0267855 -0.0451672 0.0863662 0.0577603 -0.0452558 -0.0440611 0.112236 0.0784992 -0.181638 -0.182425 -0.0165062 -0.0504888 0.0583057 -0.0305015 0.0297191 -0.0171939 0.0109857 0.0690552 0.0133902 -0.047654 0.141373 -0.0062657 -0.055146 -0.0560932 0.126308 -0.147778 -0.0115702 -0.015513 0.0506671 -0.0488903 -0.0485715 0.0297364 0.0217267 -0.100876 -0.110568 0.0144647 0.111043 0.0488327 0.038059 0.0204846 0.0607516 0.041741 -0.00973675 -0.00536161 -0.111702 
0.0847572 -0.0140156 -0.0867741 0.0361385 0.0974512 0.182361 0.0943893 -0.0167476 -0.00713109 -0.104642 0.00932084 0.0921294 0.0640581 -0.218669 -0.118119 0.0186974 -0.100931 0.116862 -0.152834 0.0892557 0.227006 -0.0562705 0.00888676 0.162991 -0.0338444 -0.107138 -0.0837049 -0.285179 -0.0181965 0.140757 -0.014893 0.0654196 -0.0709347 0.115171 0.0644543 -0.0408823 -0.0140324 -0.0283824 -0.0585461 -0.0951212 0.0688784 -0.0985219 0.0412046 0.119884 -0.0716582 -0.0373437 0.155405 0.00735823 -0.160506 0.0382814 0.0317557 -0.16735 0.0136833 -0.00251985 0.0890512 0.0496952 -0.00634359 0.078282 -0.0234405 -0.0900252 0.0168609 0.033831 0.146627 -0.111097 0.0886218 -0.147139 -0.0504382 -0.0595581 -0.0783192 0.0287915 -0.0816667 -0.000387771 -0.0891178 -0.0881099 -0.0724729 0.0368776 -0.00508908 0.0978834 -0.010961 0.0634927 -0.030356 0.0490008 -0.0676413 -0.0276466 -0.0936134 0.121073 0.0593029 -0.0352675 -0.0920352 0.0882874 0.116631 -0.153598 -0.140412 -0.0376056 -0.0941412 0.0554864 -0.0651662 0.0542338 0.0301252 0.0289061 0.107792 -0.0173031 -0.0498186 0.10357 0.0019985 -0.0383314 -0.0659112 0.144177 -0.136756 0.0110931 -0.0348214 0.0356869 -0.0627221 -0.0921407 0.0234733 0.108011 -0.112242 -0.0606655 -0.0198358 0.123705 0.0248125 0.0254109 -0.015324 0.0570897 -0.0419717 0.0448185 -0.0606861 -0.093101 
0.0692133 -0.0198885 -0.115926 0.0212664 0.0974958 0.171852 0.068631 -0.0212031 -0.0342313 -0.0791572 0.0187477 0.11011 0.078208 -0.193685 -0.153491 0.0346735 -0.0962385 0.121273 -0.133848 0.107845 0.233604 -0.0815168 0.00924078 0.175201 -0.0319675 -0.0631294 -0.0574683 -0.27507 0.00319127 0.145575 -0.0439338 0.0592495 -0.0760924 0.0901692 0.0291964 -0.0314842 -0.0598052 -0.0265197 -0.0551153 -0.0855901 0.0472354 -0.0921416 0.0390357 0.13831 -0.0665978 -0.0431378 0.180422 0.00268515 -0.170671 0.0247192 0.0392185 -0.153884 -0.00504259 -0.00838591 0.0991248 0.0506634 -0.00215804 0.105337 -0.00654171 -0.102826 0.0274249 0.0356073 0.185368 -0.0769931 0.0760981 -0.144685 -0.0644565 -0.0385732 -0.0582267 0.0275605 -0.077479 0.0202729 -0.0835465 -0.0866932 -0.0612376 0.0412292 -0.00576041 0.111624 -0.0144998 0.0482842 -0.0348914 0.0614695 -0.0601126 -0.030029 -0.117471 0.12276 0.0685332 -0.0167808 -0.0616956 0.0592818 0.0935991 -0.137528 -0.141368 -0.0215556 -0.0765835 0.049665 -0.062802 0.0717189 0.0388378 0.00562466 0.0996791 -0.0224244 -0.0447678 0.113367 -0.0213324 -0.0147834 -0.0910496 0.147339 -0.136889 -0.0168444 -0.0249032 0.0593791 -0.053381 -0.0863278 0.0216658 0.10962 -0.121598 -0.0678854 -0.0139088 0.116726 0.00324924 0.0131994 -0.0065458 0.0264897 -0.0903356 0.0770416 -0.0863621 -0.0829807 
0.0394856 0.00661784 -0.118506 -0.0149791 0.0770145 0.170954 0.00342277 -0.00901946 -0.0785327 -0.0329604 0.0331796 0.100324 0.0958828 -0.171037 -0.141194 0.0422261 -0.0995382 0.0976214 -0.102392 0.112939 0.22253 -0.092014 0.0361144 0.188637 -0.00741123 -0.00784708 0.000997515 -0.261622 0.0413284 0.121061 -0.0283547 0.0077651 -0.0643828 0.0575501 -0.0119301 -0.0132101 -0.115095 -0.0058759 -0.0547449 -0.0423911 0.0145387 -0.103151 0.00535831 0.193617 -0.0684309 -0.0444459 0.206766 0.0108633 -0.191924 0.00622136 0.0639722 -0.118891 -0.0329148 -0.0368586 0.0833218 0.0530973 -0.00756658 0.139289 0.0376702 -0.142827 0.0064411 0.0095419 0.215859 -0.0293632 0.0656299 -0.156041 -0.0599875 -0.00983079 -0.0355159 0.0410907 -0.0731086 0.0430395 -0.0805414 -0.10413 -0.0208444 0.0134643 -0.0445009 0.13803 -0.00610785 0.0903736 -0.0435043 0.0441084 -0.0342745 -0.0326058 -0.132979 0.0861138 0.0845629 -0.00211424 -0.01955 0.0202669 0.0374456 -0.110963 -0.139859 -0.00617138 -0.0694532 0.021657 -0.049465 0.101636 0.0288628 -0.0366576 0.0693137 -0.00907988 -0.0365061 0.115222 -0.0618834 0.0075594 -0.126104 0.147351 -0.0903436 -0.073518 0.00182271 0.103966 -0.0664041 -0.0687371 0.0251885 0.110099 -0.149947 -0.0866226 -0.00178179 0.124622 -0.00618205 -0.0138308 -0.0140633 0.000687266 -0.11339 0.0945497 -0.0876053 -0.0445126 
0.0196794 0.0202945 -0.11585 -0.0231626 0.0576469 0.161157 -0.0302105 -0.0199676 -0.0813306 -0.0247658 0.0393782 0.0903256 0.0991719 -0.152543 -0.142476 0.0532916 -0.100752 0.0865992 -0.0803395 0.116575 0.2235 -0.0959144 0.031287 0.194678 0.000898184 0.0257331 0.0178484 -0.251717 0.0536324 0.124328 -0.0182034 0.00384854 -0.0523111 0.0496258 -0.0193766 0.00628733 -0.113146 0.00543064 -0.0404052 -0.0355117 -0.00242917 -0.107429 0.0129598 0.196053 -0.0431564 -0.0518676 0.227154 0.0105291 -0.195071 -0.00399145 0.0601394 -0.111339 -0.0264285 -0.0325717 0.0933309 0.0626394 -0.0111663 0.139301 0.0456963 -0.170168 0.00358077 0.000893712 0.224937 -0.0201639 0.0557427 -0.135201 -0.0491299 -0.0104836 -0.0245215 0.0370103 -0.0807664 0.0383279 -0.0890488 -0.103763 0.000183816 -0.00377013 -0.0474185 0.146557 -0.00230315 0.0958851 -0.0374172 0.0586723 -0.0308067 -0.0357152 -0.132409 0.0773131 0.0766669 0.00397944 0.00577991 0.0139261 0.0275342 -0.100296 -0.128961 0.00613377 -0.0638852 0.023811 -0.0494526 0.120848 0.0327668 -0.0498698 0.0587535 -0.01278 -0.0406544 0.112508 -0.0727342 0.0270426 -0.131574 0.132153 -0.0840378 -0.0837765 -0.0017657 0.11389 -0.0764231 -0.0668267 0.0264369 0.106962 -0.145737 -0.10548 -0.00136277 0.113411 0.000224047 -0.0153304 -0.00066397 -0.0128394 -0.133779 0.1054 -0.0783357 -0.030614 
0.0436117 0.000901095 -0.11973 -0.00610478 0.0765308 0.16426 -0.00993788 -0.0225173 -0.0653759 -0.0494365 0.0249611 0.100529 0.090595 -0.1718 -0.15192 0.0577761 -0.0918875 0.105284 -0.111172 0.123251 0.227003 -0.0824178 0.0485521 0.197728 -0.0175118 -0.0108232 0.00320477 -0.267367 0.0259248 0.126807 -0.0278288 0.020086 -0.0584855 0.0651843 -0.00332741 -0.00931008 -0.0963115 0.00485439 -0.0568876 -0.0469146 -0.000760401 -0.0917453 0.014959 0.181161 -0.0564593 -0.0482095 0.214408 0.0130311 -0.181305 0.0301711 0.0680608 -0.131591 -0.0202035 -0.0248365 0.094241 0.0470517 0.0125937 0.123302 0.0459142 -0.155845 0.0108238 0.013764 0.206468 -0.0403009 0.0590318 -0.165065 -0.0586881 -0.0105374 -0.036063 0.0424766 -0.0782221 0.033125 -0.0826564 -0.0994562 -0.030413 0.00721026 -0.0376388 0.138299 -0.00828417 0.0843333 -0.0264496 0.0607178 -0.0476867 -0.0416152 -0.125784 0.0912963 0.0659314 -0.000492526 -0.0211504 0.0273268 0.0418326 -0.109524 -0.139066 -0.00816297 -0.0596066 0.041795 -0.057006 0.114399 0.0248477 -0.0357693 0.0767194 -0.0182826 -0.0435458 0.120518 -0.0519409 -0.00455442 -0.127689 0.128618 -0.0951268 -0.0575338 -0.010166 0.110256 -0.0565546 -0.0622795 0.0146068 0.112145 -0.141159 -0.0931059 -0.0167229 0.116978 -0.00394216 0.00820272 0.00305608 -0.00316542 -0.121293 0.0845787 -0.0857437 -0.0531594 
0.0349034 0.020935 -0.11471 -0.0122227 0.0720115 0.168595 -0.00574509 -0.0250611 -0.059329 -0.0343966 0.0384425 0.10587 0.0867657 -0.181204 -0.150803 0.0593431 -0.099434 0.0891237 -0.109925 0.111326 0.221974 -0.0776526 0.0217372 0.18952 -0.011267 0.00716525 0.0113002 -0.255243 0.0389497 0.131318 -0.0239258 0.0116226 -0.0551561 0.0635556 -0.00420915 -0.00802991 -0.0958712 -0.00256076 -0.045147 -0.0404179 0.00735044 -0.107338 0.0217493 0.187217 -0.0454504 -0.0451285 0.215051 0.0110026 -0.192955 0.00783031 0.0723316 -0.115129 -0.0328884 -0.0311742 0.0992581 0.0562267 -0.0196969 0.132034 0.0235447 -0.144425 -0.000940586 -0.00895419 0.220869 -0.035461 0.0693609 -0.161263 -0.0615534 -0.0101539 -0.0425634 0.0428785 -0.0741021 0.0326505 -0.0892491 -0.106296 -0.0148629 0.0150318 -0.036292 0.14936 -0.0135388 0.0892939 -0.027951 0.0575354 -0.0310125 -0.0258977 -0.13637 0.0813884 0.0779927 0.000144111 -0.0159206 0.0357422 0.0287076 -0.120653 -0.14476 0.0101374 -0.0688591 0.0378477 -0.049627 0.0915608 0.0338591 -0.0378875 0.0700078 -0.012434 -0.0528634 0.114532 -0.0592752 0.00827819 -0.126071 0.136054 -0.0979111 -0.0699385 -0.00245874 0.10277 -0.0686841 -0.0577086 0.0296085 0.10682 -0.153246 -0.0845454 -0.00980081 0.122288 0.00613336 -0.00212836 0.00422918 -0.00262464 -0.102078 0.100113 -0.0746319 -0.0539814 
