0.029882 -0.0520036 -0.103099 -0.0421568 0.146157 0.0707427 -0.0461363 -0.0869669 -0.00527629 -0.0547698 -0.023258 0.0730951 0.111638 -0.0368605 -0.0936555 0.0458269 -0.082699 0.0790918 -0.130246 0.18833 0.210367 -0.110534 0.12027 0.0947688 0.00609916 0.0321348 -0.0831022 -0.238897 -0.0116092 0.0847861 0.0514061 0.0493077 -0.0631835 0.0199384 0.0414045 0.0569947 -0.110718 0.18636 -0.0212357 -0.1068 -0.0434953 0.0374255 -0.063456 0.140501 -0.0741467 -0.0239808 0.124082 0.0802511 -0.0426824 0.0411403 -0.038461 -0.0938934 -0.0259692 -0.0271976 0.115953 -0.0418553 0.0118109 0.148565 0.00758217 -0.198588 0.0215764 -0.0190016 0.198194 0.00929986 0.0612001 -0.147973 -0.0451689 0.159839 0.0355245 0.0491881 0.0454159 0.113442 -0.0269567 -0.0969918 -0.0985346 -0.0133229 -0.101185 0.0642015 0.0406706 0.105183 -0.0200205 0.103968 -0.0730792 -0.0555687 -0.102254 -0.0499579 0.0742192 0.126966 0.0732583 -0.0576557 0.0499749 -0.0561458 -0.023343 -0.0267257 -0.0506755 -0.0602214 -0.0519574 0.112992 -0.00798176 -0.0771591 0.0557389 -0.0427261 -0.0628577 0.0717406 -0.0783933 0.0149822 -0.147145 0.067727 0.089323 -0.00338227 -0.00568659 0.150943 -0.144284 0.0520948 0.0604848 0.123719 -0.162511 -0.109747 -0.0748373 0.0964773 -0.0409813 0.124643 0.00361902 0.0512032 -0.144052 0.0208373 -0.0693561 -0.0191586 
0.0238459 -0.0344572 -0.100441 -0.0426053 0.117973 0.0651134 -0.0584645 -0.0721769 -0.00750219 -0.0367004 0.00367434 0.0739228 0.117964 -0.053642 -0.110884 0.054081 -0.0919319 0.0780709 -0.136336 0.2014 0.211742 -0.121127 0.12411 0.0930793 -0.0103758 0.0435479 -0.0667785 -0.237135 0.00583808 0.0756285 0.033009 0.0438522 -0.0481215 0.0217174 0.0205317 0.0505878 -0.121902 0.207851 -0.0278415 -0.0894247 -0.060648 0.0132807 -0.0850274 0.144134 -0.0747728 -0.0313392 0.126367 0.0680701 -0.0648777 0.0513384 -0.0314527 -0.0638017 -0.0529585 -0.0171609 0.107896 -0.0440942 0.0210105 0.124838 0.00553536 -0.194335 0.0148764 -0.0425022 0.212723 0.0186894 0.0605879 -0.163622 -0.0435018 0.15324 0.0361249 0.0615461 0.040246 0.100848 -0.0323132 -0.078031 -0.080588 -0.028191 -0.0983307 0.0832311 0.0313614 0.10899 -0.0354468 0.0887162 -0.0658651 -0.0528149 -0.110532 -0.0337575 0.0748201 0.125331 0.0874326 -0.0592211 0.0374216 -0.0668147 -0.0314628 -0.0119867 -0.0466186 -0.0736363 -0.0524242 0.114177 -0.00477705 -0.0849774 0.0567532 -0.0376586 -0.0702766 0.0805882 -0.0575679 0.018718 -0.132638 0.0794301 0.104485 -0.0304232 -0.0263492 0.165397 -0.134474 0.0527124 0.0705942 0.118216 -0.155263 -0.117604 -0.0545136 0.102945 -0.0472265 0.115496 0.00571096 0.0518735 -0.132144 0.0313635 -0.0483602 -0.00643226 
0.0362765 -0.0654095 -0.116001 -0.0440713 0.155308 0.0555529 -0.037888 -0.0887052 -0.0016314 -0.0666514 -0.0333256 0.071066 0.115891 -0.0022975 -0.0940605 0.0262312 -0.0700549 0.0566924 -0.131156 0.206484 0.184198 -0.122309 0.122205 0.0789009 0.00595973 0.0246255 -0.0833388 -0.209522 -0.0274328 0.0689589 0.0496065 0.0444847 -0.0680135 0.0105075 0.0264981 0.0688159 -0.114991 0.199726 -0.0426631 -0.11657 -0.0398895 0.0598604 -0.0696641 0.130648 -0.0808738 -0.0118188 0.105164 0.0911781 -0.0149219 0.0485062 -0.0597968 -0.0921422 -0.0210882 -0.0271231 0.123045 -0.0540584 -0.0105109 0.162353 0.0169772 -0.196957 0.0186367 -0.0036303 0.193687 0.0106193 0.0543747 -0.128813 -0.0379025 0.177044 0.0382313 0.0346217 0.0621457 0.118677 -0.00318239 -0.0917316 -0.0989001 0.00713673 -0.0917894 0.0435884 0.0462488 0.0946724 -0.0168018 0.0920976 -0.0792056 -0.0605277 -0.0940497 -0.0617502 0.0719125 0.142613 0.0797577 -0.0667566 0.0566327 -0.0555645 0.000730345 -0.0336582 -0.0455827 -0.072774 -0.0388276 0.0960073 -0.00181592 -0.0828587 0.0454245 -0.0399521 -0.0533785 0.0620157 -0.103608 0.0238429 -0.159273 0.0622421 0.0870579 0.00320713 0.0151325 0.155089 -0.141838 0.0716861 0.045542 0.119898 -0.163246 -0.0939583 -0.0806635 0.089532 -0.063456 0.127973 -0.00252331 0.0575994 -0.145236 0.016016 -0.0849804 -0.0270161 
0.0293687 -0.0444062 -0.115737 -0.0479582 0.143621 0.0609078 -0.0418685 -0.0855812 0.00256965 -0.0664177 -0.0253937 0.0671019 0.107497 -0.0330906 -0.0973915 0.0295331 -0.0824086 0.0559651 -0.131374 0.199305 0.186725 -0.114332 0.120056 0.0669226 0.00373529 0.0351884 -0.0747454 -0.223701 -0.0181307 0.0634418 0.0543814 0.0383758 -0.0593551 0.0138127 0.0402187 0.0574534 -0.107161 0.207984 -0.0336508 -0.11275 -0.036061 0.0422714 -0.0693771 0.151488 -0.087187 -0.00377675 0.115156 0.0835151 -0.0392646 0.0482281 -0.0600515 -0.0796022 -0.0299428 -0.0260216 0.117354 -0.0550062 -0.00748159 0.150171 0.00756522 -0.201893 0.0116485 -0.0251678 0.20783 0.0121987 0.0648916 -0.146362 -0.0378908 0.167446 0.040496 0.0450218 0.0580122 0.107712 -0.0119477 -0.0860517 -0.0909653 -0.0101769 -0.107597 0.0584894 0.0398145 0.105075 -0.0286135 0.095349 -0.0737344 -0.0542495 -0.0992655 -0.0629008 0.0736937 0.135737 0.0808973 -0.0613216 0.0557724 -0.0629966 -0.0176709 -0.0396174 -0.0431767 -0.0781198 -0.0328847 0.102976 -0.00949745 -0.0911886 0.0371748 -0.0333643 -0.0540629 0.0648101 -0.0974894 0.0164713 -0.143804 0.0803214 0.0967265 -0.0043472 0.0153136 0.152994 -0.149973 0.0676824 0.0559606 0.111076 -0.167626 -0.113752 -0.0630306 0.0920017 -0.0486732 0.131454 0.00247227 0.0639893 -0.127883 0.00516997 -0.0610034 -0.0215927 
0.0356403 -0.0445 -0.114182 -0.0343113 0.128445 0.0421676 -0.0550823 -0.0794374 0.00639266 -0.0546437 -0.0117012 0.091023 0.0990706 -0.0477583 -0.12436 0.0447415 -0.0662091 0.0743739 -0.137212 0.198694 0.194321 -0.100682 0.12301 0.0798848 -0.0115953 0.0531135 -0.0475509 -0.230122 -0.0220841 0.0754425 0.023621 0.0559473 -0.0403333 0.0196996 0.0176052 0.0333757 -0.114003 0.223671 -0.0396924 -0.090481 -0.0618661 0.0438685 -0.0883048 0.149333 -0.0797671 -0.00823878 0.115101 0.0520091 -0.0417628 0.0551247 -0.0149025 -0.0540667 -0.0445176 -0.0183247 0.116353 -0.0577626 0.0242734 0.122527 0.0154869 -0.189044 0.0226981 -0.0578009 0.198808 0.0266083 0.0596491 -0.195155 -0.0389844 0.16804 0.0490419 0.0664753 0.0565677 0.0925835 -0.0159916 -0.0812065 -0.100554 -0.0151122 -0.104416 0.0730875 0.0109997 0.100878 -0.0398634 0.109376 -0.0678594 -0.0574143 -0.0993831 -0.0622863 0.0783478 0.124764 0.0783357 -0.0665043 0.0180391 -0.0657128 -0.0373678 -0.0236468 -0.0307285 -0.0646599 -0.0311764 0.0911056 -0.00195435 -0.0924714 0.0431446 -0.0285999 -0.0600482 0.0949912 -0.0772057 -0.0150586 -0.144266 0.0679011 0.0951213 -0.0241211 -0.000412344 0.165763 -0.139032 0.0660911 0.0594252 0.106451 -0.162276 -0.138819 -0.0572164 0.0885616 -0.052385 0.152922 0.00889864 0.0473401 -0.0988307 0.00965038 -0.0441679 -0.0256538 
0.024726 -0.0418538 -0.105378 -0.0410411 0.113919 0.0497996 -0.0658508 -0.0784753 0.00122566 -0.0568777 0.00145223 0.085932 0.107302 -0.0531723 -0.134936 0.0460259 -0.090127 0.0800936 -0.139559 0.203262 0.206778 -0.114776 0.129822 0.0851158 -0.0182436 0.0536509 -0.0447319 -0.229224 -0.00761055 0.0708807 0.0198514 0.0385828 -0.0366334 0.0210199 0.0184174 0.0370939 -0.121586 0.225639 -0.0369622 -0.0896883 -0.066957 0.0236564 -0.0902659 0.1472 -0.0774426 -0.0270289 0.12215 0.0558783 -0.0565433 0.0612216 -0.0338436 -0.0574047 -0.0474129 -0.00824369 0.109824 -0.0511391 0.0288236 0.123492 -0.0012623 -0.193897 0.0213541 -0.0483343 0.221147 0.0318643 0.0606477 -0.175347 -0.0451031 0.153362 0.040449 0.0682183 0.0401185 0.0832031 -0.0233467 -0.0705584 -0.0845224 -0.0294895 -0.0978372 0.0689868 0.019677 0.10083 -0.0422416 0.0955435 -0.0675356 -0.0585272 -0.111712 -0.0453581 0.0736398 0.128715 0.086065 -0.0598736 0.0363759 -0.0716884 -0.0279024 -0.0163874 -0.0331562 -0.0728746 -0.0487454 0.10898 0.00441529 -0.0869395 0.0488698 -0.0330975 -0.0693872 0.0879682 -0.0512622 0.00632412 -0.128653 0.0765571 0.0962369 -0.0370292 -0.0154501 0.167417 -0.129279 0.0648722 0.0650736 0.115498 -0.15078 -0.122417 -0.0430335 0.0972613 -0.0548024 0.12758 0.00275838 0.0395031 -0.117951 0.0281571 -0.0428839 -0.0137964 
0.0250423 -0.0348364 -0.0679744 -0.0322381 0.121364 0.0673047 -0.0176975 -0.0646025 -0.0157321 -0.0193668 0.0168073 0.0679259 0.116776 -0.0354115 -0.0612027 0.0170262 -0.0623928 0.0881316 -0.103876 0.185999 0.20227 -0.120644 0.117469 0.0904963 0.00126928 0.0506822 -0.0984919 -0.239064 0.0448994 0.0608257 0.0676175 0.0556542 -0.0420404 0.0206842 0.0406716 0.0539354 -0.102656 0.243876 -0.00230067 -0.0990664 -0.0276621 0.0316125 -0.109558 0.123338 -0.116357 -0.0413985 0.108657 0.0516926 -0.0497527 0.00896788 -0.0611557 -0.0198771 -0.0518476 -0.0168275 0.102389 -0.0343061 0.0283611 0.14491 -0.0244681 -0.174444 -0.0226573 -0.0582995 0.211836 -0.0214872 0.0881742 -0.128419 -0.0200409 0.132228 0.0177531 0.0822288 0.0510781 0.115295 -0.0491422 -0.0406876 -0.0742211 -0.0524126 -0.104846 0.0860844 0.050178 0.091368 -0.0925014 0.0947673 -0.0413438 -0.0538826 -0.0695045 -0.0780081 0.0933997 0.13485 0.084525 -0.0764984 0.0684047 -0.0571722 0.00326587 -0.0285661 -0.0283459 -0.130587 -0.0292229 0.12733 -0.00911965 -0.0704566 0.0294383 -0.0142621 -0.057863 0.0897556 -0.0566662 0.0382223 -0.0829836 0.0610947 0.174538 -0.0437005 -0.0472642 0.153482 -0.156081 0.0470615 0.114721 0.102342 -0.123311 -0.165547 -0.030463 0.124971 -0.0273134 0.0996476 -0.0249437 0.0670048 -0.129935 0.0317255 -0.0149567 0.0255439 
0.0251276 -0.0466417 -0.113146 -0.0369813 0.113017 0.036962 -0.0667149 -0.0816464 -0.00479503 -0.0599206 0.00155205 0.0866113 0.109624 -0.0320241 -0.139244 0.0484009 -0.0776721 0.0709475 -0.12665 0.213362 0.20482 -0.125741 0.131606 0.0779527 -0.0150523 0.0608143 -0.0415129 -0.219408 -0.00750757 0.0723514 0.0130328 0.040086 -0.0322967 0.0137422 0.00815609 0.0410884 -0.120705 0.240249 -0.0352844 -0.0931446 -0.0724743 0.0363282 -0.0817135 0.137781 -0.0744283 -0.0228522 0.126194 0.0456722 -0.0521631 0.0574381 -0.0415365 -0.0564922 -0.046507 -0.000114484 0.118045 -0.0532557 0.0276596 0.1286 0.00103002 -0.193365 0.0220474 -0.0480062 0.223622 0.0239689 0.0638906 -0.161255 -0.0463423 0.156869 0.0432298 0.0605072 0.0443757 0.0856874 -0.0215061 -0.0644746 -0.0788107 -0.0252695 -0.0878664 0.0666887 0.0200579 0.090426 -0.051068 0.0940137 -0.0673869 -0.0624262 -0.112637 -0.0465005 0.0684399 0.133154 0.0931739 -0.0708141 0.0337805 -0.0712406 -0.0195952 -0.0168731 -0.0211012 -0.0785697 -0.0411919 0.114619 0.00877904 -0.0870975 0.0358354 -0.0348684 -0.0636076 0.0922479 -0.062948 0.0160955 -0.127616 0.0741969 0.0977968 -0.0460106 -0.0190316 0.164711 -0.127538 0.0701679 0.0675546 0.110142 -0.144946 -0.125675 -0.0431138 0.0929342 -0.0670661 0.131498 0.00566057 0.0380774 -0.123222 0.0322495 -0.0447949 -0.0110706 
0.0289146 -0.0356462 -0.0954546 -0.0419445 0.11651 0.0423712 -0.0384605 -0.0573375 0.00156 -0.0386561 0.00918117 0.0896961 0.119817 -0.0568732 -0.127331 0.0320063 -0.0703093 0.0863242 -0.159993 0.211669 0.197335 -0.12311 0.12445 0.0862497 -0.0295458 0.0454247 -0.0630322 -0.213618 0.00844111 0.0591537 0.0201705 0.0532505 -0.0362325 0.0294978 -0.00171102 0.0224346 -0.118055 0.252002 -0.0428867 -0.0831215 -0.0478581 0.0269251 -0.0972745 0.132348 -0.0952112 -0.0477686 0.10596 0.052755 -0.0452179 0.0594901 -0.0310571 -0.0380107 -0.0688288 -0.00476469 0.100797 -0.055013 0.0277428 0.117111 -0.00377751 -0.18859 0.00371906 -0.059416 0.207843 0.0250245 0.0527623 -0.17007 -0.0337372 0.148408 0.0275398 0.0586627 0.0487576 0.0842497 -0.0182607 -0.0392093 -0.0770499 -0.0302588 -0.0954037 0.0732088 0.0239392 0.0897304 -0.0669221 0.0931705 -0.0490741 -0.0483763 -0.0931657 -0.0457016 0.0874199 0.13827 0.0974761 -0.0704105 0.0309464 -0.0807608 -0.0168728 -0.0240582 -0.0319954 -0.0986063 -0.0419265 0.101666 -0.00540072 -0.0873959 0.0412846 -0.0246187 -0.0601269 0.120741 -0.0487603 0.00564827 -0.125831 0.085621 0.124125 -0.0493152 -0.0252899 0.175878 -0.141073 0.0800755 0.0682208 0.09945 -0.141849 -0.134251 -0.0342905 0.107683 -0.0571503 0.132261 -0.0113443 0.050827 -0.114594 0.0166666 -0.0482867 -0.00851015 
0.0220662 -0.0373432 -0.108416 -0.0379761 0.118294 0.0562706 -0.0670752 -0.0794804 -0.00830109 -0.0483844 0.000193186 0.0889121 0.113177 -0.0610939 -0.143078 0.0508317 -0.0839364 0.0933716 -0.142631 0.207022 0.211761 -0.117782 0.12251 0.10024 -0.020076 0.0436032 -0.0515594 -0.228781 -0.00155292 0.0787317 0.0144395 0.0368236 -0.046286 0.0171892 0.0169208 0.0377278 -0.127547 0.204372 -0.0383913 -0.0897979 -0.0676016 0.022258 -0.0797952 0.147619 -0.0709549 -0.029755 0.132691 0.0624982 -0.0653946 0.0579942 -0.0244689 -0.0662904 -0.0495138 -0.0153726 0.105633 -0.0476265 0.0255032 0.123099 0.00942509 -0.195192 0.026521 -0.0340259 0.217423 0.0277707 0.0586424 -0.178965 -0.048671 0.1448 0.0317773 0.0569844 0.0384166 0.0849827 -0.0224999 -0.0772146 -0.0882276 -0.0217911 -0.094173 0.0803477 0.0243248 0.0963081 -0.0367962 0.0964499 -0.0692088 -0.0548003 -0.113468 -0.0299412 0.0690074 0.123508 0.0829204 -0.0584088 0.0295025 -0.0670878 -0.0314253 -0.0115653 -0.036406 -0.0666873 -0.0520323 0.111385 -0.00294326 -0.0857128 0.056567 -0.033224 -0.0697512 0.092686 -0.0517103 0.0122897 -0.130537 0.0804053 0.0857274 -0.0288318 -0.015864 0.160163 -0.12106 0.0622868 0.0523117 0.115172 -0.15985 -0.11395 -0.0540177 0.0943436 -0.0649472 0.118654 0.000925789 0.0324293 -0.130329 0.0378339 -0.0624908 -0.0230719 
0.0415872 -0.0226502 -0.0836729 -0.0324229 0.142486 0.0808334 0.0022159 -0.0774206 -0.0380785 -0.0140464 0.01667 0.0651266 0.113579 -0.0122175 -0.0394604 0.0164038 -0.0220445 0.0974846 -0.0804015 0.178387 0.184535 -0.0961294 0.117126 0.0806789 0.00323405 0.0554892 -0.104643 -0.232603 0.0684714 0.0663867 0.0687471 0.0749338 -0.0463456 0.0123807 0.0517895 0.0580548 -0.0776097 0.240062 0.0137656 -0.0997147 -0.0186496 0.061936 -0.0989039 0.117442 -0.14579 -0.0207929 0.118573 0.0494816 -0.0495153 -0.00805812 -0.0631886 -0.0157024 -0.0553623 -0.0166393 0.0939753 -0.032536 0.0318043 0.16784 -0.02604 -0.157597 -0.0411374 -0.0503664 0.215842 -0.0594297 0.101848 -0.116653 -0.0121973 0.122086 0.0115777 0.0862178 0.0634168 0.130503 -0.0469937 -0.0277087 -0.0766925 -0.0511068 -0.103419 0.0927358 0.0487831 0.0541183 -0.0860653 0.120012 -0.0416603 -0.0544399 -0.0437509 -0.0884982 0.0832023 0.124909 0.066316 -0.0761701 0.0845402 -0.0513776 -0.00337021 -0.0403469 -0.000226984 -0.145585 -0.00903579 0.143468 -0.015668 -0.0609196 0.00756201 -0.00449548 -0.0392058 0.101475 -0.0894863 0.0489574 -0.0704575 0.0508375 0.184272 -0.0318611 -0.0374931 0.14292 -0.149451 0.0561732 0.110501 0.0807721 -0.11781 -0.189521 -0.0395084 0.117182 -0.0206692 0.0939456 -0.0155373 0.0722999 -0.130577 0.026269 -0.0241558 0.018533 
0.0243927 -0.0217511 -0.0734051 -0.029086 0.103597 0.0495148 -0.0249022 -0.0667949 -0.0208197 -0.00291882 0.0230206 0.0644329 0.120932 -0.0347416 -0.0762877 0.0283221 -0.0519497 0.090662 -0.0957264 0.190509 0.199732 -0.12454 0.114204 0.0881342 -0.00571208 0.0695922 -0.0857833 -0.234035 0.0536989 0.0720699 0.0481963 0.0684484 -0.0327746 0.01663 0.035991 0.0390164 -0.0967528 0.26314 0.00601343 -0.0969891 -0.0492649 0.0230903 -0.105141 0.120699 -0.105642 -0.0380995 0.114867 0.0454084 -0.0518378 0.00698167 -0.040389 0.00138753 -0.0559315 -0.00951194 0.104687 -0.0398873 0.0456235 0.124211 -0.0138741 -0.179372 -0.0151459 -0.0814457 0.210187 -0.0109821 0.0810134 -0.139094 -0.0218378 0.127843 0.0249251 0.0774066 0.0418024 0.102853 -0.0553756 -0.0339041 -0.06989 -0.0616824 -0.0973741 0.0972715 0.0456939 0.0936306 -0.0910397 0.0927201 -0.0394931 -0.0515066 -0.0621052 -0.0837444 0.0853812 0.133531 0.10175 -0.081494 0.0443119 -0.0522376 0.00344314 -0.023885 -0.0257831 -0.132838 -0.0199883 0.134667 -0.000358891 -0.0816611 0.03382 -0.00289515 -0.0557007 0.108287 -0.0494075 0.0247226 -0.0787512 0.0652094 0.184503 -0.0515407 -0.0563637 0.157208 -0.157915 0.0486011 0.111491 0.0987803 -0.116796 -0.174914 -0.0314062 0.115764 -0.0329188 0.104748 -0.0141763 0.057165 -0.12512 0.0308142 -0.00821517 0.0264954 
0.0238335 -0.0340042 -0.082082 -0.0356589 0.101215 0.0409727 -0.0350803 -0.0549352 -0.00250342 -0.0268711 0.00265232 0.0803466 0.108562 -0.0686191 -0.0991236 0.0172682 -0.0855673 0.065105 -0.12674 0.208242 0.183776 -0.120409 0.115392 0.0825308 -0.0213474 0.0656492 -0.0708878 -0.238071 0.00634141 0.0515361 0.0284695 0.0461692 -0.0401304 0.0270774 0.0194771 0.0296488 -0.109992 0.259161 -0.0360473 -0.0894472 -0.0419528 0.011304 -0.112579 0.139749 -0.0983974 -0.025038 0.107888 0.0510617 -0.0504679 0.0496223 -0.0335588 -0.0249995 -0.0599584 -0.00814834 0.118316 -0.0574277 0.02462 0.112816 -0.00421035 -0.187185 0.00757427 -0.0746801 0.205325 0.0239299 0.0716429 -0.179291 -0.022753 0.140724 0.0386723 0.0664524 0.0432243 0.0935775 -0.0262938 -0.0337189 -0.0765572 -0.042537 -0.108757 0.087087 0.0403383 0.111829 -0.0749805 0.08601 -0.0490591 -0.0513479 -0.0826732 -0.0789533 0.0954033 0.141347 0.103572 -0.0720084 0.0323797 -0.0634309 -0.00622491 -0.0281713 -0.0490793 -0.108064 -0.0162488 0.09297 0.00469819 -0.0957415 0.0381213 -0.0107959 -0.0631903 0.0957775 -0.0558344 -0.00128446 -0.111944 0.0809994 0.137098 -0.0360739 -0.0176541 0.17546 -0.15226 0.0521957 0.081969 0.101872 -0.137689 -0.159529 -0.0387781 0.103514 -0.04527 0.132331 -0.00597186 0.0618388 -0.10137 0.0154084 -0.0201675 4.8179e-05 
0.0320921 -0.0265881 -0.0745822 -0.0302844 0.10235 0.0457136 -0.0243071 -0.0573888 -0.0185772 -0.00488305 0.0170772 0.0743704 0.117427 -0.0512831 -0.0906193 0.0239448 -0.0526313 0.0896073 -0.112428 0.1964 0.191889 -0.123723 0.112825 0.0958567 -0.0143925 0.069516 -0.0758882 -0.230114 0.040252 0.0629005 0.0347653 0.0667463 -0.0403746 0.0261817 0.0181793 0.0224534 -0.103115 0.265941 -0.00529303 -0.0888859 -0.0456609 0.0198043 -0.107127 0.12415 -0.103028 -0.0485219 0.108957 0.0440915 -0.0462596 0.0256742 -0.0215455 -0.00165687 -0.0647629 -0.00561547 0.106785 -0.0500973 0.0468874 0.119807 -0.00421882 -0.18467 -0.00423662 -0.0826373 0.203718 0.00172187 0.0676179 -0.156842 -0.02005 0.129521 0.0270848 0.0751702 0.0370518 0.100487 -0.0444933 -0.0197961 -0.0750162 -0.06179 -0.0949456 0.0977399 0.0427952 0.0963851 -0.0884222 0.0943998 -0.0331433 -0.0538749 -0.0621917 -0.0863879 0.0929842 0.13788 0.107744 -0.0830276 0.0328244 -0.0580095 0.00151139 -0.0261329 -0.0298377 -0.125857 -0.014664 0.11848 -0.00172714 -0.0869156 0.0336015 -0.00141294 -0.057253 0.12615 -0.0456412 0.00684718 -0.0931202 0.071189 0.17017 -0.0531911 -0.0430067 0.172546 -0.153949 0.0582026 0.10024 0.0933038 -0.120008 -0.173023 -0.0321091 0.109863 -0.0384439 0.119564 -0.0109378 0.0523827 -0.117487 0.0199917 -0.0180427 0.0149997 
0.041179 -0.0206771 -0.0763829 -0.0287165 0.110263 0.0538854 0.00219262 -0.0644647 -0.0215327 -0.00538357 0.022304 0.0607573 0.123983 -0.0387032 -0.0638372 0.0309635 -0.0499694 0.0772293 -0.114492 0.196224 0.18914 -0.12174 0.112584 0.0750491 -0.0157375 0.065537 -0.10201 -0.229235 0.0547529 0.0627985 0.0427103 0.0857244 -0.0465448 0.027346 0.0329077 0.0352919 -0.086577 0.280274 0.00628391 -0.101542 -0.039362 0.0252958 -0.102856 0.107393 -0.111796 -0.0358304 0.104322 0.0519153 -0.0542507 0.0135193 -0.0461046 -0.0016833 -0.0651235 -0.00238297 0.110059 -0.0536782 0.0324594 0.130182 -0.0235351 -0.173701 -0.0237882 -0.0779455 0.211602 -0.0251753 0.0851386 -0.11953 -0.0209196 0.134077 0.0141332 0.0621553 0.0439559 0.109996 -0.0458467 -0.0101985 -0.0699971 -0.0628623 -0.088312 0.0840578 0.0503698 0.0874174 -0.0766987 0.0848548 -0.0442195 -0.063717 -0.0608363 -0.0864426 0.0844851 0.133988 0.102822 -0.0728898 0.060996 -0.0635448 -0.00176346 -0.0254547 -0.0307142 -0.129316 -0.00690934 0.118774 0.000999892 -0.0747891 0.0292742 -0.00732086 -0.0572073 0.114342 -0.0605652 0.0277565 -0.0805642 0.0773875 0.19129 -0.0497216 -0.0483897 0.169665 -0.1581 0.0554567 0.12054 0.0897701 -0.119857 -0.165317 -0.0314557 0.114944 -0.0336895 0.110322 0.00175341 0.0756504 -0.111742 0.0202508 -0.00910306 0.00969187 
0.0402131 -0.0375799 -0.0978924 -0.0377133 0.119099 0.0471229 -0.0289688 -0.0594313 -0.00172889 -0.0508615 0.00883507 0.0891935 0.109186 -0.0617596 -0.110324 0.0161509 -0.0698112 0.0689323 -0.149724 0.208771 0.18182 -0.108895 0.114918 0.0796898 -0.0209034 0.0566614 -0.0561085 -0.221511 0.0028223 0.0520488 0.028743 0.0545061 -0.0430057 0.035837 0.00499703 0.0236261 -0.106196 0.251327 -0.0375212 -0.083481 -0.0239521 0.0257406 -0.101662 0.147161 -0.111922 -0.0318251 0.105746 0.0494702 -0.0432762 0.0526241 -0.0338765 -0.0351574 -0.0685969 -0.00397066 0.111355 -0.0603061 0.0136559 0.127721 -0.00327007 -0.185012 -0.00343375 -0.0671333 0.209928 0.0203029 0.0590413 -0.174084 -0.0205855 0.144351 0.0378516 0.0648006 0.0485784 0.0897201 -0.0119637 -0.0330541 -0.0741112 -0.0402862 -0.106081 0.0785382 0.0215971 0.0990284 -0.0675262 0.0982262 -0.0449242 -0.0573629 -0.0858894 -0.0650043 0.0975986 0.134614 0.0828572 -0.0716002 0.0431184 -0.0829771 -0.0215247 -0.0364607 -0.0397215 -0.106999 -0.0230725 0.0874073 -0.00143751 -0.0928518 0.0198112 -0.0154947 -0.0512582 0.122501 -0.0652317 -0.00127121 -0.126411 0.0968595 0.120789 -0.0460984 -0.00624002 0.176215 -0.153825 0.0786281 0.0689731 0.0879479 -0.145624 -0.154534 -0.0305634 0.102092 -0.043713 0.139471 -0.00910366 0.0646375 -0.0973036 -0.00058726 -0.0395849 -0.00870198 
0.0486464 -0.026112 -0.0864215 -0.0340493 0.132431 0.089543 -0.000469811 -0.0711251 -0.0473004 -0.0270828 0.0120999 0.0600203 0.119376 -0.0148444 -0.0575152 0.0126425 -0.0310492 0.084271 -0.0894327 0.183242 0.191299 -0.103156 0.112383 0.0718977 -0.00267293 0.0634738 -0.109557 -0.227826 0.0644194 0.0604312 0.0584131 0.0827739 -0.0626636 0.0162325 0.0390183 0.0500969 -0.0842089 0.246318 0.0167667 -0.0976967 -0.0153705 0.0565215 -0.0968171 0.110781 -0.133317 -0.0323648 0.122307 0.0462883 -0.0546557 -0.00530511 -0.0630812 -0.0150104 -0.0518662 -0.000344065 0.0935953 -0.0425597 0.0375952 0.16477 -0.0205073 -0.177882 -0.0295324 -0.0342679 0.220855 -0.0501548 0.086065 -0.103204 0.000257144 0.121368 0.02252 0.0729519 0.0530401 0.124342 -0.0355139 -0.0134469 -0.070922 -0.0584351 -0.102135 0.0745644 0.0502945 0.066304 -0.0793631 0.116587 -0.0360269 -0.0633381 -0.0445785 -0.0818661 0.0878851 0.130713 0.0726698 -0.0829614 0.0927279 -0.0576203 0.00212914 -0.0344442 -0.01193 -0.145276 0.00198605 0.146293 -0.0136676 -0.0580407 0.00696326 -0.000568727 -0.0393963 0.122264 -0.0917247 0.0508417 -0.0779763 0.0707993 0.168469 -0.0392785 -0.0303093 0.149309 -0.160581 0.0577031 0.104298 0.0806307 -0.125471 -0.181242 -0.033948 0.103436 -0.0321175 0.0922897 -0.00288777 0.0595745 -0.13226 0.0221843 -0.0338509 0.0166553 
0.0441295 -0.0246954 -0.0914792 -0.0381367 0.135129 0.0865054 -0.0109377 -0.0775972 -0.0374778 -0.0204032 0.0168582 0.0731252 0.127199 -0.021811 -0.0695504 0.0293885 -0.0369533 0.0974434 -0.112831 0.186118 0.201614 -0.109878 0.118133 0.0993344 -0.00400958 0.0487168 -0.0952341 -0.23096 0.053048 0.077598 0.0515691 0.0748107 -0.0559936 0.0226919 0.0292517 0.0476727 -0.0983611 0.233995 0.00341482 -0.0902564 -0.0325458 0.0457493 -0.0912184 0.120427 -0.120889 -0.0399258 0.1255 0.0534651 -0.0608554 0.00843627 -0.0398323 -0.0345676 -0.0568983 -0.0130833 0.0927489 -0.0317117 0.02758 0.169461 -0.0104358 -0.177485 -0.0256847 -0.038815 0.218283 -0.0426236 0.0822139 -0.117292 -0.0193223 0.13175 0.00662714 0.0716415 0.0496015 0.119228 -0.041655 -0.0398641 -0.0744437 -0.0459071 -0.095196 0.0788112 0.0452877 0.072894 -0.0694922 0.108876 -0.0455538 -0.0642512 -0.0677723 -0.0678114 0.0847431 0.116616 0.0726289 -0.0701234 0.0662045 -0.0696682 -0.00845088 -0.026857 -0.0175338 -0.121332 -0.0231129 0.1365 -0.00951923 -0.0619975 0.0249398 -0.0136603 -0.050737 0.122067 -0.0832714 0.0428715 -0.100955 0.0678016 0.151324 -0.045686 -0.0323983 0.158899 -0.146397 0.0616591 0.097486 0.0942106 -0.139915 -0.158911 -0.0422925 0.116836 -0.0334311 0.0921815 -0.0117285 0.0602885 -0.134618 0.0315668 -0.0486121 0.00322591 
0.0246247 -0.0341746 -0.0840652 -0.0378261 0.113496 0.0284098 -0.0365169 -0.0623503 -0.00204914 -0.0192752 0.00102309 0.0844346 0.116048 -0.0415757 -0.109973 0.0304135 -0.0610153 0.084226 -0.129677 0.199341 0.196391 -0.128643 0.123085 0.081203 -0.0156015 0.0601526 -0.068425 -0.220467 0.0162333 0.0696928 0.0275886 0.0620597 -0.0310461 0.0194787 0.00990667 0.0187058 -0.116963 0.266579 -0.0227019 -0.0908788 -0.0613508 0.0301969 -0.104658 0.123107 -0.0884066 -0.0362691 0.0991222 0.0448547 -0.0377327 0.0354858 -0.0227158 -0.0154939 -0.0550438 -0.0130169 0.102378 -0.0523816 0.0418956 0.116351 -0.00408826 -0.183806 0.0111429 -0.0777691 0.196538 0.0234047 0.0645026 -0.169302 -0.0361053 0.154863 0.0295322 0.0664283 0.0482017 0.0928297 -0.0344369 -0.0468177 -0.0864314 -0.0327152 -0.0939894 0.0737732 0.0329875 0.0998765 -0.0833855 0.0898847 -0.0436665 -0.0445602 -0.0786471 -0.0839144 0.0888949 0.1429 0.108499 -0.0831749 0.0137599 -0.0615858 -0.000581455 -0.0173396 -0.0308987 -0.106846 -0.0259395 0.107591 0.000876359 -0.0887833 0.0453285 -0.0137058 -0.0651011 0.116739 -0.0491667 -0.0040767 -0.113468 0.0689861 0.153321 -0.0510245 -0.0326294 0.169901 -0.153389 0.0698553 0.0864641 0.106668 -0.13841 -0.145728 -0.0406189 0.109534 -0.0553567 0.1366 -0.0174898 0.0451172 -0.109371 0.0221537 -0.0320976 -0.000188235 
0.0368912 -0.0444687 -0.122589 -0.0332487 0.128626 0.0405122 -0.0480373 -0.0830561 -0.00562675 -0.059229 0.000949102 0.0948635 0.109405 -0.0321732 -0.138935 0.0452839 -0.0705503 0.0745947 -0.1391 0.213486 0.196693 -0.125462 0.132684 0.0803354 -0.0138038 0.0488161 -0.0462172 -0.211603 -0.00608155 0.0755658 0.0104523 0.0532753 -0.0406384 0.0183207 -0.00230356 0.0334406 -0.120314 0.234626 -0.0396198 -0.0911552 -0.0593414 0.0420559 -0.0767721 0.134427 -0.0894432 -0.0256283 0.12279 0.0496804 -0.0420064 0.0621131 -0.0343269 -0.0534599 -0.054362 -0.00360335 0.117863 -0.0556486 0.0261361 0.137191 0.00446308 -0.185258 0.0136722 -0.0433578 0.222224 0.018206 0.0566149 -0.157414 -0.0472175 0.15812 0.03455 0.062524 0.0479944 0.0967952 -0.0151994 -0.0517366 -0.0796636 -0.0185685 -0.0837957 0.0625476 0.0137284 0.0807696 -0.0492728 0.0994832 -0.0638281 -0.0612758 -0.107696 -0.0426784 0.0689666 0.131843 0.0869068 -0.0708461 0.0373319 -0.0756099 -0.0256293 -0.0270215 -0.0177016 -0.0841442 -0.0400016 0.110117 0.0103119 -0.0877468 0.0326634 -0.0363067 -0.0526908 0.107068 -0.0725372 0.0145551 -0.136931 0.0850803 0.098967 -0.0434037 -0.0100006 0.171413 -0.125826 0.0778052 0.0625273 0.103708 -0.14148 -0.120734 -0.0375932 0.100516 -0.0628811 0.135224 0.0036153 0.0436382 -0.126055 0.026272 -0.0555904 -0.0144971 
0.0374809 -0.030882 -0.128056 -0.0349885 0.129844 0.0389709 -0.0459786 -0.0818371 -0.00863294 -0.0451906 0.00235495 0.0974354 0.108593 -0.0443385 -0.138346 0.0410472 -0.0633567 0.0753721 -0.139765 0.218967 0.183717 -0.120929 0.13316 0.0754761 -0.0188951 0.0496343 -0.0450728 -0.209091 -0.000662856 0.0729219 0.00532638 0.0534368 -0.037979 0.0179939 -0.00413485 0.0268496 -0.117689 0.239762 -0.0398015 -0.0863249 -0.0585779 0.0374617 -0.0818392 0.136442 -0.0994474 -0.0181296 0.120844 0.0530478 -0.0434162 0.0678327 -0.0237456 -0.0364195 -0.0663109 -0.0053773 0.114325 -0.0622199 0.0273314 0.128265 0.00509238 -0.178325 0.00919347 -0.052092 0.22064 0.0169881 0.0594837 -0.176208 -0.0464444 0.157542 0.0304357 0.0642793 0.0526586 0.0970103 -0.0141423 -0.0415111 -0.0789424 -0.0178145 -0.0868233 0.0735368 0.0139183 0.0807753 -0.0554566 0.0977369 -0.057228 -0.0501094 -0.100436 -0.0486635 0.0697898 0.13265 0.0925609 -0.070367 0.0260991 -0.076066 -0.0269741 -0.026007 -0.0177275 -0.0964549 -0.0306248 0.104244 0.00512949 -0.0952583 0.0323648 -0.0248565 -0.0525586 0.114712 -0.0726828 0.00854779 -0.133013 0.0900086 0.108838 -0.0375022 -0.00563755 0.173231 -0.123871 0.0870975 0.0551746 0.0953659 -0.142988 -0.12689 -0.0375053 0.102699 -0.0642799 0.136757 0.00290249 0.0449618 -0.115601 0.02114 -0.0540841 -0.0169499 
0.0331835 -0.0394057 -0.123484 -0.037862 0.12683 0.0409836 -0.0536815 -0.082044 -0.00690502 -0.0545223 0.000996382 0.0924487 0.10824 -0.032802 -0.138662 0.0504166 -0.0712527 0.075583 -0.13601 0.208679 0.199129 -0.123577 0.135554 0.0704213 -0.0140015 0.0516848 -0.0448667 -0.211649 -0.00499551 0.0748606 0.0110376 0.0501403 -0.0369307 0.0146159 0.00155736 0.0328119 -0.121779 0.237486 -0.0330945 -0.0886736 -0.0676182 0.043655 -0.077787 0.133969 -0.0863407 -0.0234294 0.122345 0.046131 -0.0477112 0.0618006 -0.0340565 -0.0483762 -0.0571077 -0.00304603 0.11264 -0.0570325 0.0310983 0.133417 0.000190279 -0.18491 0.014244 -0.0477169 0.225233 0.0178082 0.0608348 -0.161702 -0.0523673 0.165193 0.0359053 0.0655752 0.0529712 0.0967672 -0.0184091 -0.0562432 -0.0824678 -0.0189126 -0.0862331 0.060828 0.0120922 0.0801947 -0.0520772 0.0984001 -0.062028 -0.056823 -0.11314 -0.0446639 0.0674845 0.131409 0.0928434 -0.0717698 0.0306398 -0.0755886 -0.0287358 -0.0213736 -0.012822 -0.0834703 -0.0391407 0.113812 0.00279839 -0.0853374 0.0327109 -0.0361009 -0.0583924 0.104075 -0.0699181 0.0142488 -0.134505 0.0813348 0.102648 -0.0454389 -0.0135983 0.167799 -0.124594 0.0799403 0.0679264 0.104679 -0.141885 -0.119514 -0.0352421 0.0996448 -0.0630594 0.134127 0.00773078 0.0411021 -0.11975 0.0256785 -0.0488251 -0.0129591 
0.0420178 -0.0264181 -0.106308 -0.0471469 0.127902 0.0395428 -0.0341438 -0.0667135 -0.0127563 -0.0242584 0.0110625 0.0821054 0.115372 -0.0272649 -0.110165 0.035871 -0.0338895 0.0866932 -0.133152 0.200802 0.183945 -0.104608 0.115405 0.083454 -0.0147859 0.0685377 -0.0465403 -0.201138 0.0265738 0.0652951 0.0213713 0.0629712 -0.0393197 0.0232081 0.00164342 0.0227449 -0.101028 0.255074 -0.0194663 -0.0814086 -0.0479969 0.0485667 -0.0863375 0.138499 -0.101694 -0.0294365 0.110789 0.0514365 -0.0410824 0.0369197 -0.0205224 -0.0223933 -0.0770733 -0.00663687 0.105744 -0.0548409 0.0262708 0.136643 0.00768857 -0.187846 -0.000248479 -0.0741615 0.209126 0.0115527 0.0528604 -0.164791 -0.0321304 0.156135 0.0413902 0.0688009 0.0568398 0.0990834 -0.0184438 -0.0398957 -0.0791716 -0.0405799 -0.0944281 0.0949216 0.022123 0.0675201 -0.064102 0.119261 -0.0406594 -0.0528233 -0.0756538 -0.0749303 0.0876625 0.137111 0.101061 -0.0770202 0.0263828 -0.0706214 -0.0202893 -0.0325616 -0.00998875 -0.109898 -0.0211077 0.108785 -0.00562549 -0.0936143 0.0195513 -0.0126863 -0.043965 0.13428 -0.078501 0.00242398 -0.128609 0.071435 0.138869 -0.0525402 -0.0103991 0.174049 -0.148054 0.0947268 0.0727517 0.0777221 -0.141484 -0.164337 -0.0440277 0.0895007 -0.0471305 0.141387 -0.000322849 0.0539745 -0.117058 0.0042569 -0.0493413 -0.00854144 
0.0227015 -0.0313405 -0.11868 -0.0474526 0.117995 0.0524993 -0.0672528 -0.0745545 -0.00595504 -0.0446552 0.0106287 0.0840254 0.105332 -0.0550989 -0.136333 0.0486519 -0.0819863 0.0859669 -0.13215 0.203112 0.198246 -0.11477 0.133789 0.0781119 -0.0189885 0.0582425 -0.0324856 -0.222466 0.00790405 0.0601485 0.0198931 0.0316863 -0.0338038 0.0167889 0.0138765 0.0363974 -0.114853 0.222399 -0.0312477 -0.0834805 -0.0576654 0.0238119 -0.0886625 0.156255 -0.0945533 -0.0268437 0.128784 0.0579037 -0.062129 0.0562313 -0.0407385 -0.0519818 -0.0655376 -0.00619145 0.10043 -0.0492969 0.0329727 0.124701 -0.000230935 -0.19016 0.0113661 -0.0521891 0.233677 0.0261731 0.0642441 -0.174186 -0.0488343 0.150591 0.0473277 0.0755593 0.0396463 0.0885241 -0.0202731 -0.0607823 -0.0757826 -0.0385425 -0.100838 0.0923824 0.0137985 0.0772304 -0.0534801 0.104186 -0.0612077 -0.0522497 -0.112571 -0.0369779 0.0731076 0.132234 0.0883043 -0.0656804 0.0413646 -0.0713057 -0.034703 -0.0274894 -0.016005 -0.0897061 -0.0484759 0.119417 -0.00424727 -0.0911288 0.0345754 -0.0346867 -0.0587094 0.0927685 -0.0495704 0.0128192 -0.122969 0.0817575 0.100638 -0.0411586 -0.0157484 0.167343 -0.117508 0.0750748 0.0637155 0.0976903 -0.145824 -0.134798 -0.033727 0.0911222 -0.0515924 0.123412 0.00275892 0.044391 -0.125743 0.0229395 -0.0508908 -0.00579449 
0.0225085 -0.0250427 -0.0868482 -0.0393825 0.0977278 0.0384615 -0.0366519 -0.0505692 0.00844361 -0.024269 0.0147275 0.0800469 0.118098 -0.0788629 -0.116486 0.0283951 -0.0827881 0.074399 -0.150846 0.207359 0.193815 -0.12432 0.113631 0.0806559 -0.0323249 0.0574665 -0.065961 -0.22922 0.0137423 0.0574514 0.0226395 0.0536738 -0.0324427 0.0323797 0.0104705 0.0182357 -0.108382 0.260753 -0.0376638 -0.0842363 -0.0457885 0.00226506 -0.107465 0.140809 -0.0904124 -0.037838 0.104112 0.0526933 -0.0551316 0.0496504 -0.0302095 -0.024734 -0.0699428 -0.00573854 0.105058 -0.0545009 0.0254892 0.0966945 -0.00713362 -0.188496 0.00590633 -0.0816346 0.204881 0.0300284 0.0622679 -0.18302 -0.0273525 0.139661 0.0357072 0.0575154 0.0380299 0.0773029 -0.0276415 -0.0387001 -0.0737445 -0.0420131 -0.104188 0.0899852 0.0288261 0.107083 -0.0735093 0.0838444 -0.0488432 -0.0447705 -0.0882316 -0.0560402 0.0932502 0.134715 0.104034 -0.0681225 0.0257653 -0.0782124 -0.0181335 -0.0239389 -0.047728 -0.102857 -0.0309228 0.0916067 0.00117661 -0.0938319 0.0461079 -0.0164511 -0.0650849 0.11269 -0.0392215 -0.00567978 -0.11216 0.093569 0.134106 -0.045501 -0.0308647 0.173179 -0.152233 0.0629079 0.0774944 0.100053 -0.142502 -0.150266 -0.0321116 0.104478 -0.0482237 0.134243 -0.00753313 0.0643473 -0.0991796 0.0117901 -0.0292461 -0.00305874 
0.0171145 -0.0275568 -0.0914001 -0.0578926 0.112919 0.0523904 -0.0629154 -0.0698944 -0.00475458 -0.0328175 0.00198557 0.0502282 0.119014 -0.0345094 -0.093624 0.0442078 -0.0870963 0.0742387 -0.125996 0.191942 0.204299 -0.112924 0.128271 0.0587277 -0.00928555 0.0596101 -0.0712478 -0.224783 0.0124878 0.0582111 0.0458686 0.0395503 -0.0403313 0.0153166 0.0354619 0.0531953 -0.108856 0.238492 -0.0128361 -0.0942322 -0.0621327 0.0269194 -0.0922295 0.144233 -0.0804197 -0.0240167 0.11354 0.0710122 -0.054872 0.0410641 -0.0561087 -0.0442519 -0.0542518 -0.00669073 0.0984799 -0.0522433 0.0304664 0.11564 0.000559828 -0.206671 0.00997341 -0.05449 0.210455 0.0259109 0.059417 -0.152662 -0.033162 0.166422 0.0574698 0.0625292 0.0515546 0.0976472 -0.024767 -0.0720924 -0.0823896 -0.0456278 -0.117111 0.076159 0.0371675 0.102627 -0.0435362 0.0963801 -0.0615316 -0.0505717 -0.10086 -0.0575117 0.0765503 0.137239 0.105534 -0.0684408 0.0467865 -0.0587649 -0.013445 -0.0264511 -0.0399022 -0.0959085 -0.0429081 0.12745 -0.0128472 -0.0901788 0.0425756 -0.0256555 -0.0602008 0.0758715 -0.0584971 0.0155832 -0.120304 0.072317 0.138019 -0.0307005 -0.0240295 0.160104 -0.153665 0.0654003 0.0815153 0.109403 -0.145385 -0.139969 -0.051873 0.085526 -0.0406023 0.12377 0.00744103 0.0601116 -0.129472 0.00856347 -0.0332203 0.00893014 
0.0218984 -0.029007 -0.100713 -0.0520038 0.108039 0.0460857 -0.0604309 -0.0670405 -0.000713483 -0.0368606 -0.00413241 0.0631046 0.108178 -0.0542958 -0.108272 0.0412317 -0.0903835 0.0677346 -0.133971 0.199741 0.188597 -0.110344 0.131488 0.059175 -0.0208171 0.063168 -0.0576775 -0.228704 -0.0018058 0.0504955 0.0311644 0.0440098 -0.0410667 0.0197518 0.0235204 0.0413787 -0.110804 0.246503 -0.0297258 -0.0855108 -0.0623392 0.0215023 -0.100867 0.147453 -0.0841004 -0.0156028 0.112568 0.0646461 -0.0524855 0.0599807 -0.0404458 -0.0395139 -0.0588406 -0.00527132 0.104124 -0.0621939 0.0362555 0.108475 0.00815596 -0.20012 0.0156399 -0.0597151 0.209258 0.0325154 0.0599454 -0.179597 -0.0325968 0.16283 0.0573187 0.0691772 0.0470256 0.0926284 -0.0168338 -0.0542371 -0.0847067 -0.0441823 -0.113921 0.0793536 0.0265281 0.101565 -0.0440701 0.0951165 -0.0644367 -0.0525363 -0.100159 -0.0617366 0.0768655 0.136146 0.103356 -0.06791 0.0367783 -0.0617873 -0.019989 -0.0315338 -0.0363151 -0.086743 -0.0309261 0.111001 -0.00566312 -0.0936686 0.0395293 -0.0233206 -0.0630581 0.0876298 -0.0562272 -0.00297361 -0.127702 0.077305 0.124152 -0.0285362 -0.0150541 0.174854 -0.143012 0.0666039 0.0705962 0.104608 -0.143337 -0.144871 -0.045661 0.0849975 -0.0447852 0.136541 0.0138267 0.0576174 -0.11401 0.00130692 -0.0347985 -0.0029293 
0.0357623 -0.0386896 -0.082234 -0.0435169 0.130879 0.0673208 -0.016196 -0.063286 -0.0208439 -0.032065 0.00472352 0.0751792 0.115779 -0.033855 -0.0793445 0.0149041 -0.0618582 0.0857808 -0.114081 0.191331 0.199191 -0.114488 0.119013 0.0791042 -0.00928349 0.0509392 -0.0918492 -0.228823 0.0354484 0.060242 0.0500165 0.0549276 -0.0516187 0.0204946 0.0345494 0.0427697 -0.105645 0.245307 -0.00747076 -0.0973549 -0.0295473 0.0436935 -0.102239 0.125772 -0.119335 -0.0367185 0.10638 0.0531213 -0.0481981 0.0257426 -0.0571237 -0.025383 -0.0566193 -0.00713905 0.102905 -0.0465461 0.0329816 0.149109 -0.0208514 -0.180409 -0.00944291 -0.0476155 0.217222 -0.0138493 0.0795388 -0.141563 -0.0220099 0.140777 0.024847 0.0765118 0.0536184 0.112699 -0.0352385 -0.0358477 -0.0841579 -0.0427255 -0.104075 0.0752873 0.0478325 0.0826241 -0.0814179 0.101099 -0.0418531 -0.0516323 -0.0705988 -0.0789926 0.0917347 0.140125 0.0890109 -0.0742569 0.0687537 -0.064684 -0.00200303 -0.0323332 -0.0238769 -0.126904 -0.0225665 0.125694 -0.0103083 -0.0708898 0.0279193 -0.0105417 -0.0556866 0.103948 -0.0676682 0.0283247 -0.0978841 0.0705556 0.155914 -0.0383885 -0.0276272 0.155485 -0.153781 0.0634457 0.0977998 0.10113 -0.12591 -0.159965 -0.0359799 0.113616 -0.0377157 0.109287 -0.0149514 0.0589451 -0.129743 0.0191864 -0.0321161 0.0122452 
0.0254291 -0.0432323 -0.0990736 -0.0458165 0.107806 0.0430972 -0.0649813 -0.0662068 -0.00409395 -0.0540772 -0.00613019 0.0622741 0.104896 -0.0458474 -0.110047 0.0392131 -0.0868352 0.0630405 -0.125599 0.201395 0.191266 -0.116017 0.141363 0.0599243 -0.0144754 0.0631739 -0.0526752 -0.229589 -0.00802067 0.0431961 0.0377431 0.0396714 -0.0367486 0.0211292 0.0200876 0.0413508 -0.112114 0.25262 -0.0293117 -0.0921197 -0.0621636 0.0283236 -0.100023 0.143821 -0.0849087 -0.0230711 0.11132 0.0585878 -0.0454201 0.0637738 -0.050646 -0.0478144 -0.0456876 -0.000733071 0.104013 -0.0639369 0.0439484 0.114686 0.0082739 -0.204109 0.0148159 -0.0526629 0.21009 0.0298675 0.0580004 -0.165616 -0.031449 0.15986 0.0581719 0.069017 0.0405037 0.0902845 -0.0197292 -0.050009 -0.0828194 -0.0520832 -0.107886 0.0676564 0.0270706 0.106585 -0.0509751 0.0903929 -0.0648288 -0.0629845 -0.0984189 -0.0643913 0.072797 0.1406 0.0996251 -0.0751867 0.048645 -0.0567918 -0.0142109 -0.0343517 -0.0280725 -0.0851842 -0.0324912 0.121709 -0.00683912 -0.0913177 0.0313764 -0.0289727 -0.060662 0.0882889 -0.0533638 0.000430763 -0.123095 0.0736295 0.125902 -0.036785 -0.0172007 0.177004 -0.140354 0.0665244 0.0748477 0.105259 -0.135275 -0.143543 -0.0383045 0.0880901 -0.0488263 0.137283 0.0100717 0.0526571 -0.118838 3.41321e-05 -0.0309334 0.00246332 
0.0354463 -0.0432605 -0.0986407 -0.0367932 0.129223 0.0451266 -0.047719 -0.0695723 -0.00763043 -0.0630919 -0.00892116 0.0890713 0.109673 -0.0484158 -0.124878 0.0390695 -0.067477 0.0787932 -0.151549 0.204752 0.206738 -0.120512 0.130581 0.081739 -0.0101938 0.0401537 -0.0614791 -0.221364 -0.01046 0.0677058 0.0245146 0.0569553 -0.0404654 0.0312949 0.00583897 0.0251837 -0.119971 0.235306 -0.0396331 -0.0950031 -0.0511556 0.0355349 -0.0797901 0.134841 -0.0842092 -0.0256237 0.114664 0.0473836 -0.0537513 0.0575739 -0.027349 -0.0595539 -0.0475734 -0.0117592 0.10568 -0.055545 0.0256753 0.127403 0.00444545 -0.192408 0.0185035 -0.0426 0.197394 0.0233866 0.0596555 -0.167152 -0.0443771 0.158834 0.0290323 0.0598188 0.0468093 0.0857436 -0.0203938 -0.0655086 -0.0877915 -0.0182962 -0.092808 0.0577289 0.0195506 0.100116 -0.0588496 0.0946223 -0.0609359 -0.0582376 -0.103438 -0.0490754 0.0803042 0.129778 0.0789809 -0.064986 0.0337716 -0.0781644 -0.0275958 -0.0216441 -0.0331519 -0.0717083 -0.039801 0.10523 -0.00658332 -0.0840084 0.0389173 -0.0312742 -0.0633332 0.115861 -0.0635356 -0.00047647 -0.139065 0.0893902 0.105178 -0.048515 -0.014091 0.169264 -0.145192 0.0738691 0.0667539 0.105829 -0.158065 -0.126757 -0.0402215 0.107634 -0.0579822 0.143361 -0.00752282 0.0465362 -0.104049 0.0131292 -0.0479446 -0.0260179 
0.0322174 -0.0334985 -0.0984521 -0.0427526 0.132227 0.0460495 -0.0516768 -0.0811062 -0.0222023 -0.0563304 -0.0213406 0.0822125 0.10838 -0.033818 -0.115166 0.0437984 -0.0695608 0.0749523 -0.131671 0.203318 0.203408 -0.11323 0.126083 0.0779817 -0.00410859 0.049204 -0.066604 -0.218408 -0.00912761 0.0807299 0.0183361 0.0521723 -0.046398 0.0234903 0.0178426 0.0332162 -0.113609 0.228833 -0.0303726 -0.0969344 -0.062845 0.0405331 -0.0585569 0.134569 -0.0780191 -0.00567843 0.133094 0.0514726 -0.0601467 0.0597739 -0.0202749 -0.0624641 -0.0459054 -0.00876706 0.122969 -0.057423 0.026551 0.133184 0.0122845 -0.199166 0.0287765 -0.0367339 0.196234 0.0209261 0.0641639 -0.164724 -0.0480702 0.161605 0.0324899 0.0597683 0.054228 0.0970279 -0.0203595 -0.0692796 -0.0870026 -0.0122762 -0.0937691 0.0617317 0.0326967 0.094371 -0.040158 0.104607 -0.0636265 -0.0536646 -0.102074 -0.0611937 0.0715876 0.131505 0.0905071 -0.0575216 0.0273782 -0.0684234 -0.0252079 -0.0248366 -0.0362328 -0.0682104 -0.0302662 0.11913 -0.00378474 -0.0878651 0.0373834 -0.0240184 -0.0592958 0.105034 -0.0856199 0.00492052 -0.148577 0.0843522 0.100815 -0.0375305 -0.00208923 0.164009 -0.148079 0.0694705 0.0609304 0.107492 -0.154436 -0.12821 -0.0589963 0.0990343 -0.0558582 0.143518 0.00985317 0.0400903 -0.115229 0.0167017 -0.0452317 -0.0275312 
0.032534 -0.0392839 -0.104638 -0.0429242 0.133097 0.0512251 -0.055944 -0.0815551 -0.0190744 -0.0637502 -0.0251068 0.087284 0.103158 -0.0469023 -0.121284 0.0417878 -0.0784547 0.0742127 -0.135398 0.206019 0.198103 -0.111841 0.12941 0.0754649 -0.0103012 0.04659 -0.0607267 -0.224301 -0.0223456 0.0753019 0.0135081 0.0448363 -0.0482125 0.0254713 0.0217569 0.0348364 -0.114327 0.218972 -0.0395139 -0.100129 -0.0601521 0.0352526 -0.0611473 0.140707 -0.0809504 -0.00114153 0.132705 0.0562023 -0.0636928 0.0706558 -0.0227141 -0.0751306 -0.0432897 -0.00948376 0.12171 -0.0587978 0.0218012 0.130265 0.0110666 -0.196419 0.0331979 -0.0295398 0.200321 0.0234399 0.0699097 -0.175336 -0.0519578 0.161274 0.0322784 0.0602753 0.0491441 0.0908029 -0.0161847 -0.0746251 -0.0923332 -0.00810421 -0.094574 0.0600238 0.0307669 0.0937558 -0.0372219 0.100792 -0.0708342 -0.0548713 -0.109158 -0.0565998 0.0692656 0.13075 0.0848572 -0.0487003 0.0329291 -0.0707843 -0.0295212 -0.0249335 -0.039181 -0.0591793 -0.0326107 0.111069 -0.0031063 -0.0878562 0.0414603 -0.0268499 -0.0646444 0.0946284 -0.0786032 0.00133158 -0.149936 0.086013 0.0827405 -0.0275046 0.00479803 0.163539 -0.136263 0.0679432 0.0533192 0.108103 -0.15891 -0.123136 -0.0577285 0.0963201 -0.0573981 0.142049 0.0125579 0.0404572 -0.108491 0.0151687 -0.0491524 -0.0359514 
0.0162584 -0.0305697 -0.107986 -0.0382818 0.125016 0.0296448 -0.0695323 -0.0997807 -0.00787134 -0.0414003 -0.0227557 0.0760162 0.104868 -0.0332898 -0.128414 0.0517372 -0.0776849 0.0750407 -0.121454 0.21421 0.190894 -0.121509 0.126179 0.0680097 -0.00675321 0.0626612 -0.0644358 -0.214777 -0.0121059 0.0795628 0.0154617 0.0498632 -0.0451191 0.00562645 0.0272659 0.0430808 -0.113436 0.232059 -0.0239195 -0.105637 -0.0800435 0.0375136 -0.0641 0.13131 -0.0636631 -0.00696185 0.130666 0.0669702 -0.0428442 0.0599562 -0.0280559 -0.0567195 -0.0402369 -0.00905479 0.123512 -0.0649977 0.0288239 0.115075 0.0156761 -0.204328 0.0393159 -0.0424373 0.201348 0.033394 0.0613826 -0.167282 -0.0471346 0.163578 0.0453222 0.0497402 0.0519742 0.0976986 -0.0130869 -0.0691991 -0.0933876 -0.0180575 -0.0945205 0.0687851 0.0354386 0.0926883 -0.0269498 0.107462 -0.0728008 -0.0488604 -0.096715 -0.0678141 0.0564125 0.144946 0.110204 -0.0667007 0.01936 -0.0500806 -0.00862215 -0.019928 -0.0376983 -0.07459 -0.0320205 0.116752 0.00167546 -0.0972695 0.0467983 -0.0282372 -0.0645674 0.0833369 -0.0709248 0.00747893 -0.133876 0.0700173 0.107112 -0.0104125 -0.0068838 0.161675 -0.135604 0.075384 0.0502455 0.105822 -0.154563 -0.118256 -0.0721469 0.0748725 -0.0665567 0.146574 0.0196628 0.0310803 -0.127543 0.0231584 -0.0526527 -0.0245951 
0.0127179 -0.0367359 -0.089275 -0.0587587 0.143044 0.0548348 -0.0550565 -0.0937887 -0.00893868 -0.0548182 -0.0346932 0.0577956 0.1099 -0.00435948 -0.0778613 0.0351501 -0.069364 0.0560768 -0.117797 0.186725 0.188589 -0.114106 0.115903 0.0741736 0.0243969 0.048577 -0.0768523 -0.203728 -0.001699 0.0636793 0.0728235 0.036315 -0.0604198 0.0110814 0.0415726 0.0651969 -0.105241 0.213669 -0.0151161 -0.113262 -0.043818 0.0525612 -0.0496735 0.14099 -0.0652538 -0.0117266 0.121187 0.0850811 -0.0389453 0.0308421 -0.059599 -0.0857444 -0.024487 -0.0351631 0.114951 -0.0449039 -0.0172627 0.170998 0.00827872 -0.21453 0.0126784 -0.0203581 0.197051 0.0129521 0.0639903 -0.110177 -0.0398113 0.172254 0.0319714 0.0455253 0.0574941 0.116819 -0.0175892 -0.0894786 -0.0844194 -0.0172664 -0.103728 0.052723 0.0563808 0.100056 -0.0252755 0.103573 -0.0649051 -0.0583752 -0.0945159 -0.0924808 0.0707603 0.146902 0.0949872 -0.064579 0.0477781 -0.0497514 0.00321041 -0.0290266 -0.0359136 -0.0731107 -0.0344828 0.117556 -0.0151265 -0.0913207 0.0235292 -0.0375234 -0.060906 0.0652469 -0.109471 0.031095 -0.150728 0.0577978 0.114753 -0.0196069 0.0160938 0.158209 -0.160888 0.0809447 0.0664953 0.104557 -0.171196 -0.10972 -0.0752794 0.090079 -0.0443989 0.134018 -0.00172429 0.053865 -0.142877 0.0125875 -0.064523 -0.0244609 
0.0269451 -0.0286366 -0.115242 -0.045941 0.134992 0.044617 -0.0529096 -0.0966082 -0.0144028 -0.0409294 -0.0219401 0.0635834 0.108755 -0.0188002 -0.0930319 0.0433795 -0.0720007 0.0592849 -0.112777 0.203775 0.17851 -0.108949 0.124047 0.0643196 0.00381105 0.0580141 -0.0726699 -0.220221 -0.00816848 0.0762491 0.0371285 0.0531263 -0.0556772 0.00754238 0.0323774 0.0577437 -0.10468 0.225775 -0.0196792 -0.0959542 -0.0597541 0.0462773 -0.0683968 0.140417 -0.080024 0.00912755 0.129934 0.0751034 -0.03786 0.0473751 -0.0349665 -0.0575736 -0.044102 -0.0175505 0.123434 -0.0612005 0.0149327 0.139539 0.0216558 -0.195549 0.0202991 -0.0393396 0.199038 0.0151126 0.0639616 -0.1596 -0.0355497 0.171093 0.0520173 0.0530706 0.0621687 0.119489 -0.0116833 -0.0688045 -0.0874034 -0.0185168 -0.108228 0.0731459 0.0372565 0.0971749 -0.0225937 0.107337 -0.0724936 -0.0509717 -0.0949258 -0.0722077 0.0648979 0.133354 0.0950549 -0.0726219 0.0313987 -0.0493843 -0.00974509 -0.0382237 -0.0389371 -0.0844202 -0.0218845 0.114334 0.00175079 -0.0987449 0.0304034 -0.0252696 -0.0495607 0.0795409 -0.100592 0.0122662 -0.146703 0.0744502 0.112926 -0.00489835 0.00674974 0.160911 -0.14942 0.0691852 0.0521379 0.103438 -0.155327 -0.132781 -0.0738409 0.0808651 -0.0482256 0.143735 0.0166724 0.0559108 -0.133539 0.00821464 -0.0572373 -0.0146656 
0.035269 -0.0452931 -0.121546 -0.0422368 0.144904 0.0475821 -0.0489106 -0.0940812 -0.0169955 -0.0475263 -0.0293746 0.0755542 0.107153 -0.0278462 -0.0993058 0.0473277 -0.0702536 0.0668723 -0.122556 0.207122 0.178016 -0.105943 0.125389 0.0709882 -0.00292296 0.0524688 -0.0667768 -0.224975 -0.0231266 0.0773508 0.0263854 0.0590257 -0.0608405 0.0140063 0.0307662 0.0546476 -0.102467 0.207981 -0.0297694 -0.104127 -0.0530029 0.0461226 -0.0594563 0.143948 -0.0838608 0.00588876 0.130827 0.078687 -0.0383754 0.0553487 -0.0266383 -0.0837304 -0.0403716 -0.0176905 0.128602 -0.0620926 0.0112726 0.138866 0.0258961 -0.191783 0.0283133 -0.0312527 0.193846 0.0176316 0.0661191 -0.165458 -0.0458109 0.170638 0.048822 0.0468587 0.0540839 0.115446 -0.00612533 -0.0803684 -0.0982441 -0.00836143 -0.101518 0.0726225 0.0337406 0.0885747 -0.0122387 0.107415 -0.0808497 -0.0564101 -0.0999481 -0.063164 0.0654593 0.132027 0.0846383 -0.06214 0.0350808 -0.0516506 -0.0233206 -0.0391396 -0.04338 -0.0618439 -0.0270269 0.105795 0.0020068 -0.0936299 0.0370015 -0.0339427 -0.0512644 0.0782395 -0.0950274 0.00246321 -0.158151 0.0751371 0.088881 0.00164109 0.0107331 0.162706 -0.136395 0.0655864 0.0440325 0.10233 -0.159173 -0.124486 -0.0794444 0.0782193 -0.0499155 0.144123 0.0229987 0.0540416 -0.129721 0.00444294 -0.070995 -0.0302204 
0.0113035 -0.0311164 -0.102107 -0.0566595 0.12912 0.0460432 -0.0691349 -0.100873 -0.0119867 -0.0471332 -0.020352 0.0509629 0.122265 0.00702503 -0.0960859 0.0474943 -0.0737049 0.0466037 -0.119465 0.190767 0.192866 -0.123375 0.106661 0.0747622 0.0260484 0.0525513 -0.0678878 -0.19063 0.00169314 0.0750623 0.0615983 0.0343168 -0.0689547 -0.00335675 0.0253874 0.0692075 -0.125252 0.205272 -0.0101447 -0.100879 -0.0625958 0.0484581 -0.0574888 0.13685 -0.0409813 -0.0126618 0.117999 0.0913394 -0.0344997 0.0196697 -0.0508402 -0.0703193 -0.0246793 -0.0380538 0.107997 -0.0484666 -0.0198651 0.165497 0.0214138 -0.213647 0.0200296 -0.0200503 0.200958 0.0303452 0.0437987 -0.107008 -0.0346127 0.182812 0.0455006 0.0272318 0.0601432 0.118451 -0.0114488 -0.100581 -0.0770367 -0.0114323 -0.099893 0.049399 0.0476065 0.11903 -0.00687493 0.0879965 -0.0647473 -0.0593606 -0.108885 -0.072239 0.0667726 0.138205 0.0980122 -0.079383 0.0281812 -0.0468925 0.00790793 -0.0110838 -0.0491757 -0.0764822 -0.0377182 0.107873 -0.0031626 -0.0998772 0.0354059 -0.0363974 -0.0614765 0.0670834 -0.107595 0.0371059 -0.154317 0.0675063 0.109409 -0.0210782 0.0147256 0.154877 -0.161361 0.0831683 0.0557825 0.117543 -0.184758 -0.0827585 -0.0819058 0.0776487 -0.0662094 0.123674 -0.00123792 0.0430572 -0.152494 0.0297268 -0.0807544 -0.019324 
0.019884 -0.0240124 -0.0920913 -0.0540234 0.140375 0.0552555 -0.0622839 -0.100739 -0.016453 -0.0420922 -0.0280733 0.0615018 0.102575 -0.00839016 -0.0869103 0.056368 -0.0566601 0.0829247 -0.109229 0.173004 0.20708 -0.0938025 0.115506 0.0812959 0.0195493 0.0565434 -0.070196 -0.216904 0.00657769 0.0920601 0.0520494 0.0514476 -0.0537241 0.00986593 0.0506546 0.0530995 -0.105402 0.212315 -0.00183564 -0.10146 -0.0714953 0.0584282 -0.0488128 0.139367 -0.0557247 0.00253942 0.133779 0.0683735 -0.0547778 0.0272051 -0.0250206 -0.0623291 -0.029478 -0.0312162 0.113231 -0.043642 0.0171983 0.155382 0.0116351 -0.206648 0.0240289 -0.0358813 0.194361 0.00952536 0.0655888 -0.145722 -0.0499225 0.172431 0.0353915 0.0666629 0.0612588 0.113343 -0.0309152 -0.0971977 -0.0984186 -0.0214946 -0.105331 0.0673049 0.0422482 0.0923541 -0.0219784 0.124261 -0.0657898 -0.0568176 -0.0960715 -0.0899562 0.0627232 0.126253 0.0920089 -0.0578864 0.025984 -0.0476781 -0.0173969 -0.022916 -0.0245266 -0.0601752 -0.0325072 0.129072 -0.0117932 -0.0860386 0.0391695 -0.0263128 -0.0624128 0.0816421 -0.102688 0.0132233 -0.147927 0.0474369 0.11854 -0.0223859 0.00621573 0.150882 -0.158555 0.068668 0.0759204 0.110167 -0.163874 -0.133058 -0.0763434 0.0879241 -0.0365858 0.141324 0.0123496 0.0387482 -0.13397 0.0172767 -0.0464705 -0.0257184 
