0.0756592 0.0578072 -0.0102766 -0.0274355 0.105694 0.208666 0.114133 -0.109523 -0.10553 -0.130178 -0.0658323 0.0585099 0.0537833 -0.0763206 0.0143424 -0.073908 -0.11488 0.0176255 -0.134128 0.103641 0.0501441 0.0238775 0.0430566 0.1066 -0.0552557 -0.033224 -0.163349 -0.15583 0.0140992 0.0549088 0.0104349 0.102027 -0.158588 0.116851 0.0788219 0.0325045 0.00876832 0.094235 -0.0278372 -0.0364848 0.107802 -0.0418261 0.0187652 0.0238856 -0.14075 0.0626286 0.151912 0.0770289 -0.158486 0.112827 -0.0372849 -0.0882354 0.0113992 0.0290482 0.128778 -0.013131 -0.038662 0.218059 -0.0345336 -0.101216 -0.0672874 0.168708 0.185162 -0.160714 0.0924016 0.00644647 0.0357945 -0.0277129 -0.154162 0.0747657 -0.0128835 0.0646067 7.17398e-05 0.142089 0.014165 -0.00413943 -0.0462474 -0.0635655 0.0939088 0.0166933 0.0487293 0.0793291 -0.0522012 -0.0803595 -0.0608127 -0.0473866 0.0411589 -0.00137728 -0.0722645 0.117778 0.210003 -0.13739 0.0240871 -0.0653485 -0.0715014 -0.0119291 0.0408924 0.0945885 0.0617915 0.00960223 0.00517302 0.0544779 -0.0548515 0.139595 -0.135795 0.0440853 -0.106694 0.13647 -0.0446915 0.0314191 0.113208 0.13919 -0.0804628 0.00614691 -0.012358 0.06469 -0.071037 -0.064763 -0.00364316 0.13118 0.0620946 -0.0167776 0.0359381 0.0520274 -0.0820162 0.0240467 -0.0481886 -0.108956 
0.076361 0.0335636 -0.0219466 -0.036422 0.111645 0.200741 0.100041 -0.0833281 -0.114789 -0.126462 -0.0555215 0.0617442 0.0600124 -0.0821251 0.0166864 -0.0805389 -0.105811 0.0114774 -0.123988 0.128646 0.0575095 0.0151488 0.05643 0.0999433 -0.0544124 -0.00668942 -0.144008 -0.170239 0.0208234 0.0291854 0.0166442 0.0882896 -0.144151 0.11974 0.071945 0.0371721 0.0105982 0.122352 -0.0366303 -0.0513764 0.118445 -0.0382552 -0.000921186 0.0542517 -0.166792 0.0499729 0.157211 0.0792556 -0.152937 0.109238 -0.0543864 -0.0862404 -0.00973691 0.0326491 0.138877 -0.0224034 -0.0396895 0.213073 -0.041087 -0.11932 -0.073771 0.14073 0.201765 -0.142305 0.0967562 -0.00678584 0.0377959 -0.0167414 -0.123978 0.0777476 -0.0166613 0.0646606 0.00217129 0.140572 0.017154 -0.02573 -0.0635256 -0.0340497 0.097087 0.0241094 0.0230383 0.083083 -0.0418642 -0.0876883 -0.0533237 -0.0589926 0.0597675 0.0317209 -0.0501865 0.100577 0.221158 -0.131871 0.0122456 -0.0752404 -0.0692538 -0.0413996 0.0469997 0.100012 0.0454716 -0.0113087 -0.0112624 0.0547763 -0.0444219 0.13303 -0.136236 0.0503799 -0.106102 0.142827 -0.0193896 0.016021 0.108622 0.153308 -0.0967257 0.0143637 0.00533702 0.0527377 -0.0695499 -0.108436 0.00581651 0.133789 0.0584374 -0.00312408 0.0366277 0.0670736 -0.0822756 0.00861904 -0.0332192 -0.0899153 
0.074167 0.0224657 -0.0113453 -0.0306892 0.126238 0.218551 0.0895937 -0.0941465 -0.121301 -0.124267 -0.0617988 0.0629497 0.0476149 -0.0738781 0.0394934 -0.0785896 -0.110663 0.0298876 -0.104808 0.112607 0.0585168 0.0253377 0.0679226 0.0978224 -0.0359038 -0.0095178 -0.143048 -0.17187 0.0102055 0.0269102 0.020864 0.0927302 -0.144894 0.118059 0.0851725 0.0471996 0.00769942 0.0913563 -0.0287702 -0.06237 0.127229 -0.0382945 0.00791853 0.0455762 -0.183068 0.0463181 0.156316 0.0805256 -0.151887 0.105838 -0.0468111 -0.0945065 0.00423268 0.0296998 0.138767 -0.0135557 -0.0279307 0.21178 -0.0442242 -0.112589 -0.0724987 0.1522 0.199353 -0.149221 0.110994 0.0109894 0.0273907 -0.0140701 -0.125476 0.105709 -0.0161599 0.0797878 -0.00124493 0.126166 0.00886306 -0.0209064 -0.0675857 -0.0477519 0.0923162 0.0116557 0.0262288 0.0976092 -0.0341851 -0.0844374 -0.0568304 -0.0601588 0.0586902 0.0374317 -0.0639743 0.114873 0.230938 -0.118811 0.00769254 -0.0706962 -0.0716199 -0.0384021 0.0380497 0.114694 0.0482468 -0.0121992 -0.00119862 0.0479975 -0.0401116 0.110052 -0.124011 0.0534773 -0.0978218 0.123466 -0.0282236 0.0240079 0.104382 0.145717 -0.0806141 0.00444808 0.0176827 0.0443381 -0.0667206 -0.102768 0.0081076 0.136086 0.0802986 -0.0154257 0.0403157 0.0552132 -0.0813559 0.0200425 -0.0154796 -0.0783934 
0.0766405 0.0105027 -0.0152613 -0.0281823 0.133305 0.214043 0.0912194 -0.0901669 -0.11321 -0.130855 -0.0649588 0.0708706 0.0439334 -0.0845218 0.0331101 -0.077177 -0.10934 0.0308249 -0.111618 0.123356 0.0574333 0.0263623 0.0694185 0.106747 -0.0442942 -0.0123446 -0.141359 -0.179952 0.00193629 0.0231036 0.0213375 0.0898155 -0.145424 0.12199 0.0817871 0.0493723 0.00783822 0.0873217 -0.0382343 -0.0604262 0.129929 -0.0331387 0.00270452 0.0481298 -0.181276 0.0454178 0.15381 0.0808625 -0.141707 0.115079 -0.0498132 -0.108178 0.00183624 0.027048 0.139198 -0.0152553 -0.0310838 0.21193 -0.0423277 -0.105362 -0.0685052 0.153823 0.197363 -0.15024 0.110792 -0.00773765 0.0255141 -0.017386 -0.123027 0.0995736 -0.0173944 0.0793968 0.00304329 0.125439 -0.000205906 -0.0190567 -0.0629747 -0.0374515 0.0903879 0.00916411 0.02609 0.0985014 -0.0422691 -0.0826906 -0.0559284 -0.0575527 0.059933 0.0391269 -0.0688482 0.111974 0.231363 -0.118226 0.00535817 -0.0721995 -0.0671769 -0.029385 0.0340651 0.104024 0.0464993 -0.00783246 -0.00367994 0.0405174 -0.0452623 0.109449 -0.119489 0.0471974 -0.100259 0.117462 -0.0378766 0.0339217 0.102851 0.148023 -0.0729714 0.00605485 0.00941186 0.0473019 -0.0646022 -0.105072 0.000124166 0.13396 0.0751477 -0.00555565 0.038254 0.060165 -0.0845329 0.0160199 -0.0279946 -0.0876108 
0.0792635 0.00777591 0.00275013 -0.0157771 0.131734 0.21841 0.102022 -0.094354 -0.102674 -0.13484 -0.0657662 0.0693749 0.0395083 -0.08033 0.0414701 -0.0769226 -0.109531 0.0376991 -0.116171 0.110309 0.0599533 0.0279342 0.0644217 0.121274 -0.0375363 -0.0260924 -0.152137 -0.176794 -0.00357088 0.026265 0.0258388 0.0974692 -0.152617 0.125261 0.0847034 0.0452876 0.0099951 0.0797889 -0.0352524 -0.059846 0.134502 -0.0319599 0.00644279 0.0283365 -0.172196 0.0334655 0.144176 0.0746168 -0.135976 0.112293 -0.0421956 -0.114539 0.0151098 0.026942 0.14099 -0.0079313 -0.0289232 0.214925 -0.0422478 -0.101204 -0.0686507 0.162099 0.18292 -0.161391 0.1086 0.0113176 0.0285417 -0.0263897 -0.136155 0.104242 -0.0191328 0.0835563 -0.000197694 0.12981 -0.000971854 -0.0167333 -0.0549708 -0.0505352 0.0910163 0.00611028 0.0288062 0.10097 -0.0408361 -0.0885258 -0.051491 -0.0546435 0.0577674 0.0319649 -0.0809368 0.116131 0.235007 -0.118364 0.0132609 -0.0709979 -0.0693104 -0.0188937 0.0291619 0.100519 0.0531937 0.00340899 0.00469351 0.0341896 -0.0477887 0.11034 -0.110574 0.0449244 -0.095111 0.103871 -0.0422936 0.0341441 0.0943891 0.145989 -0.0643916 -0.00297792 0.0155252 0.0507073 -0.0630078 -0.0908007 -0.00459349 0.135298 0.0817002 -0.00659212 0.0327873 0.0559986 -0.0837804 0.0255562 -0.0259619 -0.0890913 
0.0987609 -0.0110092 -0.0513411 -0.0312741 0.141477 0.195185 0.113525 -0.0730393 -0.123531 -0.111333 -0.0527846 0.0867842 0.0747376 -0.0726288 0.00674617 -0.0687821 -0.088057 0.0342198 -0.11801 0.149665 0.0748086 -2.81872e-05 0.0748006 0.0979332 -0.0612313 -0.000297296 -0.139413 -0.191917 0.0104262 0.0440966 -0.0120179 0.113637 -0.14581 0.116528 0.0530358 0.0283706 -0.00644651 0.126821 -0.037934 -0.0691818 0.107189 -0.0211144 -0.0156196 0.0581677 -0.190646 0.0347645 0.144502 0.0760743 -0.136105 0.109549 -0.0390629 -0.100841 -0.019922 0.0293522 0.142642 -0.0308461 -0.0260626 0.219145 -0.0437929 -0.0996505 -0.0555749 0.125475 0.210911 -0.137274 0.108226 -0.0274255 0.00993142 0.00785367 -0.111197 0.0748869 -0.0162175 0.0816637 0.00275236 0.121956 -0.0226749 -0.012996 -0.0473489 -0.0322413 0.0874641 0.0136328 0.0118043 0.0774759 -0.0491622 -0.0911041 -0.0567022 -0.0648084 0.0720535 0.0460357 -0.0455969 0.0864677 0.216914 -0.12363 -0.0103319 -0.0622915 -0.0651719 -0.0436648 0.0414465 0.0926509 0.0451908 -0.0078286 0.00770778 0.0457262 -0.0449139 0.135069 -0.12645 0.040096 -0.111645 0.133718 -0.0181033 0.0138243 0.0932935 0.159922 -0.0825063 0.0151433 0.0198379 0.0567599 -0.0677693 -0.110775 -0.00148522 0.137184 0.0432353 0.00529935 0.0356066 0.0675422 -0.0834224 0.0123861 -0.0425257 -0.0946137 
0.096666 -0.00478261 -0.0195557 -0.0236963 0.134936 0.219476 0.111691 -0.0899279 -0.104288 -0.129789 -0.0589712 0.0854897 0.0532646 -0.0892407 0.0251829 -0.0776046 -0.107969 0.0428297 -0.121989 0.117423 0.0697986 0.0291476 0.0605866 0.121695 -0.0516086 -0.0221597 -0.13931 -0.187999 -0.0127932 0.0469545 0.00348367 0.0950538 -0.154394 0.127829 0.0797981 0.0281948 0.00559978 0.0812469 -0.0328294 -0.0591717 0.120835 -0.033872 0.000453194 0.0465714 -0.180481 0.0249666 0.138706 0.0759939 -0.134536 0.121083 -0.0224857 -0.122737 0.00299808 0.0299161 0.140978 -0.016411 -0.0336345 0.219333 -0.0493522 -0.0938133 -0.0552772 0.143568 0.195335 -0.154078 0.107921 -0.021403 0.0187239 -0.0171239 -0.134189 0.0872964 -0.0194377 0.078105 -0.0011261 0.11385 -0.0208509 -0.00987404 -0.0493985 -0.0514242 0.0901952 0.0219261 0.0324352 0.0873564 -0.0393001 -0.0848512 -0.0583121 -0.0613833 0.0678389 0.0249702 -0.0727315 0.113879 0.218251 -0.131328 -0.000667774 -0.0597759 -0.0799647 -0.0201364 0.0268178 0.082698 0.0503747 0.00525766 0.0160932 0.0435341 -0.0555833 0.12005 -0.10901 0.0294377 -0.105344 0.113055 -0.0554608 0.0368391 0.10327 0.141406 -0.0648851 0.00495865 0.00770854 0.0622087 -0.0679727 -0.0830227 -0.0150978 0.135594 0.0703181 -0.00832255 0.0322153 0.0558832 -0.0723998 0.0181847 -0.0376179 -0.0983082 
0.0753229 0.0251284 -0.0265764 -0.0335726 0.112766 0.21023 0.100352 -0.0824477 -0.094363 -0.135094 -0.0630808 0.0639484 0.0492096 -0.108203 0.0161094 -0.0780023 -0.142086 0.0143564 -0.13308 0.120659 0.0658391 0.0098779 0.0600074 0.0958508 -0.0478711 -0.0229234 -0.148182 -0.189465 -0.00400877 0.0314474 0.0248089 0.0792331 -0.150834 0.121732 0.0788963 0.0357007 -0.00113208 0.0918191 -0.0364327 -0.0495827 0.122139 -0.0518246 0.00205471 0.0658744 -0.164854 0.0398959 0.153165 0.0789331 -0.143539 0.124583 -0.0519692 -0.110498 -0.00704053 0.0291876 0.13167 -0.0201683 -0.0408094 0.207299 -0.0422733 -0.114603 -0.0620891 0.141379 0.200336 -0.135111 0.0931699 -0.0231745 0.0301977 -0.018157 -0.116291 0.0782504 -0.0181097 0.0758555 0.00224652 0.128108 0.00173334 -0.0248123 -0.0694121 -0.0447543 0.0884144 0.0395672 0.0304023 0.0772018 -0.0500895 -0.0775931 -0.0687295 -0.0409027 0.0608292 0.0265035 -0.0554137 0.101628 0.218849 -0.135231 -0.00035678 -0.0829104 -0.0798331 -0.0288587 0.028469 0.0926033 0.0458338 -0.00422334 -0.00641816 0.0371055 -0.0461176 0.117508 -0.120776 0.0386958 -0.112379 0.151415 -0.0431496 0.0357965 0.109146 0.145339 -0.0923241 0.00145515 -0.000105713 0.0624267 -0.0650761 -0.0887933 0.00887821 0.132904 0.0701024 0.00272529 0.0369486 0.0720397 -0.0804788 -0.00369352 -0.0362203 -0.084989 
0.0776329 0.0424869 -0.0271036 -0.0413772 0.108668 0.20499 0.105751 -0.0808765 -0.100255 -0.129414 -0.0658215 0.0570422 0.056721 -0.0968345 0.0158101 -0.07393 -0.126168 0.0127566 -0.139423 0.118459 0.0624394 0.0175134 0.0518408 0.09566 -0.0558608 -0.0278453 -0.151277 -0.175326 0.00784178 0.0426234 0.014412 0.0870178 -0.148493 0.124456 0.0770538 0.0318671 0.00756373 0.0989981 -0.0393835 -0.0474017 0.109732 -0.0494654 0.013643 0.0597165 -0.151954 0.0549552 0.155835 0.0819366 -0.157585 0.126157 -0.046663 -0.102857 -0.00859625 0.0291514 0.130595 -0.0195095 -0.0471132 0.207583 -0.036795 -0.116744 -0.0629131 0.144718 0.193883 -0.141924 0.0889548 -0.0198234 0.027602 -0.0177179 -0.129679 0.0704003 -0.0159236 0.0639138 0.000717432 0.12774 0.00319928 -0.0188934 -0.0578915 -0.045173 0.0929766 0.0292193 0.0395581 0.0755738 -0.0573595 -0.079745 -0.0648557 -0.0441932 0.0506449 0.014127 -0.05041 0.114876 0.212655 -0.141839 -0.00276947 -0.0786452 -0.0732771 -0.0172574 0.0355824 0.0927431 0.0446378 -0.00186635 -0.00380313 0.0453985 -0.0484225 0.127603 -0.138317 0.0385064 -0.118875 0.149625 -0.0416816 0.0289249 0.115625 0.144925 -0.0956012 0.00666614 -0.00469851 0.0605583 -0.0647537 -0.0883801 0.00555346 0.132442 0.0644553 0.00017666 0.0429603 0.0740376 -0.0775138 -0.00586323 -0.0371973 -0.102713 
0.0849561 0.0158483 -0.0307286 -0.0312958 0.125214 0.215112 0.109554 -0.0790693 -0.0982442 -0.130773 -0.0659123 0.0715659 0.0507902 -0.110186 0.017908 -0.0726254 -0.130373 0.0333307 -0.134708 0.117765 0.0710889 0.0144186 0.0631371 0.111233 -0.0505407 -0.0400132 -0.147257 -0.193555 -0.0113052 0.0424071 0.0164741 0.0816488 -0.153604 0.126119 0.077743 0.0282333 -0.000344375 0.0720515 -0.0396067 -0.0497178 0.118367 -0.0465648 0.0110617 0.0641333 -0.168665 0.0303044 0.149147 0.0804604 -0.137017 0.13275 -0.0345041 -0.131204 -0.00960069 0.0261041 0.128688 -0.0162332 -0.0358437 0.211599 -0.0373731 -0.101358 -0.0548754 0.146171 0.192982 -0.14587 0.094068 -0.0354132 0.0168154 -0.0253589 -0.127852 0.0759224 -0.0216937 0.08159 0.000620115 0.118425 -0.0149384 -0.0163288 -0.0546692 -0.0420596 0.0867033 0.0292393 0.0339576 0.0743751 -0.0527948 -0.0726041 -0.0692526 -0.035356 0.0584605 0.0178031 -0.0633029 0.106444 0.212948 -0.136277 -0.00887127 -0.082491 -0.0753404 -0.0160302 0.0185246 0.0917642 0.0413587 0.00675034 0.00273368 0.0333537 -0.0479421 0.120985 -0.113264 0.0289518 -0.116473 0.140051 -0.0563275 0.0418414 0.104311 0.140036 -0.0748122 0.00150155 -0.00794533 0.0673497 -0.0557516 -0.076005 -0.00435229 0.136884 0.0682349 -0.000552769 0.0317619 0.0701128 -0.085307 -0.00276608 -0.0503294 -0.0962958 
0.0812328 0.0307002 -0.0318066 -0.0395954 0.126005 0.213117 0.0987546 -0.0845058 -0.114426 -0.122447 -0.0632342 0.0712848 0.0553664 -0.0998592 0.0197432 -0.0700985 -0.120302 0.0313636 -0.126176 0.121993 0.0665167 0.0200284 0.0699328 0.0891994 -0.0516756 -0.0184404 -0.143802 -0.18504 0.003913 0.0416762 0.00834493 0.0929108 -0.141223 0.124754 0.0787205 0.0287892 0.00764927 0.09362 -0.0291203 -0.053625 0.113157 -0.046399 0.0139039 0.061723 -0.179862 0.0444714 0.160638 0.0769269 -0.153239 0.126255 -0.0352744 -0.107781 -0.0172884 0.0335184 0.128832 -0.0208557 -0.0295815 0.204103 -0.0446984 -0.106777 -0.0615328 0.137681 0.201476 -0.146045 0.105839 -0.0299559 0.0153326 -0.0142939 -0.127222 0.0865359 -0.0170399 0.07439 -0.00122625 0.122 -0.00629243 -0.0188583 -0.0609826 -0.042463 0.0864654 0.0210823 0.0278804 0.0838644 -0.0450746 -0.0682575 -0.0644621 -0.0490808 0.0571484 0.0259365 -0.0525388 0.11254 0.211903 -0.137629 -0.0107282 -0.0747112 -0.0720671 -0.030091 0.0308929 0.107699 0.0390062 -0.00385877 -0.00455816 0.0447915 -0.0461601 0.128276 -0.120668 0.0373228 -0.110291 0.146948 -0.039327 0.028963 0.103232 0.142191 -0.0842447 0.0128319 0.00132032 0.0524216 -0.060803 -0.0947892 0.00538798 0.138051 0.0721904 -0.00164027 0.0414268 0.0655441 -0.0737931 -0.00284599 -0.0310275 -0.0922579 
0.0749474 0.0529279 -0.0255031 -0.0397449 0.0906365 0.199011 0.114161 -0.0860467 -0.10963 -0.116705 -0.0551 0.0555844 0.0740635 -0.078674 0.00102621 -0.0752848 -0.0966305 0.00518766 -0.133511 0.125344 0.0549979 0.0127755 0.0343149 0.105091 -0.0765051 -0.00422521 -0.159342 -0.161404 0.0350657 0.0401713 0.00603063 0.107237 -0.153165 0.118484 0.0672878 0.0337918 0.0190034 0.130917 -0.0308214 -0.0429994 0.107173 -0.043824 0.00297731 0.033407 -0.138349 0.0538731 0.154829 0.0831814 -0.161902 0.102164 -0.0528307 -0.0758989 -0.00418145 0.0386512 0.133256 -0.0172658 -0.0399496 0.208506 -0.0338356 -0.119927 -0.0698625 0.151603 0.196075 -0.155141 0.0865173 8.19268e-05 0.0484267 -0.0224146 -0.133577 0.0570027 -0.0235893 0.0486146 -0.00309451 0.152625 0.021733 -0.019365 -0.0490594 -0.0327326 0.103945 0.0148692 0.0335397 0.0789521 -0.0503005 -0.0867643 -0.0486757 -0.0519386 0.0540732 0.0136117 -0.0477358 0.10151 0.215065 -0.138435 0.0279436 -0.0649493 -0.0687541 -0.0305925 0.0567623 0.0953811 0.0523409 -0.00212575 0.00314169 0.062462 -0.055406 0.152925 -0.140343 0.0476194 -0.1053 0.141297 -0.0321903 0.0196318 0.103827 0.150594 -0.0958437 0.00842437 -0.00525748 0.057021 -0.0732611 -0.10232 -0.00324135 0.123948 0.0473254 -0.011675 0.0452465 0.0639262 -0.0912082 0.017021 -0.0526365 -0.105302 
0.0608708 0.0835009 -0.00306165 -0.0178157 0.075326 0.212494 0.118993 -0.123712 -0.101715 -0.0936842 -0.0533441 0.0442158 0.0730254 -0.0837284 0.0143529 -0.0763231 -0.118572 0.0343463 -0.124213 0.0943392 0.0558555 0.00878063 0.0198454 0.116255 -0.0593658 -0.0226622 -0.189624 -0.166981 0.0392679 0.07319 0.0149307 0.128836 -0.165316 0.106556 0.0969661 0.0339389 0.0121769 0.0985495 -0.00766317 -0.0475553 0.0981727 -0.0698091 0.00761166 0.0170376 -0.125672 0.05359 0.156589 0.0880015 -0.172892 0.0819325 -0.0326948 -0.0596289 0.0242271 0.0236445 0.121702 -5.56705e-05 -0.032859 0.193723 -0.0257989 -0.11399 -0.0675101 0.163478 0.179456 -0.163605 0.0884901 0.02136 0.0569452 -0.0427806 -0.157836 0.0706207 -0.0279796 0.0519178 -0.0177587 0.144053 0.0149837 -0.0196673 -0.0553298 -0.0543623 0.106024 0.0264599 0.0459725 0.0816373 -0.0586466 -0.0804961 -0.0475964 -0.0485753 0.0382365 -0.0166073 -0.0587202 0.116236 0.205232 -0.123461 0.047087 -0.0608342 -0.0913874 -0.0281093 0.0437755 0.10581 0.0713632 0.000144618 0.03261 0.0695375 -0.0569275 0.139782 -0.119521 0.0472848 -0.0817502 0.137334 -0.0265385 0.046053 0.0899707 0.133837 -0.0937074 -0.0207908 -0.0069063 0.0642483 -0.0763505 -0.0810485 -0.000346992 0.125056 0.0674682 -0.0394775 0.0316449 0.0508817 -0.0947003 0.0388108 -0.0432318 -0.0956696 
0.0448645 0.0983412 -0.0107813 -0.0217512 0.0791344 0.204258 0.11033 -0.160657 -0.093337 -0.0702837 -0.0557712 0.038074 0.0835365 -0.0529287 0.0202671 -0.0830059 -0.133572 0.048845 -0.115319 0.0835434 0.0498623 0.00150879 0.0142431 0.100399 -0.047814 -0.0195012 -0.199648 -0.162509 0.0314564 0.101749 0.00800948 0.137884 -0.15608 0.0855882 0.112637 0.0489865 0.00628766 0.0876587 0.00164399 -0.0598691 0.0922773 -0.07668 0.0143493 0.018187 -0.132749 0.0795024 0.156239 0.101107 -0.168619 0.0586841 -0.0364851 -0.0462662 0.0414015 0.0203654 0.12828 0.00659477 -0.0306461 0.182216 -0.0193278 -0.119686 -0.0641348 0.162703 0.174055 -0.142783 0.0850046 0.0391211 0.0534562 -0.0181218 -0.143885 0.069907 -0.0100248 0.0551491 -0.0160209 0.110841 0.0224979 0.00442604 -0.0794263 -0.0717887 0.104975 0.0249603 0.0570364 0.0955946 -0.0647448 -0.0643418 -0.0577849 -0.0413777 0.0355287 -0.0186885 -0.053225 0.123519 0.188741 -0.112831 0.0641651 -0.0677599 -0.120794 -0.0464967 0.0291083 0.117623 0.0953325 -0.0181515 0.0601812 0.0731917 -0.0357508 0.114411 -0.127352 0.0494684 -0.0896947 0.141223 -0.026165 0.0660388 0.0989854 0.115248 -0.104072 -0.0350019 -0.0182132 0.0721953 -0.0967915 -0.0736856 -0.00600049 0.114467 0.0811343 -0.0543554 0.0276453 0.0430719 -0.106185 0.0555117 -0.04391 -0.0762756 
0.0903749 0.0443451 -0.035652 -0.0607285 0.10472 0.207023 0.108863 -0.0796242 -0.080513 -0.139483 -0.0655134 0.0598629 0.0564123 -0.0988745 0.0240412 -0.072929 -0.122156 -0.0216437 -0.154668 0.101447 0.0430498 0.0559398 0.0384739 0.0679196 -0.073335 -0.000542151 -0.130366 -0.179537 -0.0107861 0.0391838 0.00980289 0.0838528 -0.138086 0.11963 0.0753879 0.0236845 0.0299913 0.129637 -0.0325262 -0.0209496 0.117783 -0.0375696 0.00105235 0.0608583 -0.153085 0.0777621 0.140575 0.068254 -0.150258 0.112848 -0.034746 -0.106873 -0.00178339 0.044135 0.132623 -0.0290356 -0.0504912 0.207885 -0.0401138 -0.116161 -0.0744395 0.114259 0.185763 -0.139957 0.0892171 -0.0331281 0.0415365 0.0189606 -0.103573 0.0413024 0.00428544 0.0488498 0.00950687 0.106207 0.0230306 0.0055026 -0.0884036 -0.0562663 0.0813084 0.0490421 0.0582128 0.0803359 -0.0389107 -0.070972 -0.0658424 -0.0557807 0.0771066 0.009844 -0.0668951 0.108998 0.181395 -0.1644 -0.00885785 -0.0687541 -0.098047 -0.0113428 0.0566661 0.0549192 0.0476021 0.000429884 -0.0085482 0.0494167 -0.0482702 0.138389 -0.164576 0.0112666 -0.14226 0.145372 -0.0655059 0.0241028 0.14748 0.136121 -0.105397 0.0129472 -0.0110578 0.0658059 -0.117066 -0.0851798 -0.0232449 0.105964 0.0745924 0.0109931 0.0621575 0.0703858 -0.0310402 -0.016363 -0.0462676 -0.106643 
0.0403002 0.0958808 -0.0204169 -0.0438121 0.111012 0.191332 0.0743572 -0.153296 -0.103258 -0.103483 -0.0523412 0.062298 0.0616476 -0.0385144 0.019021 -0.0780638 -0.101275 0.0135783 -0.09699 0.104455 0.0416621 0.0432414 0.0274676 0.0739954 -0.0456664 0.027668 -0.147426 -0.14629 0.0518703 0.0839983 0.00681258 0.121953 -0.108429 0.0817556 0.107665 0.0640446 0.0323887 0.120455 -0.00343761 -0.0571054 0.106394 -0.0387965 0.0167841 0.0241093 -0.155819 0.124192 0.181196 0.0765276 -0.176194 0.045061 -0.0587955 -0.0221499 0.0311941 0.0261469 0.149088 0.00643758 -0.0401188 0.195774 -0.0601463 -0.109971 -0.0882991 0.132607 0.202681 -0.14178 0.113643 0.0257802 0.0423648 0.00891163 -0.125142 0.0853759 0.0097846 0.0371689 -0.0158234 0.101007 0.0571441 0.0254135 -0.0924686 -0.0468155 0.0865857 0.0072183 0.0387264 0.126998 -0.038538 -0.0496957 -0.0494421 -0.0631125 0.0509946 0.0179108 -0.0654421 0.128094 0.193836 -0.123634 0.0301901 -0.0446174 -0.084791 -0.0627719 0.0526213 0.114608 0.0845743 -0.0355187 0.0128366 0.0750143 -0.0337363 0.112788 -0.168669 0.0732787 -0.0909028 0.128543 -0.0128623 0.0295167 0.122588 0.107266 -0.11957 -0.00455209 0.00144261 0.0517012 -0.121795 -0.120143 0.00049745 0.122708 0.0890535 -0.0251117 0.040894 0.0352461 -0.072958 0.0644812 -0.00759696 -0.0786049 
0.00332015 0.128406 0.0096545 -0.00448065 0.0758156 0.210669 0.0613565 -0.21761 -0.0801534 -0.0499879 -0.0477827 0.0423718 0.0452098 -0.0264994 0.0326586 -0.0809323 -0.117903 0.0709706 -0.0560861 0.047533 0.0274042 0.0218723 0.00387941 0.123676 -0.0116956 -0.00721813 -0.17732 -0.130584 0.053997 0.118659 0.0315652 0.124963 -0.119641 0.0410021 0.140332 0.0851413 -0.000320996 0.0386186 0.00645647 -0.0649562 0.0806382 -0.0651928 0.0188122 0.0042457 -0.124385 0.100342 0.170217 0.0996844 -0.169115 0.0190827 -0.0273687 0.00201468 0.0887718 -0.0160734 0.131758 0.0453212 -0.0315867 0.180679 -0.0295872 -0.106112 -0.0862468 0.174901 0.18072 -0.148725 0.104296 0.070748 0.0522234 -0.0403291 -0.173272 0.120741 0.0002749 0.0497287 -0.03158 0.0889609 0.0455784 0.0208713 -0.0935756 -0.0723954 0.0941876 -0.00538297 0.0614464 0.139544 -0.0555223 -0.0485975 -0.0386051 -0.0620756 0.00351924 -0.0244959 -0.0692423 0.14914 0.171244 -0.0725875 0.0792875 -0.0413543 -0.0864692 -0.0525338 0.0233181 0.129092 0.110291 -0.0336833 0.0778831 0.081428 -0.0298848 0.0472532 -0.13599 0.0850092 -0.0464621 0.066272 -0.0074526 0.0833822 0.108484 0.0890274 -0.0689441 -0.0558246 -0.0123689 0.0589123 -0.101074 -0.0763093 0.00675448 0.115133 0.112071 -0.0929358 0.0142579 -0.00741813 -0.116067 0.124021 -0.00284441 -0.0536684 
0.0451612 0.0947702 -0.0108921 -0.033441 0.0888156 0.223328 0.0918531 -0.141028 -0.106742 -0.0792079 -0.0542803 0.0474898 0.069369 -0.069573 0.0219628 -0.073787 -0.140918 0.0407262 -0.107377 0.08723 0.0563176 0.00922264 0.0294025 0.104319 -0.0394474 -0.0135866 -0.17615 -0.161168 0.0401373 0.0812494 0.014443 0.106451 -0.152956 0.0852988 0.101642 0.0547665 -0.00455494 0.0729571 -0.0010165 -0.0460077 0.0962977 -0.0722751 0.016537 0.0295562 -0.14479 0.0662693 0.171098 0.0925674 -0.176091 0.0751221 -0.034414 -0.0514839 0.0233277 0.0204573 0.129396 0.00812135 -0.0300768 0.199718 -0.0330163 -0.120236 -0.0731221 0.163071 0.198275 -0.148656 0.0916979 0.0304134 0.0422663 -0.0206982 -0.146869 0.0882105 -0.0094378 0.0716997 -0.019166 0.116378 0.0333647 -0.000420804 -0.0792842 -0.0588136 0.102961 0.0244116 0.0516982 0.0979247 -0.0448052 -0.0571336 -0.0644799 -0.038824 0.0386928 -0.000463669 -0.0492388 0.123225 0.19195 -0.117785 0.0419035 -0.0565566 -0.100546 -0.0499603 0.0294581 0.126757 0.0783052 -0.0174238 0.0367439 0.0642133 -0.0417367 0.107097 -0.133247 0.0691161 -0.0918274 0.134689 -0.0280595 0.0478742 0.105296 0.1235 -0.0893427 -0.0210978 -0.00677109 0.0685898 -0.0887889 -0.0726211 0.00189105 0.129018 0.0864242 -0.0607141 0.0349834 0.0334994 -0.107381 0.0620214 -0.0330363 -0.0676856 
-0.00630131 0.140527 0.0181704 0.0113396 0.0721958 0.195497 0.0689665 -0.231234 -0.0613185 -0.0482231 -0.0445905 0.0449007 0.0439428 -0.0196061 0.0273302 -0.0822751 -0.114285 0.0651609 -0.0704022 0.0490916 0.0233867 0.00450226 -0.011895 0.127482 -0.000231991 -0.0153419 -0.192461 -0.119202 0.0510952 0.126954 0.0406892 0.14365 -0.119229 0.0419659 0.128568 0.0868433 -0.00189851 0.0415949 0.00730707 -0.0643618 0.0882655 -0.0701387 0.0235784 -0.0118277 -0.107807 0.100557 0.160787 0.0945854 -0.159035 0.00153471 -0.0268509 0.0132711 0.0930176 -0.0226497 0.137928 0.0490332 -0.0471586 0.178186 -0.0293099 -0.104664 -0.0910959 0.171868 0.165071 -0.146396 0.0955848 0.0905751 0.0554773 -0.0412633 -0.182414 0.113841 0.00618742 0.0512871 -0.0303814 0.0919044 0.0580917 0.0305679 -0.0880828 -0.0774861 0.088542 -0.000226271 0.0550058 0.140666 -0.0530353 -0.0460794 -0.0382457 -0.056678 0.00442528 -0.026016 -0.070632 0.144383 0.158179 -0.0791124 0.0958948 -0.0360686 -0.0957615 -0.052679 0.0169672 0.109341 0.120929 -0.0363943 0.0800251 0.0742929 -0.0309588 0.0584936 -0.134497 0.0920724 -0.0472761 0.0728712 -0.00113236 0.0797976 0.10074 0.0884081 -0.0834291 -0.0531483 -0.0140639 0.0553988 -0.111523 -0.064279 0.0105154 0.118248 0.111042 -0.0799389 0.0042137 -0.00345132 -0.112524 0.135947 -0.00502434 -0.0589425 
-0.0160996 0.147538 0.0176512 0.00768196 0.0726769 0.188805 0.0639361 -0.233869 -0.0576336 -0.0472719 -0.0483816 0.0420561 0.0413262 -0.00756549 0.0331889 -0.0837431 -0.106735 0.0568746 -0.0626473 0.0456988 0.0209062 0.00263911 -0.00988123 0.121011 0.00552862 -0.0156522 -0.19125 -0.112007 0.0566128 0.128977 0.0490677 0.144218 -0.107128 0.0371716 0.130598 0.0937217 0.00124459 0.0478608 0.00509156 -0.0669222 0.0849489 -0.0658145 0.0254153 -0.013498 -0.106151 0.113425 0.160311 0.0928344 -0.157733 -0.0072114 -0.0338495 0.0252471 0.0967845 -0.0277102 0.140735 0.0535994 -0.0506458 0.178749 -0.034277 -0.103682 -0.0964326 0.167161 0.162421 -0.149424 0.103135 0.0933466 0.0524673 -0.036729 -0.185338 0.119714 0.0117484 0.0488059 -0.0377174 0.086308 0.0636207 0.0372105 -0.0878169 -0.0753647 0.0873272 -0.00299753 0.0457377 0.140002 -0.0529702 -0.0408758 -0.0352908 -0.0654013 0.001324 -0.0258081 -0.0687812 0.145063 0.152803 -0.0783668 0.0986429 -0.0371727 -0.0851333 -0.0560731 0.0201512 0.110578 0.119584 -0.0383282 0.0754143 0.0768761 -0.0320805 0.0536089 -0.142847 0.0971904 -0.0463931 0.0672961 0.00970629 0.0745142 0.0983997 0.0827233 -0.0903502 -0.0528929 -0.00858968 0.0539264 -0.108669 -0.0716523 0.0169407 0.12684 0.113665 -0.0770497 -0.000455454 -0.000560895 -0.10957 0.13708 0.00285285 -0.0564853 
0.0555698 0.105104 0.0117326 -0.00603096 0.0841085 0.212957 0.115005 -0.151281 -0.103882 -0.0920539 -0.0544814 0.0487465 0.0638085 -0.0578333 0.0270829 -0.0745025 -0.104333 0.0358035 -0.115336 0.0785608 0.0439879 0.0195543 0.0129558 0.115947 -0.0377985 -0.0293858 -0.193036 -0.142153 0.0416314 0.0890378 0.0162386 0.136472 -0.158128 0.0970038 0.0989095 0.0412339 0.0144771 0.0850469 0.00136617 -0.0448913 0.102512 -0.0595021 0.0263956 -0.00700457 -0.127099 0.0726288 0.158143 0.0750027 -0.172048 0.064611 -0.0174152 -0.0406112 0.0360839 0.0202592 0.130583 0.00976512 -0.0356409 0.199991 -0.0257899 -0.102699 -0.0798195 0.16873 0.165984 -0.176472 0.0945178 0.0478006 0.0551735 -0.0390546 -0.176819 0.084663 -0.00798173 0.0604703 -0.017533 0.136316 0.03411 0.00715599 -0.0553947 -0.0701589 0.0976103 0.015894 0.0519031 0.0950137 -0.0433459 -0.0700506 -0.04519 -0.0512239 0.0321966 -0.0238369 -0.0757786 0.128117 0.188596 -0.125462 0.0564097 -0.0502649 -0.0927117 -0.0307779 0.0460175 0.105644 0.08428 -0.00210354 0.031762 0.0763366 -0.0478571 0.138717 -0.136251 0.0600156 -0.0787577 0.125706 -0.0233482 0.0409314 0.0961406 0.119557 -0.0896821 -0.0162717 -0.00563756 0.0586623 -0.0889804 -0.0651734 -0.00430435 0.129992 0.0799096 -0.0467889 0.0264726 0.0330627 -0.0833999 0.0652862 -0.0302509 -0.0937388 
0.0731592 0.0581079 -0.0154936 -0.0337267 0.0941234 0.207685 0.118495 -0.0892266 -0.109971 -0.100988 -0.0558478 0.0457203 0.0732242 -0.083108 0.0240824 -0.0736516 -0.117376 0.016407 -0.135823 0.114656 0.0546813 0.00486255 0.0397216 0.104258 -0.059658 -0.0238765 -0.174742 -0.167111 0.0287266 0.0436354 0.0139414 0.10652 -0.163496 0.115797 0.0733385 0.0388995 0.00556523 0.10876 -0.0273259 -0.0419158 0.10789 -0.0553902 0.00554255 0.0352631 -0.144462 0.0502578 0.151503 0.0904159 -0.161439 0.10487 -0.0449973 -0.0847044 -0.00673349 0.0286023 0.125966 -0.0158063 -0.0435722 0.206145 -0.0276164 -0.115802 -0.0693521 0.154636 0.187322 -0.154198 0.085806 0.0107698 0.0443322 -0.0203186 -0.139373 0.0642359 -0.0174229 0.0727615 -0.00140749 0.145866 0.0147044 -0.0207869 -0.0558041 -0.0425758 0.105528 0.022463 0.0417623 0.0742682 -0.0556064 -0.0840308 -0.059045 -0.041985 0.0506681 0.00825079 -0.0480008 0.105921 0.212583 -0.132275 0.0259388 -0.0725328 -0.0830285 -0.0299557 0.0423995 0.0970726 0.0548217 -0.00301333 0.00823944 0.0526636 -0.0490435 0.135738 -0.134276 0.0513774 -0.107219 0.146236 -0.0244742 0.0301005 0.101062 0.151615 -0.0906095 -0.00166965 -0.00148978 0.0602296 -0.0696517 -0.0839463 -0.00252251 0.12829 0.0583692 -0.0205292 0.040781 0.0734858 -0.094156 0.0155735 -0.0491657 -0.096671 
0.0710208 0.0351529 -0.0238683 -0.0382716 0.121087 0.207537 0.0890775 -0.0905496 -0.111088 -0.130811 -0.0650104 0.0672332 0.0500013 -0.0916136 0.0191396 -0.0784417 -0.107797 0.0182927 -0.119527 0.121587 0.0583252 0.0268612 0.0641923 0.0905102 -0.0520221 0.00021679 -0.142574 -0.181094 0.0164411 0.0293264 0.0239127 0.0987415 -0.137017 0.121041 0.0828411 0.03998 0.0149227 0.113321 -0.0312466 -0.0529935 0.12362 -0.0390229 -0.000693117 0.056186 -0.172079 0.0590205 0.162358 0.0764742 -0.154673 0.104575 -0.0502368 -0.0866298 -0.00244017 0.0261101 0.131742 -0.0174838 -0.0301009 0.206683 -0.0436801 -0.113638 -0.0747131 0.139686 0.198883 -0.146392 0.111838 -0.0229769 0.0327691 -0.016104 -0.121517 0.0928607 -0.0193056 0.0612126 -0.00214547 0.130018 0.0086067 -0.0240284 -0.0724573 -0.0328222 0.0869752 0.0222415 0.019168 0.0934876 -0.0401962 -0.0759873 -0.0535505 -0.0657409 0.0619383 0.0313711 -0.062692 0.104671 0.218906 -0.126508 0.00437302 -0.074428 -0.064334 -0.0346699 0.0468105 0.106481 0.039898 -0.00889242 -0.0115836 0.0551304 -0.0488433 0.131318 -0.128279 0.0406764 -0.101966 0.137897 -0.0250245 0.0248071 0.105054 0.145058 -0.0985383 0.0119188 0.00657308 0.0469052 -0.0736854 -0.120244 0.0104628 0.135273 0.0727216 0.00272032 0.0378132 0.0610355 -0.0717217 0.00358001 -0.0282026 -0.0895498 
0.0744402 0.0212843 -0.00871962 -0.0228665 0.127066 0.217739 0.095575 -0.0925085 -0.118048 -0.121611 -0.0678437 0.059612 0.0442035 -0.0840726 0.0403465 -0.0726598 -0.117072 0.040409 -0.106941 0.109079 0.0637518 0.0178018 0.0707609 0.102527 -0.0319947 -0.0199819 -0.154725 -0.18265 0.00701972 0.0303851 0.0242775 0.101565 -0.149044 0.118847 0.0887586 0.0438424 0.00197489 0.0804448 -0.0283333 -0.0670467 0.123606 -0.0420102 0.0125248 0.0447785 -0.174882 0.0429582 0.157533 0.0788699 -0.152466 0.110119 -0.0448739 -0.105031 0.00926181 0.0239919 0.132957 -0.0112981 -0.0233575 0.206444 -0.0369956 -0.1113 -0.0652725 0.157005 0.191304 -0.151959 0.110041 0.00937086 0.021925 -0.0234609 -0.129188 0.10576 -0.02242 0.0846697 -0.00392184 0.12606 -0.00436881 -0.0250684 -0.0621307 -0.0485819 0.0914762 0.00993731 0.0268569 0.0964056 -0.0476582 -0.0860844 -0.0567791 -0.0536713 0.0505383 0.0306076 -0.0642028 0.115346 0.233133 -0.11111 0.00198941 -0.0781133 -0.0674512 -0.0243162 0.0325542 0.120216 0.0481067 -0.00483011 0.00255483 0.0383926 -0.0404013 0.107206 -0.116964 0.0487267 -0.0959328 0.123043 -0.0284076 0.030627 0.0953708 0.146395 -0.0766301 -0.00842816 0.0197962 0.046474 -0.0573903 -0.0998086 0.0106007 0.136373 0.0822886 -0.01243 0.0406379 0.0582953 -0.0867891 0.0150675 -0.0166645 -0.0831236 
0.109747 0.00750073 -0.0816193 -0.0382188 0.140245 0.188943 0.113823 -0.071766 -0.122509 -0.0921885 -0.0464063 0.104715 0.0795993 -0.0986976 -0.0128891 -0.061897 -0.066782 0.0365144 -0.121387 0.15815 0.061294 0.0182907 0.0705966 0.0932162 -0.0783748 0.0140093 -0.111248 -0.193697 0.0138105 0.0625966 -0.0353514 0.125031 -0.127858 0.122997 0.0436845 -0.000268928 0.0155222 0.136483 -0.0323673 -0.0608596 0.100848 -0.0342044 -0.00710078 0.0752355 -0.206106 0.0347976 0.152395 0.0722954 -0.136758 0.119788 0.00112399 -0.0906349 -0.036703 0.0357081 0.142931 -0.0392191 -0.0204032 0.199781 -0.0409858 -0.101875 -0.0557832 0.0862447 0.213926 -0.137678 0.106066 -0.0700423 0.00516145 0.00669106 -0.113169 0.0617124 -0.0245218 0.0627826 -0.000674535 0.118408 -0.0222431 -0.00909068 -0.0429676 -0.0112357 0.0749959 0.0205144 0.0163136 0.085042 -0.0359476 -0.0729678 -0.0391163 -0.0740513 0.0752179 0.0411226 -0.0320465 0.0884212 0.179905 -0.140101 -0.0333339 -0.0545597 -0.066438 -0.0494901 0.0533142 0.0836765 0.036709 -0.0192198 0.00976916 0.0597259 -0.0428901 0.167478 -0.132212 0.0127668 -0.119618 0.145004 -0.0269837 0.0166303 0.103196 0.160295 -0.0823242 0.0325398 -0.0025616 0.0407157 -0.0770917 -0.122903 -0.00804411 0.130522 0.0458491 0.0158967 0.0478097 0.0605337 -0.0605276 -0.00443298 -0.0493922 -0.107592 
0.0883189 0.00854318 -0.0362307 -0.0240853 0.147862 0.200508 0.105738 -0.0910849 -0.14106 -0.0826193 -0.057106 0.0740999 0.0628237 -0.0629685 0.0281957 -0.0591152 -0.0721653 0.0626815 -0.0899261 0.132588 0.058701 0.0165818 0.0783115 0.0971071 -0.0480253 0.0155621 -0.145528 -0.184221 0.0411742 0.039008 -0.00347536 0.142787 -0.148699 0.101323 0.0720325 0.0348604 -0.00183262 0.121944 -0.0227197 -0.0800377 0.110746 -0.0194054 -0.0128005 0.0487968 -0.199581 0.044635 0.152941 0.0856168 -0.144944 0.0819157 -0.0266605 -0.0747969 -0.00617423 0.0126394 0.13563 -0.0236367 -0.00421267 0.212148 -0.0300041 -0.104503 -0.0649868 0.129003 0.205451 -0.141679 0.119188 -0.000936259 0.0134701 -0.00233063 -0.11447 0.105318 -0.0225151 0.0914862 0.0014901 0.133191 -0.0227512 -0.0300548 -0.0587442 -0.0203534 0.0869868 -0.0143443 0.022124 0.110405 -0.0485881 -0.0981702 -0.0324262 -0.0850133 0.0606405 0.0542972 -0.0487313 0.0936998 0.225582 -0.0841293 -0.0112068 -0.0666589 -0.0508563 -0.048578 0.0557953 0.122306 0.0461047 -0.0179057 0.0147551 0.0507861 -0.0333443 0.124866 -0.12973 0.0429155 -0.0903674 0.110377 0.0175138 0.0211741 0.0878307 0.167753 -0.0748158 0.00280134 0.0336563 0.0308099 -0.0693458 -0.132478 0.00458297 0.124265 0.0631801 -0.00510408 0.0455722 0.0520979 -0.0934413 0.0250691 -0.0267868 -0.0873999 
0.0908954 -0.000893082 -0.033253 -0.0134683 0.14477 0.201108 0.112377 -0.0925207 -0.121895 -0.0943512 -0.0514328 0.0773965 0.0632764 -0.0698916 0.0260606 -0.0687861 -0.0857996 0.0628158 -0.101975 0.137464 0.0660474 0.00424627 0.0769177 0.115817 -0.0436209 -0.00701353 -0.15065 -0.192326 0.0237418 0.0454961 0.00190221 0.129926 -0.149127 0.106015 0.0713303 0.0349759 -0.00630112 0.114068 -0.0335909 -0.0804964 0.114115 -0.0260527 -0.0192053 0.0466667 -0.197638 0.0328819 0.145043 0.0847163 -0.135528 0.093011 -0.0315176 -0.0867136 0.00215619 0.0131394 0.141055 -0.0202657 -0.0140224 0.212486 -0.0329456 -0.104173 -0.0648821 0.132293 0.202987 -0.142997 0.110213 0.000284998 0.0171806 -0.00772663 -0.121683 0.098952 -0.0219547 0.0915942 -0.00170339 0.128207 -0.0217145 -0.0245447 -0.0559423 -0.0289453 0.089169 0.00144142 0.0165059 0.10226 -0.0538915 -0.101762 -0.0373353 -0.0699449 0.0609044 0.048232 -0.0531023 0.0936327 0.228119 -0.0958351 -0.00310018 -0.0684418 -0.0636379 -0.0498152 0.0392132 0.108701 0.0544543 -0.0161585 0.0237755 0.0432622 -0.0336461 0.117851 -0.120814 0.0447997 -0.0914247 0.111014 0.00644298 0.0275631 0.0867984 0.165938 -0.0730135 -0.00421374 0.0271008 0.0458018 -0.0686464 -0.118308 0.0034234 0.133785 0.0613337 -0.00542124 0.0311339 0.0602959 -0.094565 0.0296461 -0.0283483 -0.084925 
0.0998936 0.00250999 -0.0520223 -0.0280348 0.138998 0.202797 0.112022 -0.0825918 -0.115995 -0.119071 -0.0567548 0.0886307 0.0618905 -0.0933346 0.00830743 -0.0678545 -0.0900754 0.0312681 -0.121774 0.135957 0.0683028 0.0162344 0.0653982 0.101819 -0.0575785 -0.00474501 -0.133009 -0.195311 0.000831612 0.0490364 -0.00203116 0.112093 -0.145273 0.125666 0.0628002 0.0233779 0.00425143 0.107534 -0.0363883 -0.0621941 0.114954 -0.0322717 -0.00217339 0.0670521 -0.183714 0.0408802 0.149905 0.0753116 -0.140052 0.111545 -0.0230753 -0.107916 -0.0153849 0.0240223 0.141653 -0.0272114 -0.0320938 0.215115 -0.0415497 -0.0971469 -0.0575749 0.120317 0.20483 -0.143708 0.111049 -0.0415927 0.0120969 -0.00370042 -0.118761 0.0775196 -0.0206117 0.0744927 9.54721e-05 0.117484 -0.0203609 -0.0131698 -0.0495791 -0.028094 0.0793751 0.0223418 0.0209171 0.0820315 -0.045084 -0.0853736 -0.0612816 -0.0659609 0.0713775 0.0306416 -0.0583195 0.0976866 0.206682 -0.130744 -0.0190997 -0.0653746 -0.068863 -0.0267888 0.0435733 0.0826173 0.0421904 -0.00474373 0.00427516 0.0488215 -0.048196 0.137665 -0.126195 0.0254062 -0.115897 0.136862 -0.0353207 0.0250035 0.104001 0.152006 -0.0841857 0.0131558 0.00935717 0.0533266 -0.0733268 -0.107388 -0.00370934 0.13605 0.0570026 0.00925973 0.0401948 0.0662733 -0.0698032 0.00339902 -0.0419373 -0.104309 
0.106787 -0.0124625 -0.0347906 -0.0226975 0.144333 0.214882 0.111544 -0.0808161 -0.114819 -0.125468 -0.0593504 0.0962246 0.0588918 -0.0932934 0.00767551 -0.0620287 -0.091069 0.0550539 -0.121945 0.126888 0.0805904 0.0295503 0.0699567 0.124528 -0.0608877 -0.0176585 -0.131451 -0.199321 -0.0113089 0.0546422 -0.0106918 0.105861 -0.153635 0.128142 0.0671234 0.0151629 0.00185543 0.0875544 -0.0351092 -0.0565439 0.108538 -0.021314 0.000569117 0.0551567 -0.182635 0.0195677 0.145473 0.0670402 -0.133906 0.123783 -0.000565047 -0.130413 -0.00824655 0.0310256 0.140436 -0.020129 -0.0168579 0.219465 -0.036566 -0.0920378 -0.0445002 0.133805 0.195066 -0.15216 0.111849 -0.0500089 0.00839883 -0.0136414 -0.126255 0.088651 -0.022273 0.0800751 0.000172291 0.107667 -0.0381626 -0.00797197 -0.0413918 -0.0351827 0.0792701 0.0147198 0.0321625 0.0895983 -0.0422602 -0.0851452 -0.0573935 -0.0614588 0.0711632 0.0266986 -0.0729197 0.102969 0.207055 -0.130194 -0.0198922 -0.0561225 -0.0698435 -0.0122079 0.0312607 0.0874637 0.0402598 0.0123581 0.0190033 0.0452116 -0.0571042 0.13887 -0.107436 0.0163494 -0.11228 0.110948 -0.0572505 0.0294993 0.0953902 0.146741 -0.0605788 0.0107903 0.00518122 0.0609241 -0.0695038 -0.0914962 -0.0225841 0.131461 0.0572849 0.00646662 0.0350847 0.0486217 -0.0713927 0.0155395 -0.0485423 -0.106488 
0.0984211 0.00362263 -0.0266457 -0.0215239 0.143857 0.213066 0.112489 -0.0935339 -0.12652 -0.105757 -0.0561538 0.0811913 0.0626696 -0.0710131 0.0310948 -0.0746297 -0.0821647 0.0502782 -0.108157 0.126761 0.0610913 0.0221778 0.0655132 0.102619 -0.0497158 -0.00534409 -0.149194 -0.183013 0.00819466 0.0466852 -0.00458196 0.127025 -0.15204 0.120379 0.0775127 0.0308508 0.0046906 0.104908 -0.0241106 -0.0777154 0.116989 -0.0318758 -0.00787008 0.0366202 -0.192811 0.0455956 0.139501 0.0816015 -0.146928 0.097323 -0.0232099 -0.0904756 0.00227192 0.0224829 0.138746 -0.0224718 -0.0263738 0.212566 -0.0464097 -0.0942698 -0.0595298 0.137897 0.197773 -0.153784 0.119555 -0.00336367 0.0135266 0.000515182 -0.132333 0.0936181 -0.0153798 0.0791811 -0.0035355 0.116398 -0.0214928 -0.00853491 -0.0491328 -0.046683 0.0933049 0.0077776 0.0200413 0.0922911 -0.040979 -0.0921307 -0.0475297 -0.0780986 0.0671654 0.0359686 -0.0618059 0.111649 0.221127 -0.115704 0.000854136 -0.0513802 -0.0768783 -0.0373941 0.0461945 0.0926681 0.0501423 -0.00990968 0.0234857 0.0559553 -0.0494965 0.125002 -0.117836 0.0392496 -0.0959927 0.115431 -0.0212941 0.0279005 0.0982192 0.148598 -0.0751245 0.00686828 0.0242411 0.0434701 -0.0798587 -0.103873 -0.00304724 0.13468 0.0646507 -0.0111887 0.0371562 0.0566661 -0.0650121 0.0257711 -0.0244807 -0.100347 
0.105488 -0.00426635 -0.0296613 -0.0123184 0.143929 0.212647 0.118075 -0.089878 -0.115579 -0.126111 -0.0617411 0.0881492 0.0545874 -0.0894958 0.0150778 -0.0652387 -0.0806682 0.0509349 -0.122087 0.124093 0.0694327 0.0253133 0.068837 0.117218 -0.0546657 -0.0208484 -0.14303 -0.192781 -0.0067155 0.0501619 -0.00188219 0.12539 -0.153264 0.133153 0.06996 0.0155724 0.0103613 0.0946765 -0.0322289 -0.0655806 0.117571 -0.0278535 0.00315938 0.0383241 -0.178142 0.0288684 0.139907 0.0705628 -0.137881 0.114124 -0.00935374 -0.119692 0.0054624 0.0251171 0.135186 -0.0206596 -0.0183562 0.21259 -0.03742 -0.0891579 -0.0524715 0.140039 0.186416 -0.162538 0.116464 -0.0262203 0.0113102 -0.0179172 -0.138077 0.0879836 -0.0288624 0.0726714 -0.0022177 0.119644 -0.032843 -0.01135 -0.0339595 -0.0427398 0.0795736 0.010058 0.0249788 0.0871503 -0.0466595 -0.0930883 -0.0507441 -0.0667961 0.0634308 0.0224709 -0.0788076 0.107696 0.216591 -0.124919 -0.0109321 -0.0567341 -0.066283 -0.00761669 0.0384813 0.0869674 0.0453044 0.0113254 0.0187117 0.0459767 -0.0575453 0.142667 -0.105305 0.0165346 -0.101756 0.114252 -0.0453904 0.0303766 0.090729 0.149725 -0.0636931 0.00801267 0.011338 0.0498177 -0.071907 -0.092255 -0.0119534 0.133439 0.0598169 0.00727809 0.0347235 0.0538168 -0.0655942 0.0144082 -0.0421632 -0.115056 
0.10815 -0.00477199 -0.0317646 -0.0147573 0.144921 0.215265 0.11567 -0.0894612 -0.117291 -0.128956 -0.0626909 0.0900377 0.0525499 -0.093508 0.0170338 -0.0687915 -0.0794994 0.0495627 -0.118497 0.122106 0.0667605 0.0345406 0.0663469 0.117643 -0.0553646 -0.0194539 -0.13772 -0.192498 -0.010135 0.0501382 -0.00207106 0.118078 -0.154281 0.132489 0.0730174 0.014448 0.0128693 0.0875323 -0.03186 -0.0621048 0.11991 -0.026205 0.00366321 0.0461944 -0.18279 0.0306264 0.141183 0.0709433 -0.135808 0.117048 -0.00437304 -0.120877 0.00337537 0.0254457 0.134905 -0.0223224 -0.0202839 0.213623 -0.0363283 -0.0881256 -0.051779 0.13864 0.186571 -0.160972 0.115594 -0.0364389 0.0144752 -0.0199034 -0.13464 0.0870144 -0.0260543 0.0717561 0.000516101 0.116465 -0.0339194 -0.0109091 -0.038976 -0.0408923 0.0790203 0.0148843 0.0296457 0.089304 -0.0415742 -0.0892113 -0.0489278 -0.0686596 0.0661529 0.0202948 -0.0821276 0.108024 0.213446 -0.125757 -0.014246 -0.0580933 -0.0691726 -0.0102124 0.0413465 0.0838748 0.0410242 0.00939148 0.0162019 0.0517157 -0.0541851 0.141852 -0.109885 0.0134092 -0.103343 0.11485 -0.0517365 0.0359475 0.0997117 0.144487 -0.0636935 0.0100105 0.0040651 0.0489549 -0.0725474 -0.0935587 -0.0161884 0.130649 0.0612815 0.00585229 0.0355014 0.0511017 -0.0608989 0.0105522 -0.0433214 -0.11408 
0.105458 -0.00886783 -0.0464401 -0.0264461 0.140129 0.196094 0.1187 -0.0813076 -0.132639 -0.105147 -0.0555043 0.0871434 0.076309 -0.0757733 0.0119216 -0.0682641 -0.0803896 0.0408547 -0.115215 0.144372 0.0690894 0.00740569 0.0688634 0.100734 -0.0615916 0.00273743 -0.142924 -0.195457 0.00474031 0.0520942 -0.0198605 0.125273 -0.150919 0.122363 0.0579506 0.0179627 -0.00202119 0.124063 -0.0302982 -0.0702489 0.106614 -0.0292616 -0.0106182 0.0503043 -0.187375 0.041417 0.143369 0.0753533 -0.142973 0.104447 -0.0203889 -0.103462 -0.00986209 0.0297083 0.142111 -0.0339992 -0.0225122 0.213745 -0.0388843 -0.0973204 -0.048686 0.125408 0.200425 -0.140138 0.113803 -0.0261257 0.0105182 0.00574159 -0.118916 0.0675343 -0.0196866 0.0764833 0.00103942 0.117089 -0.0255124 -0.00884373 -0.0445589 -0.0387514 0.0907031 0.0190631 0.0180744 0.0772534 -0.0477596 -0.0927035 -0.0566249 -0.0713392 0.0739294 0.0361386 -0.0513816 0.0918556 0.207419 -0.12158 -0.00604507 -0.0549278 -0.0794048 -0.0333706 0.0485103 0.0875723 0.0502294 -0.00685717 0.0176517 0.0531202 -0.0475453 0.144034 -0.122211 0.0276984 -0.112601 0.134544 -0.0256063 0.0182145 0.0981509 0.157311 -0.0813867 0.00916808 0.0139219 0.0556227 -0.0805419 -0.104701 -0.0111917 0.130867 0.0439093 0.00098001 0.0382771 0.0602832 -0.0704961 0.0152151 -0.0448249 -0.106817 
0.107514 -0.0143262 -0.0360514 -0.0198274 0.144164 0.203757 0.116981 -0.080939 -0.128667 -0.122463 -0.05943 0.0863532 0.0657902 -0.0786998 0.0180294 -0.072627 -0.0779103 0.0404716 -0.113384 0.13818 0.0685154 0.0189391 0.0691143 0.109907 -0.05733 -0.00738453 -0.144189 -0.194406 4.7178e-05 0.0452192 -0.00847207 0.117377 -0.155496 0.124177 0.0637261 0.0215437 0.00193245 0.109181 -0.034523 -0.0674729 0.11627 -0.0209612 -0.00954621 0.0469435 -0.187903 0.0387752 0.140694 0.0720412 -0.135007 0.107853 -0.0216993 -0.110697 -0.001816 0.0276434 0.140038 -0.0311226 -0.0209834 0.21579 -0.036038 -0.0923951 -0.0518582 0.136625 0.19218 -0.148121 0.112506 -0.0287419 0.0172944 -0.00616304 -0.120899 0.0744436 -0.0196814 0.0772299 0.0041358 0.118403 -0.0266602 -0.00921888 -0.0461286 -0.0396406 0.0879318 0.0202529 0.0213806 0.0822914 -0.0439418 -0.093485 -0.0498294 -0.0685996 0.073165 0.0326498 -0.0695479 0.0937899 0.216741 -0.118526 -0.00621913 -0.0576653 -0.0758577 -0.0282937 0.0473489 0.0859268 0.0459734 -0.000661118 0.0131328 0.0529509 -0.0467783 0.140331 -0.120758 0.0252399 -0.106467 0.12558 -0.0326858 0.0261808 0.100015 0.151707 -0.076085 0.00695445 0.010072 0.0563385 -0.0765185 -0.103698 -0.0156969 0.131027 0.0467694 0.00313385 0.0331179 0.0575557 -0.0708472 0.0154246 -0.0449179 -0.106381 
0.0796119 0.037364 -0.0353305 -0.0377933 0.117058 0.201327 0.0958324 -0.104457 -0.118762 -0.127776 -0.0570128 0.0636773 0.0577521 -0.0788319 0.00840705 -0.0813342 -0.116598 0.0191584 -0.110111 0.126351 0.0613976 0.0162052 0.0658122 0.0719089 -0.054902 0.000966116 -0.149366 -0.180333 0.0158358 0.0469396 0.00520543 0.0943372 -0.141032 0.107353 0.0910927 0.0335471 0.00579121 0.12265 -0.0197713 -0.0631204 0.100582 -0.0371146 -0.00762799 0.0569704 -0.176272 0.0725488 0.158638 0.0800594 -0.157786 0.107478 -0.0584121 -0.0687348 -0.000538399 0.033137 0.131651 -0.0319816 -0.0239184 0.205722 -0.05327 -0.110252 -0.0620361 0.138611 0.215704 -0.134209 0.10743 -0.0190175 0.0285205 -0.00252567 -0.114735 0.086281 -0.00866684 0.0619398 -0.00118208 0.127922 0.000878408 -0.0226088 -0.0720629 -0.0529449 0.0939344 0.032425 0.0238704 0.0815572 -0.0504347 -0.0811553 -0.0582627 -0.0685819 0.0514858 0.027834 -0.0498517 0.103032 0.222794 -0.124571 0.00931292 -0.0695717 -0.0744812 -0.0543716 0.0480929 0.108649 0.0516336 -0.0141958 0.000382302 0.0666319 -0.0453979 0.12161 -0.130841 0.0460366 -0.0940972 0.153212 -0.0130654 0.0314108 0.115683 0.137939 -0.101622 0.0110672 0.00768305 0.0599458 -0.0729096 -0.105677 0.0145706 0.131336 0.0565576 -0.00612575 0.0387729 0.0590759 -0.0717136 0.00804083 -0.0182846 -0.084676 
0.0903765 0.0133369 -0.0342566 -0.0283655 0.123335 0.21155 0.109244 -0.078217 -0.107818 -0.13182 -0.0596592 0.0725754 0.0563205 -0.0992935 0.0143495 -0.0708443 -0.11831 0.0256875 -0.130717 0.123567 0.073991 0.0110678 0.0652334 0.103281 -0.0500851 -0.0260997 -0.147445 -0.193382 -0.00519248 0.0423692 0.0104877 0.0901168 -0.151742 0.126305 0.0715232 0.0282848 -0.00245068 0.0935991 -0.0366257 -0.0528724 0.113093 -0.0388813 0.00397062 0.0604854 -0.168866 0.0348686 0.151469 0.0728329 -0.145182 0.12424 -0.0368658 -0.118385 -0.0107976 0.0296228 0.132131 -0.0212377 -0.0346124 0.214916 -0.0405561 -0.103315 -0.0585346 0.139946 0.199728 -0.148825 0.102027 -0.0288162 0.0191514 -0.0162262 -0.125681 0.0756339 -0.0183867 0.078699 -0.00048335 0.122362 -0.0131484 -0.0180988 -0.0531126 -0.0452854 0.0854755 0.0305461 0.0257472 0.0715361 -0.0497272 -0.0829832 -0.0701805 -0.0435255 0.0612057 0.0186916 -0.0598833 0.100494 0.213899 -0.137671 -0.0097802 -0.0756755 -0.0712572 -0.019793 0.0307631 0.0912585 0.0411265 0.00569082 -0.00218498 0.0410761 -0.0493887 0.128394 -0.121297 0.0345883 -0.112908 0.142536 -0.0452812 0.0282168 0.101979 0.144192 -0.0825651 0.00516098 0.00569521 0.064073 -0.0613246 -0.0864398 0.00198747 0.137656 0.0598315 4.20288e-05 0.0377294 0.0697908 -0.0753596 0.000839731 -0.0392 -0.0961202 
0.10921 -0.00692984 -0.0377111 -0.0270728 0.134795 0.211551 0.113909 -0.0813131 -0.118289 -0.129476 -0.0590238 0.0847706 0.0635077 -0.091051 0.0119737 -0.0706953 -0.0960586 0.0400782 -0.123292 0.130604 0.0718956 0.0269308 0.0673564 0.101658 -0.064084 -0.0138259 -0.13809 -0.194518 -0.0144075 0.0511685 -0.0142823 0.106867 -0.151327 0.131468 0.0709913 0.0148657 0.00985701 0.100215 -0.0309882 -0.0628627 0.109373 -0.0315482 0.00111117 0.0523955 -0.184799 0.0315142 0.142069 0.072567 -0.140176 0.127265 -0.0162217 -0.12148 -0.00582311 0.0397323 0.138316 -0.0309981 -0.021375 0.207415 -0.0426789 -0.096947 -0.0469258 0.133816 0.196189 -0.148715 0.108644 -0.0380162 0.0141852 -0.00831044 -0.123293 0.0739793 -0.0213219 0.0688656 0.00274052 0.113948 -0.0294112 -0.011459 -0.0442281 -0.0498371 0.0855867 0.0248679 0.0328975 0.0780118 -0.0442797 -0.0876543 -0.0575706 -0.0596545 0.0670287 0.0240099 -0.0640152 0.107942 0.213594 -0.136389 -0.0137818 -0.0583303 -0.081628 -0.0198201 0.0375268 0.0851965 0.0426897 0.00549189 0.0167949 0.0524129 -0.0527995 0.137585 -0.11196 0.0186001 -0.109764 0.130462 -0.0536664 0.0315742 0.103733 0.143906 -0.0725313 0.0115184 0.0026582 0.0577315 -0.0696146 -0.0895564 -0.0145413 0.126835 0.0545513 0.00230945 0.0433856 0.0579857 -0.0589647 0.00280538 -0.0385846 -0.10668 
0.0774365 0.0303355 -0.0322127 -0.0346987 0.116009 0.208749 0.10207 -0.0851502 -0.105942 -0.125983 -0.0546439 0.0670506 0.0553532 -0.101863 0.0124884 -0.0784212 -0.124227 0.0214868 -0.126341 0.12117 0.0689326 0.0133157 0.0581417 0.100971 -0.0495858 -0.0157808 -0.144987 -0.187721 0.0142975 0.0390451 0.0210996 0.085573 -0.150823 0.118435 0.0781034 0.0335596 -0.00230472 0.0982612 -0.032937 -0.0486218 0.116898 -0.0457863 -0.00551272 0.0717889 -0.169659 0.0437663 0.156909 0.0803087 -0.149782 0.111306 -0.0476896 -0.0944501 -0.0123123 0.0221191 0.127307 -0.0185195 -0.038305 0.214565 -0.0422988 -0.108991 -0.0671913 0.136258 0.208061 -0.137055 0.0980114 -0.0290551 0.0313775 -0.0202213 -0.118962 0.0838711 -0.0188671 0.0729356 -0.000518271 0.129085 -0.00108831 -0.0291675 -0.0683443 -0.0342295 0.0868094 0.0353783 0.024301 0.0794288 -0.0472582 -0.0800398 -0.0638114 -0.0514494 0.0625796 0.022243 -0.0573365 0.0973551 0.218513 -0.130443 -0.00301899 -0.079291 -0.070747 -0.0368437 0.0339398 0.0951905 0.0435083 -0.00634603 -0.00680892 0.0489022 -0.04631 0.126558 -0.126357 0.0410636 -0.106131 0.150423 -0.0278383 0.0288371 0.108638 0.145272 -0.0960783 0.00587799 0.003894 0.0613101 -0.0652119 -0.100987 0.011259 0.137513 0.0638318 -0.00257576 0.0306943 0.0704277 -0.0836763 0.00173236 -0.0373485 -0.0867495 
