-0.0548323 0.101389 -0.0552738 -0.0301874 0.0305211 0.227636 0.000436679 -0.186539 -0.0452413 0.0458761 -0.0194664 0.00890068 0.0759113 -0.0738705 -0.0404642 0.0108737 -0.177793 0.137013 -0.0412462 0.00763666 0.102692 -0.0539598 -0.00268624 0.0387346 -0.0335473 0.0624253 -0.177555 -0.211364 0.0309287 0.106476 0.0186972 0.161235 -0.0975816 0.0136463 0.155069 0.0941651 -0.0152064 0.00952604 0.0674733 -0.103353 0.0469182 -0.125864 0.0292586 0.0440622 -0.0754169 0.0164652 0.179311 0.0989937 -0.201144 -0.05775 -0.0401931 -0.0615972 0.0693116 0.00149292 0.0899156 0.0843046 0.0483988 0.0809057 -0.0310597 -0.155 -0.0271843 0.130996 0.208562 -0.096409 0.119203 0.0771817 -0.0100917 0.0213002 -0.0523697 0.113519 -0.0361143 0.0459687 -0.06762 -0.0172743 0.0104766 -0.0133717 -0.13206 -0.0162664 0.055201 -0.0540067 0.0364062 0.15542 -0.0694658 -0.0236162 -0.138208 0.0502968 0.0276063 0.00567933 -0.00234524 0.109048 0.13868 -0.0571494 0.0298089 -0.0284212 -0.114728 -0.00701986 -0.0419843 0.176008 0.0678841 -0.00998196 0.156483 0.0107147 -0.0529507 -0.00700679 0.00141355 0.0758966 -0.0432728 0.0553427 -0.0614534 0.0911123 -0.0115875 0.0536999 -0.0443998 -0.126643 0.0485518 0.0586903 -0.126034 -0.0809369 0.0241974 0.0347514 0.143793 -0.1194 0.0835853 -0.0289804 -0.14151 0.128935 -0.0228393 0.00933375 
-0.0269832 0.0915201 -0.072089 -0.0390509 0.0884883 0.226283 -0.0145714 -0.108165 -0.0766024 0.00292891 0.0128063 0.0367884 0.0660036 -0.0513131 -0.0610984 0.0235725 -0.10814 0.158991 -0.0176753 0.0288789 0.186186 -0.0644724 0.0460281 0.0894766 0.0188086 0.026484 -0.086706 -0.1933 0.102391 0.10846 0.038571 0.0837767 -0.0532154 0.0102722 0.105608 0.0767623 -0.0499851 0.0170365 0.0259798 -0.102834 0.0381008 -0.064232 0.0464495 0.12024 -0.12489 -0.0271474 0.217264 0.0382869 -0.211052 -0.0509477 -0.0283698 -0.055281 0.0079782 -0.0160874 0.0985035 0.106281 0.0382844 0.154285 -0.0321856 -0.16936 -0.0503523 0.0718907 0.263212 -0.114222 0.145999 0.0147163 -0.0508419 -0.00485894 -0.0741933 0.176495 -0.0276982 0.0625427 -0.0924838 -0.0553579 -8.8044e-05 -0.023858 -0.0825625 0.0663332 0.02024 -0.0821246 -0.0503066 0.161466 -0.0293561 -0.0221618 -0.10935 0.0254238 0.0363305 0.0368911 0.0125933 0.0840137 0.139171 -0.0922596 -0.0673237 -0.0434069 0.0057133 -0.0379835 -0.0475032 0.229159 0.0109339 0.00253891 0.070666 0.013817 -0.0350126 0.0311313 -0.0541007 0.112493 -0.0483973 0.0453244 -0.00885189 -0.0270745 -0.026469 0.054086 -0.0558828 -0.0627791 0.0987391 0.0480057 -0.0778885 -0.143778 0.0624926 0.113094 0.110338 -0.0876885 0.0331506 -0.0315444 -0.141749 0.124957 0.0162933 0.0283769 
-0.0278358 0.0383264 -0.0592082 -0.0490648 0.0473694 0.23637 0.0147658 -0.124585 -0.0923387 -0.0375842 -0.0485773 0.00434859 0.0773035 -0.0604964 -0.0463615 -0.0219923 -0.165114 0.105091 -0.0123926 0.0332506 0.126844 -0.0516799 0.0372813 0.0137429 -0.0553638 0.0585711 -0.17781 -0.22842 0.0320443 0.0487783 0.0366028 0.12043 -0.113591 0.00934117 0.158038 0.0905532 -0.0270728 0.0377439 0.0304078 -0.126112 0.0557412 -0.0768836 0.00745781 0.0818193 -0.116105 0.0154099 0.183269 0.0838431 -0.19931 -0.0131231 -0.105714 -0.102167 0.0747954 0.0192601 0.081426 0.052523 0.0609151 0.122767 -0.0322528 -0.175054 -0.00918942 0.169477 0.236583 -0.0949051 0.132931 0.0570796 0.0065893 0.000765115 -0.0283542 0.107836 -0.0444528 0.0370982 -0.0483284 0.0124131 -0.0240137 -0.0414971 -0.118225 -0.0356108 0.0779417 -0.0456947 0.0115464 0.122369 -0.0857068 -0.0616068 -0.111994 0.010692 0.0322859 0.02453 -0.00650148 0.0841871 0.216988 -0.0424657 0.013299 -0.062728 -0.0677922 -0.0162369 -0.00855001 0.222001 0.0221448 0.0149665 0.10681 0.0229919 -0.0458883 -0.0161683 -0.0300883 0.0842329 -0.0279447 0.0684424 -0.046945 0.0751786 0.0101623 0.0551195 -0.0544816 -0.120983 0.0532929 0.0615667 -0.0771142 -0.118098 0.0426885 0.0467581 0.0973602 -0.109889 0.0768527 -0.0268923 -0.157928 0.0816724 -0.0133373 0.0120819 
-8.56456e-06 0.0671155 -0.0571565 -0.0874577 0.0519599 0.203987 0.0629262 -0.0994498 -0.118403 0.0420242 -0.0389167 -0.0119176 0.128544 -0.0474575 0.032334 -0.026183 -0.15284 0.102995 -0.040313 0.00971511 0.106027 0.00455936 -0.0146401 0.0211602 -0.0528591 0.0639314 -0.189648 -0.232618 0.0668851 0.109353 -0.00385727 0.146337 -0.128874 0.000446962 0.13643 0.0528133 -0.0257817 0.0407749 0.0409222 -0.0675336 0.0659518 -0.0787903 -0.000878555 0.12129 -0.125462 0.0683122 0.180527 0.0814182 -0.203931 -0.0881873 -0.0395145 -0.0890606 0.0472709 0.00374744 0.0694848 0.0552442 0.0325427 0.128481 0.0200465 -0.157694 -0.0145504 0.112646 0.163879 -0.0310154 0.0819438 0.0295931 0.0407087 0.0374532 0.0167531 0.0274947 -0.00674982 0.0600636 -0.0236558 -0.0340271 -0.00747947 -0.0063043 -0.189458 -0.0242093 0.0718201 -0.0018534 0.0714587 0.137881 -0.0821475 -0.0422425 -0.0943156 0.0275832 0.0843399 -0.0231207 -0.0232299 0.0667777 0.146447 -0.0374827 -0.0181163 -0.0837633 -0.160873 -0.0307883 0.0022175 0.173216 0.0604228 -0.0108026 0.102277 0.0422798 0.0292226 0.0203563 -0.132179 0.0336249 -0.101959 0.123975 -0.0316756 0.0695932 0.0751645 0.0503122 -0.139125 -0.149815 0.00926419 0.0758522 -0.146762 -0.149076 -0.0251219 0.00377598 0.108301 -0.0990965 0.0591273 0.017289 -0.141875 0.0548266 -0.0709251 0.00317576 
-0.00877539 0.135148 -0.0395161 -0.0770923 0.0486397 0.221124 0.0618973 -0.130362 -0.111179 0.0551314 -0.0117694 -0.00444194 0.099041 -0.0614092 0.0188864 -0.036132 -0.132752 0.129209 -0.0444964 -0.0298694 0.0911416 0.0282813 -0.0634298 0.0242209 -0.0362982 0.0718541 -0.169848 -0.177889 0.10989 0.130625 0.00218301 0.1603 -0.126221 -0.000802998 0.143441 0.0427927 -0.0271619 0.00339293 0.0649515 -0.0655679 0.0703162 -0.0952642 0.0226672 0.128326 -0.10451 0.06849 0.186361 0.0763558 -0.246189 -0.119791 -0.0102142 -0.0263516 0.0285776 -0.0315545 0.0524688 0.0886162 -0.0150793 0.150746 -0.0114663 -0.13415 -0.0342717 0.0975049 0.19563 -0.0418932 0.0949002 0.038853 0.0327289 -0.000685492 -0.0416024 0.0843212 -0.00778654 0.0303914 -0.0288436 -0.0247073 -0.0116283 -0.0193659 -0.167393 -0.0154753 0.0453942 -0.040537 0.0614295 0.164497 -0.0647379 -0.0312236 -0.0858352 -0.00533158 0.0669684 -0.0445386 -0.0250716 0.113499 0.137677 -0.0603476 -0.0446339 -0.0522598 -0.114237 -0.0185877 0.0126769 0.151892 0.056894 -0.00362174 0.0882643 0.0769938 0.0119379 0.0317051 -0.13833 0.0614438 -0.0727418 0.110769 -0.0201492 0.0463471 0.0935925 0.0343913 -0.144565 -0.118247 0.0351311 0.030218 -0.14084 -0.147208 0.0287957 0.0136247 0.135234 -0.117581 0.0527926 -0.00611179 -0.0955442 0.071115 -0.0287899 -0.0237596 
-0.0222923 0.113848 -0.0441172 -0.0951858 0.0325919 0.260489 0.0488003 -0.0554532 -0.105343 0.103794 0.00588228 -0.0384943 0.117051 -0.0727087 0.0597692 -0.0231858 -0.14977 0.129975 -0.0436452 -0.0425835 0.106146 -0.0121629 -0.023628 0.0647754 -0.0139249 0.0297929 -0.146988 -0.201807 0.120634 0.0783107 0.0388779 0.102854 -0.122967 0.00861704 0.10545 0.0606616 -0.0623464 -0.00842816 0.037025 -0.0376167 0.0688555 -0.118301 -0.019155 0.136619 -0.114573 -0.000547692 0.165373 0.0943118 -0.234936 -0.111082 -0.0117203 -0.0600915 0.00972839 -0.0483403 0.0204297 0.107958 -0.00340486 0.156503 0.018896 -0.162931 -0.0621308 0.0984534 0.194239 -0.0569951 0.0807178 0.071053 0.0265283 0.0144887 -0.042381 0.0872276 -0.0218825 0.0763289 -0.049281 -0.0447867 0.0134481 -0.039968 -0.170715 0.0139838 0.0577222 -0.0263979 0.0331334 0.12521 -0.0503787 -0.0398515 -0.104498 0.0384703 0.081726 -0.031452 0.00406359 0.0841084 0.129277 -0.058073 -0.0439466 -0.0599184 -0.10956 -0.0270231 -0.0247794 0.157306 0.0312039 0.0040035 0.09836 0.0336848 0.0106889 0.00521698 -0.11846 0.0774073 -0.0943157 0.070462 -0.0126234 0.0144925 0.0644266 0.0749798 -0.0970566 -0.139631 0.0571363 0.050191 -0.136251 -0.124053 0.033062 0.0395911 0.142061 -0.165579 0.038947 0.0121499 -0.130974 0.0871401 -0.0513036 0.014981 
-0.00557735 0.0827797 -0.048507 -0.0497475 0.0750637 0.282332 0.0415018 -0.0983272 -0.0757669 0.0455445 0.0186795 0.0349445 0.0995426 -0.0455305 0.00434213 -0.0553061 -0.14247 0.149466 -0.024223 0.0024083 0.153777 -0.0478171 -0.0364355 0.104732 0.0236001 -0.018974 -0.166993 -0.183087 0.0783519 0.136933 0.0427404 0.0585586 -0.11892 0.0042929 0.106341 0.0878437 -0.106914 -0.0655015 0.0497918 -0.0720166 0.0565869 -0.0904014 -0.0141813 0.0802617 -0.107513 -0.0522992 0.1441 0.0680828 -0.187003 -0.066335 -0.0248858 -0.0400265 0.0319745 -0.0420382 0.0514102 0.121359 -0.0349246 0.188443 -0.0579187 -0.117123 -0.0486415 0.123111 0.237299 -0.115092 0.0901505 0.0583767 0.00436529 0.00148394 -0.12089 0.0987355 0.0194624 0.101458 -0.0832944 -0.0656182 -0.0181834 0.0251806 -0.0972005 -0.0478998 0.0669077 0.00184052 -0.0261679 0.113871 -0.00606124 0.00317375 -0.112292 0.0259158 0.0716126 -0.0166958 0.0266212 0.083278 0.1145 -0.0902356 0.00373914 0.0181416 -0.097697 -0.0723117 -0.0565623 0.124555 0.0169694 0.0180026 0.121683 0.0437736 -0.0469451 -0.0181812 -0.0982521 0.152918 -0.0442644 0.0237737 -0.050154 0.0441207 0.0478955 0.0107915 -0.0734746 -0.0971545 0.0501532 0.0886487 -0.111022 -0.0502146 0.0230678 0.105401 0.103743 -0.188743 -0.00143243 -0.0349826 -0.122035 0.17062 -0.0115205 0.0192356 
0.0274976 0.0412957 -0.0136972 -0.0348784 0.046616 0.245824 0.118642 -0.0955881 -0.025107 -0.0359947 -0.0139062 0.00762437 0.0995136 -0.0860072 0.0414555 -0.0697796 -0.200079 0.0662215 -0.121133 -0.0257859 0.110645 -0.00234231 -0.0383229 0.114643 -0.0177257 -0.046469 -0.175257 -0.22407 -0.01648 0.10231 0.047337 0.0863728 -0.161751 0.0722041 0.110547 0.0465738 -0.0206837 -0.0278556 0.00614235 -0.030546 0.1384 -0.113722 -0.00539887 0.0772119 -0.102631 -0.00329989 0.111665 0.083854 -0.141241 -0.0364291 -0.0245515 -0.124013 0.0636568 0.00820652 0.0925898 0.0779003 -0.0349748 0.159655 -0.00491207 -0.126225 -0.0439306 0.118705 0.137881 -0.0923666 0.0589858 0.0504665 0.0566921 0.0126321 -0.0500736 0.0456053 -0.0137779 0.0707585 -0.0355156 -0.0325344 0.0271358 0.0274115 -0.144474 -0.0484725 0.0553332 0.0601099 0.0587051 0.0836095 -0.031906 -0.0459483 -0.133582 0.0716165 0.112435 -0.0519732 -0.0964754 0.0874027 0.152601 -0.123351 0.0176208 -0.0874474 -0.205123 -0.0109318 -0.0498374 0.0622407 0.100412 0.0159672 0.126245 0.018525 0.00159351 0.0382577 -0.0727905 0.0149614 -0.115209 0.120016 -0.128484 0.0690116 0.0721029 0.0495162 -0.101548 -0.137314 0.00752926 0.117207 -0.151251 -0.0364063 -0.0277661 0.0671471 0.135289 -0.105718 0.00972627 0.0497827 -0.102351 0.0799752 -0.0846363 -0.00455784 
0.0206961 0.0619947 0.0130928 -0.0401482 0.0378439 0.219248 0.113801 -0.09226 0.00869965 -0.079363 -0.0234478 0.00395058 0.0939334 -0.138206 0.00160864 -0.0375958 -0.225919 0.0502338 -0.172024 -0.0149495 0.147841 0.0141808 -0.0264332 0.104554 -0.055068 -0.0633064 -0.176715 -0.234291 -0.0145962 0.115209 0.0377673 0.0640993 -0.143249 0.0939882 0.137775 0.0107686 0.029111 0.00615114 0.0052899 -0.0199742 0.116937 -0.114634 0.0238985 0.0718716 -0.0736123 -0.00796075 0.124226 0.0782617 -0.140086 0.0042795 -0.0253515 -0.145168 0.0454852 0.0403219 0.098551 0.05876 -0.0121402 0.115574 -0.0276946 -0.132043 -0.0260608 0.0963873 0.122284 -0.0876072 0.0700976 -0.0211099 0.0466456 -0.0158665 -0.0480695 0.0258354 -0.0340147 0.0304945 -0.0355633 -0.0287828 0.0213537 0.0192208 -0.13031 -0.0238307 0.0556159 0.0800391 0.0866363 0.0717048 -0.0363709 -0.0111348 -0.130225 0.0832306 0.0951292 -0.043054 -0.110837 0.1034 0.147265 -0.154444 -0.000317467 -0.0878876 -0.212483 0.00606498 -0.0645208 0.0736446 0.0871959 0.037683 0.132093 0.0132167 -0.0305603 0.070847 -0.0202399 -0.0293422 -0.100473 0.149302 -0.130554 0.0752621 0.0394289 0.0338144 -0.114868 -0.101729 -0.0154658 0.141505 -0.144635 -0.0106607 -0.062203 0.0643614 0.115383 -0.0447062 0.0116279 0.0551657 -0.0883115 0.0502763 -0.0940225 -0.0261937 
0.0120408 0.0802097 -0.0188542 -0.086923 0.0428686 0.215525 0.0904959 -0.0573391 0.00348725 -0.0691244 -0.0171374 -0.000720716 0.102882 -0.159455 -0.0363719 -0.0322554 -0.231691 0.0384675 -0.188457 0.00282511 0.159506 0.0054071 -0.028488 0.0626685 -0.0728232 -0.0382414 -0.139783 -0.219644 0.00777017 0.0957861 0.0209557 0.0408211 -0.122023 0.0868505 0.121583 0.00098852 0.0153838 0.0244107 -0.00739714 -0.0336388 0.108158 -0.12848 0.0215005 0.117872 -0.0699883 0.0151543 0.134306 0.0893959 -0.189218 0.00120939 -0.0484208 -0.128003 0.0125099 0.0331424 0.0886805 0.0490387 -0.0317483 0.105478 -0.0401926 -0.162899 -0.014433 0.0732757 0.16079 -0.0414631 0.0653211 -0.0453639 0.0221119 0.0211629 -0.0209874 0.0255065 -0.0290967 0.00282847 -0.037192 -0.0588741 0.0240505 0.019921 -0.140686 0.0043387 0.0509446 0.07216 0.0680872 0.0720076 -0.0394166 -0.00161481 -0.139273 0.0884018 0.100057 -0.0159457 -0.0645741 0.114272 0.146429 -0.166188 -0.0443662 -0.0745014 -0.200113 -0.000288841 -0.0577515 0.0777741 0.0641721 0.0114609 0.126805 0.0138437 -0.0352474 0.062322 -0.0404994 -0.0173451 -0.121087 0.179774 -0.127304 0.0412571 0.0628088 0.0451368 -0.13697 -0.0770335 0.00176274 0.125532 -0.17756 -0.0344083 -0.0339603 0.0603065 0.105442 -0.0340961 0.0290856 0.0607549 -0.0734181 0.027609 -0.0864191 -0.0382238 
-0.054904 0.0555825 -0.00755194 -0.0822278 0.0477195 0.204446 0.0481871 -0.0638084 -0.0119995 -0.0139812 -0.0107831 0.00942634 0.066165 -0.142548 -0.00543384 -0.017982 -0.261335 0.0621898 -0.100913 -0.00902568 0.149009 -0.026167 -0.0249369 0.0527833 -0.033624 0.0245798 -0.120005 -0.234776 0.0438825 0.0544695 0.0490765 0.0214088 -0.0873372 0.0359395 0.142462 0.0623152 -0.0343434 -0.00808626 -0.00950741 -0.0673789 0.119411 -0.131214 0.00691141 0.155929 -0.081475 0.0253627 0.15994 0.0776268 -0.207605 -0.0654061 -0.101046 -0.131288 0.0197937 -0.0145986 0.0975792 0.0934361 -0.0502822 0.119799 -0.0592151 -0.146446 -0.0291974 0.0667276 0.20185 0.000618209 0.123283 0.00675989 -0.00937532 0.00991249 0.00132813 0.0748437 -0.0298056 0.0322813 -0.0444411 -0.0856911 0.0377473 0.000902163 -0.170764 0.0445172 0.0489515 0.013147 0.0272593 0.100668 -0.0589703 -0.00566303 -0.161887 0.0608931 0.104788 0.0237886 -0.04319 0.109669 0.167971 -0.0891427 -0.0560625 -0.0756944 -0.160122 -0.00257616 -0.0663944 0.107651 0.0733875 0.00142706 0.10021 -0.0225042 -0.028695 -0.0558108 -0.0363604 0.0465351 -0.0835132 0.122638 -0.0802526 0.030155 0.0385645 0.0479413 -0.109994 -0.136421 0.0667452 0.100927 -0.147667 -0.0830392 0.0116843 0.0605094 0.136966 -0.07814 0.0228418 0.0385552 -0.115545 0.0902188 -0.0358624 0.0128292 
-0.0638272 0.0401421 -0.0540769 -0.0781218 0.0144192 0.201661 0.0125337 -0.0453263 -0.0415709 0.0248791 0.00505646 0.0123069 0.0917543 -0.114653 -0.0444284 -0.0185947 -0.261339 0.0678015 -0.0658338 0.0491626 0.14292 -0.109171 0.0365992 0.04382 -0.0446031 0.0611644 -0.100789 -0.246713 0.0546612 0.0223389 0.0324172 0.0199972 -0.0778025 0.00634483 0.0868697 0.0810482 -0.0777395 0.0684656 -0.0241125 -0.0678185 0.0729754 -0.133566 -0.0447215 0.161146 -0.117978 -0.0308847 0.174646 0.0727808 -0.200192 -0.0324554 -0.10841 -0.100664 -0.0137622 0.00191727 0.098165 0.0764962 -0.00772893 0.128879 -0.0379543 -0.182131 -0.0346512 0.0633296 0.263724 -0.0086444 0.123732 0.0224007 -0.00767626 0.0205297 0.00886163 0.0923413 -0.0426585 0.0638174 -0.0387105 -0.0273192 0.0407173 -0.0407766 -0.150578 0.0528829 0.0632713 -0.00150214 -0.0286435 0.074481 -0.0644163 -0.0332771 -0.162531 0.0514208 0.0930037 0.065082 0.0465204 0.048899 0.156871 -0.0831816 -0.0242177 -0.0726769 -0.110231 -0.0564976 -0.0522784 0.149635 0.0608413 -0.00700471 0.0777651 -0.0235577 -0.0340809 -0.0433051 -0.0273198 0.093624 -0.075518 0.107982 -0.0306275 -0.00747379 0.00481408 0.10662 -0.0721616 -0.120933 0.0841971 0.0877652 -0.105004 -0.105732 0.0542932 0.067013 0.0993325 -0.10156 0.0311703 0.0199397 -0.146284 0.103717 -0.0258239 0.0547497 
-0.0579653 0.0693989 -0.0352234 -0.0662849 0.0211951 0.20417 0.0595788 -0.0587311 -0.00599047 0.0184777 0.00738581 -0.00770401 0.0755983 -0.145194 -0.0166155 -0.0397658 -0.280317 0.0613552 -0.088803 0.0104627 0.130906 -0.0794927 -0.0111177 0.0592679 -0.0252018 0.007654 -0.123877 -0.235506 0.065264 0.051961 0.0490678 0.0182241 -0.0937014 0.0153587 0.117368 0.0575734 -0.0647718 0.00528905 -0.0259415 -0.0689152 0.112051 -0.161248 -0.0336497 0.169529 -0.105175 -0.00121089 0.144607 0.0984602 -0.187234 -0.0587528 -0.111753 -0.0875098 0.0163879 -0.0310602 0.0830588 0.0875914 -0.0465388 0.117567 -0.0431068 -0.155834 -0.0439082 0.0655909 0.227785 0.00587652 0.0964161 0.0296931 0.0099849 -0.0127766 -0.00538483 0.0683511 -0.0455709 0.0518751 -0.0376922 -0.0456198 0.0456649 -0.0255636 -0.159131 0.0403366 0.0581096 0.0335044 0.00906215 0.0690799 -0.0689572 -0.018304 -0.142783 0.0671569 0.0868597 0.0267576 -0.00188739 0.0839943 0.169616 -0.0781325 -0.0378572 -0.0861266 -0.155603 -0.0532007 -0.0690884 0.105623 0.0894874 -0.0173069 0.112997 -0.0193182 -0.00919906 -0.0610548 -0.037965 0.0708869 -0.0628129 0.137576 -0.0397199 0.0344815 0.0454766 0.0806473 -0.0957972 -0.143315 0.0591106 0.0990074 -0.123855 -0.0655343 0.0475622 0.0651469 0.117085 -0.106464 0.00434 0.0476125 -0.137643 0.0993708 -0.0419085 0.035153 
-0.0584409 0.0567052 -0.0336708 -0.0730911 0.0169378 0.199918 0.0238714 -0.0587239 -0.0252214 0.00443554 0.00563761 -0.00514354 0.0887518 -0.133776 -0.0371526 -0.00666623 -0.267289 0.0547975 -0.0877141 0.0237521 0.159137 -0.0818142 0.00290407 0.043453 -0.0362568 0.0460979 -0.114586 -0.250449 0.0536003 0.046827 0.0399517 0.0271827 -0.083117 0.0219925 0.113357 0.0644002 -0.0519763 0.0409225 -0.00530998 -0.071832 0.0882488 -0.150033 -0.0199509 0.154283 -0.0802459 -0.0086593 0.171818 0.0775353 -0.209819 -0.0615375 -0.108387 -0.110476 0.0183402 -0.00041231 0.0954687 0.0814217 -0.0200907 0.105075 -0.0397314 -0.181445 -0.0278693 0.0597597 0.229172 0.00221471 0.111909 0.0272249 0.00134212 0.0156722 0.0169195 0.0561976 -0.0514721 0.0383074 -0.0473059 -0.0633812 0.0512857 -0.0258145 -0.159376 0.0492659 0.0565352 0.0382922 0.00867194 0.0740874 -0.0626016 -0.0216587 -0.163169 0.0720876 0.0939511 0.0399222 0.00510688 0.0701555 0.158759 -0.0836167 -0.0398587 -0.0649179 -0.157471 -0.0296718 -0.0614286 0.13214 0.0736678 -0.012128 0.103032 -0.0240316 -0.0288261 -0.0400142 -0.0234294 0.067141 -0.0742727 0.136047 -0.05236 0.00706797 0.0162469 0.0773392 -0.103165 -0.135677 0.0741875 0.103678 -0.145167 -0.0832159 0.0269506 0.0518631 0.105825 -0.087776 0.031889 0.0300077 -0.131996 0.100654 -0.0374212 0.0353918 
-0.0425611 0.0540221 -0.0139082 -0.0941947 0.00603984 0.173486 0.0517628 -0.0185702 0.0114504 -0.0162026 0.0120899 -0.0161787 0.111086 -0.154161 -0.0613308 -0.0187805 -0.282646 0.0403413 -0.161595 0.0192895 0.18713 -0.0700971 -0.0165013 0.0666163 -0.0599632 -0.000897963 -0.106817 -0.225594 0.0502594 0.0569283 0.0189013 -0.00113153 -0.0919321 0.058981 0.0914345 0.0159819 -0.0363717 0.0471035 -0.0242579 -0.0464662 0.0979648 -0.162551 -0.0165752 0.155073 -0.0594439 -0.0365252 0.134181 0.0899026 -0.179058 -0.0351192 -0.0948344 -0.116118 -0.00802915 0.0240975 0.0929793 0.0680783 -0.0247424 0.0827423 -0.0413215 -0.188954 -0.00621812 0.0412595 0.189091 0.0418555 0.0564168 -0.0125582 0.0102563 0.0160333 0.0316518 0.0234876 -0.061822 0.00869666 -0.0392158 -0.0666543 0.0553438 -0.0138845 -0.147235 0.056243 0.0588717 0.0679596 0.0312556 0.0490898 -0.0377648 -0.00299302 -0.160465 0.10125 0.11436 0.0408958 -0.00176238 0.0747407 0.149896 -0.127099 -0.0398794 -0.0753376 -0.202992 -0.0334355 -0.0915097 0.0962458 0.0847614 -0.0107269 0.130293 -0.0198665 -0.0268994 0.0096508 0.00466127 0.0168563 -0.100458 0.179959 -0.0762239 -0.00781232 0.0216486 0.0793932 -0.13333 -0.102038 0.0414999 0.132957 -0.148439 -0.047595 -0.00167499 0.0552659 0.0864738 -0.0538519 0.00704217 0.0526146 -0.129485 0.0700283 -0.0777079 0.0178482 
-0.0204606 0.0611987 -0.0175296 -0.0776888 0.0247088 0.206657 0.0490603 -0.0307947 -0.0288517 0.000368014 0.00771955 -0.00830979 0.114207 -0.159291 -0.0305081 -0.00723857 -0.25097 0.0680276 -0.144818 0.0254087 0.183029 -0.0601752 0.00634252 0.0990961 -0.0431675 -0.014431 -0.119541 -0.249418 0.051437 0.0690036 0.0260901 0.0231154 -0.107333 0.0656573 0.0853071 0.0220928 -0.048925 0.0245445 -0.0152777 -0.032338 0.0908587 -0.161101 -0.0146805 0.146119 -0.0789844 -0.0312318 0.159331 0.0861805 -0.196336 -0.0218331 -0.0437039 -0.12267 -0.00563159 0.010212 0.0801257 0.0675277 -0.000537374 0.0999317 -0.007434 -0.179873 -0.0175932 0.0627261 0.179466 -0.00365867 0.064557 -0.0240282 0.00695099 0.00691019 -0.000929367 0.0428874 -0.060188 0.0400573 -0.0524138 -0.0591655 0.04228 -0.0205136 -0.14466 0.0594166 0.0573396 0.0751032 0.030651 0.055859 -0.0374248 -0.011446 -0.152924 0.101414 0.106195 0.0131782 -0.0222728 0.0729628 0.13706 -0.116684 -0.047198 -0.0722317 -0.192931 -0.0240365 -0.0844642 0.122956 0.0697301 -0.00941257 0.124506 -0.0131123 -0.0221499 0.0380264 -0.0119344 0.0176775 -0.111065 0.169025 -0.0670054 -0.000703156 0.0181902 0.0895816 -0.115999 -0.111656 0.0331177 0.128214 -0.149574 -0.0595773 -0.0109328 0.0796258 0.0974324 -0.0665795 0.0077309 0.0487057 -0.135591 0.0730784 -0.0794207 0.0154861 
-0.0617931 0.0853032 -0.000284156 -0.0774702 0.0254418 0.219835 0.0434402 -0.0350286 -0.0244178 0.0592966 0.0122589 -0.02027 0.114798 -0.107592 0.00654058 -0.00347523 -0.22801 0.114115 -0.121987 -0.0357736 0.190917 -0.0839557 -0.011319 0.0846571 0.00570422 -0.0177596 -0.139379 -0.21727 0.0713873 0.0793334 0.0560841 0.0527016 -0.0868055 0.0481673 0.089567 0.0413382 -0.0716538 -0.000292921 0.00715308 -0.0558244 0.0907545 -0.160205 0.00972185 0.131666 -0.0662541 -0.0571521 0.142395 0.0721471 -0.212205 -0.0942253 -0.0324251 -0.113474 -0.00261827 -0.0249531 0.0626538 0.121122 -0.0145386 0.11332 -0.0104052 -0.18187 -0.0352925 0.0604462 0.16115 -0.0124027 0.0868063 0.0538156 -0.0221427 0.0238033 -0.037519 0.0811667 -0.0376702 0.0598552 -0.0665188 -0.104778 0.0359043 -0.00632708 -0.143982 0.0355653 0.0481983 0.0173387 -0.0107969 0.0776939 -0.0191066 0.00310985 -0.169859 0.0811952 0.109602 0.0100961 0.00489614 0.0821696 0.100952 -0.111 -0.0409377 -0.0614977 -0.167851 -0.00864315 -0.10258 0.137446 0.0468229 0.0161893 0.12707 -0.0173255 -0.0198841 0.0131151 -0.0126838 0.0518221 -0.110999 0.116732 -0.039523 -0.0280831 -0.0102885 0.069332 -0.121645 -0.121987 0.0806641 0.100996 -0.143858 -0.0612302 0.0214059 0.0876727 0.135077 -0.110027 -0.00901025 0.0209711 -0.126714 0.103916 -0.0517904 0.0339013 
-0.0344207 0.0588327 -0.0052224 -0.0571546 0.0287693 0.217497 0.0438431 -0.0386841 -0.0252386 0.0130441 0.0114023 -0.0183529 0.109939 -0.123146 -0.00783887 0.0101239 -0.239181 0.0879772 -0.124303 -0.00850007 0.206014 -0.0777782 0.00249584 0.109826 0.00322124 -0.0350553 -0.136548 -0.239538 0.0532715 0.0857237 0.044228 0.0331756 -0.100323 0.0597345 0.0868968 0.0404224 -0.0614909 -0.0084692 0.00153318 -0.0460388 0.0895317 -0.152022 0.0146505 0.119497 -0.0614678 -0.0562818 0.155518 0.0698337 -0.186579 -0.0541395 -0.0346754 -0.129681 0.0128909 0.00169213 0.08556 0.0979698 0.00655306 0.104286 -0.00333494 -0.18075 -0.0235734 0.0747113 0.158718 -0.0201921 0.0699398 0.0313154 -0.0106271 0.00936972 -0.0177473 0.0584869 -0.0525827 0.0661831 -0.0668178 -0.0892734 0.0482091 -0.0057831 -0.131069 0.043556 0.0485553 0.056763 0.0218055 0.0667918 -0.0209632 -0.00740354 -0.164022 0.114033 0.0999422 0.00931602 -0.0266266 0.0732382 0.123661 -0.109468 -0.044274 -0.0650702 -0.188146 -0.007237 -0.105507 0.140698 0.0655296 0.0101717 0.1338 -0.0263299 -0.0137323 0.019902 -0.00633357 0.0410849 -0.107689 0.137291 -0.0639713 -0.010841 -0.0113943 0.0707783 -0.108395 -0.129212 0.0594582 0.131894 -0.13788 -0.040962 -0.00771752 0.0899727 0.112212 -0.0898567 0.00149026 0.0256822 -0.149953 0.107025 -0.0631179 0.0369498 
-0.032427 0.0510695 -0.0275113 -0.0725968 0.0364739 0.181868 0.0505811 -0.0301907 -0.0249132 -0.00736362 0.0119282 -0.0046039 0.116846 -0.127157 -0.0568912 -5.21322e-05 -0.250917 0.0607116 -0.143119 0.046712 0.209869 -0.106777 -0.00468711 0.0909995 -0.0220138 -0.0175182 -0.126306 -0.223028 0.0660957 0.0738322 0.0152044 0.0072377 -0.103818 0.0506845 0.0714191 0.0348973 -0.0747891 0.028279 -0.0222067 -0.0673737 0.0853107 -0.14635 0.00974768 0.148587 -0.0623295 -0.0390047 0.158634 0.0794629 -0.189323 -0.0339275 -0.0801661 -0.125978 -0.020774 0.00698403 0.103748 0.0702997 -0.0323389 0.115641 -0.0237771 -0.189242 -0.00190622 0.0602072 0.201918 0.0182352 0.0628697 0.00961779 -0.0197517 0.0155657 0.00359943 0.0319165 -0.0463343 0.0534775 -0.0457856 -0.0679422 0.0424361 -0.00864552 -0.117248 0.0614835 0.0620927 0.0525285 0.0129284 0.0552867 -0.0385712 -0.0100479 -0.164917 0.102988 0.0991035 0.0457547 0.0107221 0.0635282 0.144099 -0.120093 -0.0492146 -0.068738 -0.175924 -0.0340529 -0.0901315 0.123696 0.0683117 -0.0112238 0.114333 -0.0266295 -0.0176056 0.0135263 -0.0294564 0.0600029 -0.107312 0.176523 -0.0533762 -0.022228 0.0107675 0.0815759 -0.12552 -0.0948484 0.0547475 0.128931 -0.138005 -0.0435239 -0.0020568 0.0837895 0.0658785 -0.0601605 0.000371404 0.0458523 -0.161439 0.0944765 -0.0712313 0.0160784 
-0.00786632 0.0281625 -0.0199809 -0.062175 0.0318458 0.223016 0.0789326 -0.0382308 -0.0172161 -0.0322114 -0.00826877 -0.00879099 0.111768 -0.106016 0.00131373 -0.0541018 -0.230223 0.0780436 -0.12757 0.0151683 0.164681 -0.0556023 0.00495825 0.115976 -0.0323728 -0.0458736 -0.156328 -0.250631 0.0240132 0.0637035 0.0583941 0.0379022 -0.122649 0.0642317 0.0873811 0.0508491 -0.0478437 0.0125725 -0.0276817 -0.0332362 0.116831 -0.124086 -0.0260382 0.128752 -0.109068 -0.0488439 0.136765 0.0816831 -0.156391 -0.0171977 -0.0757066 -0.142336 0.0252952 0.014115 0.0785863 0.0846881 -0.00494098 0.142586 -0.000165223 -0.17284 -0.0361033 0.11122 0.170466 -0.0466383 0.0540459 0.0152588 0.0397293 -0.00689531 -0.0177067 0.0536862 -0.0380618 0.0569142 -0.0388949 -0.0354359 0.0307285 -0.0167241 -0.149752 0.0110374 0.0621617 0.0497517 0.0115032 0.077371 -0.0492548 -0.040342 -0.136502 0.0985096 0.108896 -0.00378461 -0.0473661 0.0584192 0.17338 -0.115928 -0.0043266 -0.107375 -0.172251 -0.0326044 -0.0867504 0.122954 0.0661073 0.0163442 0.109942 -0.0135423 -0.00401864 0.031863 -0.0414352 0.0332378 -0.113058 0.132001 -0.0832776 0.0229429 0.0293666 0.0774884 -0.108545 -0.130874 0.0198104 0.12665 -0.117964 -0.0750139 -0.00156943 0.0822986 0.109217 -0.0885127 -0.0132179 0.0586504 -0.161079 0.0647577 -0.0896679 0.0295117 
0.00155088 0.0586931 -0.0273323 -0.0874827 0.0169244 0.205285 0.0757988 -0.0225167 -0.0664825 0.00847914 0.000608228 -0.030221 0.141566 -0.101553 -0.00293858 -0.0533503 -0.214817 0.0586963 -0.131595 0.0417255 0.149628 -0.0717449 0.00933622 0.108922 -0.0490479 -0.0176296 -0.143969 -0.224021 0.0663078 0.0519134 0.0281743 0.0314233 -0.138655 0.0572942 0.0651075 0.0342995 -0.0586338 0.0651011 -0.0278484 -0.030901 0.0866723 -0.133061 -0.0398122 0.146154 -0.114881 -0.0314528 0.146412 0.105439 -0.179316 -0.011914 -0.0626756 -0.103864 -0.00964344 0.0126608 0.0781508 0.0505628 -0.00388974 0.146438 0.0217789 -0.203376 -0.0327229 0.0963052 0.185487 -0.0121721 0.0288212 0.0211652 0.0477082 0.010599 -0.00518473 0.0324774 -0.0445827 0.0621137 -0.0255498 0.00246496 0.0437948 -0.045199 -0.148723 0.030191 0.0923458 0.0628016 0.027502 0.0544822 -0.0495252 -0.0557727 -0.119943 0.074261 0.102919 0.0147749 0.00815398 0.0507234 0.167503 -0.102931 -0.00081655 -0.101755 -0.176303 -0.061762 -0.0571126 0.134459 0.0649643 -0.0165378 0.102159 0.0158062 0.0067989 0.0581487 -0.07341 0.0416819 -0.1275 0.163594 -0.0240177 -0.00355063 0.0602187 0.125027 -0.124677 -0.0989784 0.0189873 0.119607 -0.122039 -0.0858565 -0.00167898 0.0700432 0.075863 -0.0886105 0.00229159 0.0639638 -0.171553 0.0521187 -0.0968224 0.0159043 
0.00557679 0.0518434 -0.0256332 -0.080715 0.0227846 0.176918 0.0719964 -0.0352738 -0.0373493 -0.0367142 0.0056552 0.00084452 0.128662 -0.151348 -0.0606662 -0.0129868 -0.245993 0.0424892 -0.181248 0.0591289 0.177278 -0.0536093 0.00993483 0.0838865 -0.080125 -0.00738847 -0.125138 -0.237097 0.0400572 0.0703759 -0.01251 0.0314511 -0.12232 0.0788341 0.066837 0.00130421 -0.0342414 0.0770979 -0.0223995 -0.0190488 0.0832111 -0.138256 -0.0131536 0.137463 -0.0908166 -0.0225051 0.154403 0.0825597 -0.179977 0.012454 -0.049241 -0.125513 -0.0300991 0.0455817 0.0950119 0.0295984 0.00379077 0.108322 -0.0145134 -0.176265 -0.00455942 0.0594067 0.186134 0.00649415 0.0508781 -0.0464901 0.0212673 0.0144593 0.0134378 0.0138019 -0.0524811 0.031621 -0.0210724 -0.00889034 0.0408618 -0.0196688 -0.132229 0.043967 0.0595699 0.0765638 0.0559663 0.0447031 -0.0435642 -0.0249287 -0.151382 0.104157 0.108295 0.0201516 -0.0240025 0.0609627 0.148601 -0.141465 -0.0357501 -0.0804872 -0.19675 -0.0307385 -0.0690668 0.107839 0.0804155 -0.00745844 0.106327 -0.000619103 -0.022241 0.0864673 -0.0199085 -0.00175109 -0.123328 0.211868 -0.0698985 -0.00827578 0.0349091 0.107902 -0.127065 -0.0742206 0.00845634 0.134798 -0.144616 -0.0510398 -0.0276684 0.0651669 0.061437 -0.0307613 0.020571 0.0621675 -0.129821 0.0470237 -0.105816 -0.00995392 
0.00563767 0.107455 0.00667974 -0.0381289 0.0191428 0.251156 0.0699425 -0.0925187 -0.0515572 0.0230098 0.00511413 -0.0215026 0.102282 -0.157926 0.0355132 -0.0281094 -0.222689 0.0822423 -0.132052 0.00100127 0.123506 -0.0243132 -0.00953966 0.0927203 -0.0184239 -0.0244538 -0.166183 -0.234345 0.039222 0.0824394 0.0528998 0.0953378 -0.144 0.0787099 0.119709 0.0341203 -0.0200614 0.00337214 0.0288686 -0.0389959 0.103755 -0.189413 -0.00585029 0.100415 -0.0997428 -0.0144338 0.151914 0.112817 -0.20223 -0.0225546 0.0118248 -0.0775148 0.0164993 -0.00309224 0.0678905 0.0563278 -0.0137924 0.0928698 0.00388293 -0.163197 -0.0495913 0.0796322 0.150016 -0.0750839 0.0769198 0.0204392 0.0395889 -0.0127943 -0.0612903 0.0836338 -0.0529672 0.0612336 -0.052016 -0.0094888 0.0326453 -0.0489582 -0.143057 0.0148764 0.0670909 0.0921049 0.0617893 0.0667408 -0.0355225 -0.0368609 -0.118606 0.059299 0.0806798 -0.0254616 -0.0433165 0.112485 0.140039 -0.103763 -0.017843 -0.0632441 -0.213833 -0.0300458 -0.0469878 0.113975 0.0711605 -0.0186954 0.132338 0.0283411 -0.0239387 0.0483926 -0.0130439 0.0196467 -0.0867975 0.156741 -0.0413236 0.0482414 0.0254921 0.0924789 -0.111575 -0.112492 0.0331762 0.0798377 -0.1456 -0.0535244 -0.00292749 0.0797666 0.138427 -0.092814 0.0324801 0.0551476 -0.0847452 0.0565608 -0.0337396 0.00225916 
-0.011582 0.129611 -0.0179389 -0.0688383 0.00935357 0.223915 0.0186746 -0.0746099 -0.105636 0.0347558 0.000418337 -0.00866681 0.0958988 -0.18006 -0.0176357 0.00402044 -0.23073 0.0772255 -0.0953419 0.0386439 0.129711 -0.0288268 0.0211717 0.054626 -0.0495884 0.0378374 -0.116354 -0.231927 0.0711104 0.0723365 -0.00401908 0.0663712 -0.106539 0.0529174 0.105007 0.0149133 -0.0201611 0.038023 0.0269099 -0.0330521 0.0622038 -0.184404 0.0204471 0.135693 -0.116665 0.0104258 0.220288 0.0838217 -0.248357 0.00805974 0.0230577 -0.059856 -0.022858 0.0272446 0.0848037 0.0349893 0.0384764 0.0633799 0.0114964 -0.190066 -0.0300478 0.0563954 0.18862 -0.0344121 0.0859989 -0.0314177 0.0106628 -0.0195235 -0.0286143 0.0860981 -0.0679649 0.0430246 -0.0460581 0.0115657 0.0495244 -0.0584394 -0.152561 0.0597287 0.0661554 0.0682461 0.0565902 0.0766755 -0.0326172 -0.0109166 -0.113389 0.0632774 0.0608059 0.00891613 0.00845839 0.106466 0.118806 -0.0875303 -0.0601518 -0.0593888 -0.175294 -0.0391398 -0.0226893 0.183679 0.0539171 -0.0431681 0.0984632 0.0411188 -0.0121605 0.0641595 -0.0268387 0.0268032 -0.0893943 0.188295 -0.0246263 0.0160153 0.0272172 0.104581 -0.10303 -0.100125 0.0296721 0.0654621 -0.122832 -0.0977686 0.00985933 0.0661182 0.122153 -0.0804619 0.0710716 0.0158963 -0.0986396 0.0507978 -0.0126448 0.0151494 
-0.0435463 0.0674978 0.00727257 -0.064558 0.0133755 0.208127 0.0559432 -0.0242115 -0.0352324 0.0388281 0.0189543 -0.0113971 0.104253 -0.140271 -0.0230041 -0.0369234 -0.258739 0.0986517 -0.119044 0.0183072 0.179571 -0.0897327 0.00118179 0.132248 -0.0197322 -0.0181243 -0.131743 -0.224257 0.0905862 0.0544864 0.0329964 -0.00193611 -0.114847 0.0437501 0.0769265 0.0293303 -0.0884498 0.0227741 -0.0282006 -0.0410672 0.0915887 -0.154097 -0.0339424 0.150249 -0.101698 -0.0794142 0.149259 0.0875423 -0.177506 -0.0371924 -0.0439618 -0.0900086 -0.0205652 -0.0106924 0.0840209 0.0871736 -0.00730418 0.126442 -0.00836556 -0.191338 -0.0316011 0.0701298 0.197615 0.0109314 0.0599643 0.0185905 0.0144187 -0.0272184 -0.0263645 0.0764799 -0.0522093 0.0736215 -0.0330873 -0.019973 0.0450895 -0.043719 -0.14394 0.0592045 0.0765515 0.0437089 0.00518211 0.0690685 -0.023423 -0.0186297 -0.127984 0.0721487 0.104466 0.0431656 0.0189585 0.0641825 0.139256 -0.093622 -0.020446 -0.0781158 -0.171383 -0.0675462 -0.0875216 0.131468 0.067418 -0.00549483 0.126263 -0.000577428 -0.00723522 0.00571848 -0.020203 0.0595302 -0.0831663 0.128654 -0.0168108 -0.00802325 0.0262694 0.113194 -0.0985599 -0.112944 0.0522008 0.116096 -0.110657 -0.0602859 0.0108912 0.0807127 0.0917153 -0.105194 -0.0187695 0.0196146 -0.168793 0.116229 -0.0613918 0.0399957 
-0.0227715 0.108539 -0.0363138 -0.0792952 0.00923081 0.220275 0.0624552 -0.0293029 -0.0720444 0.0587127 0.0127506 -0.0343172 0.120154 -0.145357 -0.0172384 -0.02181 -0.209384 0.101333 -0.120525 0.011537 0.144862 -0.0771473 0.00226999 0.0931929 -0.0396773 -0.00416569 -0.132891 -0.22414 0.0954654 0.0546769 0.0280301 0.067331 -0.124309 0.0560503 0.0785446 0.0157067 -0.0527331 0.0406804 -0.0102902 -0.044753 0.0794873 -0.169059 -0.0149676 0.158103 -0.102417 -0.0329873 0.17074 0.104161 -0.228456 -0.0405292 -0.0283472 -0.0850745 -0.0219273 -0.0148456 0.0503036 0.0755044 0.00476897 0.112617 0.0267019 -0.20181 -0.0339552 0.077846 0.190372 -0.0238199 0.0593133 0.020874 0.0176258 -0.0141461 -0.0270978 0.0737053 -0.0730726 0.0468786 -0.04078 -0.00279332 0.0300151 -0.0679717 -0.139263 0.065279 0.0665738 0.021147 0.0103575 0.0742086 -0.0582052 -0.0466068 -0.122374 0.0707045 0.0804463 0.000538726 0.0210849 0.0784599 0.149252 -0.0933074 -0.0408114 -0.0949395 -0.143109 -0.0332534 -0.0520561 0.155002 0.0511489 -0.0149782 0.110271 0.0123782 -0.000633845 0.0545446 -0.0415796 0.035363 -0.102793 0.157707 -0.0169324 -0.00657339 0.0334271 0.126011 -0.10389 -0.112028 0.0446753 0.0707656 -0.121073 -0.103876 0.0382637 0.063879 0.10491 -0.0956687 0.0185157 0.0479372 -0.150033 0.0543898 -0.0727388 0.00192686 
-0.0494467 0.0516486 -0.0384888 -0.0499273 0.0383535 0.19935 0.0365205 -0.0514201 -0.0467211 0.0221894 0.000623291 -0.000361356 0.0950711 -0.117302 -0.0353993 -0.0146086 -0.219378 0.100612 -0.0722709 0.0511055 0.1755 -0.101567 -0.0136535 0.0762098 -0.0185887 0.0197371 -0.153888 -0.234921 0.0746322 0.0710341 0.0291196 0.0590596 -0.0908512 0.0209939 0.107507 0.0656876 -0.0512648 0.0167204 -0.00907994 -0.110264 0.0977834 -0.132021 0.0182474 0.139853 -0.0951557 -0.0315199 0.191289 0.0750578 -0.196811 -0.0566362 -0.0913639 -0.109528 0.0146546 -0.00130344 0.118509 0.0861851 -0.0128735 0.0976384 -0.0187824 -0.20369 -0.0206346 0.0820154 0.210746 -0.0158659 0.0841611 0.0512455 -0.0060367 -0.0151353 -0.000886026 0.0575082 -0.0457588 0.052312 -0.0472039 -0.0456016 0.0328361 -0.0249368 -0.135256 0.0604357 0.0743088 -0.00643042 -0.00570461 0.118165 -0.0594103 -0.02468 -0.11732 0.0818841 0.0764065 0.0585771 0.0323298 0.0753654 0.166722 -0.0720196 -0.0406006 -0.0760426 -0.141409 -0.0464443 -0.0596401 0.166094 0.0516665 -0.0201953 0.111888 -0.0148725 0.00240401 -0.0271922 -0.0502838 0.0947905 -0.0664853 0.119698 -0.035852 0.0238851 0.00615964 0.066826 -0.10601 -0.13714 0.0670309 0.0780722 -0.110705 -0.115453 0.0202328 0.0538351 0.100466 -0.0867264 0.0295985 0.0173547 -0.173537 0.107551 -0.022975 0.0342628 
-0.0318437 0.0822668 -0.0471521 -0.095018 -0.00212616 0.203665 0.0504278 -0.0264342 -0.0678483 0.0571405 0.0119132 -0.034161 0.134068 -0.120503 -0.015997 -0.0339438 -0.220227 0.0816579 -0.110235 0.0276276 0.127763 -0.0734694 -0.012508 0.0796464 -0.061114 0.0190427 -0.130913 -0.225137 0.0821578 0.0501613 0.0208009 0.0657741 -0.119455 0.0381346 0.0714303 0.0403804 -0.0518848 0.038069 -0.0181246 -0.0340975 0.0876581 -0.163423 -0.0328804 0.162027 -0.101721 -0.0180637 0.167326 0.112042 -0.212088 -0.0509781 -0.0587322 -0.0914016 -0.0121698 -0.00385287 0.0595799 0.0725738 -0.00481891 0.104702 0.0342673 -0.199746 -0.0300364 0.0832908 0.185851 0.006627 0.0373953 0.0231949 0.0399138 0.000928126 0.0160342 0.0399861 -0.0623002 0.0367715 -0.0282267 -0.0139729 0.0468121 -0.0564003 -0.163931 0.0619458 0.0710915 0.0259106 0.0265783 0.0802571 -0.067913 -0.0449764 -0.123476 0.0920592 0.0944579 0.00554559 0.0192744 0.0639158 0.151853 -0.0811107 -0.0241754 -0.0985975 -0.168096 -0.0440071 -0.0562488 0.140438 0.0659304 -0.0275162 0.110266 0.00928484 0.011114 0.0323251 -0.0570711 0.0446248 -0.11278 0.159301 -0.0379697 0.0121946 0.0424138 0.109072 -0.113603 -0.129112 0.0194804 0.0799276 -0.127029 -0.118838 0.0238508 0.0359813 0.101804 -0.104181 0.0218804 0.0518064 -0.166923 0.0539117 -0.0915729 0.0227117 
-0.0555114 0.0545232 -0.0384527 -0.0741224 0.00698377 0.1813 0.0118598 -0.0346976 -0.0316919 0.0209836 0.0106901 0.000273822 0.108996 -0.150429 -0.0782049 -0.00191354 -0.251534 0.0863291 -0.101921 0.0567609 0.191257 -0.106958 0.0020241 0.0878826 -0.0490671 0.0282609 -0.1078 -0.242046 0.0653471 0.0661002 0.00938998 0.0170541 -0.0778686 0.0352945 0.0863548 0.0382837 -0.0537734 0.0358373 -0.0153892 -0.0725104 0.0721707 -0.164488 0.00374355 0.159259 -0.0742647 -0.0560214 0.188592 0.0827615 -0.193447 -0.0280637 -0.067903 -0.11295 -0.00867375 0.0225157 0.105993 0.0746462 0.00875973 0.070767 -0.0128174 -0.212189 -0.00053202 0.0509442 0.209286 0.0224902 0.0670979 -0.0117775 -0.0100527 -0.013113 0.0198107 0.0426452 -0.0732692 0.0261544 -0.05337 -0.0503582 0.0428429 -0.0354975 -0.133546 0.09022 0.0684312 0.0355535 0.0038765 0.0810661 -0.0438689 -0.00469141 -0.13974 0.0986954 0.0871334 0.0581355 0.0420503 0.0621847 0.131453 -0.0934198 -0.0361995 -0.0695021 -0.167298 -0.0450207 -0.0820205 0.156652 0.0617454 -0.028099 0.125041 -0.012939 -0.0195326 0.00532671 0.00323176 0.0508864 -0.0826346 0.152559 -0.0569749 0.00354661 -0.0112482 0.0808963 -0.104192 -0.114638 0.0408259 0.104954 -0.114647 -0.0926087 0.00765327 0.0580232 0.0834679 -0.0722228 0.0206911 0.0149162 -0.174661 0.0924258 -0.0568338 0.0381172 
-0.0534053 0.0562272 -0.0460352 -0.0676611 0.00776913 0.175792 0.0187386 -0.0463791 -0.012721 0.00103731 0.0134932 0.00283442 0.107287 -0.137959 -0.074254 -0.000490583 -0.254641 0.070852 -0.11565 0.0577683 0.183562 -0.103613 0.00989141 0.0792965 -0.0494322 0.0189566 -0.10608 -0.247098 0.0514726 0.0734015 0.0113106 0.0310165 -0.0640959 0.0405825 0.082386 0.045856 -0.0421794 0.0519954 -0.0305656 -0.0653456 0.080215 -0.159838 -0.000723901 0.152255 -0.0785773 -0.0284733 0.184592 0.0753144 -0.19564 -0.0320384 -0.0808132 -0.111385 0.00140392 0.0241163 0.11158 0.0784423 0.00379868 0.0714183 -0.0167988 -0.199685 -0.0131782 0.052238 0.206051 0.0120621 0.0766184 -0.00769077 -0.00377761 0.000712197 0.0208699 0.0470943 -0.0670318 0.0169416 -0.0536201 -0.0580264 0.058975 -0.0189805 -0.138619 0.0807375 0.0520371 0.0351414 0.00232203 0.0791656 -0.0582918 -0.0112493 -0.152675 0.112996 0.0869404 0.0428487 0.0148931 0.0678378 0.136547 -0.110621 -0.0369758 -0.0771633 -0.170458 -0.0381119 -0.0849741 0.143355 0.0829228 -0.0261039 0.121322 -0.0234118 -0.0153804 0.00679805 -0.00696322 0.0451508 -0.0925177 0.16069 -0.066865 -0.00264688 -0.010184 0.0835386 -0.108544 -0.120545 0.0385283 0.110298 -0.130438 -0.0928659 0.0148956 0.0661093 0.0895004 -0.0617039 0.0167598 0.0331422 -0.156108 0.0909955 -0.0566428 0.0354428 
-0.0589872 0.0404774 -0.0448023 -0.0801123 0.00616712 0.158224 0.00169814 -0.0229623 -0.0134937 0.0132496 0.0174305 0.0060672 0.110507 -0.14578 -0.0948786 0.0211524 -0.264656 0.0571222 -0.115878 0.0718014 0.201947 -0.129433 0.026909 0.060945 -0.0526087 0.0405994 -0.0902341 -0.242564 0.0616775 0.0514714 0.000616781 0.0144728 -0.0550263 0.0348417 0.0665652 0.0350099 -0.0581085 0.0803577 -0.0190275 -0.0740715 0.0631739 -0.163034 -0.0130465 0.146125 -0.068784 -0.0516815 0.172641 0.0729815 -0.187811 -0.0267963 -0.089527 -0.103885 -0.0196876 0.0322141 0.111759 0.0614603 0.0174724 0.0590904 -0.0357697 -0.206217 0.00122501 0.0266591 0.220914 0.0367776 0.0780618 -0.00836042 -0.0274991 0.0237114 0.0386325 0.037764 -0.0739719 0.0248909 -0.059075 -0.0559791 0.060284 -0.0249335 -0.124582 0.0908796 0.0601041 0.0445948 -0.0103806 0.0567013 -0.0403206 -0.00246363 -0.157392 0.104027 0.0941577 0.0841076 0.0539268 0.0459699 0.125971 -0.103816 -0.0424908 -0.0524119 -0.162522 -0.0512827 -0.0845345 0.145107 0.0703237 -0.0316134 0.122629 -0.036964 -0.0366381 0.00637225 0.0209002 0.0511958 -0.0844877 0.164738 -0.0417441 -0.0297167 -0.0304096 0.0974347 -0.104643 -0.100822 0.0667283 0.114231 -0.129551 -0.0767637 0.0169819 0.068934 0.0684587 -0.0499807 0.0237106 0.0251023 -0.156974 0.0970789 -0.050424 0.0449236 
-0.0633972 0.031769 -0.006561 -0.0630844 0.0083961 0.159945 0.0245518 -0.0207868 -0.00903596 0.010648 0.0087065 0.00156259 0.110422 -0.130101 -0.072561 0.00377201 -0.26295 0.0779008 -0.129328 0.0639148 0.210528 -0.139078 0.0115423 0.0927997 -0.0437148 0.00635649 -0.130843 -0.235661 0.0503042 0.0567954 0.00594571 0.0180328 -0.0675016 0.0480447 0.0675187 0.0450037 -0.061577 0.0613768 -0.0348315 -0.0806057 0.0769377 -0.156652 0.000262363 0.121715 -0.0585806 -0.0635065 0.164769 0.067472 -0.181546 -0.0248512 -0.0881322 -0.128536 -0.013135 0.0308402 0.125401 0.0779224 0.00464246 0.0681753 -0.0291989 -0.20281 0.00646766 0.0567272 0.186296 0.0253845 0.0736748 0.018357 -0.0225629 0.00453872 0.0112099 0.0421543 -0.0638292 0.0325331 -0.0515793 -0.0525853 0.0569723 -0.0149012 -0.116352 0.0782554 0.0739584 0.0238914 -0.0152428 0.0659059 -0.0456152 -0.00836538 -0.157545 0.113391 0.0943739 0.0752727 0.0398836 0.0615264 0.135039 -0.10824 -0.0218732 -0.0658177 -0.174832 -0.0355341 -0.102328 0.140013 0.0734022 -0.010085 0.130382 -0.0402502 -0.0324164 -0.0010557 0.0244685 0.0616155 -0.0897612 0.145604 -0.0508767 -0.0227804 -0.037746 0.0909857 -0.10429 -0.116501 0.0647276 0.122438 -0.111533 -0.070266 0.00620006 0.0753136 0.0714696 -0.0554209 0.00731668 0.0287424 -0.1679 0.112664 -0.0506771 0.0377782 
-0.0603575 0.0658546 -0.044001 -0.0804047 0.00527884 0.152014 0.0224624 -0.0355994 -0.00562062 0.0250957 0.018347 -0.00497555 0.117627 -0.147283 -0.0885443 0.0188001 -0.266129 0.058744 -0.140732 0.0616899 0.188215 -0.119524 0.00694658 0.0592251 -0.0604561 0.0297565 -0.104492 -0.230892 0.0643244 0.06653 -0.00681519 0.0338586 -0.0646011 0.0455488 0.0699909 0.0322323 -0.0438541 0.0758209 -0.0234633 -0.0674055 0.0662766 -0.171477 -0.00312164 0.144346 -0.0560227 -0.0301198 0.169766 0.0880463 -0.198098 -0.035358 -0.0853239 -0.101812 -0.0252759 0.0252382 0.108385 0.0650155 -0.0023348 0.056395 -0.0286194 -0.198381 -0.000938473 0.0283875 0.206311 0.0388169 0.0703063 -0.00499222 -0.0219731 0.0228789 0.0338178 0.0302662 -0.0734209 0.0154898 -0.0502942 -0.052022 0.0587329 -0.0209826 -0.125294 0.0923232 0.054673 0.0333586 0.00913463 0.060803 -0.056972 -0.00314997 -0.164454 0.111175 0.0882105 0.0603793 0.0431283 0.0656476 0.127558 -0.112021 -0.0437323 -0.0644567 -0.174886 -0.0359359 -0.0893457 0.12845 0.0855976 -0.031202 0.128746 -0.0338461 -0.0292432 0.0134869 0.0126251 0.040958 -0.0976238 0.178004 -0.0467501 -0.0168257 -0.0176179 0.0975553 -0.115888 -0.100761 0.0526022 0.111684 -0.13439 -0.0724242 0.0126471 0.0591269 0.0755594 -0.0424103 0.0275079 0.0468579 -0.1524 0.0859817 -0.0650929 0.0232452 
-0.0614387 0.0465429 -0.0210531 -0.0389511 0.0146583 0.190051 0.0380773 -0.0312752 0.00741237 0.00620616 0.0212407 0.00365542 0.0981658 -0.126991 -0.0797784 -0.0127387 -0.243535 0.0959573 -0.119096 0.0404099 0.212916 -0.147934 -0.00602154 0.123249 -0.0109321 -0.0300738 -0.137174 -0.227249 0.064327 0.070921 0.0441275 0.0216632 -0.0813653 0.0398628 0.0586606 0.0526494 -0.0843451 0.0131109 -0.030828 -0.0737588 0.0929366 -0.155806 -0.00744921 0.123478 -0.0561898 -0.0909374 0.152539 0.0640171 -0.173171 -0.0480006 -0.0844601 -0.105042 0.00448204 -0.000943979 0.100894 0.104859 -0.00886471 0.0979668 -0.0262262 -0.18933 -0.0166508 0.0745752 0.198618 -0.0116061 0.0663213 0.0317756 -0.0096251 -0.0197981 -0.0233347 0.0669912 -0.0586957 0.0480534 -0.0648424 -0.054151 0.0487236 -0.0130483 -0.102048 0.0770013 0.0528496 0.0205403 -0.0414409 0.0733643 -0.0324607 -0.00931131 -0.15175 0.121033 0.0916664 0.0502701 0.0181445 0.0516107 0.134861 -0.116116 -0.0182763 -0.0642903 -0.145472 -0.0429909 -0.108295 0.128509 0.0641955 0.00610239 0.130469 -0.0359569 -0.0308132 0.00757537 0.0172985 0.0833307 -0.074512 0.127589 -0.0566988 -0.0196642 -0.038736 0.0770948 -0.0963879 -0.120239 0.0640783 0.118035 -0.110708 -0.0575023 0.0344721 0.0965295 0.0766006 -0.08328 -0.0219121 0.019877 -0.176344 0.132242 -0.0590669 0.0434873 
-0.066934 0.0999008 -0.0448254 -0.043353 0.00442238 0.207887 0.0338213 -0.0742383 -0.0559501 0.0620021 0.0036875 -0.0328886 0.0978777 -0.100775 -0.00620429 -0.00111563 -0.214109 0.0844382 -0.0607709 0.0103814 0.130524 -0.115406 0.00900557 0.057623 -0.00939024 0.0268891 -0.158382 -0.230805 0.0980964 0.0549196 0.0601982 0.100611 -0.0970699 0.0107814 0.0875484 0.0765192 -0.060735 0.0461215 0.00633765 -0.0730096 0.0803424 -0.151527 -0.0134403 0.119117 -0.0883538 -0.0221204 0.180378 0.0867302 -0.211493 -0.0871421 -0.0815081 -0.066576 0.0256716 -0.0266202 0.0764734 0.0956642 0.010662 0.113937 0.00975477 -0.192323 -0.0618233 0.0909484 0.210171 -0.0443785 0.0944484 0.0989902 0.0149956 -0.00844976 -0.0210034 0.0795972 -0.0585544 0.0689307 -0.0544021 -0.00306584 0.0592068 -0.0547567 -0.142102 0.0425769 0.0558942 -0.002742 -0.00554818 0.0920722 -0.0682111 -0.0502015 -0.131018 0.0705185 0.0598987 0.0235598 0.0205251 0.0563533 0.153826 -0.0546957 -0.0169484 -0.0838651 -0.115014 -0.0374014 -0.0475365 0.171854 0.0625629 -0.00787448 0.0997602 -0.0188034 -0.0050267 -0.00470164 -0.0472292 0.0961249 -0.0661324 0.114171 0.00663806 0.00584227 -0.00168901 0.106483 -0.0934991 -0.145782 0.0799256 0.0663075 -0.114496 -0.103052 0.0646433 0.0600591 0.116291 -0.116192 0.0315066 0.0231386 -0.167519 0.10929 -0.038407 0.0421119 
-0.0525302 0.113333 -0.0360976 -0.0576013 0.0196452 0.230413 0.0290057 -0.0324284 -0.0882801 0.0484699 -0.00153694 -0.0455221 0.11009 -0.0888727 0.00760142 -0.0168204 -0.16775 0.0955186 -0.0678298 0.0235705 0.132272 -0.110702 0.010349 0.0556753 -0.00689174 -0.00146464 -0.16364 -0.205625 0.10744 0.0300464 0.076465 0.0950961 -0.101006 0.0209828 0.0726694 0.0758104 -0.0586026 0.0390428 0.00172321 -0.0680314 0.0949782 -0.141007 0.000922262 0.111123 -0.103721 -0.0307531 0.190033 0.0783717 -0.238917 -0.0732439 -0.0801044 -0.0675944 0.0113854 -0.0222578 0.0499747 0.094889 0.0054009 0.119486 0.0223344 -0.21001 -0.0760065 0.116256 0.196314 -0.0786726 0.0834668 0.105467 0.0204007 -0.0142054 -0.0487367 0.0790121 -0.0471865 0.05926 -0.056489 0.000556784 0.0576118 -0.0565165 -0.133113 0.0446058 0.0633054 -0.0122031 -0.0366894 0.0906849 -0.0540029 -0.049919 -0.111545 0.0840612 0.0592498 0.0212919 0.0261016 0.0570637 0.16129 -0.070971 -0.0213603 -0.0855355 -0.0862382 -0.041864 -0.0351379 0.198577 0.00619381 -0.00278475 0.0682321 -0.00405061 -0.00120117 0.0302853 -0.0700987 0.11821 -0.072877 0.119978 0.0107411 -0.0223271 -0.00726089 0.0911798 -0.105028 -0.123598 0.0733687 0.0360076 -0.113861 -0.122876 0.0793062 0.0766435 0.10953 -0.126587 0.019901 0.0282088 -0.151231 0.0813236 -0.0323546 0.0342816 
-0.0417301 0.0729941 -0.0412705 -0.0435086 0.0247471 0.220666 0.0369856 -0.0417358 -0.0390043 0.00923905 0.00866896 -0.0161243 0.106418 -0.0827813 -0.0370747 -0.0203637 -0.188866 0.0979022 -0.0906555 0.0488881 0.171024 -0.122084 0.00286944 0.10764 -0.0157093 -0.0169615 -0.159942 -0.217671 0.0797232 0.0568753 0.0563183 0.0607443 -0.0938963 0.0303323 0.0642955 0.0821593 -0.0639056 0.0371929 -0.0249368 -0.0737947 0.0880184 -0.117624 -0.00550178 0.104027 -0.0862586 -0.0640281 0.181917 0.0684445 -0.200342 -0.0449857 -0.0988109 -0.0960561 0.0186463 0.00038021 0.0941297 0.105279 -0.00349293 0.133081 -0.000742087 -0.21182 -0.0559811 0.115802 0.217405 -0.0740855 0.0648252 0.0873931 0.0164374 -0.0132413 -0.0423211 0.0722232 -0.0385865 0.0577439 -0.0538909 -0.0124861 0.0529944 -0.0273424 -0.117064 0.0468056 0.0649646 -0.0195319 -0.0348085 0.110801 -0.0573838 -0.0496883 -0.124372 0.108241 0.0665534 0.0359267 0.0248242 0.0577313 0.169352 -0.101665 -0.0110745 -0.077787 -0.0958577 -0.0449775 -0.0676607 0.168504 0.0379259 0.0036922 0.0963501 -0.0235009 -0.00991402 0.0130995 -0.0633829 0.121129 -0.0786063 0.0918885 -0.0353707 -0.0119517 -0.0045613 0.0896032 -0.0875858 -0.121329 0.0649908 0.0804301 -0.110437 -0.104738 0.0439692 0.0770919 0.091213 -0.106147 0.0121231 0.0262118 -0.183077 0.118709 -0.0440485 0.0330596 
-0.0118752 0.0865345 -0.0621627 -0.0672767 0.0307105 0.213632 0.0515651 -0.0269301 -0.0832485 0.0763673 0.0353745 -0.00484329 0.129242 -0.143165 -0.0405936 -0.0048304 -0.202798 0.126071 -0.116967 0.0657351 0.156386 -0.113547 0.0243054 0.111942 -0.0374477 -0.0172802 -0.122637 -0.226748 0.0891818 0.0604814 0.0076496 0.0467408 -0.116589 0.0491151 0.0471354 0.0323155 -0.0852264 0.0270919 -0.0160415 -0.045613 0.0639571 -0.167044 -0.0225137 0.153445 -0.124293 -0.0592243 0.175115 0.105112 -0.214191 -0.0092077 -0.0179358 -0.0830522 -0.0604212 -0.00944118 0.0622126 0.0666 0.00265488 0.115996 0.0186072 -0.17406 -0.0349073 0.0682622 0.217265 -0.0308521 0.0642263 -0.00721677 -0.0145964 -0.00729522 -0.0415361 0.0772855 -0.0543606 0.0776087 -0.0457706 -0.0024065 0.0242975 -0.0527414 -0.109328 0.094376 0.0635702 0.01283 -0.00969465 0.0556645 -0.0501062 -0.030405 -0.140941 0.103311 0.0783137 0.0231973 0.0446439 0.0598233 0.131071 -0.100235 -0.0471456 -0.0745732 -0.131073 -0.0597189 -0.0726847 0.151711 0.0380829 -0.0232933 0.110808 0.00207786 -0.0101589 0.0506076 -0.0177394 0.0707149 -0.0998702 0.155494 -0.00590728 -0.0162607 0.00416872 0.126819 -0.070071 -0.0859224 0.0424409 0.0774424 -0.102048 -0.0807333 0.0307477 0.0927206 0.0764835 -0.106083 0.00835037 0.04993 -0.165403 0.0810814 -0.0742516 0.0174414 
