0.0118907 0.0607472 -0.0227779 -0.0129175 0.0529842 0.187432 0.0715524 -0.0359422 -0.127843 -0.00765754 0.0254831 0.0693674 0.0417451 -0.170204 0.00528794 -0.00707474 -0.145291 -0.0078888 -0.0181352 0.042028 0.129266 -0.0530454 -0.0799189 0.0886438 0.0416642 0.109149 -0.0744882 -0.231507 0.0768156 0.0695123 0.0177495 0.0535243 -0.123685 0.0614038 0.0507065 0.0291277 -0.0559005 0.00472215 0.0455676 -0.0576442 0.128551 -0.133178 0.0249844 0.143858 -0.0708138 0.0403267 0.211934 -0.0208791 -0.245819 -0.109302 -0.00792368 -0.0788812 -0.0279567 -0.0317418 0.132502 0.0715583 -0.122217 0.188755 -0.0512776 -0.0998728 -0.0276095 -0.0181489 0.22881 -0.0691562 0.149731 0.0110064 0.0138598 -0.03646 -0.0261149 0.0341813 -0.0617283 0.0941316 -0.0697054 -0.0105833 0.0561995 -0.0174708 -0.0774394 0.111632 0.037081 0.0872581 -0.0458796 0.0708567 -0.00177454 -0.0559327 -0.117069 -0.0221371 0.13259 0.0133733 -0.0263126 0.0431664 0.116395 -0.0847599 -0.0931701 -0.000628577 -0.122461 -0.00332484 0.0609664 0.0239652 0.0818736 -0.029659 -0.0397987 0.00593615 -0.0457208 0.0559634 -0.132521 0.0843283 -0.0702315 0.173669 -0.0590625 -0.059941 0.0600854 0.0844244 -0.154359 -0.109419 0.132229 0.0274814 -0.159483 -0.136785 0.0320861 0.084956 0.0803576 -0.0284462 0.0379964 0.0439466 -0.0311348 0.104652 0.00371576 -0.0514293 
0.0282182 0.0877415 -0.00771683 -0.0303553 0.050671 0.206044 0.0872051 0.00725246 -0.0934074 -0.00478338 0.0410954 0.0663077 0.0579338 -0.186483 0.000835231 -0.0145549 -0.119423 0.0123633 -0.110947 0.0485207 0.122185 -0.0324314 -0.0922543 0.0951096 0.0137377 0.0691589 -0.0708994 -0.178789 0.0778183 0.0472014 0.0309629 0.0795061 -0.127587 0.113815 0.024411 0.0168466 -0.0419199 0.0266216 0.018498 -0.0457345 0.140217 -0.141829 0.0299254 0.144584 -0.0621332 -0.0214039 0.178334 0.00487795 -0.251056 -0.0651612 0.0118559 -0.0776621 -0.0842716 -0.0271406 0.108449 0.0669388 -0.180745 0.177185 -0.0534246 -0.120473 -0.0661224 -0.0374358 0.218164 -0.0881728 0.118239 0.00653646 0.018668 -0.0372124 -0.0861977 0.0495173 -0.0542444 0.0654687 -0.0469975 0.015901 0.0338946 -0.0443719 -0.0519376 0.101938 0.0324262 0.0585118 -0.0415752 0.0653971 0.00929358 -0.0631384 -0.113207 -0.0300945 0.138785 0.0130037 0.0076613 0.080318 0.111888 -0.147108 -0.107152 0.00255349 -0.0960125 0.0197415 0.0484797 -0.00456979 0.0321579 -0.0165533 -0.0490644 0.0187085 -0.0681784 0.10382 -0.122091 0.0815537 -0.0985092 0.16127 -0.0481904 -0.0895332 0.0535583 0.110906 -0.171251 -0.0392533 0.133695 -0.0131158 -0.136724 -0.131479 0.0578861 0.100226 0.0943217 -0.0153242 0.0498476 0.0777685 0.0132075 0.0493145 0.0168927 -0.0848284 
0.0361282 0.0975549 -0.0879187 -0.0956657 0.0801875 0.197739 0.0985531 0.0246689 -0.153164 0.0400306 0.0145961 0.0571792 0.0790475 -0.145008 -0.00188469 0.00339203 -0.07211 -0.00467319 -0.0602455 0.0542538 0.0859507 -0.0206178 -0.0697714 -0.000695603 -0.0185178 0.118198 -0.0587807 -0.167168 0.1111 0.0350969 -0.00401781 0.0917461 -0.133117 0.0711665 0.0130963 0.00824411 -0.0303751 0.0710605 0.0573503 -0.0348695 0.112986 -0.0947743 0.0323786 0.158937 -0.108072 0.0295767 0.181612 0.00996173 -0.252107 -0.0721293 -0.0105227 -0.0612161 -0.116778 -0.0114473 0.0687938 0.0365486 -0.14612 0.202304 -0.0753143 -0.0946627 -0.0596726 -0.0396926 0.255642 -0.103235 0.139246 -0.0064203 -0.00727104 0.0179891 -0.0495042 0.0113961 -0.0285773 0.0869198 -0.0318046 0.0250645 0.0175747 -0.0267822 -0.0535905 0.0957283 0.0358597 0.0009492 -0.0418576 0.0691121 0.00557259 -0.0367112 -0.117625 -0.053203 0.136107 0.0277751 0.0434423 0.0428869 0.102153 -0.131657 -0.121404 0.00374995 -0.0352064 -0.0131585 0.092733 0.0276099 -0.00926746 -0.0106656 -0.0826332 0.0221878 -0.0638519 0.119603 -0.167525 0.0803953 -0.103342 0.175357 -0.0290986 -0.0898857 0.0829572 0.0941636 -0.151035 0.00184053 0.122864 -0.0298547 -0.139891 -0.147382 0.0489072 0.076655 0.065354 -0.0237329 0.0842672 0.0763387 -0.00433622 0.017714 -0.0306643 -0.0955524 
0.0746953 -0.023802 -0.0406086 -0.00967271 0.111057 0.231117 0.166185 -0.0476681 -0.0594047 -0.0628256 -0.057234 0.100966 0.0764328 -0.180194 0.000421538 -0.06237 -0.13712 0.0595692 -0.137981 0.0675754 0.0795078 0.00708252 -0.0293528 0.121256 -0.0717015 -0.0282191 -0.160192 -0.23784 -0.052467 0.0691604 0.0322621 0.11119 -0.199577 0.113713 0.0703204 0.0104294 -0.0229713 -0.0265737 -0.0364312 -0.0349825 0.157936 -0.0799567 0.00476074 0.11438 -0.143179 -0.0423749 0.106265 0.0540717 -0.0952913 0.0542195 0.0344974 -0.217155 -0.0267343 -0.00699408 0.0914858 0.0274023 -0.0998302 0.198874 -0.0159682 -0.0434943 -0.0166763 0.0843776 0.151749 -0.148942 0.125393 -0.0996907 0.023179 -0.0605527 -0.108847 0.00112466 -0.0414175 0.10256 0.0139024 0.0442001 -0.0845272 0.0219113 -0.0454149 0.0079578 0.0548804 0.0386129 0.0333218 0.0279496 -0.0323419 -0.0286744 -0.109823 -0.025925 0.132143 -0.0244201 -0.0911439 0.0649774 0.132059 -0.125849 -0.035344 -0.0677142 -0.125825 0.04187 0.0109234 -0.0067998 0.0238561 0.0641838 0.0301732 0.0234256 -0.0707689 0.108544 -0.059162 -0.0249136 -0.107344 0.120636 -0.143956 0.0915175 0.0540107 0.072928 -0.0660993 -0.0465461 -0.0239161 0.0606397 -0.077758 -0.0363191 -0.0674667 0.0938545 0.0598778 -0.0135752 0.0147375 0.0701615 -0.054564 0.00908494 -0.139693 -0.107211 
