{
  "descriptor": [
    -0.030266214162111282,
    -0.0115498136729002,
    0.08702809363603592,
    -0.09424678981304169,
    -0.1142767071723938,
    0.030387407168745995,
    0.02963469736278057,
    -0.07562991231679916,
    0.1850583702325821,
    -0.11060664802789688,
    0.14264601469039917,
    -0.021459754556417465,
    -0.23653621971607208,
    0.033014535903930664,
    0.040779463946819305,
    0.16218778491020203,
    -0.13227561116218567,
    -0.13313411176204681,
    -0.16334213316440582,
    -0.049879930913448334,
    -0.014533229172229767,
    0.0997215211391449,
    -0.020550081506371498,
    0.08256051689386368,
    -0.1587821990251541,
    -0.3383941650390625,
    -0.0658559501171112,
    -0.08869641274213791,
    0.03412895277142525,
    0.0005135243409313262,
    -0.002026038244366646,
    0.09151429682970047,
    -0.15552236139774323,
    -0.023073965683579445,
    0.14088481664657593,
    0.04231586307287216,
    -0.06272739171981812,
    -0.10519144684076309,
    0.20115666091442108,
    0.03415750712156296,
    -0.2849265933036804,
    -0.03891318291425705,
    0.11266257613897324,
    0.22161266207695007,
    0.21532806754112244,
    0.040393661707639694,
    0.012372969649732113,
    -0.08107513189315796,
    0.15631088614463806,
    -0.3654727637767792,
    0.05639396607875824,
    0.11628899723291397,
    0.047572940587997437,
    0.08524719625711441,
    0.06758689135313034,
    -0.21407347917556763,
    0.016681881621479988,
    0.10900634527206421,
    -0.22548598051071167,
    0.08622337877750397,
    0.08641168475151062,
    -0.15443365275859833,
    -0.06886198371648788,
    -0.0681716799736023,
    0.1678074598312378,
    0.04001317918300629,
    -0.1998882293701172,
    -0.13875611126422882,
    0.1432918757200241,
    -0.1906215101480484,
    0.04838496074080467,
    0.12230699509382248,
    -0.11865238100290298,
    -0.21920068562030792,
    -0.231965571641922,
    0.0415966771543026,
    0.44415798783302307,
    0.1404588371515274,
    -0.17270946502685547,
    -0.04426859691739082,
    -0.06968329101800919,
    0.007191628683358431,
    0.051130685955286026,
    0.12442689388990402,
    0.04205584526062012,
    -0.1078168973326683,
    -0.02528846263885498,
    0.030093997716903687,
    0.237178772687912,
    -0.07518953830003738,
    0.0734165832400322,
    0.31812912225723267,
    -0.006762139964848757,
    -0.027016185224056244,
    -0.06451673805713654,
    0.12076034396886826,
    -0.14773041009902954,
    -0.0010272464714944363,
    -0.11540815979242325,
    0.03665884956717491,
    0.013962266966700554,
    0.011024437844753265,
    0.061006419360637665,
    0.1102106049656868,
    -0.2241557240486145,
    0.2241736203432083,
    -0.03982599824666977,
    -0.06525550782680511,
    0.058496732264757156,
    -0.1047474592924118,
    -0.10274951905012131,
    -0.0732249841094017,
    0.18229033052921295,
    -0.23176634311676025,
    0.12079773098230362,
    0.18577159941196442,
    0.06495847553014755,
    0.14649656414985657,
    0.01474399957805872,
    0.04019303247332573,
    0.05118629336357117,
    -0.057418160140514374,
    -0.2248258888721466,
    -0.04748363792896271,
    0.07546059787273407,
    -0.1095392182469368,
    -0.06353050470352173,
    -0.04318572208285332
  ]
}