0.0787522 -0.0630635 -0.0411089 -0.0376482 0.0813488 0.215738 0.0856375 -0.0296466 -0.0405248 -0.165828 -0.0707515 0.0674878 0.0590196 -0.131577 -0.0293437 -0.121018 -0.175341 -0.0213063 -0.111299 0.110635 0.0951768 -0.0259425 0.0787141 0.0408046 -0.0600679 0.0136636 -0.101055 -0.238391 -0.0646092 -0.0212984 0.045314 0.0434138 -0.129312 0.104349 0.0646896 0.00738317 -0.000130921 0.142181 -0.0504062 -0.0869054 0.150785 -0.0635061 -0.0643305 0.107115 -0.209683 -0.0293129 0.0950015 0.0473142 -0.0747102 0.10359 -0.0783072 -0.126581 0.0315161 0.0713119 0.138571 -0.0382526 0.0123328 0.168675 -0.05038 -0.172376 -0.0285008 0.0784401 0.202849 -0.0900878 0.109043 -0.0524555 0.0535587 0.0148913 -0.00867061 0.0764348 -0.0412927 0.0495554 0.00285415 0.0760774 -0.0151366 -0.0319388 -0.111856 -0.0415333 0.0774937 0.094039 -0.0298953 0.0446805 0.00364868 -0.0663574 -0.042473 -0.0582161 0.134805 0.0971483 -0.0356376 0.0342121 0.224916 -0.144084 0.0129539 -0.0923144 -0.115911 -0.0836585 0.033872 0.0812477 0.0456852 0.00261811 0.0276404 0.0435203 -0.0381156 0.107023 -0.049787 -0.0104752 -0.0933503 0.146057 -0.0740303 0.0263951 0.0782314 0.13701 -0.111897 -0.0196389 0.0357132 0.0713747 -0.0887512 -0.111147 0.0130786 0.0984453 0.0607901 0.0160509 0.0302938 0.0401406 -0.0396204 -0.0199908 -0.0244978 -0.0097099 
0.0814965 -0.0806837 -0.0300879 -0.0267109 0.0716759 0.195162 0.112849 -0.0108924 -0.0165984 -0.186866 -0.0770187 0.0635135 0.0644581 -0.111701 -0.0287136 -0.132055 -0.148107 -0.0318173 -0.147361 0.117847 0.0807659 -0.0309988 0.0670783 0.0474597 -0.0775682 -0.00975744 -0.117388 -0.224898 -0.0854942 -0.0371547 0.0509438 0.0710314 -0.125283 0.131038 0.0403263 0.008004 0.0226174 0.160905 -0.0810802 -0.0807577 0.167081 -0.0547896 -0.0643245 0.0804552 -0.187532 -0.0377328 0.0679136 0.0403202 -0.0559709 0.107544 -0.0929605 -0.151166 0.0349659 0.0788619 0.133342 -0.0343016 -0.00675732 0.161061 -0.0411665 -0.162254 -0.0292351 0.0900586 0.159921 -0.105964 0.0960556 -0.0409724 0.071284 0.00506216 -0.0218291 0.0543158 -0.0458568 0.0249307 0.0146274 0.0913587 -0.0141995 -0.0268584 -0.0830144 -0.0459087 0.0716799 0.0721626 -0.0419818 0.0398474 -0.0146425 -0.0814747 -0.0389106 -0.0473852 0.13709 0.0855067 -0.055011 0.0292198 0.230917 -0.163674 0.0300551 -0.105875 -0.110972 -0.0483109 0.0325391 0.0470333 0.042279 0.0280984 0.0173397 0.0298643 -0.0483345 0.135741 -0.0444233 -0.0257693 -0.109783 0.136846 -0.0959774 0.0204539 0.0610337 0.142939 -0.115322 -0.0131148 0.0171071 0.059573 -0.0779644 -0.116216 0.0124318 0.0942906 0.0470639 0.0417123 0.0194749 0.0688354 -0.0248332 -0.0451481 -0.0519185 -0.0393017 
0.0514692 -0.0491336 0.006088 -0.0076433 0.0608186 0.211641 0.0872962 -0.0340082 -0.00817006 -0.17722 -0.065525 0.0456706 0.0416926 -0.124375 0.00605209 -0.143548 -0.170928 -0.0253092 -0.12208 0.100014 0.0720363 -0.033265 0.0674023 0.0487743 -0.040649 -0.0119027 -0.13734 -0.220042 -0.0580729 -0.0546885 0.102452 0.0623757 -0.120148 0.116232 0.0719513 0.029106 0.0191592 0.145486 -0.0582672 -0.0846526 0.193487 -0.0728083 -0.0789922 0.0742826 -0.201933 -0.0482577 0.0731431 0.0466097 -0.0617555 0.0831395 -0.116843 -0.112195 0.0562845 0.0599512 0.115489 -0.0223862 -0.0030313 0.146525 -0.0533319 -0.174031 -0.0652609 0.0948491 0.164795 -0.10982 0.101643 0.00433851 0.092387 -0.0189338 -0.0344078 0.0837731 -0.0431542 0.0397984 0.00713074 0.106994 0.0127903 -0.0577274 -0.117351 -0.0530236 0.0767882 0.0918479 -0.0552881 0.0578571 0.003796 -0.0765738 -0.0207814 -0.0490522 0.129175 0.0928126 -0.0589672 0.0270694 0.248921 -0.133495 0.0479049 -0.105722 -0.114385 -0.0874403 0.0250313 0.071831 0.0351362 0.00830188 0.0106997 0.0245883 -0.0366698 0.102912 -0.0337972 0.0111027 -0.0622184 0.130908 -0.0494254 0.0334844 0.0525915 0.138793 -0.122902 -0.0263534 0.0379898 0.040757 -0.0803687 -0.124589 0.0431188 0.101849 0.079003 0.0156297 0.00424711 0.0613073 -0.0303848 -0.0284337 -0.00889818 0.00263199 
0.0390155 -0.0567665 0.0138216 -0.00821298 0.100209 0.209458 0.114917 -0.0836684 -0.0375029 -0.135211 -0.103818 0.0737634 0.0436971 -0.0866048 0.00830782 -0.163641 -0.142614 0.01614 -0.0970267 0.100913 0.0253295 -0.0161354 0.0433208 0.0555858 -0.0570254 0.00239167 -0.16774 -0.195923 -0.0545255 -0.0329319 0.0714064 0.110608 -0.153143 0.0893416 0.0904318 0.0338244 0.012995 0.116935 -0.062939 -0.107383 0.208281 -0.0515575 -0.0661705 0.0516586 -0.219413 -0.0166596 0.0647331 0.0723057 -0.0506963 0.0580733 -0.0947666 -0.129072 0.0773872 0.0324412 0.122852 -0.0109759 -0.0143057 0.17063 -0.0387317 -0.14087 -0.0343984 0.142666 0.148258 -0.110479 0.12848 0.00884578 0.0864164 -0.0261957 -0.0609194 0.0833031 -0.0357738 0.0529698 0.0348955 0.117942 -0.0271067 -0.016124 -0.108164 -0.0685578 0.0986649 0.0254728 -0.0331927 0.0905578 -0.0138211 -0.0642315 -0.00453965 -0.104808 0.129667 0.099454 -0.0731899 0.0436886 0.243164 -0.0893736 0.0906824 -0.0937449 -0.117064 -0.0821716 0.0444908 0.0676678 0.0549511 0.0163238 0.0415657 0.0487628 -0.0431009 0.0884253 -0.0474268 0.0015971 -0.0571666 0.0976691 -0.0626946 0.0914015 0.0758535 0.126481 -0.0919474 -0.0253183 -0.00380253 0.0198349 -0.0935244 -0.114845 -0.00191976 0.0755601 0.0687243 -0.0002415 -0.0155384 0.0270158 -0.0580284 0.00350614 -0.0663468 -0.0363945 
0.0556474 -0.0199097 0.00197971 0.00881338 0.136071 0.203022 0.129335 -0.111533 -0.0651556 -0.0906134 -0.108644 0.0487711 0.0467397 -0.0461702 0.0525851 -0.183078 -0.0686131 0.0513918 -0.0649581 0.0852119 -0.0118407 -0.0105125 0.0643889 0.043343 -0.0211607 -0.0344406 -0.193435 -0.156558 -0.038874 -0.0223127 0.0906534 0.146277 -0.15329 0.092194 0.10099 0.0278443 0.0342983 0.108647 -0.040072 -0.124734 0.205785 -0.0341295 -0.0475922 0.0285164 -0.247554 0.0057766 0.0430032 0.101734 -0.0264062 0.0536329 -0.0704302 -0.0915466 0.0741274 0.00502313 0.0826325 -0.0184671 -0.00864389 0.16254 -0.00680575 -0.11511 -0.0497569 0.147159 0.115266 -0.14648 0.123132 0.0213018 0.0868446 -0.0265621 -0.0868642 0.112394 -0.0329326 0.0734541 0.0321574 0.136605 -0.0550739 -0.0286351 -0.0878416 -0.074972 0.097052 -0.00716294 -0.0542722 0.099333 -0.0174531 -0.0578056 0.0393458 -0.143225 0.0961903 0.0775315 -0.0617229 0.0460652 0.239792 -0.0613393 0.111313 -0.128342 -0.0817666 -0.114376 0.0469956 0.0892029 0.0409059 0.0044795 0.0258172 0.0820653 -0.000818654 0.104271 -0.0629961 -0.00816017 -0.0446959 0.0897338 -0.00702886 0.117284 0.0792155 0.114411 -0.087935 0.000108365 -0.0154697 -0.0185761 -0.0496036 -0.128373 0.0157029 0.0865101 0.0755285 0.00454714 -0.0358826 0.046798 -0.059897 -0.0356408 -0.061774 -0.0420578 
0.0407604 0.0237516 -0.0511644 -0.0593399 0.122399 0.205561 0.0762581 -0.104061 -0.10101 -0.0527287 -0.0808076 0.0643971 0.0664547 -0.00784283 0.00437855 -0.191455 -0.0543225 0.0433279 -0.00216877 0.103856 -0.011053 0.0124801 0.0580296 0.0484605 -0.0574229 0.0273732 -0.101441 -0.107221 0.0403365 0.00918447 0.0343514 0.0665345 -0.122671 0.0378703 0.0868202 0.0497459 0.00261847 0.103163 -0.0579904 -0.0982407 0.139201 -0.017224 -0.0673232 0.100404 -0.274954 0.0469625 0.0876815 0.119459 -0.0605774 0.0515848 -0.0638621 0.00748073 0.0179365 0.00583012 0.108369 -0.00294716 -0.0121278 0.19969 -0.0149633 -0.129032 -0.0553805 0.127337 0.214608 -0.108886 0.116546 -0.0405252 0.0731686 -0.0156908 -0.0686522 0.15772 -0.0130468 0.0662464 0.0190919 0.120116 -0.0381734 -0.0245067 -0.0901101 -0.00685042 0.109187 -0.044238 -0.0447141 0.107919 0.00345223 -0.033025 0.0507059 -0.178007 0.0872253 0.0969775 0.0132037 0.0675166 0.214724 -0.0617456 0.0865567 -0.0998716 -0.0302315 -0.179335 0.0726111 0.12937 0.0494098 -0.0466503 0.0232763 0.152396 0.00438621 0.073902 -0.138874 0.0476744 -0.0541423 0.0594432 0.0168881 0.0911099 0.133387 0.10884 -0.0837019 0.0333204 -0.0266894 -0.00503196 -0.0163677 -0.177819 0.0271953 0.0932748 0.061811 -0.0511135 -0.0194475 -0.000284487 -0.105706 0.00905288 -0.0407131 -0.0140324 
0.0284164 0.0252976 -0.0551121 -0.0239099 0.122744 0.172287 0.0725009 -0.131551 -0.0742363 -0.0489752 -0.0394224 0.0912332 0.0797217 -0.0375721 -0.0524149 -0.178011 -0.0593078 0.0864894 -0.0379703 0.151858 0.0422433 -0.0537755 0.0688549 0.0827493 -0.0511592 0.0163266 -0.0977697 -0.140604 0.0445035 0.0532914 0.0225256 0.0914531 -0.096335 0.0639771 0.0788567 0.0306006 0.00159358 0.139 -0.0600847 -0.125985 0.129164 -0.0574389 -0.0664437 0.106293 -0.268325 0.00717511 0.101909 0.106831 -0.0586436 0.0460107 -0.0562501 0.00319793 -0.00922021 0.0041816 0.124412 0.00440349 -0.0132432 0.164812 -0.0438244 -0.116593 -0.0444986 0.068689 0.223771 -0.102778 0.145256 -0.0789066 0.0406422 -0.03904 -0.0808962 0.162224 -0.0413282 0.0424687 -0.00578544 0.10141 -0.0447435 -0.0441513 -0.0525114 0.0422172 0.089275 -0.0349571 -0.101459 0.0984627 -0.00706885 -0.0193521 0.0269519 -0.151878 0.0960694 0.109498 0.0139004 0.0578898 0.192722 -0.0931754 0.0857533 -0.0954242 -0.0434848 -0.192216 0.0264402 0.1264 0.0739953 -0.0510215 0.0325045 0.135793 -0.0195548 0.120149 -0.0544297 0.0443605 -0.0341035 0.102934 0.0323179 0.059525 0.0548629 0.12101 -0.101895 0.0476443 -0.0158475 0.00451203 -0.0119306 -0.184484 0.0396372 0.132114 0.035639 -0.0173346 -0.0577764 0.0201403 -0.0994365 0.0266821 -0.0362455 -0.0161145 
0.0589887 -0.0186211 -0.0772072 -0.055266 0.122112 0.172448 0.0701518 -0.0888173 -0.103914 -0.117849 -0.084168 0.0643924 0.0623954 -0.0100828 -0.0275503 -0.170148 -0.0643815 -0.0203158 0.00701805 0.140637 0.0103427 -0.00310679 0.0694818 0.018744 -0.0643629 0.0632322 -0.0866195 -0.136262 0.0170898 -0.00775884 0.0197458 0.0414855 -0.116741 0.0382296 0.0780692 0.0472851 0.0155181 0.149 -0.0491245 -0.11235 0.136559 0.0059822 -0.0663554 0.100484 -0.260261 0.0705853 0.101291 0.0894736 -0.0439822 0.0589484 -0.113863 -0.0170959 0.0262461 0.0434411 0.140507 -0.0407583 0.00228288 0.197856 -0.0285682 -0.137994 -0.0351462 0.112818 0.229279 -0.0924036 0.115696 -0.0513128 0.068449 0.00820565 -0.00550665 0.0996868 -0.0111469 0.0597533 0.0249507 0.118404 -0.0162991 -0.0194597 -0.0897225 0.000107432 0.104911 -0.00148967 -0.0406514 0.0831179 0.00475066 -0.0444149 0.038516 -0.162681 0.0964846 0.126906 0.00310361 0.0260501 0.234686 -0.0639697 0.0716509 -0.10095 -0.0395812 -0.17536 0.0958788 0.124202 0.0545747 -0.0492773 -0.00764718 0.134963 0.00522886 0.0778601 -0.14647 0.0431319 -0.0545314 0.102049 0.000758741 0.074007 0.139761 0.102213 -0.103363 0.0398454 -0.0197398 0.0212901 -0.0353006 -0.178034 -0.000261684 0.0766121 0.0170676 -0.00676484 0.00360824 0.0097274 -0.103767 -0.000562719 -0.0444035 -0.00845026 
0.083975 -0.0650538 -0.0452101 -0.00374986 0.121068 0.216741 0.0625401 -0.106178 -0.0601066 -0.165224 -0.0786356 0.0892115 0.0374117 -0.0520903 -0.0168963 -0.143887 -0.136252 -0.00774261 -0.0278586 0.127117 0.0721979 -0.0248323 0.0994882 0.07077 -0.0234335 0.0150418 -0.112519 -0.20233 -0.0622226 0.0100698 0.0487549 0.0257938 -0.139148 0.0549312 0.0871363 0.0582287 -0.024974 0.120579 -0.026323 -0.104465 0.127423 -0.00688037 -0.0841144 0.064032 -0.229298 0.00120054 0.092221 0.057035 -0.0247248 0.0959686 -0.0819327 -0.0569669 0.0643869 0.0595319 0.159094 -0.037511 0.0236815 0.203964 -0.0575542 -0.142447 -0.034538 0.119632 0.225118 -0.12193 0.113912 -0.0378583 0.0618718 0.0257471 -0.0314205 0.122661 0.00255956 0.0996853 -0.00145933 0.0842764 -0.025384 -0.00270967 -0.0999362 -0.0662707 0.0924709 0.0911282 -0.0411982 0.0741085 0.0185103 -0.055673 -0.0100762 -0.112522 0.106532 0.113219 -0.0377326 0.0202167 0.225405 -0.0952527 0.0741129 -0.0657589 -0.0891014 -0.150626 0.0487113 0.104122 0.0660296 -0.0199814 0.0320765 0.0829676 -0.0373479 0.0665252 -0.0831793 0.0426935 -0.0580867 0.0817982 -0.0327369 0.0782898 0.104315 0.109226 -0.0813362 0.00392141 0.0224679 0.0839759 -0.0668077 -0.110898 -0.0115125 0.114744 0.0437899 -0.00829195 0.00168294 -0.00673666 -0.0790571 0.0441005 -0.00292737 0.0217093 
0.0612515 -0.031758 -0.0180171 -0.004045 0.100799 0.22641 0.0508711 -0.109696 -0.063364 -0.159999 -0.0831012 0.0639151 0.0204848 -0.0305459 0.0246608 -0.161532 -0.125608 -0.0293679 0.0032054 0.108188 0.0263761 -0.000656369 0.106907 0.0448534 -0.0215597 0.0169176 -0.116341 -0.169102 -0.045756 -0.0190805 0.0771152 0.0165267 -0.116648 0.0446923 0.103022 0.076784 -0.00136538 0.132372 -0.0269469 -0.0950714 0.134314 -0.00546168 -0.091846 0.0372652 -0.244445 0.0197835 0.0826671 0.0568888 -0.0294498 0.0921962 -0.100324 -0.0217235 0.0853281 0.0562319 0.143004 -0.0286012 0.0251146 0.193673 -0.0594884 -0.138463 -0.0714817 0.133695 0.215833 -0.148839 0.124301 0.00195102 0.0836398 0.0120756 -0.0547131 0.140813 0.0108494 0.0871001 -0.00417301 0.109566 0.00524603 -0.0102552 -0.109698 -0.0869891 0.103052 0.080484 -0.0489647 0.0647248 0.0302408 -0.051527 0.0164389 -0.134468 0.0875673 0.108238 -0.0392112 0.0361589 0.230673 -0.0817315 0.10112 -0.0620991 -0.0718547 -0.166044 0.0654629 0.119497 0.0562485 -0.02319 0.0140678 0.103125 -0.03381 0.0420732 -0.0956068 0.0623671 -0.0252719 0.0502279 -0.00306639 0.0852408 0.111597 0.102369 -0.0713451 0.00499665 0.0233804 0.0588823 -0.0488477 -0.116897 0.00936265 0.115961 0.0650184 -0.0361272 0.00215403 -0.0135223 -0.0579983 0.0464461 0.0336135 0.0391259 
0.0774114 -0.0451432 -0.0459852 -0.0295145 0.0921909 0.22096 0.0400329 -0.0980434 -0.0833335 -0.158494 -0.0898561 0.0633896 0.0333486 -0.029076 0.00512709 -0.162641 -0.12267 -0.0416848 0.0125183 0.108528 0.0266518 0.011818 0.105628 0.03507 -0.0378347 0.0423585 -0.0828369 -0.177451 -0.0529505 -0.0177993 0.04492 -0.00134786 -0.122726 0.0421318 0.0912609 0.0626691 -0.00378025 0.134596 -0.0316441 -0.087907 0.116833 -0.00118888 -0.0936185 0.0673082 -0.242703 0.0359035 0.0934524 0.0635153 -0.0371644 0.101255 -0.085148 -0.0272463 0.0761306 0.0667516 0.148095 -0.04553 0.040417 0.192118 -0.0339387 -0.159347 -0.045738 0.130396 0.223701 -0.119137 0.110854 -0.0324711 0.0853674 0.0338827 -0.0134534 0.129525 0.00404329 0.0798637 0.00721536 0.0973128 -0.00339357 -0.0106376 -0.121818 -0.0722589 0.102387 0.0886526 -0.0303498 0.0644075 0.0286102 -0.0574976 0.0102649 -0.1399 0.096173 0.106883 -0.0280408 0.0274787 0.22176 -0.0796549 0.0895352 -0.0697964 -0.0825513 -0.162946 0.0828594 0.12056 0.0597991 -0.0367998 0.0185159 0.119723 -0.0213511 0.0490272 -0.116728 0.0346407 -0.0530583 0.0656625 -0.0322975 0.083398 0.144077 0.107296 -0.0712084 0.00324219 0.00460429 0.0658258 -0.0621145 -0.13041 -0.00689047 0.0895831 0.0520751 -0.0286552 0.0200443 -0.0227232 -0.064221 0.0270395 0.0117971 0.0326968 
0.0867984 -0.0829158 -0.0274821 -0.0186631 0.113244 0.217559 0.0753674 -0.0902645 -0.0462797 -0.17697 -0.0879848 0.0813823 0.0348948 -0.0390495 -0.0024383 -0.169304 -0.111185 -0.019607 -0.0343428 0.110448 0.0413476 0.0140273 0.0786481 0.0734889 -0.0502944 0.0165721 -0.105303 -0.181712 -0.0663841 -0.0180033 0.058217 0.030066 -0.140406 0.0657365 0.0931286 0.0575136 0.00080724 0.125059 -0.0518231 -0.100563 0.147174 0.00453039 -0.0995301 0.0614336 -0.229757 0.00725848 0.0588626 0.0742001 -0.016542 0.0945017 -0.0904392 -0.0720955 0.0801508 0.0548921 0.151208 -0.037431 0.00629074 0.204734 -0.049074 -0.141649 -0.0356074 0.132036 0.200718 -0.119805 0.10799 -0.0383583 0.0885458 0.0183211 -0.0252937 0.119424 -0.00266556 0.0690765 0.0167291 0.0953239 -0.0361831 -0.0134039 -0.104642 -0.0695463 0.101996 0.0662055 -0.0268555 0.0800837 0.0117058 -0.0782001 0.0180989 -0.14133 0.115949 0.107295 -0.0548326 0.036923 0.24617 -0.0919821 0.0868632 -0.0764902 -0.083963 -0.131361 0.0616908 0.076756 0.0583967 -0.00885259 0.0368119 0.0961802 -0.0365683 0.0581995 -0.0875574 0.0170332 -0.0598163 0.0514561 -0.0479985 0.093984 0.12272 0.112583 -0.0801359 0.00452103 0.00750717 0.0653336 -0.0643652 -0.127134 -0.0178897 0.0890444 0.0453817 -0.00492721 0.00337098 0.00403644 -0.0644016 0.0160913 -0.0204139 0.00317818 
0.0526674 -0.05028 -0.0435858 -0.0297556 0.109336 0.201013 0.0563809 -0.0845698 -0.0560636 -0.13875 -0.0731612 0.0695605 0.0449733 -0.0416154 -0.0129878 -0.171179 -0.114352 -0.018119 -0.0165249 0.144624 0.0422799 -0.0244887 0.0831415 0.0561166 -0.0480054 0.0301688 -0.108291 -0.170445 -0.0164325 -0.0240149 0.0584719 0.00862707 -0.119487 0.0447695 0.0860736 0.0733615 -0.0133392 0.134615 -0.0600747 -0.114932 0.139665 -0.01196 -0.104138 0.0836866 -0.24603 0.0158602 0.0788535 0.0914154 -0.0245848 0.0809551 -0.125087 -0.0303305 0.0489906 0.0398199 0.149597 -0.034532 -0.00581174 0.191412 -0.0532027 -0.150157 -0.0458632 0.117481 0.230922 -0.0961912 0.110618 -0.038128 0.0763687 0.0117837 -0.0197389 0.11959 -0.00375987 0.0728235 0.0109252 0.100796 -0.0154905 -0.0224296 -0.105725 -0.0233294 0.114073 0.0501664 -0.0520864 0.0734425 0.0138474 -0.0528836 0.0232896 -0.137822 0.106146 0.137489 -0.00362831 0.0312481 0.245327 -0.0769366 0.0871351 -0.0789034 -0.0723681 -0.178792 0.0583778 0.0998249 0.0509646 -0.0399994 0.0226801 0.106354 -0.0241168 0.0352021 -0.0985301 0.0598614 -0.0378379 0.0691497 0.00140069 0.0868115 0.114792 0.114671 -0.0927115 0.0159099 0.00963932 0.0538672 -0.044421 -0.14814 0.00340432 0.099493 0.0310836 -0.0192896 -0.00827224 0.0131332 -0.0945614 0.0299866 -0.00903845 0.0234892 
0.0349022 -0.021926 -0.00743278 -0.0141398 0.0907282 0.217975 0.0467314 -0.131286 -0.0655626 -0.135778 -0.0886702 0.072832 0.0206582 -0.0305422 0.0309008 -0.175882 -0.0974035 0.00139292 0.0184525 0.0986729 -0.00488999 0.0302308 0.0854877 0.0712502 -0.0489303 0.0318649 -0.108968 -0.158147 -0.0260824 -0.0146486 0.0713188 0.0410006 -0.104559 0.0439448 0.126994 0.0815183 0.0291141 0.114742 -0.0473237 -0.0944247 0.148744 -0.0152285 -0.086 0.0486516 -0.259815 0.0407022 0.0871802 0.0785809 -0.0351145 0.0792481 -0.0887873 -0.0264127 0.0866488 0.0378382 0.139794 -0.00908293 0.0161075 0.180618 -0.0473313 -0.123043 -0.0671045 0.142593 0.198572 -0.145872 0.139667 -0.0257496 0.0958326 -0.0308365 -0.0711528 0.154559 -0.0114199 0.0533219 -0.00342167 0.123182 -0.0014903 -0.02072 -0.11297 -0.0525206 0.109971 0.0255424 -0.0368086 0.0951536 0.0156435 -0.0500111 0.0395248 -0.159919 0.0816907 0.088525 -0.0567495 0.0639949 0.230353 -0.0625431 0.114952 -0.082278 -0.0601069 -0.15361 0.067651 0.123937 0.0626386 -0.0254118 0.0207923 0.123215 -0.0277963 0.0427185 -0.0849539 0.0359503 -0.014873 0.0318063 -0.0167651 0.115242 0.10597 0.0952527 -0.0583861 -0.00655097 -0.015659 0.0311432 -0.0277357 -0.159925 0.00612243 0.106119 0.0792479 -0.04407 -0.0107227 -0.0112622 -0.0716745 0.039639 0.00489865 0.0181304 
0.0443948 -0.0326118 -0.033961 -0.0294147 0.101275 0.196317 0.0497067 -0.100539 -0.0890564 -0.129281 -0.0814386 0.0592952 0.0420064 -0.0468881 0.00412018 -0.154152 -0.11378 -0.00463963 -0.0011534 0.132719 0.0247219 -0.0134307 0.101245 0.0383196 -0.0527265 0.0475096 -0.122749 -0.182291 -0.00190548 -0.0276554 0.053243 0.0466558 -0.110645 0.0425513 0.101645 0.0661834 0.00101003 0.145889 -0.0336768 -0.112053 0.138138 -0.0214786 -0.0957249 0.0618202 -0.252984 0.0437431 0.0964149 0.0823542 -0.0525718 0.0758892 -0.128534 -0.0245207 0.0670498 0.0433114 0.12593 -0.0364877 0.0361436 0.177207 -0.0532372 -0.137875 -0.0478568 0.138194 0.221155 -0.106469 0.123109 -0.0169603 0.0731653 -0.000863791 -0.0316285 0.117116 -0.0206968 0.0588251 -0.00103816 0.124862 -0.00313277 -0.0355577 -0.112456 -0.0427586 0.114921 0.0389888 -0.0474472 0.0776295 0.00115294 -0.0562967 0.0258701 -0.133788 0.0869761 0.119559 -0.0246727 0.0356669 0.25405 -0.0553926 0.091381 -0.0821287 -0.0660588 -0.166261 0.0650207 0.140214 0.0565513 -0.0381108 0.0169704 0.0987456 -0.0239157 0.0548554 -0.0834503 0.0512915 -0.020746 0.0837852 0.0157009 0.0850507 0.101968 0.117864 -0.083152 -0.00217266 0.00735828 0.0440746 -0.0450438 -0.157209 0.0193684 0.101965 0.0476742 -0.030744 -0.00161143 0.00524467 -0.0971348 0.0281907 -0.00640259 0.0177025 
0.0255501 -0.00446981 -0.0209819 -0.0229256 0.0803257 0.220787 0.0371973 -0.0990958 -0.108754 -0.112582 -0.0819133 0.0602764 0.0361521 -0.0667201 0.0126746 -0.150963 -0.100101 0.0100266 0.000432501 0.127409 0.000292125 0.00105181 0.106715 0.0554081 -0.0644285 0.0422318 -0.111734 -0.177613 0.00713344 -0.0356718 0.0574183 0.0648137 -0.101862 0.055039 0.0997436 0.0702441 0.0184612 0.140387 -0.0503025 -0.0919495 0.143018 -0.0470886 -0.0880919 0.0483645 -0.257205 0.0375227 0.115594 0.0827131 -0.0843531 0.0837512 -0.0921551 -0.0226968 0.0668264 0.0372324 0.113452 -0.0204739 0.0434663 0.160639 -0.0386114 -0.133545 -0.0685429 0.150034 0.209491 -0.145834 0.146196 -0.0207725 0.0770858 -0.0362925 -0.0787085 0.143917 -0.0412694 0.0445548 -0.00913258 0.144361 0.0134591 -0.0406274 -0.102514 -0.0251331 0.111523 0.0210906 -0.0544711 0.0737784 0.00381438 -0.0544617 0.0250966 -0.128727 0.0742854 0.0994615 -0.040055 0.0574843 0.237531 -0.0616133 0.0952981 -0.0742428 -0.0537487 -0.141795 0.074191 0.151434 0.047614 -0.029276 0.0163024 0.10987 -0.0441963 0.0775168 -0.0633699 0.0445412 -0.0146042 0.0723765 0.000607166 0.0803298 0.0774446 0.130055 -0.0546763 -0.00580453 -0.00480208 0.0213535 -0.0382958 -0.162431 0.032991 0.118683 0.0627986 -0.0560745 0.00327055 -0.01066 -0.0785655 0.0381428 -0.00893433 0.00263909 
0.0153716 -0.0245249 -0.00153499 -0.0269838 0.0711472 0.198223 0.0420087 -0.100929 -0.0991344 -0.121522 -0.0958772 0.0660588 0.0353564 -0.0114537 0.0387658 -0.170026 -0.0832104 -0.00652998 0.0261168 0.114733 -0.0223119 0.0291876 0.0902176 0.0566015 -0.0740221 0.0541069 -0.12003 -0.165266 0.000253146 -0.0313966 0.0557492 0.0673413 -0.0879856 0.0291915 0.108603 0.0854139 0.0264238 0.147929 -0.0663689 -0.0776377 0.147806 -0.00474153 -0.0966098 0.0308205 -0.258918 0.0639356 0.102754 0.0611817 -0.0641545 0.0609661 -0.106953 -0.0307517 0.0923394 0.0425561 0.126042 -0.00833998 0.0373354 0.177274 -0.0327197 -0.121398 -0.0750435 0.163022 0.186126 -0.1455 0.148208 -0.0111346 0.105085 -0.0369207 -0.0655006 0.132179 -0.0152933 0.0373717 0.00125294 0.141426 0.0186755 -0.0164703 -0.122391 -0.0490412 0.114389 0.00234177 -0.0428196 0.0901122 -0.00406257 -0.0538532 0.0466056 -0.142773 0.0822331 0.0835342 -0.0607038 0.0482926 0.228467 -0.0468507 0.118546 -0.0816469 -0.0501202 -0.141734 0.0835291 0.144034 0.0613404 -0.0155924 0.00528688 0.113274 -0.0237082 0.0559418 -0.101659 0.0451935 -0.0164881 0.0369775 -0.0122531 0.0881178 0.0899498 0.10077 -0.061208 -0.0347762 -0.0212946 0.0260159 -0.0328144 -0.185842 0.0140453 0.0996273 0.06321 -0.0568371 -0.00498362 -0.013895 -0.0787053 0.0477255 -0.0136402 0.0148584 
