0.10862 0.0294762 -0.136513 -0.0203082 0.134717 0.196939 0.0265242 -0.0527312 -0.0702842 -0.0992093 0.0651472 0.10268 0.0840169 -0.102346 -0.105167 -0.01768 -0.0759529 0.0645067 -0.128408 0.140415 0.192048 -0.0603707 0.0839641 0.126732 0.0287438 -0.0470709 -0.00913331 -0.195303 0.0568037 0.105019 0.0241573 0.00943324 -0.0866173 0.0688015 -0.0164493 0.00921738 -0.112003 0.0603261 -0.0161624 -0.0414169 0.0296724 -0.0418944 -0.0571994 0.179313 -0.160166 -0.0319046 0.147413 0.0388704 -0.135975 0.0663277 0.000910446 0.00221306 -0.0720181 -0.0233261 0.0658292 -0.0102118 -0.0210684 0.204445 -0.0280678 -0.117026 -0.0672902 0.00697069 0.283036 -0.0734736 0.0319054 -0.128026 -0.0151138 0.0474137 -0.055176 0.126407 0.00652477 0.0915875 -0.0591731 -0.0225676 -0.0207565 -0.0277806 -0.0574501 0.0565392 -0.0161748 0.118941 -0.0559715 0.0585472 0.00157899 -0.0539159 -0.092295 0.0354978 0.0794313 0.0252049 -0.0145263 0.00709804 0.128431 -0.154642 -0.115096 -0.0162806 -0.0216127 -0.107469 -0.0414654 0.0879709 0.00777452 -0.0638569 0.0119709 0.0260307 -0.0251986 0.144064 -0.110878 0.0667202 -0.109083 0.171157 0.0337366 -0.0795359 0.0521687 0.1328 -0.113125 0.0547182 0.0543157 0.0925149 -0.118162 -0.0845321 0.0638434 0.178057 0.00578333 0.00644103 -0.0304685 0.0575892 -0.0858802 0.0364023 -0.00918547 -0.0106323 
0.142102 0.0107561 -0.133378 -0.00905655 0.142365 0.216893 0.046707 -0.0479742 -0.0843846 -0.148961 0.0382459 0.109473 0.0844318 -0.120819 -0.106551 -0.0383354 -0.0575821 0.0565918 -0.145854 0.157761 0.179725 -0.0214999 0.0814847 0.100144 -0.00470283 -0.0567938 -0.0405623 -0.194289 0.0131871 0.0962235 0.00745807 0.0420365 -0.102547 0.107409 -0.00127157 -0.00575494 -0.0597243 0.0646163 -0.0168642 -0.0582507 0.0526787 -0.0334553 -0.0289101 0.151339 -0.178797 -0.0347616 0.147698 0.0371071 -0.130683 0.115443 0.012371 -0.0343003 -0.0625008 0.0208067 0.082538 -0.043119 -0.0132678 0.175664 -0.028721 -0.12543 -0.0554351 0.0355912 0.255487 -0.103954 0.0270577 -0.141573 0.004043 0.0298679 -0.0632751 0.102588 0.00131322 0.0666825 -0.0373462 0.00990196 -0.0431182 -0.024883 -0.0473413 0.0243091 -0.00677172 0.119055 -0.0294205 0.0658709 0.00541392 -0.0598734 -0.0661368 0.0352066 0.0767407 0.0241449 -0.0293715 0.0320421 0.158555 -0.177078 -0.117053 -0.0189232 -0.0466674 -0.0893653 -0.0194472 0.082106 -0.0173625 -0.0462485 0.011295 0.0518808 -0.0283901 0.174406 -0.106271 0.0408141 -0.110472 0.185369 -0.00801494 -0.0369443 0.0609432 0.118822 -0.122116 0.0685426 0.021893 0.0687824 -0.0989129 -0.0936486 0.042155 0.159691 0.00379456 0.0307591 0.00625154 0.0557655 -0.0488976 -0.00863736 -0.00332778 -0.0402441 
0.117363 0.0460808 -0.136845 -0.0208432 0.132133 0.20568 0.0229935 -0.0606752 -0.085853 -0.115222 0.0611499 0.0917178 0.0865387 -0.0945448 -0.100602 -0.0263831 -0.0627809 0.057596 -0.11758 0.143617 0.18746 -0.0440967 0.0796492 0.109492 0.0267702 -0.0454084 -0.0179071 -0.18255 0.0629326 0.110017 0.0225196 0.0214791 -0.0904721 0.0743176 -0.00772938 0.0110656 -0.0894381 0.0626215 -0.000428625 -0.0492175 0.0302973 -0.0440484 -0.0401125 0.172733 -0.163844 -0.0207247 0.159644 0.0400429 -0.147807 0.0737891 -0.00319944 0.0132614 -0.0684818 -0.0070088 0.0658786 -0.0210135 -0.0195992 0.195209 -0.0298131 -0.125846 -0.0679217 0.0185446 0.28397 -0.0884443 0.0262053 -0.12073 -0.0016989 0.0356668 -0.059649 0.121944 0.00424515 0.0791406 -0.0596458 -0.00770258 -0.0170278 -0.0367986 -0.0528344 0.0472385 -0.0108643 0.121571 -0.0444876 0.0653175 0.00583468 -0.0560095 -0.0753595 0.0354331 0.0654096 0.018629 -0.0139266 0.0187837 0.146434 -0.161481 -0.115466 -0.012683 -0.0229862 -0.114355 -0.0286044 0.102432 -0.000751867 -0.0652753 0.00361368 0.0436276 -0.0232244 0.157702 -0.121721 0.0750954 -0.10121 0.184109 0.0333636 -0.0699622 0.0561558 0.120909 -0.12801 0.0649212 0.0457205 0.0762923 -0.106484 -0.0976 0.0684697 0.172446 0.00763188 0.00673219 -0.0139452 0.0565263 -0.0772583 0.0213986 0.00439793 -0.0148684 
0.11486 0.0532035 -0.125651 -0.0198951 0.137918 0.210872 0.0238692 -0.0731778 -0.0776847 -0.116585 0.0679862 0.0911446 0.0790165 -0.0817996 -0.0886585 -0.0382256 -0.0666339 0.0643028 -0.111593 0.131178 0.187014 -0.0320019 0.0681812 0.114038 0.0410432 -0.0564904 -0.017163 -0.167538 0.070559 0.122463 0.0331291 0.00899206 -0.0916878 0.0658154 0.00484423 0.0205447 -0.0943775 0.0403684 0.0040808 -0.0486832 0.0337871 -0.0398171 -0.0417714 0.177873 -0.168057 -0.0166489 0.153074 0.0453358 -0.142322 0.0643664 -0.00525269 0.0294261 -0.0661738 -0.0162385 0.0645835 -0.0127045 -0.0356075 0.204882 -0.0393416 -0.116857 -0.0746724 0.0181259 0.287446 -0.086149 0.0237198 -0.117913 0.00366893 0.031046 -0.0661775 0.138294 0.0189422 0.0853216 -0.0597969 -0.0202661 -0.0189849 -0.033796 -0.0574017 0.042693 -0.0121886 0.123452 -0.0380545 0.0735923 0.0124942 -0.0484148 -0.0688893 0.0281856 0.0645032 0.01475 -0.0211586 0.0286189 0.151546 -0.161864 -0.114855 -0.00909766 -0.0256056 -0.127218 -0.0373868 0.0953369 0.00464832 -0.0682828 0.00571852 0.053073 -0.0181613 0.140476 -0.128722 0.0877468 -0.0922545 0.174439 0.0410637 -0.0638077 0.0652042 0.106098 -0.135205 0.069287 0.04625 0.0787804 -0.10207 -0.0912354 0.0684725 0.177211 0.0171853 -0.0028729 -0.0271596 0.0557582 -0.0759005 0.0297308 0.0182326 -0.00595506 
0.123066 0.0403836 -0.131825 -0.0196853 0.14073 0.197715 0.03885 -0.0482536 -0.0709229 -0.120975 0.0624745 0.0978234 0.0900336 -0.0958148 -0.10316 -0.028549 -0.0516105 0.0529135 -0.143537 0.150098 0.189897 -0.0424456 0.0691027 0.109065 0.0228028 -0.0514453 -0.0253154 -0.171255 0.0605018 0.106788 0.022001 0.032311 -0.0915376 0.0862787 -0.0180396 0.0023925 -0.0835826 0.0754389 -0.0101571 -0.0517006 0.0418372 -0.0338469 -0.0375684 0.164111 -0.159536 -0.030307 0.144858 0.0378085 -0.137499 0.0733075 -0.00380534 0.0076292 -0.0774309 -0.00730856 0.0706646 -0.0240666 -0.0388846 0.195473 -0.0352518 -0.127029 -0.0727389 0.00920551 0.272169 -0.0877283 0.0200187 -0.117125 -0.000666789 0.0430058 -0.0626617 0.10884 0.0129444 0.0765581 -0.0503302 -0.00446875 -0.0207766 -0.0290575 -0.0483305 0.0445667 -0.0139419 0.117047 -0.0452641 0.0672204 0.0100862 -0.0574333 -0.0692663 0.0323626 0.0766608 0.0267773 -0.0115 0.0183583 0.143923 -0.173512 -0.119322 -0.0106465 -0.0241091 -0.110434 -0.0272846 0.0797147 -0.00743895 -0.0619328 8.55214e-05 0.0391949 -0.0235717 0.169096 -0.13021 0.0694793 -0.109747 0.184246 0.0365349 -0.0765725 0.0579028 0.125937 -0.141055 0.0772936 0.0497359 0.0695575 -0.115964 -0.0951475 0.0630944 0.171295 0.00194282 0.0258552 -0.0166836 0.0678812 -0.0641119 0.012156 0.000285626 -0.0284729 
0.112472 0.0553062 -0.127574 -0.0118327 0.126983 0.196749 0.00534001 -0.0956457 -0.0831813 -0.122566 0.0758385 0.0820935 0.0891301 -0.0206402 -0.0903322 -0.0407589 -0.0382665 0.0675242 -0.083876 0.130606 0.193238 -0.0451303 0.0850487 0.144814 0.0531721 -0.0699721 -0.00393896 -0.15658 0.0745389 0.149047 0.0295851 -0.0130093 -0.0717643 0.0458911 1.95929e-05 0.0393575 -0.106192 0.048981 -0.00959705 -0.0486185 -0.00876917 -0.0168899 -0.0506835 0.161908 -0.158344 0.00180938 0.155433 0.0408495 -0.135914 0.0535271 -0.00569511 0.0453002 -0.0372057 -0.0225374 0.0700865 0.00499117 -0.0217405 0.2249 -0.0204018 -0.118272 -0.0748135 0.0364242 0.284936 -0.0996546 0.0201837 -0.100587 0.00656256 0.0406221 -0.0781459 0.148164 0.0276359 0.0797166 -0.0731412 -0.0465296 -0.0100477 -0.0181017 -0.0438915 0.0323071 -0.0059372 0.122027 -0.0462101 0.0640391 -0.0017204 -0.0646737 -0.0696682 0.0230208 0.0411859 -0.00468384 -0.0271273 0.0261402 0.139057 -0.156439 -0.0826561 -0.002749 -0.00937103 -0.132911 -0.0439681 0.114229 0.0261116 -0.072922 0.0174707 0.065728 -0.0147516 0.129371 -0.147614 0.102908 -0.0916468 0.141786 0.0471516 -0.0786971 0.0674331 0.101737 -0.118181 0.061032 0.0405331 0.106879 -0.101938 -0.0875692 0.0592027 0.188136 -0.0058844 -0.0219063 -0.0527211 0.0419341 -0.0942932 0.0665921 0.0172517 -0.000265812 
0.126965 0.0282005 -0.116848 0.0138505 0.116069 0.215992 0.0267457 -0.0818592 -0.0796444 -0.147765 0.0588443 0.0817249 0.0851071 -0.0384695 -0.0818664 -0.0696638 -0.0400636 0.069461 -0.0908346 0.134887 0.186056 -0.0487258 0.088606 0.174387 0.0396188 -0.102744 -0.0279585 -0.176047 0.0312857 0.135607 0.0304266 -0.0142328 -0.0822831 0.0699445 0.00881078 0.0355215 -0.0967116 0.0402554 -0.0491066 -0.0652026 0.00829829 -0.0240279 -0.056194 0.146476 -0.16711 -0.0119705 0.145153 0.0444819 -0.130121 0.0903947 0.000286334 0.0132904 -0.00720775 -0.0144947 0.086222 0.00723615 -0.017465 0.215346 -0.00182949 -0.130965 -0.0711053 0.0714931 0.261307 -0.127545 0.0183386 -0.0942856 0.0200646 0.013477 -0.101092 0.143986 0.0113749 0.0653815 -0.0692489 -0.0312411 -0.0220893 -0.0144292 -0.0339765 0.0100678 0.013848 0.13126 -0.0530033 0.0467052 -0.0151369 -0.0903981 -0.0583623 0.0291891 0.037702 -0.0194748 -0.0410724 0.0451877 0.159618 -0.161991 -0.0629271 -0.0224704 -0.0274165 -0.1135 -0.0375699 0.103752 0.0261012 -0.0634861 0.0423149 0.0803037 -0.0130113 0.121289 -0.138922 0.088024 -0.0910045 0.127413 0.0124509 -0.051851 0.0731664 0.104856 -0.0994674 0.0301275 0.0285267 0.113961 -0.0821517 -0.087034 0.0585151 0.19412 -0.00337203 -0.0326081 -0.053305 0.0444601 -0.0865467 0.0616871 0.0237982 -0.0111703 
0.116017 0.0232562 -0.13239 -0.0092579 0.121295 0.188727 0.0249118 -0.049369 -0.073945 -0.129073 0.0571611 0.0881303 0.0966226 -0.0834992 -0.11366 -0.0275529 -0.0689656 0.0502097 -0.124662 0.164433 0.206316 -0.0798922 0.0920991 0.127853 0.0280737 -0.0671787 -0.0250045 -0.189866 0.0468065 0.115376 0.0147192 -0.00113928 -0.0767253 0.0756968 -0.0147246 0.00797214 -0.10199 0.0820127 -0.0304636 -0.0729275 0.010148 -0.0466231 -0.0409138 0.160699 -0.151182 -0.0326169 0.149603 0.0365188 -0.138894 0.0910109 -0.0185197 -0.00844103 -0.0463054 -0.00276989 0.0846007 -0.0213012 -0.0217824 0.189847 -0.0266259 -0.145139 -0.0569022 0.0262906 0.276213 -0.0857121 0.0226572 -0.103879 -0.0121922 0.0364421 -0.0699374 0.096284 0.000695073 0.0693469 -0.0668169 -0.0236442 -0.0171452 -0.0226187 -0.0326423 0.0304646 0.00900716 0.137485 -0.0555659 0.0341799 -0.0102675 -0.0683851 -0.0792412 0.0421773 0.0531607 0.0273165 0.00312939 0.0191627 0.145131 -0.166564 -0.099 -0.00962548 -0.0326415 -0.108461 -0.0386957 0.104126 0.0096623 -0.0668406 0.0260285 0.0333866 -0.0288682 0.139747 -0.119856 0.0796749 -0.100841 0.175542 0.0301864 -0.0785858 0.048419 0.126406 -0.117959 0.0517775 0.0497153 0.102282 -0.105125 -0.0730268 0.0600504 0.183505 -0.0222561 0.0040031 -0.0272257 0.0555708 -0.0847604 0.04186 0.0086512 -0.0196971 
0.117279 0.052667 -0.13861 -0.00400439 0.137732 0.202703 0.0333455 -0.0765627 -0.0784612 -0.114063 0.068628 0.0891985 0.0940345 -0.0728728 -0.098946 -0.0287706 -0.0363352 0.0702976 -0.110159 0.132722 0.20425 -0.0546872 0.0512033 0.138412 0.053492 -0.066707 -0.0321062 -0.177426 0.0713883 0.147694 0.0347769 0.0305209 -0.0913041 0.0640445 -0.00118948 0.0160205 -0.0961624 0.0295706 0.00136213 -0.0659284 0.0290208 -0.0386703 -0.0209934 0.171033 -0.141406 -0.0184019 0.159562 0.0403718 -0.145885 0.0377775 0.000349929 0.0128823 -0.0439078 -0.030303 0.0661412 0.00189643 -0.0476561 0.208449 -0.0195473 -0.125225 -0.0682179 0.0274937 0.268865 -0.101358 0.0177272 -0.102123 0.00217468 0.0235091 -0.0767769 0.10259 0.00909665 0.0759334 -0.0718776 -0.0438904 -0.0255496 -0.0197271 -0.0389893 0.0453936 -0.0127045 0.127832 -0.0456363 0.0675019 -0.00130802 -0.0587006 -0.0699828 0.0404875 0.0570855 -0.00704556 -0.0254868 0.0213188 0.136473 -0.159627 -0.113921 -0.00544244 -0.0257305 -0.105468 -0.0359879 0.0950362 0.00362803 -0.0659658 0.0159364 0.0474896 -0.0119785 0.153173 -0.146233 0.0875293 -0.0977553 0.176384 0.0272975 -0.0666831 0.0578045 0.0947765 -0.14102 0.0466839 0.0448189 0.0815795 -0.122744 -0.0911343 0.0602598 0.176659 0.000776963 -0.00404945 -0.0363876 0.0551886 -0.0852276 0.0420443 -0.00429211 -0.024937 
0.109542 0.0354764 -0.140118 -0.0130192 0.134481 0.190604 0.034441 -0.0574295 -0.075635 -0.114307 0.0614597 0.0898819 0.0946797 -0.0709547 -0.104441 -0.0361152 -0.0508681 0.0606038 -0.110081 0.145447 0.202733 -0.0697994 0.062352 0.135937 0.042545 -0.0609053 -0.0277859 -0.181987 0.067831 0.128167 0.0276331 0.0116905 -0.087225 0.0618189 -0.00930509 0.0175073 -0.104414 0.0516395 -0.0205284 -0.0693567 0.0282186 -0.0348851 -0.0345444 0.177331 -0.149551 -0.0209562 0.156186 0.0400579 -0.139908 0.0481417 -0.0202028 0.00271395 -0.0498048 -0.0261535 0.0770763 -0.000396422 -0.0454048 0.213401 -0.0216834 -0.13473 -0.0622438 0.0265232 0.27898 -0.0862237 0.0223825 -0.101151 -0.00399779 0.0307534 -0.0638437 0.100136 0.00930974 0.0786752 -0.065075 -0.0357056 -0.0220622 -0.0200535 -0.0422971 0.0486466 -0.00120508 0.11601 -0.0586802 0.0606767 -0.00858869 -0.0645499 -0.0749295 0.0358314 0.063641 0.0153026 -0.00721098 0.0134029 0.144324 -0.156132 -0.105007 -0.0178798 -0.0209347 -0.111562 -0.0337848 0.0962158 0.00891541 -0.067797 0.0128352 0.0379767 -0.0127122 0.137923 -0.147764 0.0889834 -0.104704 0.171963 0.0293376 -0.0725394 0.0626248 0.109748 -0.134614 0.0439463 0.0490403 0.0885961 -0.113493 -0.0959343 0.0632726 0.174461 -0.00989074 0.000220614 -0.0373251 0.0596064 -0.0972236 0.0445458 -0.00890248 -0.021895 
0.112796 0.0390619 -0.140594 -0.00808213 0.139021 0.195051 0.0386027 -0.0589684 -0.0734514 -0.110689 0.0620163 0.0916395 0.0923062 -0.0853919 -0.104016 -0.0404249 -0.0478935 0.0696737 -0.112303 0.148027 0.199285 -0.0712579 0.0615276 0.14406 0.0428052 -0.0732292 -0.0299609 -0.183411 0.0658927 0.128674 0.0324015 0.00496432 -0.0877121 0.0630553 -0.00496042 0.0130715 -0.102643 0.0387009 -0.0221364 -0.0717829 0.0307457 -0.0409651 -0.0343878 0.178816 -0.152253 -0.0244296 0.153052 0.0467972 -0.138594 0.055946 -0.0142505 0.00211489 -0.0496424 -0.0328089 0.0703956 -0.00146469 -0.0461852 0.20717 -0.0212129 -0.129062 -0.064054 0.0287779 0.274521 -0.0913847 0.0213726 -0.110949 -0.0047364 0.0197467 -0.0751092 0.0994713 0.00703161 0.0783407 -0.0670204 -0.0363354 -0.0277154 -0.0201223 -0.0382275 0.0547726 0.00108516 0.121679 -0.0613928 0.0572156 -0.00840861 -0.0563096 -0.0678741 0.0384667 0.0589823 0.0122834 -0.00903608 0.0171974 0.141724 -0.15372 -0.105169 -0.0178933 -0.0229537 -0.114498 -0.0373582 0.0941737 0.00123642 -0.0693745 0.0191592 0.0421525 -0.0127049 0.137421 -0.139695 0.087548 -0.0962451 0.171999 0.0309546 -0.0620426 0.0615682 0.104562 -0.128026 0.0459808 0.0408965 0.0874581 -0.113186 -0.0883358 0.0598936 0.180467 -0.0106947 -0.00352644 -0.0452685 0.0603531 -0.095904 0.0418525 -0.0100868 -0.0243945 
0.12112 0.0397314 -0.129468 -0.0107646 0.127486 0.208699 0.0303176 -0.0573256 -0.0845584 -0.13202 0.054601 0.0871365 0.0805635 -0.0927795 -0.0916039 -0.0401763 -0.0660036 0.045571 -0.108761 0.146541 0.18739 -0.0448722 0.0739878 0.121268 0.0362506 -0.0598946 -0.0213984 -0.182143 0.0546273 0.11339 0.0251836 0.00538756 -0.0875106 0.0802492 -0.000351795 0.01377 -0.0837383 0.0523445 -0.015116 -0.0662432 0.0340429 -0.0483958 -0.0286691 0.171839 -0.163519 -0.017286 0.161177 0.0393051 -0.1474 0.0863508 -0.0117292 0.00121338 -0.0498819 -0.00471 0.0837741 -0.0178433 -0.0350365 0.19682 -0.0300576 -0.135747 -0.0686232 0.0288752 0.280285 -0.0957941 0.0235135 -0.105431 0.00326591 0.0198794 -0.069064 0.112698 0.000426975 0.0741339 -0.0644946 -0.0101835 -0.0128363 -0.032191 -0.0437591 0.0370157 0.00150253 0.131357 -0.0412401 0.0577528 0.00141393 -0.0659246 -0.0661798 0.0336483 0.0563075 0.016676 -0.0140057 0.0348 0.163033 -0.165307 -0.113864 -0.0150836 -0.0315992 -0.109247 -0.0261869 0.0996625 0.00654885 -0.0692586 0.00705968 0.0473766 -0.0169624 0.138988 -0.138421 0.0822741 -0.0973365 0.178559 0.0236489 -0.0637436 0.0680841 0.116484 -0.127742 0.0505755 0.0459783 0.0811619 -0.0964135 -0.0940745 0.0663999 0.178209 0.00760293 0.00211676 -0.0146344 0.0605553 -0.0775402 0.026199 0.0222256 -0.0193891 
0.139714 0.0210628 -0.125717 -0.00690902 0.124103 0.212806 0.0296852 -0.0418866 -0.0887791 -0.153882 0.0392287 0.0865319 0.0766362 -0.115061 -0.0938041 -0.033295 -0.067917 0.0328702 -0.12422 0.158082 0.186965 -0.0342053 0.0870866 0.106027 0.0196712 -0.0583024 -0.0262442 -0.197972 0.0278887 0.0952692 0.0158262 0.0137525 -0.0913812 0.0981184 -0.00345406 0.0011471 -0.0708693 0.0707722 -0.0205585 -0.0681882 0.0336074 -0.0491779 -0.0301838 0.161084 -0.16241 -0.0165251 0.156761 0.0303889 -0.145768 0.11678 -0.00182164 -0.0160738 -0.0470491 0.0157185 0.0888268 -0.0427551 -0.0142219 0.173878 -0.0235431 -0.143474 -0.0580917 0.031076 0.262999 -0.0986191 0.0217429 -0.122971 0.00433769 0.025752 -0.059754 0.101935 -0.00584168 0.0651412 -0.0584117 -0.000252153 -0.020895 -0.0348509 -0.0436085 0.0265737 0.00331065 0.148584 -0.0316477 0.046836 -9.30427e-05 -0.0732341 -0.0622798 0.0374994 0.0573702 0.0221511 -0.020298 0.035852 0.163577 -0.16949 -0.123002 -0.0135838 -0.0452899 -0.0921243 -0.0126101 0.0954016 -0.00330111 -0.06281 0.00898986 0.0478964 -0.0253897 0.152051 -0.126023 0.0568956 -0.102869 0.186616 0.0114736 -0.0583357 0.064366 0.125364 -0.126444 0.0505741 0.0440837 0.0802598 -0.0980438 -0.0932443 0.0555246 0.170968 0.00140408 0.0213441 0.00730064 0.0599082 -0.0524976 0.00338947 0.0306354 -0.0295755 
0.115795 0.0173035 -0.134374 -0.00628736 0.128002 0.204557 0.0302098 -0.0416398 -0.0706953 -0.12389 0.061996 0.108141 0.076128 -0.11524 -0.113331 -0.0258437 -0.0709455 0.0604668 -0.122352 0.148794 0.196135 -0.0576099 0.0759341 0.139282 0.0268159 -0.0542574 -0.00901149 -0.197119 0.0438313 0.100447 0.0190923 0.0050251 -0.0850142 0.0852901 -0.0162936 0.0069402 -0.0944446 0.048633 -0.0256994 -0.0562336 0.0404672 -0.045131 -0.0355066 0.172732 -0.157191 -0.0494031 0.158529 0.0283438 -0.139075 0.0890917 -0.00424245 -0.0207626 -0.0623917 -0.00732099 0.0839641 -0.00993089 -0.027745 0.197715 -0.0334479 -0.128633 -0.0637656 0.0203821 0.284176 -0.0887048 0.0276071 -0.116086 -0.0114149 0.0204199 -0.0656519 0.115124 -0.0082797 0.0781575 -0.0616823 -0.00650199 -0.0176081 -0.0320973 -0.0401896 0.0535912 -0.0102387 0.113031 -0.0573785 0.0620069 0.00265519 -0.0662526 -0.0833288 0.0468804 0.0703805 0.0258236 -0.0126536 0.0210951 0.149238 -0.165379 -0.120419 -0.015584 -0.0183342 -0.0938302 -0.0382318 0.0886343 0.00110709 -0.0573993 0.00617111 0.0239839 -0.0243707 0.142144 -0.112156 0.0733191 -0.102049 0.166353 0.00528427 -0.0734167 0.0510155 0.12777 -0.102986 0.0452082 0.0528203 0.0817828 -0.0963188 -0.0915212 0.0705385 0.176933 0.00674804 0.00757419 -0.0167233 0.0529425 -0.084247 0.034861 0.00505574 -0.0193165 
0.0961608 0.0360944 -0.112445 -0.0152716 0.123046 0.190952 0.0185096 -0.0663932 -0.0786962 -0.107394 0.066141 0.0945795 0.0783686 -0.0831393 -0.0929123 -0.0313611 -0.0769662 0.0608861 -0.101705 0.138103 0.195043 -0.0600118 0.0758107 0.133065 0.0407227 -0.0339279 -0.0122255 -0.190466 0.0746614 0.108326 0.0334076 0.00254965 -0.086131 0.0588781 0.000438245 0.0225594 -0.110178 0.0705631 -0.00679185 -0.0513698 0.027034 -0.0394776 -0.0597087 0.178385 -0.157938 -0.0177329 0.159252 0.0311089 -0.145358 0.0496893 -0.0178236 0.017546 -0.0587386 -0.0234302 0.0746007 -0.00300796 -0.024958 0.214665 -0.0357937 -0.125873 -0.0648002 0.0105566 0.29109 -0.0716804 0.042374 -0.109713 -0.000893138 0.0296938 -0.0576595 0.135925 0.00607218 0.0882434 -0.0650918 -0.0159966 -0.0107438 -0.043456 -0.0611928 0.0575247 -0.0023211 0.120882 -0.0629468 0.0666273 0.000524664 -0.0649028 -0.0801642 0.0133856 0.0728522 0.0274447 -0.0149565 0.00873202 0.146376 -0.144584 -0.0965628 -0.0145856 -0.0210078 -0.121566 -0.0331046 0.101867 0.0201606 -0.0686899 0.000623354 0.0372488 -0.0266276 0.133055 -0.120253 0.0858506 -0.0887435 0.163493 0.0517288 -0.0827604 0.0514497 0.126672 -0.130377 0.0483092 0.0647889 0.0896403 -0.108773 -0.105309 0.0693066 0.177168 0.0066778 0.00179915 -0.0388951 0.052774 -0.0920354 0.0507184 0.0109142 -0.00298368 
0.109476 0.0353826 -0.115776 -0.0133117 0.12253 0.189973 0.0194546 -0.0666837 -0.0753847 -0.125119 0.0619366 0.0786102 0.0948881 -0.0621157 -0.0929442 -0.0353656 -0.0611245 0.0493092 -0.115855 0.152301 0.199143 -0.0658722 0.0799424 0.139789 0.0390331 -0.0548307 -0.0305445 -0.179201 0.0720614 0.114025 0.0399399 0.00969716 -0.0916673 0.0632633 -0.0106665 0.0279566 -0.110104 0.0803808 -0.0161585 -0.0586213 0.0169442 -0.0344208 -0.0608596 0.160888 -0.143187 -0.0192198 0.147848 0.0448781 -0.136261 0.059317 -0.027345 0.0183579 -0.0416529 -0.0211574 0.0715218 -0.0103116 -0.0299351 0.21395 -0.0195422 -0.141492 -0.0686871 0.0342735 0.275677 -0.0825084 0.0159736 -0.0921542 0.0136515 0.0364515 -0.0653797 0.112528 0.00678551 0.0775091 -0.0653156 -0.0166905 -0.00950161 -0.0393784 -0.0486737 0.0341245 0.00834288 0.140122 -0.04872 0.053881 -0.00780281 -0.0773384 -0.066413 0.0229487 0.0587909 0.0202469 -0.0136206 0.0108017 0.155054 -0.149368 -0.0840175 -0.00770775 -0.0272421 -0.119387 -0.0347023 0.1038 0.0155441 -0.0706704 0.0151702 0.0408943 -0.0276145 0.142705 -0.136868 0.0923749 -0.0978469 0.163381 0.0564513 -0.0795013 0.0585432 0.130138 -0.139376 0.0550783 0.0520213 0.0999875 -0.114668 -0.0925078 0.0596428 0.179582 -0.0120015 0.00255045 -0.0399628 0.0583472 -0.0991911 0.047029 0.000303359 -0.0120926 
0.0949629 0.0365197 -0.115967 -0.01373 0.137563 0.171563 0.0409636 -0.0698476 -0.053902 -0.098063 0.0722608 0.0925226 0.101602 -0.0490033 -0.0924399 -0.0486246 -0.058389 0.0764995 -0.134076 0.144332 0.191851 -0.0767633 0.0703936 0.149468 0.0378453 -0.0690493 -0.0385102 -0.16978 0.0802508 0.121577 0.0441144 0.0135643 -0.087931 0.0500119 -0.0150385 0.0280463 -0.125894 0.0701333 -0.032181 -0.0477312 0.0326387 -0.022849 -0.0775575 0.172497 -0.163112 -0.024449 0.127951 0.0510902 -0.113451 0.0324983 -0.0263269 0.0226841 -0.0637337 -0.0442295 0.0604375 0.00693071 -0.04646 0.22535 -0.018898 -0.114519 -0.0761013 0.0190808 0.267174 -0.0664654 0.0193675 -0.105951 0.00843821 0.0409113 -0.0687643 0.12126 0.0303494 0.091265 -0.0478622 -0.0313408 -0.0201619 -0.0248021 -0.0618831 0.0473253 -0.00345494 0.110864 -0.065527 0.0628731 -0.00850536 -0.0577939 -0.0720225 0.0223657 0.0780952 0.0190287 -0.017999 -0.00338894 0.134218 -0.146225 -0.0750978 -0.031398 -0.0250826 -0.137793 -0.0528303 0.0851482 0.0202926 -0.0677135 0.0144798 0.0384843 -0.00774906 0.137464 -0.133281 0.0895787 -0.102632 0.160589 0.0694859 -0.0752962 0.0569405 0.122057 -0.14176 0.0578734 0.0416744 0.0993984 -0.117525 -0.0910292 0.0575741 0.183862 -0.0104021 0.00107285 -0.0766819 0.0702198 -0.107471 0.0524635 -0.0267848 -0.00353968 
0.10125 0.0449627 -0.128483 -0.0252276 0.126768 0.176174 0.0265893 -0.0377663 -0.0598506 -0.10223 0.0685437 0.0931663 0.0897326 -0.103026 -0.108927 -0.0229785 -0.0632185 0.0478541 -0.138548 0.160985 0.186397 -0.072198 0.0752209 0.122477 0.0256009 -0.0406147 -0.00918887 -0.170775 0.0759107 0.0892794 0.0309873 0.0111054 -0.073303 0.078313 -0.0299721 0.00409114 -0.0949476 0.0935237 -0.0217036 -0.0526597 0.0370025 -0.0501693 -0.0456913 0.175901 -0.150907 -0.040195 0.146545 0.0410094 -0.13928 0.0703566 -0.0222879 0.00944826 -0.0808707 -0.0190737 0.0704209 -0.0135372 -0.0435201 0.195291 -0.0349548 -0.138043 -0.0786375 -0.00564541 0.2823 -0.0702509 0.0220048 -0.104909 -0.0091614 0.036201 -0.0648518 0.102529 -9.29614e-05 0.0724872 -0.0583567 0.000937014 -0.00141475 -0.0416947 -0.0445831 0.0662912 -0.00409881 0.11467 -0.0662857 0.0555906 0.00618624 -0.0561186 -0.0727834 0.0284222 0.0730303 0.0423287 0.0145904 0.00944677 0.136942 -0.163213 -0.109629 -0.0146329 -0.0107758 -0.116336 -0.0348321 0.0883632 -0.00318472 -0.0752124 -0.00438795 0.0232654 -0.0271283 0.156254 -0.121629 0.0808265 -0.101989 0.178706 0.057789 -0.096994 0.0496078 0.142681 -0.132234 0.0765917 0.059199 0.0692824 -0.112843 -0.0974116 0.0751435 0.178286 -0.00150252 0.0225802 -0.0300526 0.0715952 -0.0837478 0.0244364 5.58306e-05 -0.0184167 
0.097564 0.038781 -0.120161 -0.0168275 0.12512 0.18962 0.019881 -0.021759 -0.0573327 -0.110068 0.0650744 0.106775 0.0751157 -0.130338 -0.1198 -0.0134487 -0.0636771 0.0514497 -0.145402 0.15079 0.194418 -0.0672988 0.0697915 0.139804 0.0268843 -0.039574 -0.00368197 -0.18094 0.0675424 0.0779492 0.0347156 0.0116902 -0.0762862 0.0888503 -0.0411255 -0.00408442 -0.0974032 0.0749259 -0.0268514 -0.0390227 0.0496325 -0.0475218 -0.0388529 0.170607 -0.136421 -0.0641853 0.153813 0.0235073 -0.144194 0.0725837 -0.00356576 -0.0097662 -0.0797256 -0.0222481 0.0683438 -0.00269393 -0.0385141 0.194973 -0.0306955 -0.139867 -0.0784402 0.00048587 0.273381 -0.0769852 0.023738 -0.112606 -0.0120345 0.0228765 -0.0685858 0.106711 -0.0102532 0.0712444 -0.059489 0.00516796 4.06856e-06 -0.0401835 -0.0433486 0.0747126 -0.0162757 0.113664 -0.0735592 0.0639835 0.0194544 -0.0548364 -0.07804 0.039163 0.0839259 0.0409935 0.00173407 0.00552764 0.125854 -0.165614 -0.123381 -0.00614291 -0.00150886 -0.0909263 -0.0350194 0.0811134 -0.0185322 -0.0599619 -0.0100143 0.0113348 -0.0356342 0.166388 -0.111367 0.0710696 -0.104317 0.167172 0.0304543 -0.104585 0.043554 0.145923 -0.12008 0.067632 0.0650429 0.0645377 -0.119947 -0.097893 0.0781959 0.17648 0.00393597 0.0281258 -0.0271481 0.0537355 -0.0759174 0.0296063 -0.00533308 -0.0245046 
0.0761437 0.0574566 -0.0932825 -0.0206425 0.153573 0.199118 0.0299049 -0.0584573 -0.0358176 -0.0914581 0.0647709 0.0839083 0.0770258 -0.0838276 -0.0706084 -0.03614 -0.0630905 0.0772722 -0.139995 0.129079 0.190976 -0.060942 0.060722 0.14021 0.0533575 -0.0653821 -0.0464088 -0.156495 0.0959553 0.0901762 0.0903749 0.00856522 -0.0898317 0.0636562 0.00765242 0.0419024 -0.101031 0.0520875 -0.0107678 -0.0561966 0.0633204 -0.027714 -0.0521636 0.171003 -0.152193 -0.0526761 0.131354 0.0623837 -0.118151 0.0309494 -0.0415248 0.0132739 -0.0755517 -0.0542599 0.0575908 0.0166503 -0.069319 0.222151 -0.0446922 -0.130627 -0.0997251 0.0138679 0.273749 -0.0868229 0.0343165 -0.0859059 0.00166309 0.0282933 -0.0853203 0.137724 0.026079 0.10279 -0.0550504 -0.0176172 -0.0148098 -0.0449398 -0.0627032 0.0713004 0.000568626 0.0924919 -0.065401 0.0899903 0.0159495 -0.0404441 -0.0625327 0.00933204 0.0790955 0.0476947 -0.00255549 0.0145951 0.152193 -0.149175 -0.0909504 -0.0204345 -0.00106196 -0.128369 -0.0552673 0.0876665 -0.0227296 -0.0556359 -0.00447123 0.0214512 -0.0299733 0.122432 -0.12233 0.107304 -0.0856701 0.134787 0.0840379 -0.0664108 0.0426931 0.119751 -0.144059 0.0822836 0.0702495 0.0660381 -0.112275 -0.0955397 0.0647916 0.185093 0.0255331 0.00924477 -0.0574134 0.0714293 -0.101912 0.0403565 -0.00552551 -0.00425282 
0.0675134 0.0445068 -0.107013 -0.0279227 0.145505 0.166682 0.0202879 -0.0642801 -0.062165 -0.063802 0.0671698 0.0939138 0.095186 -0.0430288 -0.0780647 -0.0268704 -0.0408013 0.107638 -0.115542 0.131977 0.191783 -0.0521071 0.0716786 0.16762 0.0317675 -0.0400836 -0.0222789 -0.171073 0.106671 0.116432 0.0439101 0.0240392 -0.0733598 0.0473395 -0.00295921 0.042922 -0.103769 0.0706873 -0.0307656 -0.0389251 0.034673 -0.00646241 -0.0582985 0.183901 -0.167941 -0.0296587 0.161558 0.0546592 -0.121949 0.00996981 -0.0120922 0.00360421 -0.0773088 -0.0525477 0.0726243 0.0323135 -0.0322075 0.230885 -0.00763176 -0.126419 -0.0816661 0.00728837 0.268491 -0.0640241 0.0387707 -0.10882 -0.00351954 0.0338282 -0.0587646 0.145165 0.0220582 0.100821 -0.0477815 -0.0330941 -0.0174554 -0.0367008 -0.0745787 0.0974947 -0.00474103 0.0499689 -0.0599728 0.116646 -0.00760285 -0.0564029 -0.0690736 0.0096483 0.0813405 0.0373864 -0.0112229 0.00123329 0.128256 -0.125291 -0.0865228 -0.0430508 0.00505837 -0.119095 -0.0546182 0.114811 0.00962398 -0.0669139 1.65358e-05 0.0265878 -0.00516975 0.131937 -0.138986 0.087233 -0.110241 0.117991 0.0770913 -0.0791091 0.0447473 0.13159 -0.128961 0.0541998 0.049578 0.0788303 -0.10627 -0.137523 0.037658 0.168103 0.0150451 0.00936724 -0.0610031 0.0589091 -0.137699 0.0598495 -0.0366507 -0.001275 
0.0993451 0.0320564 -0.117745 0.00442061 0.120197 0.205761 0.00518143 -0.0735588 -0.065283 -0.103983 0.0748368 0.0936157 0.0761195 -0.0925428 -0.0920408 -0.036479 -0.0641214 0.0859935 -0.0987956 0.143224 0.190987 -0.0580668 0.08987 0.152607 0.0390997 -0.0462521 -0.0146445 -0.200417 0.0638714 0.101485 0.0504437 0.00990319 -0.0755213 0.0644065 0.00637677 0.0329685 -0.100907 0.057899 -0.0144738 -0.0579627 0.0300536 -0.0422558 -0.0692505 0.179977 -0.171641 -0.0477438 0.158037 0.0434366 -0.125271 0.0637076 -0.00623866 0.0173077 -0.0531621 -0.0221573 0.068428 0.00183279 -0.0097783 0.192601 -0.0182302 -0.132732 -0.0776664 0.0148081 0.28555 -0.0889964 0.0340442 -0.121364 0.010504 0.0114418 -0.0657714 0.153267 -0.00424362 0.0838701 -0.0673739 -0.0100666 -0.0187838 -0.0637379 -0.0619293 0.066481 -0.00885331 0.120667 -0.0671308 0.0764169 0.00152595 -0.069607 -0.0611506 0.0213096 0.0639373 0.0223316 -0.0169655 0.00907257 0.148364 -0.138143 -0.090913 -0.0251528 -0.0140213 -0.127815 -0.0444949 0.116246 0.00393826 -0.0700416 0.0124201 0.0446934 -0.0188428 0.128896 -0.0955192 0.0813471 -0.0744917 0.141045 0.0553619 -0.0601932 0.0324009 0.127586 -0.11333 0.0441305 0.05572 0.0782924 -0.086911 -0.122632 0.0728432 0.181315 0.0190216 -0.00605819 -0.0394222 0.0507896 -0.096495 0.0433846 0.0210292 0.01751 
0.131685 0.00570774 -0.129164 -0.000995153 0.125218 0.205746 0.0278208 -0.0272297 -0.0770885 -0.134086 0.0525009 0.104275 0.0781136 -0.138667 -0.115743 -0.0304226 -0.0640639 0.0560639 -0.146262 0.171168 0.179957 -0.0440812 0.0883339 0.117899 0.00369894 -0.0455926 -0.0201586 -0.197519 0.0295951 0.0700365 0.0177731 0.0298707 -0.0939997 0.104339 -0.0235068 -0.00732503 -0.0803512 0.0772771 -0.028288 -0.0582632 0.0483373 -0.0474039 -0.0506015 0.166517 -0.169038 -0.0629939 0.14649 0.0378314 -0.128462 0.116378 0.00592408 -0.0218986 -0.0691813 0.00995908 0.0738821 -0.0426381 -0.00931869 0.165536 -0.0164732 -0.143465 -0.0626327 0.0211218 0.264359 -0.0828063 0.0123114 -0.133085 0.00603454 0.019288 -0.0556453 0.10265 -0.0167385 0.067535 -0.0386746 0.0259586 -0.0305541 -0.0575088 -0.0461289 0.0449337 -0.00763804 0.130999 -0.0448937 0.0567731 0.00670387 -0.0760827 -0.0577837 0.03814 0.074878 0.041152 -0.00769793 0.0131304 0.156749 -0.160716 -0.118931 -0.0175407 -0.0321854 -0.0952523 -0.0221153 0.086056 -0.0217186 -0.062116 0.00566717 0.0358087 -0.027953 0.168109 -0.093828 0.0479838 -0.100213 0.179209 0.019033 -0.0573078 0.0499832 0.14811 -0.114285 0.0652796 0.0395718 0.0597385 -0.0935636 -0.103753 0.0633156 0.161324 -0.00228745 0.0300038 0.000883779 0.0548483 -0.0626827 -0.00351849 0.00685965 -0.0242034 
0.124081 0.0057772 -0.123825 -0.0101658 0.124435 0.198448 0.0203103 -0.0256899 -0.0842436 -0.135422 0.0462795 0.113156 0.073111 -0.145432 -0.123192 -0.0211852 -0.0728048 0.0477522 -0.144763 0.165073 0.18054 -0.0370517 0.0875833 0.0977467 -0.0017949 -0.0193141 -0.00960055 -0.203724 0.0223277 0.0633334 0.0053215 0.0293711 -0.0911163 0.104079 -0.0261072 -0.0165583 -0.0790417 0.090963 -0.0175971 -0.0449445 0.0501849 -0.0444528 -0.0454141 0.16871 -0.167577 -0.051619 0.153927 0.0161908 -0.135728 0.108896 0.015046 -0.0273805 -0.0800641 0.0203837 0.0763596 -0.0461426 -0.000334167 0.162233 -0.0231436 -0.139512 -0.0504832 0.00466479 0.261039 -0.0705273 0.0287861 -0.151793 0.000627936 0.0318059 -0.0355778 0.104114 -0.011155 0.0697721 -0.033764 0.0220156 -0.0261117 -0.0506195 -0.0593253 0.0517926 -0.0159817 0.129312 -0.0489007 0.0628763 0.0185507 -0.0636276 -0.0730956 0.0309382 0.0913986 0.0481711 -0.0104769 0.00334321 0.137897 -0.163911 -0.124283 -0.0145038 -0.0374125 -0.0901976 -0.0124611 0.0836485 -0.0204477 -0.0589188 -0.0104373 0.034581 -0.0326746 0.180433 -0.0871689 0.0331984 -0.106437 0.191066 0.00746568 -0.0697149 0.0485662 0.146054 -0.121227 0.0700414 0.0416539 0.0555577 -0.110303 -0.110217 0.05535 0.150096 -0.000930132 0.0476562 0.00830515 0.0464629 -0.0454158 -0.00720947 0.0020793 -0.0251921 
0.133982 0.00411288 -0.116189 -0.0193142 0.123948 0.20555 0.0311596 -0.018107 -0.0856875 -0.154862 0.0295796 0.0886396 0.086724 -0.12722 -0.103958 -0.0393731 -0.0715391 0.0349303 -0.158463 0.172013 0.175887 -0.0338254 0.0941075 0.0958859 -0.0101689 -0.0495174 -0.0353238 -0.193398 0.0161262 0.0594596 0.0160015 0.0249841 -0.101157 0.110829 -0.0182153 -0.00588907 -0.0708125 0.0979162 -0.0377841 -0.056996 0.0477849 -0.0418621 -0.0470572 0.15846 -0.168115 -0.0384647 0.141057 0.0400037 -0.133077 0.1306 -0.00547657 -0.0383853 -0.0639638 0.0227272 0.0776546 -0.0540951 -0.00982637 0.165608 -0.0132957 -0.154029 -0.0534954 0.037191 0.246725 -0.0824514 0.0161363 -0.133829 0.0123457 0.0340702 -0.0494216 0.0892854 -0.00778602 0.0603876 -0.02795 0.0233788 -0.029896 -0.045128 -0.0539888 0.0257045 0.00751578 0.135508 -0.0319644 0.0454136 0.00010686 -0.0756011 -0.0623331 0.0330277 0.0774671 0.0444356 -0.0107548 0.0218062 0.165951 -0.170091 -0.108429 -0.0246128 -0.0487371 -0.0854418 -0.0123321 0.0856597 -0.0236001 -0.0548302 0.00330948 0.043692 -0.0339 0.171344 -0.105901 0.0387501 -0.117171 0.187851 0.0106962 -0.0539519 0.0622163 0.148125 -0.129556 0.0707589 0.0280218 0.0688454 -0.101318 -0.0977503 0.0471546 0.154677 -0.0101829 0.0391227 0.00963917 0.0625209 -0.0513334 -0.0201898 -0.00147275 -0.0376183 
0.112427 0.0362599 -0.123281 -0.00505183 0.108159 0.19719 0.00565835 -0.0785916 -0.0850617 -0.123587 0.0690323 0.0798541 0.094365 -0.0641641 -0.0999235 -0.0486991 -0.0706779 0.0637741 -0.0987595 0.15344 0.194405 -0.0583946 0.0951508 0.126675 0.0318011 -0.0562342 -0.0210867 -0.183782 0.0537526 0.122404 0.024164 -0.00613796 -0.0796343 0.0593847 0.00295658 0.0258703 -0.109022 0.0753047 -0.0184447 -0.0599632 -0.00188357 -0.0422796 -0.0683271 0.172767 -0.16723 -0.02192 0.154062 0.0465406 -0.132173 0.0823565 -0.00999368 0.0330533 -0.0418834 -0.00298309 0.0723823 -0.0201598 -0.00709814 0.187644 -0.015694 -0.142443 -0.0635354 0.0296925 0.283076 -0.077627 0.0180857 -0.118086 0.0180479 0.0294307 -0.062262 0.130948 0.00972044 0.0727975 -0.0613732 -0.0174991 -0.0192387 -0.0456106 -0.0581435 0.0249404 0.00385177 0.15048 -0.0492753 0.0460752 -0.006498 -0.0718512 -0.0661117 0.0252482 0.0490564 0.0126147 -0.00687146 0.0160053 0.148915 -0.14994 -0.079586 -0.0127778 -0.0400928 -0.138976 -0.037986 0.117721 0.0176692 -0.0781938 0.0257971 0.0708551 -0.0171452 0.130584 -0.115184 0.084822 -0.0836805 0.16533 0.0547285 -0.061285 0.0538655 0.118506 -0.129263 0.0531808 0.0368448 0.10454 -0.0878043 -0.0957523 0.0641034 0.178685 -0.0107267 -0.0136652 -0.0364004 0.0464762 -0.0879432 0.0423604 0.028481 0.0115564 
0.129517 0.0111195 -0.120881 -0.0197772 0.125814 0.199742 0.0254506 -0.039964 -0.0839832 -0.147408 0.0322843 0.0888788 0.0969707 -0.103821 -0.10821 -0.0358723 -0.0674783 0.0486834 -0.15862 0.176515 0.180355 -0.0412147 0.103115 0.105776 -0.0128682 -0.0545302 -0.0380765 -0.192497 0.0167642 0.080916 0.0102093 0.0260812 -0.0936918 0.103291 -0.0135817 0.00266603 -0.0762905 0.108324 -0.0417906 -0.0590027 0.0259763 -0.0356611 -0.0474085 0.15155 -0.165641 -0.0307128 0.144681 0.0476043 -0.131402 0.130562 -0.00154192 -0.0336572 -0.0580825 0.0205331 0.083413 -0.047462 -0.004348 0.171964 -0.00816851 -0.154238 -0.0533586 0.0416667 0.249857 -0.0864588 0.0198085 -0.134304 0.00683253 0.0440879 -0.0609937 0.0973318 -0.000175419 0.0585786 -0.0323004 0.0124575 -0.0332293 -0.0361437 -0.0503431 0.0218167 0.0102498 0.126376 -0.0287143 0.0476232 -0.0116889 -0.0752997 -0.0692211 0.0305726 0.0667997 0.0380666 -0.00589804 0.0270832 0.156531 -0.173053 -0.0947472 -0.024394 -0.0459224 -0.086924 -0.0229144 0.0969585 -0.0120232 -0.0545145 0.0163971 0.0495875 -0.0364368 0.169771 -0.107766 0.0430412 -0.123141 0.175795 0.0166793 -0.0526506 0.0575177 0.147138 -0.124422 0.0742217 0.0226331 0.0832677 -0.100819 -0.0919127 0.0397278 0.161539 -0.0150495 0.032773 0.00293716 0.0584067 -0.0629196 -0.00566396 -0.00624776 -0.0382749 
0.110257 0.0163702 -0.132506 -0.0271698 0.12529 0.182577 0.0201821 -0.0269888 -0.0644277 -0.124159 0.0451783 0.0968521 0.0794179 -0.126441 -0.112476 -0.0126393 -0.0863285 0.0390337 -0.162535 0.166318 0.173803 -0.0539353 0.0933033 0.110332 0.000789052 -0.0351534 -0.00660071 -0.195251 0.027688 0.0620052 0.0125633 0.0128798 -0.0833464 0.0948071 -0.0319115 0.00179226 -0.0937125 0.0989238 -0.0485558 -0.042255 0.0404162 -0.0437161 -0.0477668 0.178454 -0.152992 -0.0257948 0.148696 0.0390674 -0.139885 0.109406 -0.00680933 -0.0365152 -0.081281 -0.00264736 0.0817025 -0.0332736 -0.0256058 0.182355 -0.0131144 -0.143552 -0.0600476 0.0106282 0.265517 -0.0579695 0.0248691 -0.132962 -0.014596 0.0535771 -0.0425826 0.103483 -0.000938801 0.0710993 -0.0322963 0.0067317 -0.012107 -0.0374507 -0.0624209 0.0542393 -0.0105432 0.113509 -0.0409637 0.0551743 -0.011061 -0.0716218 -0.0947051 0.0394435 0.0803195 0.0442779 -0.00315858 0.0164883 0.137104 -0.164455 -0.119792 -0.0332895 -0.0268654 -0.0771261 -0.0272106 0.0780588 -0.00487395 -0.067578 -0.0033028 0.013698 -0.0280456 0.151383 -0.113252 0.0447897 -0.131963 0.182554 0.0171988 -0.0804243 0.0638848 0.163459 -0.112717 0.0647781 0.0426964 0.0713801 -0.121929 -0.0959908 0.0580504 0.159784 0.000606793 0.0439182 -0.00120365 0.0711859 -0.0694242 0.00151825 -0.0119461 -0.0343636 
0.111644 0.0128101 -0.142792 -0.0288207 0.130581 0.175138 0.0219662 -0.0352176 -0.0542926 -0.11171 0.0632764 0.111418 0.0849134 -0.116639 -0.125093 -0.0132142 -0.0772783 0.049766 -0.169765 0.161557 0.170969 -0.0508611 0.0842246 0.112597 -0.0016838 -0.0281926 0.00543332 -0.185275 0.0274742 0.0703672 0.00390601 0.0166838 -0.0812404 0.0873315 -0.042173 -0.000633767 -0.106362 0.0936998 -0.0452363 -0.0297603 0.0401095 -0.034715 -0.0610611 0.183879 -0.157523 -0.0306776 0.13587 0.0386762 -0.129214 0.0941669 0.000373802 -0.0244331 -0.0939051 -0.00897095 0.0714543 -0.0294457 -0.0334678 0.188179 -0.0176495 -0.126256 -0.0620601 -0.00396205 0.272502 -0.0460251 0.0169754 -0.144369 -0.0149754 0.0693982 -0.0350804 0.10786 0.0130839 0.0736996 -0.0250512 -0.00470188 -0.0179861 -0.0280208 -0.0687701 0.0560693 -0.0257162 0.106758 -0.0451959 0.0631899 -0.00387066 -0.0651095 -0.104134 0.0397453 0.0942032 0.0375004 -0.00738477 0.00499674 0.119378 -0.1667 -0.118639 -0.0282074 -0.0233737 -0.0882867 -0.0352987 0.0589224 0.000591224 -0.0732334 -0.00203407 0.014722 -0.0234223 0.154464 -0.110615 0.0411691 -0.134981 0.181016 0.0161019 -0.0847135 0.0684249 0.159186 -0.109694 0.0744426 0.0397356 0.0716681 -0.133882 -0.0930325 0.0568739 0.155183 -0.00231505 0.0422328 -0.0144178 0.0707693 -0.0671959 0.0077158 -0.0248757 -0.0288477 
0.114983 0.0143637 -0.123084 -0.0238877 0.137329 0.191668 0.0299514 -0.0207806 -0.0566653 -0.136654 0.0401849 0.114321 0.076184 -0.136517 -0.115221 -0.0244107 -0.0676573 0.0553315 -0.17682 0.157993 0.175867 -0.0282946 0.0737556 0.119981 -0.00526176 -0.0434113 -0.0101128 -0.190733 0.0188497 0.0691964 0.0125848 0.0252327 -0.0861081 0.103895 -0.0277014 -0.00955684 -0.0803538 0.0763698 -0.0538347 -0.0366974 0.0633377 -0.0325448 -0.0379416 0.180555 -0.160102 -0.036501 0.147817 0.0293534 -0.13595 0.102951 0.0132984 -0.052119 -0.0828183 -0.0054683 0.0777263 -0.0256462 -0.0395366 0.180713 -0.0112084 -0.137442 -0.0620766 0.0108912 0.245431 -0.0663716 0.0222828 -0.152889 -0.00588234 0.0401935 -0.0498969 0.0986968 0.00525473 0.0609464 -0.0210531 -0.00623348 -0.0254822 -0.0234084 -0.0692649 0.057031 -0.0188615 0.105666 -0.0393423 0.0754499 0.00177063 -0.0617215 -0.0842807 0.0396292 0.0968051 0.0363132 -0.0235834 0.0226482 0.125334 -0.174297 -0.131619 -0.0325036 -0.0323035 -0.0677197 -0.026938 0.0596769 -0.0212308 -0.0584977 -0.00726389 0.0214812 -0.0236092 0.166826 -0.117001 0.0290875 -0.136383 0.177161 -0.00923738 -0.070144 0.0716032 0.145183 -0.123 0.0681829 0.0262881 0.058612 -0.133759 -0.104578 0.0451719 0.15143 0.005805 0.0536704 -0.00853115 0.0662661 -0.0475063 -0.00970722 -0.0234857 -0.0487175 
0.0881221 0.0161733 -0.130041 -0.0219896 0.128783 0.15814 0.0187655 -0.0363388 -0.0520781 -0.0933276 0.0652202 0.104103 0.0952174 -0.113185 -0.129793 -0.00888929 -0.0804834 0.0720981 -0.164566 0.165534 0.194342 -0.0866929 0.086557 0.120429 0.0115226 -0.0333306 -0.00942159 -0.195051 0.0433376 0.0782948 0.014919 0.0147691 -0.0720796 0.0747948 -0.0334669 -0.00060042 -0.118545 0.098174 -0.0460471 -0.0494392 0.0350128 -0.0432703 -0.0583318 0.189091 -0.152633 -0.0423682 0.141732 0.0391222 -0.131757 0.067514 -0.0091517 -0.0267897 -0.0907073 -0.0222433 0.068525 -0.0176832 -0.0286312 0.177954 -0.0127019 -0.138227 -0.0533157 -0.0114945 0.26354 -0.0313238 0.0285901 -0.136938 -0.0249855 0.0609072 -0.0368001 0.101877 0.00702017 0.077286 -0.0345797 -0.025125 -0.0220446 -0.0322037 -0.0690755 0.0745742 -0.0177601 0.104056 -0.0687645 0.0580698 -0.0101739 -0.0575482 -0.10725 0.0410889 0.0919884 0.0492639 0.00581226 -0.00885194 0.109728 -0.152656 -0.109161 -0.0335895 -0.0302252 -0.0974685 -0.0502526 0.0807883 -0.00164573 -0.075397 0.00685536 0.00775619 -0.0209327 0.148875 -0.0910575 0.0479134 -0.121788 0.185503 0.0402614 -0.0911754 0.038757 0.151952 -0.12092 0.0640858 0.0488887 0.077536 -0.136058 -0.0952895 0.0565457 0.162313 -0.0136774 0.0419912 -0.0379105 0.0686459 -0.0843709 0.0212988 -0.0301746 -0.0184062 
0.0973553 0.0225278 -0.12311 -0.0331359 0.151218 0.15387 0.024268 -0.0347602 -0.0470691 -0.0902413 0.0720403 0.108718 0.0948432 -0.0873057 -0.0944718 -0.0238575 -0.0440515 0.0816367 -0.169292 0.154449 0.176371 -0.0355138 0.0567433 0.147903 0.0185367 -0.0417612 -0.000722978 -0.16813 0.0537363 0.0937642 0.023562 0.0145681 -0.07602 0.0738431 -0.0328115 0.0179388 -0.109463 0.0639894 -0.0561445 -0.0266874 0.0526287 -0.0119898 -0.0525318 0.206104 -0.159064 -0.023227 0.140091 0.0500008 -0.116181 0.0538456 0.0062321 -0.0262545 -0.104562 -0.0433779 0.0681716 -0.00547699 -0.0730701 0.201467 0.000281348 -0.120503 -0.0707275 -0.0155134 0.243519 -0.0295013 0.00374066 -0.154109 -0.00479018 0.0632118 -0.0361322 0.101352 0.0375957 0.0839864 -0.0175614 -0.0462786 -0.0266033 -0.0195321 -0.0887199 0.0889169 -0.0232659 0.0899531 -0.0413514 0.0978867 -0.00776995 -0.0564567 -0.0885723 0.0320481 0.10371 0.0300783 -0.0166262 0.00387543 0.100617 -0.148106 -0.122833 -0.0426285 -0.0270505 -0.0949196 -0.0517554 0.0498489 -0.00665396 -0.0894048 -0.0149108 0.0166102 0.00280128 0.14284 -0.146041 0.0484349 -0.14816 0.161599 0.039151 -0.0787617 0.076988 0.1398 -0.139246 0.0720057 0.0275041 0.0636953 -0.144012 -0.120896 0.0283866 0.153721 0.00420972 0.0515513 -0.0490175 0.0879707 -0.0883479 0.00783477 -0.0428148 -0.028002 
0.081158 0.0254584 -0.100141 -0.0384502 0.141783 0.155195 0.0152889 -0.0402602 -0.0371161 -0.080689 0.0782501 0.0940435 0.0953607 -0.076059 -0.0788669 -0.025632 -0.0669288 0.0867018 -0.160291 0.146425 0.188696 -0.0446998 0.0676971 0.148995 0.0283498 -0.0416806 -0.00478284 -0.170565 0.0704329 0.0927813 0.0433968 -0.00597114 -0.0678317 0.0607556 -0.01528 0.0316498 -0.118325 0.0752109 -0.0500223 -0.0321264 0.0427783 -0.0180181 -0.0663989 0.211487 -0.163376 -0.0318957 0.135832 0.0561733 -0.112804 0.0444271 -0.009848 -0.0124715 -0.101354 -0.0463812 0.0684812 0.000782607 -0.0674338 0.202724 -0.0115184 -0.130782 -0.0775453 -0.024517 0.252767 -0.0196477 0.0139898 -0.142547 -0.00500236 0.0617545 -0.0392385 0.119715 0.0420736 0.0925952 -0.0263958 -0.05533 -0.0206632 -0.0330245 -0.0969045 0.0892279 -0.0101149 0.0987494 -0.0455079 0.0922922 -0.00449052 -0.051072 -0.0862342 0.0192174 0.101056 0.0431655 -0.00456339 0.00401666 0.107339 -0.141407 -0.110102 -0.0409461 -0.0326559 -0.115502 -0.064525 0.0691055 -0.00180768 -0.0889694 -0.00638803 0.0171989 -0.00114452 0.118414 -0.131659 0.0638606 -0.130669 0.147573 0.0741051 -0.0835924 0.0613739 0.141288 -0.146577 0.071951 0.0459408 0.0777078 -0.133264 -0.116824 0.0303516 0.164732 0.0115286 0.0369401 -0.0590408 0.0849702 -0.0987092 0.0230013 -0.0206688 -0.00156384 
0.0579062 0.0368658 -0.0696942 -0.0302554 0.131931 0.165662 0.0363176 -0.0653427 -0.0314039 -0.0774084 0.079091 0.0791299 0.101244 -0.0408259 -0.0603445 -0.0619241 -0.0898692 0.106498 -0.142573 0.108155 0.200553 -0.0532499 0.0444113 0.162041 0.0468765 -0.0672402 -0.0441862 -0.162328 0.0891948 0.12386 0.0641583 -0.0151003 -0.0820686 0.0332776 0.0150383 0.0467066 -0.142458 0.0378651 -0.044768 -0.0387242 0.046896 -0.0212019 -0.0763078 0.212054 -0.165706 -0.0387502 0.125703 0.0627367 -0.107705 0.000112625 -0.0266427 0.00123726 -0.0714056 -0.0653463 0.0582781 0.0328413 -0.0798039 0.22691 -0.0141726 -0.122472 -0.0790495 0.00405186 0.25021 -0.0165849 0.0186627 -0.111563 0.0133472 0.0315699 -0.0616664 0.128986 0.0545827 0.0971372 -0.0263733 -0.0775144 -0.0296582 -0.0257592 -0.106043 0.0562186 -0.000623272 0.101592 -0.0450885 0.0882542 -0.00444494 -0.040881 -0.0803968 0.012587 0.0997134 0.0199108 -0.0195498 0.00775021 0.118122 -0.132278 -0.0812733 -0.0502766 -0.055551 -0.134406 -0.0818928 0.0781372 0.0165522 -0.0674551 0.0155564 0.0417513 0.0122377 0.0871527 -0.135724 0.0898553 -0.105771 0.137537 0.0836712 -0.0672826 0.0641309 0.104499 -0.168125 0.0425169 0.0399229 0.103057 -0.116912 -0.0979546 0.0324627 0.170318 0.0148297 -0.0110723 -0.0984094 0.0684167 -0.115062 0.0584274 -0.0191081 0.0224707 
0.0688738 0.0557922 -0.0880194 -0.0383573 0.12909 0.179781 0.0286077 -0.0652301 -0.0475883 -0.0697501 0.0783508 0.0652177 0.0936841 -0.0640373 -0.0514889 -0.0516044 -0.0832884 0.0926192 -0.127223 0.110935 0.185857 -0.0425924 0.0420204 0.149963 0.0495435 -0.0576068 -0.0253678 -0.165503 0.0940597 0.116745 0.0640616 -0.0177511 -0.0839626 0.0390356 0.0243148 0.0489071 -0.122192 0.0263188 -0.0324803 -0.0482246 0.0441419 -0.0427859 -0.0583197 0.225607 -0.161358 -0.00924026 0.142638 0.074913 -0.135743 0.0112356 -0.0249294 0.00662873 -0.0742908 -0.0654121 0.058375 0.0235042 -0.0899272 0.219288 -0.0136365 -0.127499 -0.081256 -0.00017886 0.26262 -0.0295169 0.0250805 -0.115182 0.00799322 0.0271989 -0.0607571 0.128156 0.0391413 0.0914591 -0.0386707 -0.074352 -0.0229711 -0.0399765 -0.0981488 0.0787305 0.00399553 0.105666 -0.0357855 0.0820075 -0.015403 -0.0484358 -0.0798245 0.0106268 0.0826271 0.0131277 -0.0140781 0.0269758 0.131075 -0.130683 -0.100763 -0.0462643 -0.046253 -0.124628 -0.0632507 0.0836479 0.011592 -0.0813702 0.00859749 0.0455327 0.00783119 0.0833305 -0.143837 0.0917382 -0.103431 0.148964 0.079278 -0.0618628 0.0736533 0.107997 -0.161182 0.0431263 0.0477054 0.0828748 -0.119203 -0.109195 0.0440697 0.168322 0.026225 -0.0145657 -0.0721004 0.0810265 -0.105197 0.0411213 -0.00501911 0.00659529 
0.0443233 0.0541816 -0.0697011 -0.0226773 0.122196 0.173212 0.0308622 -0.0792046 -0.0314643 -0.0477928 0.0903817 0.0567438 0.10201 -0.0159357 -0.0329978 -0.0675123 -0.0826833 0.135326 -0.108863 0.0802276 0.193794 -0.051653 0.030899 0.175656 0.0630084 -0.093294 -0.0529729 -0.153395 0.100718 0.146503 0.0719746 -0.0212455 -0.0728565 0.00831174 0.0286173 0.0729466 -0.158626 -0.0171566 -0.0520312 -0.03842 0.0315389 -0.0289416 -0.0792584 0.218306 -0.165622 -0.0214426 0.124999 0.0731153 -0.115134 -0.0285783 -0.0156763 0.0164908 -0.0558902 -0.0914551 0.0399498 0.0629278 -0.089404 0.223008 0.00351605 -0.100034 -0.083737 0.0193733 0.238866 -0.0197072 0.0190127 -0.101364 0.0137381 0.0169898 -0.0781213 0.147729 0.0670132 0.0981961 -0.0354627 -0.113871 -0.036712 -0.0145267 -0.109146 0.0540522 -0.00774679 0.0847854 -0.0407066 0.0881642 -0.0229958 -0.0363561 -0.0826716 0.0325067 0.0811306 -0.019929 -0.033099 0.0246237 0.105846 -0.115157 -0.0822135 -0.0538741 -0.0541013 -0.131582 -0.0983905 0.0795695 0.025293 -0.0632704 0.0374635 0.0544103 0.0282432 0.0442543 -0.142422 0.109604 -0.0942546 0.109646 0.0845336 -0.0504109 0.0635122 0.0739982 -0.153893 0.00537011 0.0327527 0.106435 -0.0992088 -0.0966282 0.0404584 0.173475 0.0260006 -0.0564105 -0.115509 0.0678714 -0.119523 0.082551 -0.00819361 0.0380047 
0.00605263 0.0720773 -0.0552215 -0.0207582 0.116315 0.172647 0.0535239 -0.0788107 -0.0201097 -0.037913 0.069827 0.0462465 0.0969674 0.00496974 -0.0191994 -0.0920653 -0.117672 0.103967 -0.107519 0.0892254 0.153375 -0.0949716 0.0373884 0.137325 0.0631941 -0.0990003 -0.0963138 -0.120235 0.106265 0.107799 0.0860435 -0.027639 -0.0772702 -0.00668361 0.0255115 0.092158 -0.162627 0.0196722 -0.0729394 -0.0519958 0.0593357 -0.0349493 -0.0751156 0.183439 -0.186539 -0.0296945 0.108406 0.0781487 -0.100693 -0.0201814 -0.0673208 0.0218996 -0.0592891 -0.0858933 0.0594934 0.0673203 -0.111214 0.235022 -0.0131211 -0.106179 -0.109306 0.0430561 0.251079 -0.0371599 0.0444154 -0.0239012 0.0148004 0.00958665 -0.104672 0.147904 0.079463 0.123395 -0.0156712 -0.0578576 -0.000999279 -0.00245682 -0.101353 0.0201215 0.0220423 0.0519979 -0.0628171 0.0650633 -0.0145215 -0.0233801 -0.0803509 0.0155083 0.0777957 0.0235516 0.000929827 0.022323 0.123004 -0.118655 -0.0311502 -0.0721551 -0.050514 -0.165181 -0.0825521 0.0866341 0.0337534 -0.0523394 0.0200615 0.0470315 0.0255382 0.012778 -0.150886 0.153086 -0.0766398 0.113046 0.10774 -0.0464243 0.0615434 0.0828054 -0.140253 0.0153415 0.042383 0.0911273 -0.0739627 -0.0620758 0.0618322 0.183882 0.0254886 -0.0774584 -0.119429 0.0688887 -0.130474 0.103667 -0.00222541 0.0531912 
0.0569869 0.0633316 -0.102273 -0.0355354 0.128041 0.171452 0.0506111 -0.052464 -0.0319492 -0.0626457 0.0783879 0.0738947 0.108263 -0.0561585 -0.0709444 -0.0756604 -0.0736208 0.0974454 -0.142128 0.106931 0.182611 -0.0686661 0.0311688 0.1553 0.0394334 -0.0834471 -0.0444119 -0.153231 0.088409 0.120317 0.0586611 -0.0135502 -0.0820387 0.0414662 0.00350012 0.0361398 -0.125693 0.0215097 -0.0583052 -0.0387251 0.0591012 -0.0426826 -0.0625056 0.221284 -0.169336 -0.0245508 0.125775 0.0722979 -0.119084 0.00141414 -0.0265612 0.00505912 -0.085155 -0.0701294 0.0480172 0.0392727 -0.096072 0.218835 -0.00518242 -0.118501 -0.0794699 0.00850755 0.246839 -0.0337452 0.0173362 -0.117315 0.0133658 0.0206351 -0.0658508 0.116609 0.043101 0.0843634 -0.0302004 -0.0719731 -0.0220023 -0.0168775 -0.0942065 0.0761632 -0.00365155 0.0870153 -0.0654643 0.0722477 -0.0102441 -0.0324755 -0.0832938 0.0330856 0.0948621 0.000560004 -0.0137747 0.0131812 0.111158 -0.148935 -0.0817997 -0.067365 -0.0463989 -0.138301 -0.0725549 0.0668721 0.0102121 -0.0700232 0.0149713 0.050245 0.022694 0.101965 -0.14108 0.0850299 -0.113184 0.164753 0.0551138 -0.0601894 0.0701414 0.092531 -0.160606 0.0402164 0.0227259 0.0850977 -0.114377 -0.103508 0.0553367 0.173392 0.0137597 -0.018272 -0.10289 0.0889031 -0.110698 0.0401211 -0.0407782 0.00742265 
