{
  "descriptor": [
    -0.06520316749811172,
    0.05893392488360405,
    0.09452342987060547,
    -0.10273765027523041,
    -0.17132733762264252,
    0.0672374963760376,
    -0.08811797946691513,
    -0.000021170737454667687,
    0.1683003008365631,
    -0.13754230737686157,
    0.14246463775634766,
    -0.04255198687314987,
    -0.2189406007528305,
    0.11561000347137451,
    -0.09064417332410812,
    0.18443801999092102,
    -0.1740664839744568,
    -0.20390631258487701,
    -0.015342515893280506,
    -0.09010784327983856,
    0.014093706384301186,
    0.09191069006919861,
    -0.018824731931090355,
    0.10005198419094086,
    -0.18070539832115173,
    -0.35041770339012146,
    -0.07148802280426025,
    -0.08475859463214874,
    0.02529037743806839,
    -0.1312834620475769,
    -0.06676352769136429,
    0.05064157769083977,
    -0.16330285370349884,
    0.04700978845357895,
    0.08344529569149017,
    0.10993820428848267,
    -0.034041035920381546,
    -0.16019447147846222,
    0.2079044133424759,
    0.14717911183834076,
    -0.22770768404006958,
    0.010680215433239937,
    0.10474817454814911,
    0.2929389476776123,
    0.1508335918188095,
    -0.006932422053068876,
    0.04745117574930191,
    -0.04849683493375778,
    0.18792025744915009,
    -0.27387410402297974,
    0.0158008374273777,
    0.19535064697265625,
    0.06987068057060242,
    0.08072111755609512,
    0.05738610774278641,
    -0.11159738153219223,
    0.03430548682808876,
    0.1381974220275879,
    -0.1618206948041916,
    0.10290602594614029,
    0.07372421771287918,
    -0.06669516861438751,
    0.013130800798535347,
    -0.06635595113039017,
    0.2287789285182953,
    0.08940594643354416,
    -0.11212510615587234,
    -0.1631317436695099,
    0.23943260312080383,
    -0.13642707467079163,
    -0.10254333913326263,
    0.0812782347202301,
    -0.12268062680959702,
    -0.1472400724887848,
    -0.1810036599636078,
    0.02804364450275898,
    0.42778971791267395,
    0.15009276568889618,
    -0.09082550555467606,
    0.09570340067148209,
    -0.031326476484537125,
    -0.05068428814411163,
    -0.03649706766009331,
    0.1813817322254181,
    -0.0802660882472992,
    0.06986589729785919,
    -0.04522131755948067,
    0.06777019053697586,
    0.29748445749282837,
    0.026047397404909134,
    0.036256931722164154,
    0.23067469894886017,
    0.01851128228008747,
    0.045829568058252335,
    0.07256167382001877,
    0.07348279654979706,
    -0.16949591040611267,
    -0.0635407418012619,
    -0.15284167230129242,
    -0.053249817341566086,
    -0.06132464483380318,
    -0.05793658643960953,
    -0.01035563088953495,
    0.14524182677268982,
    -0.21552728116512299,
    0.14699146151542664,
    -0.07777659595012665,
    -0.10670699179172516,
    -0.07581643760204315,
    0.06926771998405457,
    -0.05144219100475311,
    -0.02660268545150757,
    0.12473703920841217,
    -0.2465827763080597,
    0.08489397168159485,
    0.16772688925266266,
    0.11383263766765594,
    0.10416781157255173,
    0.08015604317188263,
    0.019007990136742592,
    0.04334156960248947,
    -0.06646345555782318,
    -0.15605750679969788,
    -0.11649088561534882,
    0.01902385987341404,
    -0.06645885854959488,
    -0.015262871980667114,
    0.020001675933599472
  ]
}