{
  "descriptor": [
    -0.09899675846099854,
    0.1434060037136078,
    0.10904539376497269,
    -0.087006114423275,
    -0.15636520087718964,
    0.12822325527668,
    -0.09258035570383072,
    -0.06642245501279831,
    0.12110938876867294,
    -0.11186966300010681,
    0.18186166882514954,
    -0.0012712277239188552,
    -0.24624678492546082,
    -0.05134433135390282,
    -0.03653509542346001,
    0.11716967821121216,
    -0.0353127047419548,
    -0.11718554049730301,
    -0.11100766807794571,
    -0.13364410400390625,
    -0.04384871944785118,
    0.08147726953029633,
    -0.01782108284533024,
    -0.05910152569413185,
    -0.06954871118068695,
    -0.27840369939804077,
    -0.03037509135901928,
    -0.09698955714702606,
    0.0631783977150917,
    -0.11109047383069992,
    0.04814533516764641,
    0.05584297701716423,
    -0.15248234570026398,
    -0.021643521264195442,
    -0.012667156755924225,
    0.06687412410974503,
    -0.11089790612459183,
    -0.04329477995634079,
    0.2208367884159088,
    -0.06327053904533386,
    -0.09127958863973618,
    0.03141329810023308,
    0.04700149968266487,
    0.25501343607902527,
    0.08876872807741165,
    -0.025315582752227783,
    0.07041092216968536,
    -0.004872812889516354,
    0.11889364570379257,
    -0.303994745016098,
    0.09419126063585281,
    0.13763800263404846,
    0.11814182996749878,
    0.1338174045085907,
    0.06741424649953842,
    -0.15189161896705627,
    0.047170404344797134,
    0.1789703518152237,
    -0.2013600468635559,
    0.19625426828861237,
    0.07525350153446198,
    -0.11559098958969116,
    -0.15382689237594604,
    -0.030527697876095772,
    0.24225257337093353,
    0.15638868510723114,
    -0.11494074016809464,
    -0.20335368812084198,
    0.13889066874980927,
    -0.09766804426908493,
    -0.02122248336672783,
    0.14308267831802368,
    -0.10771117359399796,
    -0.13975100219249725,
    -0.1744057685136795,
    0.1608550101518631,
    0.3819933533668518,
    0.15623974800109863,
    -0.196808859705925,
    -0.01695730909705162,
    -0.031081365421414375,
    -0.009773931466042995,
    0.039277851581573486,
    0.04429304972290993,
    -0.049890805035829544,
    -0.11209280788898468,
    -0.005344722419977188,
    0.019691448658704758,
    0.18513746559619904,
    -0.026817813515663147,
    -0.05982277914881706,
    0.2406567484140396,
    0.09962496906518936,
    -0.0002922384883277118,
    -0.026167284697294235,
    0.05361190065741539,
    -0.016848808154463768,
    -0.06573420763015747,
    -0.06824689358472824,
    0.04337373375892639,
    0.048527996987104416,
    -0.14333851635456085,
    -0.025792788714170456,
    0.04012764245271683,
    -0.14902588725090027,
    0.2514818608760834,
    -0.03949027508497238,
    0.027231598272919655,
    0.015962960198521614,
    -0.008688223548233509,
    -0.05437266826629639,
    0.015557529404759407,
    0.22927819192409515,
    -0.2857874631881714,
    0.23460806906223297,
    0.16371484100818634,
    0.04175112769007683,
    0.16508199274539948,
    0.09161026030778885,
    0.10018724203109741,
    0.0972762331366539,
    -0.026821797713637352,
    -0.11785485595464706,
    -0.1625211536884308,
    0.04584823176264763,
    -0.057091593742370605,
    -0.0526663139462471,
    0.07620549947023392
  ]
}