0.0817837 -0.0162526 -0.124486 -0.0426481 0.141885 0.126467 -0.000224231 -0.131254 -0.143218 -0.0441112 -0.0482798 0.0918754 0.0980583 0.0648391 -0.0389603 -0.00504294 0.0112318 0.0701728 0.0227877 0.135118 0.115507 -0.0181851 0.125615 0.11621 -0.00708018 0.0750554 -0.0416034 -0.207407 0.0353338 0.128624 -0.0325099 0.054422 -0.0686462 0.000315654 0.0588594 0.0531545 -0.0533148 0.169382 -0.0144609 -0.0827709 -0.0598377 0.0931457 -0.0354764 0.101825 -0.163047 0.0913697 0.181739 0.0386286 -0.0978318 0.0300644 0.018962 -0.0521664 0.0187069 -0.00082036 0.157556 -0.0115964 0.0619926 0.250998 0.037864 -0.145612 -0.00345648 0.0544112 0.222377 -0.0987125 0.122884 -0.0896415 -0.0179431 0.100619 -0.0221441 0.105342 0.032799 0.119076 -0.0313666 -0.0256922 -0.0632798 0.0190509 -0.0775705 0.0246379 0.0754577 0.00810446 -0.00183045 0.126164 -0.0640702 -0.0940452 -0.0437524 -0.13983 0.0379223 0.0573272 0.0171583 0.00355079 0.0826615 -0.0373237 0.00665759 -0.0405348 0.0087013 -0.0747013 0.0571459 0.175279 0.0658465 -0.0559152 0.0277836 0.0660509 -0.00201074 0.085287 -0.205358 0.0278806 -0.1291 0.00530364 0.0472426 -0.00906458 0.10599 0.137748 -0.0637266 0.0117657 0.0243354 0.104873 -0.118186 -0.170563 -0.0848816 0.0930325 -0.0182661 0.0256268 0.0249442 -0.0137149 -0.132886 0.0793589 -0.0541941 -0.0460981 
0.0852455 -0.0174641 -0.114027 -0.0438472 0.13586 0.12164 -0.0029122 -0.129403 -0.150144 -0.0394633 -0.0510064 0.0891655 0.105471 0.0651306 -0.0437242 0.00262168 0.00382243 0.0793272 0.0127197 0.131667 0.129687 -0.0225372 0.126372 0.115939 -0.00559824 0.0763513 -0.0457239 -0.208797 0.035307 0.137155 -0.0459504 0.064626 -0.0754165 0.00339797 0.0550644 0.0398876 -0.063872 0.175217 -0.00431341 -0.0838802 -0.0735719 0.0866047 -0.0340471 0.0970149 -0.151719 0.0832214 0.179801 0.0347472 -0.106096 0.0301934 0.0343957 -0.0489539 0.0189839 0.00557235 0.153479 -0.0195314 0.0760897 0.241232 0.0409347 -0.155787 0.0109739 0.0514128 0.21318 -0.0825015 0.111922 -0.0883444 -0.0218802 0.108975 -0.020259 0.100437 0.0278396 0.118679 -0.0322436 -0.0301022 -0.069396 0.0164735 -0.0771795 0.0111579 0.0787137 0.0213582 0.00517422 0.123445 -0.0618072 -0.0961874 -0.0463881 -0.139284 0.0377089 0.0564114 0.0245955 0.00270825 0.0720764 -0.0368387 0.0063669 -0.0322176 -0.00736314 -0.0680075 0.0521564 0.180744 0.0691852 -0.0565873 0.0405413 0.0645162 -0.00687092 0.0997615 -0.195909 0.0181107 -0.136372 0.0158217 0.0528278 -0.0193692 0.101345 0.14319 -0.0732588 0.0117053 0.0291955 0.112621 -0.124769 -0.160461 -0.0872949 0.0895624 -0.0219023 0.0274576 0.0291716 -0.0238225 -0.130893 0.077939 -0.0535561 -0.048464 
0.0894436 -0.017835 -0.11136 -0.0505129 0.146572 0.115916 0.00885822 -0.117813 -0.151348 -0.037696 -0.0570282 0.0908986 0.10359 0.0594529 -0.0406342 0.00494698 0.00212247 0.0744244 -0.00708713 0.138068 0.126368 -0.0186858 0.124435 0.102633 -0.0098213 0.0765162 -0.0511233 -0.20038 0.0358993 0.127475 -0.0495827 0.0757442 -0.0855977 0.0137876 0.0470014 0.0358966 -0.0656966 0.185342 -0.00748053 -0.0820172 -0.0640427 0.0866559 -0.0309709 0.0979536 -0.152985 0.0854071 0.171326 0.0395747 -0.10349 0.036371 0.0360597 -0.0457077 -0.00215513 0.00610757 0.155544 -0.0310804 0.064918 0.24262 0.0378554 -0.149255 0.0118773 0.0426357 0.207885 -0.0763936 0.111063 -0.098004 -0.0275677 0.117333 -0.018401 0.101838 0.0329221 0.125737 -0.0227002 -0.0193772 -0.0756664 0.0175649 -0.0725697 0.015172 0.0763108 0.014835 0.010048 0.121752 -0.0575342 -0.0928752 -0.0483589 -0.146954 0.0456585 0.0683635 0.0303397 0.00605328 0.0713901 -0.042231 -0.00258889 -0.0364084 -0.00941126 -0.0640431 0.0583716 0.167427 0.0648286 -0.0561617 0.0315178 0.063324 -0.0104371 0.110592 -0.197976 0.0118691 -0.149572 0.0280357 0.0607034 -0.0238616 0.103729 0.153619 -0.0848389 0.0278824 0.0337469 0.104389 -0.120234 -0.160832 -0.0861858 0.0910515 -0.0220558 0.0427751 0.0368246 -0.0125511 -0.122155 0.0618246 -0.0559681 -0.0591726 
0.0809624 -0.0046895 -0.10778 -0.0566414 0.141991 0.101815 0.0110446 -0.115907 -0.147298 -0.0309659 -0.0555378 0.0784388 0.10196 0.0683342 -0.0337803 0.00747559 0.00513393 0.0695602 -0.00373804 0.132367 0.124365 -0.0242533 0.129965 0.0816451 -0.0066346 0.0829776 -0.0524555 -0.196846 0.0517196 0.119265 -0.0402908 0.0819017 -0.0799757 0.00613564 0.0448008 0.0352897 -0.0622323 0.212102 -0.000956485 -0.0777579 -0.0669282 0.0905271 -0.0412129 0.0965473 -0.153475 0.0958667 0.164706 0.0366031 -0.103271 0.0226876 0.022742 -0.0227384 -0.0128767 0.00347948 0.142701 -0.0318402 0.0728673 0.240642 0.033758 -0.144393 0.0076284 0.02714 0.207898 -0.0753345 0.117988 -0.0979143 -0.0250703 0.122502 -0.00959779 0.112173 0.0369708 0.129268 -0.0252657 -0.00909158 -0.0727687 0.00615686 -0.077365 0.0242463 0.0711644 0.00738328 -0.00645467 0.121714 -0.0571362 -0.0906341 -0.044935 -0.157775 0.0441189 0.072101 0.0352072 -0.00820215 0.0704784 -0.0376926 0.00464834 -0.0478103 0.00410205 -0.0800881 0.0661849 0.174103 0.0650633 -0.0571395 0.015502 0.0640602 -0.00867716 0.117458 -0.196043 0.00989316 -0.140569 0.0335892 0.090951 -0.034504 0.0939776 0.154224 -0.0980294 0.035542 0.0465465 0.0962631 -0.114079 -0.175324 -0.0755316 0.0914823 -0.0203959 0.0556065 0.0295856 -0.00144432 -0.117595 0.050525 -0.0520613 -0.0503739 
0.0696432 0.00157033 -0.104927 -0.0486831 0.151638 0.112151 0.0115738 -0.124646 -0.158252 -0.0145227 -0.0540272 0.0817366 0.101432 0.0680073 -0.0155239 0.0035225 0.0362502 0.0823621 0.0291233 0.126749 0.107411 -0.0147719 0.121217 0.102832 -0.00821802 0.0902025 -0.0573474 -0.198108 0.0650055 0.11976 -0.0250981 0.0844863 -0.0674346 0.00181099 0.0619878 0.0472164 -0.0346599 0.188187 0.00194224 -0.0829777 -0.0477677 0.0939192 -0.0231197 0.091719 -0.168759 0.0977219 0.183623 0.0370631 -0.0999535 0.00422172 0.0240308 -0.0387092 -0.00163032 -0.00626669 0.147053 -0.00673953 0.0702811 0.244338 0.0371948 -0.134677 -0.00668482 0.035764 0.201935 -0.10456 0.140217 -0.0847612 -0.0205695 0.0936453 -0.023357 0.111226 0.0284073 0.122873 -0.0350896 -0.0099671 -0.0621392 0.00952895 -0.0741254 0.0497978 0.0791913 -0.0246116 -0.0147133 0.140515 -0.0559395 -0.0802133 -0.0292614 -0.157888 0.0431001 0.067941 0.0215904 -0.000362539 0.0770189 -0.0242058 0.0100804 -0.0508247 0.0207583 -0.0803625 0.0690871 0.189131 0.0559423 -0.0515417 0.011296 0.0695201 0.00188344 0.107099 -0.196223 0.0215951 -0.121207 0.00548457 0.0857126 -0.0197815 0.0839988 0.136265 -0.0783446 0.0196811 0.0382524 0.0810415 -0.107663 -0.196971 -0.0862983 0.0901861 -0.00577447 0.0381449 0.0241946 -0.00648684 -0.130632 0.0691007 -0.0564672 -0.0477802 
0.0766281 -0.00550921 -0.107526 -0.0501489 0.126217 0.103204 -0.0185804 -0.127033 -0.155188 -0.0291892 -0.0514433 0.0748274 0.100912 0.0732339 -0.0415675 0.028955 0.0159453 0.0769914 0.0205357 0.123137 0.130816 -0.0215914 0.136797 0.0884877 -0.00219992 0.101926 -0.0344869 -0.204709 0.0459554 0.120948 -0.0421764 0.0759503 -0.0686722 0.000208087 0.0528538 0.0348485 -0.0539916 0.208318 0.0171887 -0.0771387 -0.0883558 0.0938613 -0.0280959 0.0927184 -0.138448 0.0855711 0.182951 0.0235634 -0.111401 0.022699 0.0379238 -0.0382135 0.00238421 0.012861 0.140796 -0.0267674 0.101503 0.229971 0.0454432 -0.158967 0.0189724 0.0282362 0.206261 -0.0783494 0.121094 -0.0899256 -0.0274291 0.122171 0.000621583 0.111737 0.0240616 0.121664 -0.0349251 -0.0207326 -0.0693928 -0.00468568 -0.0786869 0.0289189 0.0695898 0.00667653 -0.00165553 0.132326 -0.0569963 -0.0964397 -0.0507228 -0.150566 0.0322812 0.0643354 0.0329074 -0.015266 0.0593716 -0.0297305 0.00610886 -0.03964 0.0134614 -0.0645873 0.0611961 0.198904 0.0595231 -0.0571045 0.0179835 0.0568373 -0.0127245 0.11866 -0.181257 0.00598358 -0.133657 0.0154572 0.0759779 -0.0385366 0.0811378 0.150418 -0.0755148 0.0270553 0.0453073 0.095303 -0.120726 -0.177637 -0.0870657 0.0741067 -0.0188741 0.0544498 0.0421271 -0.0231426 -0.123109 0.0585137 -0.0478464 -0.0422834 
0.0722224 -0.0158502 -0.0918811 -0.0598343 0.114349 0.103652 -0.0249155 -0.113922 -0.161921 -0.0342222 -0.0491927 0.08059 0.104094 0.0715163 -0.037106 0.0221733 -0.00373442 0.0699739 0.0206219 0.121623 0.140342 -0.0274972 0.142117 0.100355 -0.000522023 0.105513 -0.0235214 -0.209085 0.046875 0.116169 -0.0442561 0.0570278 -0.0691833 0.00513637 0.0409673 0.0303594 -0.0686067 0.211249 0.0174713 -0.0643661 -0.0912748 0.0838817 -0.0380399 0.0960371 -0.136134 0.0692126 0.182658 0.014347 -0.117776 0.0268055 0.0374305 -0.0453285 0.000739832 0.0173628 0.138861 -0.0230088 0.0982965 0.244575 0.0349312 -0.156881 0.0203231 0.0273181 0.212931 -0.0686373 0.118259 -0.0848397 -0.02578 0.118096 -0.00395087 0.110142 0.0159186 0.122351 -0.0411452 -0.0173295 -0.0581925 -0.011122 -0.077554 0.0168315 0.0774883 0.0273639 -0.0094919 0.115993 -0.0496065 -0.0997643 -0.0614061 -0.154201 0.0429368 0.0653509 0.0345817 -0.0191386 0.0591606 -0.0352313 0.0109673 -0.0296884 0.00616097 -0.0646642 0.0533935 0.196639 0.0649291 -0.0538616 0.0120396 0.0494013 -0.0245445 0.119322 -0.173885 0.0103453 -0.136958 0.0191549 0.0728284 -0.0618946 0.0803847 0.160662 -0.0782937 0.0241889 0.0516192 0.108319 -0.118801 -0.167643 -0.0798585 0.0859615 -0.0203228 0.0436233 0.0295061 -0.0282794 -0.125483 0.0683142 -0.047713 -0.0378953 
0.0654172 -0.0347833 -0.0810389 -0.0548691 0.10917 0.0952731 -0.0274157 -0.113205 -0.162783 -0.0531353 -0.0617059 0.0866256 0.0914034 0.0707758 -0.0141785 0.00212295 -0.0168632 0.0477552 0.054759 0.123064 0.129504 -0.0154386 0.140082 0.102502 0.00832947 0.112928 -0.0172655 -0.224819 0.0255039 0.117582 -0.0420388 0.0378118 -0.0533244 -0.000553913 0.0547888 0.0353837 -0.0538238 0.205346 0.00951931 -0.0665637 -0.0735374 0.0819198 -0.0298806 0.0988482 -0.149699 0.0879578 0.191735 -0.000631395 -0.106455 0.0258092 0.0316363 -0.06411 0.0303207 0.0258546 0.166822 -0.0158464 0.0978707 0.238936 0.0317718 -0.153485 0.0265969 0.0273261 0.19849 -0.0626421 0.12909 -0.0870095 -0.0159266 0.104122 0.011921 0.0945258 0.0136705 0.119199 -0.0464598 -0.0275633 -0.0409641 0.00207085 -0.0944279 0.00997919 0.0847353 0.0484556 -0.0120839 0.117394 -0.0459759 -0.090192 -0.0523022 -0.157375 0.0508779 0.0667637 0.0208806 -0.0223309 0.0585526 -0.02708 0.0165553 -0.0379377 -0.017789 -0.0709114 0.0602071 0.194693 0.084094 -0.0635614 0.00436704 0.0504395 -0.00790026 0.0951774 -0.18657 0.00416488 -0.134167 0.016771 0.0486796 -0.0484994 0.0973231 0.143355 -0.086177 -0.00813945 0.0384637 0.115534 -0.118235 -0.18318 -0.095046 0.0853434 -0.00944262 0.0472397 0.0200266 -0.032097 -0.123998 0.075495 -0.03538 -0.0237606 
-0.0151764 0.0168662 -0.0589326 -0.0402368 0.086749 0.112048 -0.0284992 -0.160497 -0.161358 0.0178449 -0.01379 0.0230676 0.10553 0.0867988 0.0407056 0.00448288 -0.0263323 0.0789105 0.104009 0.10961 0.0712275 -0.0335702 0.111548 0.0970588 -0.0118806 0.115394 -0.106343 -0.200304 0.104834 0.0860263 0.0175033 0.0431855 -0.0421382 -0.0625026 0.110423 0.11754 -0.0245101 0.152474 0.029961 -0.0675622 -0.0473359 0.0700605 -0.0345404 0.0651909 -0.158775 0.069937 0.216945 0.0609305 -0.102132 -0.0428681 -0.0742502 -0.0701217 0.0526571 -0.00895456 0.113064 0.0323053 0.0768322 0.216324 0.0210063 -0.127361 -0.044005 0.0973045 0.218648 -0.0918216 0.134114 0.0483013 0.0300229 0.026893 -0.0118021 0.0520767 0.00699641 0.120679 -0.0302626 0.0238767 0.0206173 -0.0350907 -0.128268 0.0226384 0.114386 -0.027934 0.0277782 0.139349 -0.0889599 -0.0742481 -0.0326666 -0.0879734 0.00250411 0.0480327 0.00769417 -0.0141301 0.131086 0.0426283 0.0753679 -0.0535947 0.00167256 -0.114401 0.0164454 0.240326 0.063787 -0.0420797 0.00331965 0.0274789 0.0210045 -0.0149188 -0.161963 0.109795 -0.0240061 -0.0277654 0.113015 0.0324232 0.0560208 0.0995832 -0.0285026 -0.0677902 0.0134923 0.0959266 -0.0845324 -0.160993 -0.0918865 0.042619 0.0104202 -0.0612111 0.00700832 -0.0158095 -0.222673 0.139217 -0.0572276 0.0292652 
0.00485751 0.00501854 -0.0763585 -0.0371433 0.0947262 0.0992747 -0.0241441 -0.153567 -0.161714 0.0144938 -0.0238248 0.0322676 0.11547 0.092727 0.0137387 0.0120931 -0.0222752 0.0900788 0.0871798 0.119237 0.0935406 -0.0463955 0.117347 0.119579 -0.00728821 0.10805 -0.0874846 -0.199739 0.0912803 0.107329 -0.00798286 0.050077 -0.0553543 -0.0538827 0.0938448 0.09171 -0.0308857 0.1586 0.0212267 -0.0759773 -0.0579337 0.0725844 -0.0201628 0.0862052 -0.156493 0.0543533 0.219414 0.0623134 -0.0894855 -0.0270468 -0.0367265 -0.0806887 0.0407266 0.000449974 0.135336 0.0203905 0.0868244 0.216587 0.0516332 -0.154274 -0.0178599 0.079857 0.208906 -0.0714692 0.111152 0.023449 0.020927 0.0393619 0.00420696 0.0518819 0.000883709 0.129768 -0.0248278 0.0139464 -0.00066675 -0.0343984 -0.115412 0.0349805 0.110763 -0.0192468 0.0367371 0.144292 -0.0855229 -0.0843699 -0.0295932 -0.0910592 0.00708971 0.0559607 0.0277277 -0.0235809 0.110415 0.0329317 0.0596048 -0.072244 -0.00718752 -0.108131 0.0140778 0.246265 0.0695405 -0.0553325 0.0193001 0.0330973 0.0371387 0.0169218 -0.167573 0.0809941 -0.0601583 -0.012429 0.10022 0.0228259 0.0599458 0.115752 -0.0396442 -0.0543238 0.00641736 0.102625 -0.0806787 -0.164856 -0.104751 0.0359753 -0.00078487 -0.0308564 0.0133973 -0.020491 -0.234017 0.12298 -0.0706476 0.0244202 
0.0554815 -0.0179428 -0.0519883 -0.0198544 0.0909824 0.0875138 -0.0303581 -0.149049 -0.175312 -0.0473726 -0.0272905 0.0582657 0.0965882 0.0993896 0.0131317 0.00455705 0.0173477 0.0596258 0.0982713 0.122415 0.117765 -0.0122074 0.134195 0.153793 0.0151944 0.100383 -0.0315177 -0.209847 0.073484 0.133607 -0.0193577 0.0368914 -0.0369777 -0.017884 0.0763792 0.0648153 -0.0260163 0.1779 0.0185499 -0.0715706 -0.0811201 0.0795339 -0.0230192 0.0813769 -0.15114 0.0888497 0.216795 0.015912 -0.101796 0.00122277 0.0168517 -0.0502116 0.0618369 0.0126563 0.165588 0.00660739 0.103791 0.231689 0.0453661 -0.141109 0.000914127 0.0556082 0.187721 -0.085549 0.121481 -0.0351699 0.0148605 0.0421976 -0.0124953 0.0932704 -0.0112039 0.104964 -0.0640029 -0.00597058 -0.00945741 -0.0311812 -0.0784152 0.0346561 0.100345 0.0432379 0.0102831 0.121104 -0.0665605 -0.109993 -0.0127105 -0.142095 0.00630422 0.0342767 -0.0117557 -0.00876002 0.0937154 0.0107354 0.0372917 -0.0358613 -0.00440639 -0.0890084 0.042798 0.229932 0.0924497 -0.0694703 0.0107464 0.0661459 0.0132428 0.0690234 -0.181089 0.0416407 -0.071158 -0.011551 0.0959844 -0.0329602 0.0720268 0.127233 -0.0607057 -0.0383438 0.0264508 0.115995 -0.0837042 -0.189656 -0.104235 0.0865837 -0.00921095 0.0119326 -0.00293013 -0.0303979 -0.171854 0.115973 -0.0196917 0.000266206 
0.0692929 -0.0300797 -0.0705688 -0.0430055 0.106952 0.0935839 -0.0242508 -0.142295 -0.171142 -0.0566707 -0.0514271 0.0699277 0.0905619 0.0893802 0.00883719 -0.00191624 -0.00548442 0.0458923 0.0917051 0.110727 0.119116 0.00109897 0.138366 0.10892 0.0164713 0.110915 -0.0280252 -0.22128 0.0452046 0.133086 -0.0296472 0.0339136 -0.050593 -0.0179043 0.0818296 0.0474743 -0.0335261 0.186836 0.0362218 -0.0698147 -0.0800103 0.0860211 -0.0305716 0.0874814 -0.157697 0.103863 0.194003 0.00965939 -0.0950419 0.010028 0.0173621 -0.0474606 0.0588534 0.0223085 0.162767 -0.013881 0.111314 0.238868 0.0230907 -0.133786 0.0187773 0.0427582 0.196249 -0.0714873 0.12707 -0.0651312 0.00201526 0.0835092 0.0104261 0.0902972 0.00790455 0.120917 -0.0597248 -0.0207938 -0.0331382 -0.00972247 -0.097173 0.00386109 0.0947398 0.0616131 0.00971716 0.118158 -0.0508246 -0.093004 -0.029087 -0.160858 0.0277795 0.0498709 -0.00324722 -0.0199932 0.0828282 -0.00119521 0.0286488 -0.0302079 -0.0209449 -0.0901868 0.0567955 0.210529 0.0932468 -0.0660227 0.0109038 0.0629086 0.00477582 0.0738499 -0.186589 0.018051 -0.0945381 0.00595584 0.0757359 -0.0249968 0.0991445 0.122382 -0.0797838 -0.0239092 0.0322514 0.124511 -0.105711 -0.177629 -0.104459 0.0833116 -0.00576199 0.0267158 0.00927423 -0.0354217 -0.144223 0.0923526 -0.0249136 -0.00719905 
0.0582128 -0.030882 -0.0692965 -0.0580674 0.0923182 0.0823945 -0.0336554 -0.115981 -0.162863 -0.0437748 -0.0511345 0.080013 0.0952309 0.0687271 -0.0148014 0.00117495 -0.0435374 0.0357514 0.0522743 0.128289 0.126412 -0.0222907 0.14719 0.0895896 0.00279675 0.130002 -0.0173214 -0.222286 0.030108 0.110188 -0.0508392 0.0331794 -0.0518703 0.000828856 0.0485262 0.0328094 -0.0567 0.230485 0.0231472 -0.0579244 -0.0815962 0.0681296 -0.0458752 0.0913305 -0.152649 0.0777413 0.18558 -0.000838346 -0.104669 0.0320865 0.0205544 -0.0482926 0.0231277 0.0402195 0.164792 -0.0282011 0.108381 0.227187 0.0192417 -0.155465 0.0259069 0.0166708 0.2068 -0.0440372 0.119042 -0.0751355 -0.00793362 0.110223 0.0225876 0.0902931 0.00881392 0.123351 -0.0413798 -0.00461913 -0.027153 -0.0135994 -0.104434 -0.00142909 0.0901876 0.0660065 -0.010927 0.109363 -0.0385703 -0.0910271 -0.0580817 -0.160309 0.0524668 0.0778655 0.0372304 -0.0315527 0.0635206 -0.0252942 0.0330327 -0.0309966 -0.0344143 -0.0910161 0.0561607 0.192726 0.095613 -0.0729994 0.00449721 0.0471807 -0.0137002 0.0931376 -0.171796 0.00734926 -0.123522 0.0306043 0.0710214 -0.0550992 0.0951747 0.159497 -0.089744 -0.00260841 0.04464 0.11885 -0.114898 -0.174887 -0.0905874 0.079053 -0.00917715 0.045883 0.0220399 -0.0322488 -0.127984 0.0782351 -0.0258975 -0.00827185 
0.0693666 -0.0390269 -0.0554927 -0.0478595 0.0990199 0.083736 -0.0241477 -0.13468 -0.157514 -0.0487766 -0.047399 0.0782693 0.0878501 0.0986641 0.0147253 0.00231517 -0.00804952 0.0553365 0.0811766 0.106314 0.119771 0.0176952 0.150904 0.1231 -0.00242929 0.115286 -0.00920811 -0.222307 0.0434511 0.132874 -0.0443362 0.0429519 -0.0292409 -0.00257406 0.0768155 0.042025 -0.0147253 0.210731 0.0261648 -0.0591851 -0.0874459 0.0819141 -0.0396827 0.0762749 -0.166358 0.0966556 0.188738 0.00432241 -0.0909928 0.0233999 0.0313689 -0.0433172 0.0508274 0.0407702 0.176113 -0.0102876 0.134758 0.224336 0.0128018 -0.127849 0.0169554 0.024682 0.184926 -0.0689945 0.12673 -0.0747711 -0.00342745 0.08745 0.00986366 0.110961 -0.000338515 0.107764 -0.0669994 -0.0118866 -0.0237884 -0.01626 -0.0940755 0.0108656 0.0928581 0.0439116 0.00971875 0.128898 -0.051568 -0.0935275 -0.0244812 -0.163458 0.0310221 0.0550834 -0.000397739 -0.00605215 0.0785455 -0.0095284 0.029006 -0.0320786 -0.0178305 -0.0846106 0.0419613 0.212577 0.107255 -0.0603127 0.0239813 0.0579223 -0.000701535 0.0818703 -0.163683 -0.00128302 -0.103551 -0.0155335 0.078185 -0.0399782 0.0841974 0.137833 -0.0696352 -0.0247779 0.0386581 0.128353 -0.0828276 -0.194889 -0.106793 0.0904421 0.0133092 0.0341912 0.0127542 -0.0324839 -0.139826 0.0912107 -0.0121219 0.000154076 
0.0786575 -0.0379557 -0.0752987 -0.0629176 0.109291 0.0901031 -0.000213833 -0.0990384 -0.139576 -0.0621263 -0.0352711 0.0810485 0.0912538 0.0776898 0.0123356 -0.02611 -0.034744 0.0210308 0.049195 0.134241 0.112372 0.00939584 0.136366 0.0837379 -0.0174564 0.110587 -0.0242537 -0.218056 0.0441476 0.109763 -0.0477595 0.0304243 -0.0442985 0.0014352 0.0576829 0.0501484 -0.0272182 0.237166 0.00545343 -0.0535803 -0.0548507 0.0865226 -0.0768905 0.0850027 -0.194739 0.101159 0.165288 0.00130981 -0.0846278 0.0331625 -0.0185706 -0.020946 0.0147923 0.0510477 0.171457 -0.0250492 0.091271 0.231929 -0.019731 -0.12239 -0.00544386 0.00779996 0.221322 -0.0685105 0.119249 -0.0823079 0.0164749 0.105859 0.0252453 0.0936775 0.0333044 0.120391 -0.0409279 0.00642768 -0.0115119 0.00229581 -0.112875 0.00233514 0.0861019 0.0495869 -0.0119746 0.119321 -0.0403749 -0.0838219 -0.0294275 -0.146141 0.0613778 0.0770809 0.0157562 -0.0184583 0.103354 -0.0434027 0.024529 -0.0433371 -0.0302386 -0.127358 0.0582152 0.166128 0.106247 -0.0667666 -0.00112639 0.0531121 0.000171395 0.0750246 -0.195199 0.025202 -0.108816 0.0226214 0.0796555 -0.0404143 0.109533 0.141211 -0.100063 -0.00704901 0.0451226 0.122869 -0.0970764 -0.200553 -0.0838946 0.0931378 0.00375812 0.0378476 0.0176403 0.00518926 -0.111146 0.07436 -0.0120858 0.00404065 
0.079991 -0.0453016 -0.0794014 -0.0552751 0.112827 0.0877252 -1.99617e-05 -0.113345 -0.14087 -0.0497453 -0.0364669 0.0947548 0.0899991 0.0743637 0.00550608 -0.0138074 -0.0319982 0.0397092 0.0603485 0.122951 0.122737 0.0123167 0.133267 0.103532 -0.00781156 0.116213 -0.0161866 -0.228016 0.0463214 0.131184 -0.0503461 0.0356342 -0.0488912 -0.00638012 0.0594155 0.0382072 -0.0342745 0.215553 0.0232753 -0.0513436 -0.0648373 0.0853584 -0.0685423 0.0942669 -0.187024 0.0866945 0.171787 -0.00117702 -0.0750406 0.0195379 0.00990397 -0.0290789 0.0208853 0.0401249 0.171877 -0.0193476 0.101296 0.240643 -0.0131103 -0.115528 0.00613527 -0.00212083 0.218416 -0.060192 0.11677 -0.0936656 0.00878811 0.0993098 0.0254518 0.0892909 0.024236 0.130838 -0.0504665 -0.00647999 -0.0265506 -0.00154202 -0.107109 0.00627415 0.0814171 0.059091 -0.000445563 0.125621 -0.0375848 -0.0814134 -0.0274975 -0.153111 0.0606174 0.0695975 0.0103659 -0.0291571 0.0842353 -0.0297549 0.0150143 -0.034442 -0.0309465 -0.116275 0.0496571 0.170522 0.108436 -0.0627991 0.0084526 0.0491673 0.000743502 0.0801046 -0.187396 0.012848 -0.108619 0.0156079 0.0779013 -0.0365566 0.104509 0.137059 -0.0936797 -0.0119739 0.0424925 0.128999 -0.0974978 -0.190288 -0.0956883 0.0894265 0.00532907 0.0375676 0.0107721 -0.0125265 -0.125559 0.0848481 -0.0249665 0.00423888 
0.0608896 -0.0279697 -0.0736301 -0.0537536 0.098047 0.0707632 -0.00166756 -0.140672 -0.135851 -0.0234249 -0.00977153 0.0830174 0.0952328 0.118391 0.0336407 -0.00822325 -0.0165712 0.0426395 0.097373 0.101251 0.104893 0.0236401 0.12627 0.0979135 -0.00465447 0.134788 -0.0120786 -0.21433 0.0739293 0.147625 -0.0401531 0.048758 -0.0210064 -0.025617 0.0695893 0.0616729 -0.00977101 0.221563 0.0485651 -0.031596 -0.0758339 0.0897894 -0.0686134 0.0787893 -0.190462 0.0930676 0.176848 -0.00251805 -0.0622479 -0.0179425 0.000375593 -0.00437834 0.0221944 0.0399146 0.165447 0.00565315 0.110371 0.241892 -0.0266026 -0.084481 -0.013809 -0.0182717 0.217281 -0.07269 0.130105 -0.0664083 0.0210298 0.0847174 0.0258887 0.0992511 0.0261077 0.13138 -0.0665561 0.00439391 -0.00336728 -0.0149091 -0.107045 0.0141021 0.0735555 0.0328743 0.00425065 0.135774 -0.0422156 -0.0740698 -0.0196073 -0.155986 0.0481882 0.0507679 0.00246872 -0.0343924 0.0790699 -0.0165603 0.0343136 -0.0356003 -0.010784 -0.137026 0.0387048 0.185808 0.127225 -0.0541699 -0.00392932 0.0525874 0.0130019 0.0668879 -0.179688 0.0305147 -0.0806439 -0.0123981 0.107555 -0.0387859 0.0784176 0.112935 -0.0867851 -0.0224993 0.0444338 0.12469 -0.0665577 -0.202228 -0.0984518 0.0858303 0.0250021 0.0208487 -0.000223271 -0.00726076 -0.140569 0.101202 -0.0154433 0.034871 
0.0357269 0.0164863 -0.0749986 -0.0183354 0.0758704 0.121473 -0.00320984 -0.156867 -0.172959 0.0170489 0.00361251 0.0482393 0.108175 0.101544 0.0400874 -0.00978581 0.00904119 0.0793929 0.11357 0.0910175 0.078716 -0.017621 0.113933 0.120068 -0.00353424 0.108364 -0.0700127 -0.216841 0.100221 0.134446 -0.0102602 0.0880204 -0.0352599 -0.0418649 0.0755287 0.0904084 -0.0215244 0.170923 0.0295415 -0.0431791 -0.0568879 0.0608261 -0.0602175 0.0604372 -0.178809 0.0866461 0.208263 0.0174881 -0.114773 -0.0533759 -0.00493824 -0.00347035 0.0541783 0.00496182 0.129046 0.0406418 0.108426 0.227064 0.026061 -0.0995557 -0.048682 0.0581246 0.213407 -0.127095 0.143641 0.00813199 0.0393286 0.0317321 -0.0271187 0.102474 0.000754599 0.113729 -0.0624018 0.0210176 0.0167669 -0.0215012 -0.101503 0.0237372 0.0751986 -0.00648055 -0.0082454 0.130345 -0.0722398 -0.0913207 -0.020065 -0.102582 0.0149956 0.00135088 -0.0204746 -0.0144803 0.0979305 0.00803438 0.0540735 -0.0451064 0.00766494 -0.119161 0.0465283 0.219953 0.106274 -0.0383236 0.0123705 0.0681744 0.0236896 0.0519517 -0.177148 0.0756566 -0.0435136 -0.0168823 0.103329 -0.0141401 0.0515686 0.107061 -0.0398257 -0.0814844 0.0357577 0.100739 -0.0760432 -0.201068 -0.0607346 0.0792438 0.0298028 -0.0609956 0.00326415 -0.0183951 -0.160416 0.142797 -0.0261556 0.0325799 
0.0226922 0.017383 -0.0688217 -0.00779066 0.0606809 0.10762 0.000678793 -0.15134 -0.140071 0.00424903 0.0103429 0.0351098 0.110972 0.116244 0.0511075 -0.0264295 0.00161461 0.0590086 0.101159 0.0997678 0.0684565 -0.0268194 0.119329 0.116019 -0.00459635 0.0898625 -0.085061 -0.206832 0.104517 0.124793 0.0156014 0.0903454 -0.0215658 -0.0500509 0.0695872 0.108071 -0.0177636 0.201364 0.00432684 -0.0383686 -0.0504156 0.068473 -0.0885673 0.0565925 -0.187796 0.0805969 0.19177 0.0199719 -0.0844791 -0.052396 -0.0378338 0.0133297 0.0616027 0.0046678 0.127939 0.0381857 0.0940511 0.218053 0.02427 -0.105957 -0.0762113 0.0526035 0.207721 -0.128835 0.131309 0.0234334 0.0693841 0.0251328 -0.0319947 0.0983458 0.0110723 0.110664 -0.0535406 0.0411539 0.0345282 -0.0269608 -0.112748 0.00898294 0.0731883 0.00510369 -0.0136009 0.119879 -0.0786305 -0.0985374 -0.000970259 -0.0995058 0.0113715 0.00574397 -0.0214648 -0.0273633 0.105748 0.00328532 0.073099 -0.062755 0.0100012 -0.145063 0.0407955 0.211662 0.110522 -0.038216 0.00261397 0.0622096 0.0329516 0.0419937 -0.187132 0.090229 -0.033534 -0.019967 0.13509 -0.0121611 0.0452027 0.112299 -0.054774 -0.0822999 0.0320132 0.10402 -0.0626146 -0.205365 -0.0447318 0.0883039 0.0265895 -0.0572639 -0.0107869 0.00176344 -0.159174 0.1366 -0.0151492 0.0533231 
0.026144 0.0103959 -0.0744492 -0.0339148 0.131402 0.112881 0.0150752 -0.173906 -0.125087 -0.00895244 -0.0257224 0.0475644 0.12274 0.097661 0.0180832 -0.0210968 -0.0545431 0.0932598 0.01359 0.124759 0.0954357 -0.0365751 0.124095 0.107103 0.0027832 0.0516766 -0.120408 -0.167306 0.0760568 0.133872 -0.00524379 0.0842053 -0.0561708 -0.0262977 0.0871758 0.0776687 -0.0271604 0.163767 0.0119832 -0.0905816 -0.01143 0.0548586 -0.00572099 0.078561 -0.206419 0.0261373 0.182394 0.0874326 -0.0544852 0.00486398 -0.0373199 -0.0580869 0.0365191 0.0197463 0.154093 -0.00134299 0.0672727 0.213484 0.018861 -0.161454 -0.0549869 0.0860249 0.20772 -0.0642958 0.0777944 0.0486791 0.0163908 0.0573873 -0.0338272 0.0638641 0.0242202 0.133272 -0.00196224 0.029238 0.00778342 -0.00858975 -0.115664 -0.0371307 0.101155 -0.00529695 0.0629292 0.145717 -0.0534596 -0.0676556 -0.0210346 -0.0771405 0.0184075 0.0753731 0.0269606 0.0101453 0.134085 -0.0191203 0.0550863 -0.0835028 -0.0525494 -0.145228 -0.0189035 0.235496 0.0818334 -0.0602701 0.0523162 0.0362408 0.0645776 0.0380755 -0.172209 0.08201 -0.0870906 0.0347036 0.116582 0.0235096 0.0799851 0.126592 -0.0748274 -0.012476 -0.00397113 0.103021 -0.0749194 -0.117388 -0.0821241 0.0781862 0.0329278 -0.0355622 0.00756439 -0.0079927 -0.221522 0.106377 -0.0527526 0.0376759 
0.0381816 -0.050121 -0.0703757 -0.0390106 0.0956756 0.10485 -0.00534812 -0.105648 -0.112618 -0.0496513 -0.0174868 0.0739403 0.125193 0.0786263 -0.00078746 -0.0322744 -0.0641842 0.0377968 0.000902783 0.167948 0.109243 -0.0640078 0.146581 0.137234 -0.0182467 0.0757517 -0.0545943 -0.203173 0.0461719 0.0802769 -0.00275323 0.053474 -0.0429906 0.000685085 0.0274673 0.079346 -0.0421073 0.22687 -0.0333132 -0.0671466 -0.00901731 0.0444127 -0.0705869 0.0832984 -0.200482 -0.00829023 0.172006 0.0489996 -0.0563283 0.0346203 -0.0528073 -0.082587 0.0323299 0.0397714 0.166542 -0.00740063 0.0609268 0.225808 0.011495 -0.18264 -0.0518804 0.0565981 0.223363 -0.0665166 0.0787115 0.0279892 0.0379357 0.0684951 -0.0109031 0.0616774 -0.005409 0.119128 -0.0143323 0.0391591 0.0294309 -0.023539 -0.103135 -0.0153168 0.102253 0.0405016 0.00296583 0.106582 -0.0506803 -0.110245 -0.0293798 -0.0838721 0.0536449 0.105326 0.0325533 -0.0261045 0.131609 -0.0452822 0.0614751 -0.0627282 -0.0458526 -0.134795 -0.00136647 0.197167 0.091249 -0.0634925 0.0206628 0.00558145 0.0182907 0.0645201 -0.159974 0.076219 -0.109618 0.0272346 0.0846448 -0.041818 0.0591069 0.185934 -0.0737555 -0.0112859 0.023134 0.112933 -0.0940016 -0.150821 -0.0611678 0.0983302 0.00821271 -0.012589 0.000244509 0.00552073 -0.188614 0.0995353 -0.0536085 0.0388185 
0.079551 -0.0693919 -0.0737134 -0.0438152 0.128851 0.0999245 0.038119 -0.103427 -0.106044 -0.0960697 -0.0427752 0.0980355 0.119715 0.0443578 -0.0657534 -0.0231973 -0.076276 0.057249 -0.0731538 0.175105 0.157932 -0.0641705 0.129503 0.104163 -0.0420566 0.0597084 -0.0807657 -0.204606 0.022285 0.104804 -0.0565305 0.0936459 -0.0752803 0.0420305 0.0376888 0.0228795 -0.0608687 0.227593 -0.0289743 -0.116506 -0.0115742 0.0397994 -0.050405 0.0783778 -0.173509 0.0190075 0.141646 0.0458317 -0.0908989 0.0544873 -0.0502821 -0.0875996 0.0241514 0.0494211 0.170149 -0.042457 0.0531808 0.21021 -0.0279843 -0.174941 0.00657646 0.0593881 0.224818 -0.0376047 0.0778478 -0.0177916 -0.0116472 0.0982146 -0.0177191 0.0500179 -0.000194498 0.0825728 -0.0091161 0.0140895 -0.0403675 0.00648355 -0.0683934 -0.0535521 0.098789 0.0426353 0.00560249 0.0955237 -0.0616886 -0.111636 -0.0446756 -0.0982472 0.0638879 0.109607 0.0326161 0.0142701 0.148661 -0.0839773 0.0197327 -0.0379845 -0.0655869 -0.0907733 0.00715729 0.160361 0.0909536 -0.0458433 0.0681594 0.0123139 -0.0207448 0.103688 -0.135052 0.0344053 -0.122117 0.0839956 0.0505566 -0.0473957 0.0768231 0.173924 -0.111031 0.015058 0.0457191 0.12053 -0.127293 -0.117555 -0.0521517 0.098826 -0.0237937 0.0303459 0.0155397 0.0054606 -0.13202 0.0731554 -0.0484422 -0.0374251 
0.0701923 -0.0133153 -0.0586889 -0.0199381 0.120502 0.107313 0.0512032 -0.170518 -0.152966 -0.0585018 -0.0469832 0.0658127 0.116269 0.0861319 -0.0150803 -0.0263776 -0.0664444 0.0520896 -0.00829153 0.154635 0.10185 -0.0505281 0.11763 0.0658959 -0.029156 0.0625234 -0.143391 -0.177428 0.0364709 0.138617 -0.076516 0.131915 -0.0774675 0.0142754 0.081426 0.0426197 -0.0216407 0.203245 0.024371 -0.130992 -0.0261277 0.0271943 -0.00829001 0.0104206 -0.182743 0.0834395 0.162032 0.059421 -0.109704 0.0385667 -0.0483236 -0.037798 0.0604091 0.0682423 0.180783 -0.0503079 0.0774713 0.185534 -0.0353708 -0.137411 -0.00467985 0.106688 0.207131 -0.0847608 0.0999824 0.0631457 -0.00564832 0.0762211 -0.0548455 0.040625 0.0104675 0.0912089 -0.0173443 0.0545118 -0.00650755 0.0198476 -0.059681 -0.0985332 0.127143 0.0253283 0.0499981 0.0882611 -0.0710044 -0.0974307 -0.023425 -0.096107 0.00988961 0.0718295 0.0277651 0.0519119 0.157178 -0.0501109 0.0633629 -0.0233604 -0.0836373 -0.115332 0.0281668 0.197642 0.119087 -0.0443848 0.0842476 0.0490112 0.00558422 0.0684893 -0.144355 0.0750433 -0.0707319 0.0856754 0.0785108 0.00281854 0.0794246 0.131836 -0.0842377 -0.0158627 0.0346148 0.10968 -0.0997126 -0.0838991 -0.0581873 0.0908293 -0.00163461 -0.0291763 0.0455348 -0.0122883 -0.142149 0.111336 -0.0122142 -0.0217667 
