{
  "descriptor": [
    -0.07440796494483948,
    0.06421750038862228,
    0.1101086363196373,
    -0.04319198429584503,
    -0.17179256677627563,
    0.03273935243487358,
    -0.08636385947465897,
    -0.03931160271167755,
    0.1572471410036087,
    -0.1258152723312378,
    0.20598168671131134,
    -0.04688194766640663,
    -0.22048868238925934,
    0.04570303484797478,
    -0.036045026034116745,
    0.12188554555177689,
    -0.12237603217363358,
    -0.14970903098583221,
    -0.021159231662750244,
    -0.061555132269859314,
    0.03317253291606903,
    0.11934993416070938,
    -0.00643225759267807,
    0.07118193060159683,
    -0.13057909905910492,
    -0.4002044200897217,
    -0.08630642294883728,
    -0.10867977142333984,
    0.04560953006148338,
    -0.13499237596988678,
    -0.07836923748254776,
    0.08942977339029312,
    -0.09157197922468185,
    0.017631081864237785,
    0.045708294957876205,
    0.052728209644556046,
    -0.04217296466231346,
    -0.10114399343729019,
    0.24586321413516998,
    0.10323511809110641,
    -0.2439645677804947,
    0.02097734622657299,
    0.06066782400012016,
    0.26825985312461853,
    0.11296243220567703,
    -0.02794746495783329,
    0.030561422929167747,
    -0.02537825144827366,
    0.11450614780187607,
    -0.2746395170688629,
    0.03891034796833992,
    0.23745931684970856,
    0.04318339750170708,
    0.07809130102396011,
    0.11339651793241501,
    -0.12084266543388367,
    -0.019475510343909264,
    0.11631924659013748,
    -0.14512132108211517,
    0.08138640224933624,
    0.05626193806529045,
    -0.055395856499671936,
    0.007416888605803251,
    -0.055865127593278885,
    0.16782338917255402,
    0.11383798718452454,
    -0.09875407814979553,
    -0.1137891486287117,
    0.08472242951393127,
    -0.14488585293293,
    -0.11602882295846939,
    0.08800218254327774,
    -0.1497386395931244,
    -0.16451145708560944,
    -0.22264139354228973,
    0.0777214914560318,
    0.4316594898700714,
    0.14197109639644623,
    -0.13387635350227356,
    0.056145232170820236,
    -0.008434033021330833,
    -0.08358598500490189,
    0.049046218395233154,
    0.11726289987564087,
    -0.10016343742609024,
    0.031175507232546806,
    -0.03362123668193817,
    0.06097247079014778,
    0.18905967473983765,
    0.03904464468359947,
    0.023525841534137726,
    0.23533467948436737,
    0.009370957501232624,
    0.09876146167516708,
    0.07402697205543518,
    0.09010372310876846,
    -0.09612103551626205,
    -0.09788630157709122,
    -0.12066919356584549,
    -0.008178177289664745,
    -0.009140853770077229,
    -0.08044005185365677,
    -0.018371207639575005,
    0.11767078191041946,
    -0.22729569673538208,
    0.1193467378616333,
    -0.03356524184346199,
    -0.09951175004243851,
    -0.03755616769194603,
    0.06662305444478989,
    -0.05840637907385826,
    -0.006336296442896128,
    0.12727150321006775,
    -0.24182625114917755,
    0.10842198878526688,
    0.16291256248950958,
    0.062242526561021805,
    0.13896773755550385,
    0.08166863769292831,
    -0.012445978820323944,
    -0.013621866703033447,
    -0.07220735400915146,
    -0.10811737179756165,
    -0.09787816554307938,
    0.054541636258363724,
    -0.011947873048484325,
    -0.041945815086364746,
    -0.01703048311173916
  ]
}