{
  "descriptor": [
    -0.07939877361059189,
    -0.017591621726751328,
    0.06797154247760773,
    -0.09317793697118759,
    -0.15577277541160583,
    0.06180797517299652,
    -0.04568925127387047,
    -0.03782835230231285,
    0.19660918414592743,
    -0.20793460309505463,
    0.18372869491577148,
    -0.035726215690374374,
    -0.26252710819244385,
    0.08566123247146606,
    -0.022467806935310364,
    0.16374434530735016,
    -0.15052177011966705,
    -0.18176856637001038,
    -0.02315027080476284,
    -0.015477530658245087,
    0.004119041375815868,
    0.08705072104930878,
    0.010518320836126804,
    0.0848684087395668,
    -0.11765129119157791,
    -0.41264602541923523,
    -0.1018049493432045,
    -0.07101081311702728,
    0.07413983345031738,
    -0.08517083525657654,
    -0.10781797766685486,
    0.1084180697798729,
    -0.1354781836271286,
    0.01462311390787363,
    0.08915038406848907,
    0.09119179844856262,
    -0.07369961589574814,
    -0.15744592249393463,
    0.25602906942367554,
    0.07571954280138016,
    -0.2834274470806122,
    -0.024031877517700195,
    0.05872740224003792,
    0.22030983865261078,
    0.16359113156795502,
    0.025831177830696106,
    0.015027498826384544,
    -0.08015674352645874,
    0.13836446404457092,
    -0.31589826941490173,
    0.03787212446331978,
    0.2009211927652359,
    0.027027888223528862,
    0.07161467522382736,
    0.05343625321984291,
    -0.1645510047674179,
    0.007568307686597109,
    0.09577964246273041,
    -0.15632016956806183,
    0.01843671314418316,
    0.0562959723174572,
    -0.06502344459295273,
    0.014767441898584366,
    -0.05924975126981735,
    0.19499027729034424,
    0.1226448193192482,
    -0.10952791571617126,
    -0.13682827353477478,
    0.2240218222141266,
    -0.17948855459690094,
    -0.07359368354082108,
    0.052477020770311356,
    -0.15395453572273254,
    -0.18719378113746643,
    -0.16434001922607422,
    0.013729266822338104,
    0.35790759325027466,
    0.16211214661598206,
    -0.06962095946073532,
    0.09485766291618347,
    0.01896156370639801,
    -0.030615830793976784,
    0.030327025800943375,
    0.1586548089981079,
    -0.08561033010482788,
    0.011144498363137245,
    0.001057568471878767,
    0.04731547459959984,
    0.24216683208942413,
    0.01786773093044758,
    0.023250937461853027,
    0.2271142601966858,
    -0.00874810479581356,
    0.07073575258255005,
    0.12004093825817108,
    0.09719350934028625,
    -0.09139534085988998,
    -0.07314056158065796,
    -0.1945561170578003,
    -0.002574371872469783,
    0.007991939783096313,
    -0.03699631243944168,
    0.011285724118351936,
    0.17698490619659424,
    -0.20654970407485962,
    0.15764325857162476,
    -0.09993921965360641,
    -0.09308622777462006,
    0.013240226544439793,
    0.005743676330894232,
    -0.057069532573223114,
    -0.013361052609980106,
    0.10373776406049728,
    -0.21190330386161804,
    0.13650713860988617,
    0.15679870545864105,
    0.06931198388338089,
    0.1478649228811264,
    0.09421312063932419,
    0.02141711302101612,
    0.029516676440835,
    -0.06505155563354492,
    -0.22948814928531647,
    -0.11458621919155121,
    0.09487466514110565,
    -0.030876832082867622,
    -0.005267984699457884,
    -0.020588090643286705
  ]
}