{
  "descriptor": [
    -0.08276056498289108,
    0.14108075201511383,
    0.0963408499956131,
    -0.024288276210427284,
    -0.15208642184734344,
    -0.007434510625898838,
    -0.07355449348688126,
    -0.11906503140926361,
    0.21208691596984863,
    -0.09744817018508911,
    0.20137085020542145,
    -0.000870630145072937,
    -0.18902696669101715,
    0.050614792853593826,
    -0.08206812292337418,
    0.13180506229400635,
    -0.1933973878622055,
    -0.14769402146339417,
    -0.01907121017575264,
    -0.05381988361477852,
    0.07069747149944305,
    0.04818585887551308,
    0.09652073681354523,
    0.1022997722029686,
    -0.17068840563297272,
    -0.3498997092247009,
    -0.05339980497956276,
    -0.056957293301820755,
    0.08195661008358002,
    -0.09026151150465012,
    -0.027795452624559402,
    0.02512977086007595,
    -0.2273884117603302,
    -0.0022904793731868267,
    0.04876812919974327,
    0.07832445949316025,
    -0.02639932930469513,
    -0.11659813672304153,
    0.20327527821063995,
    0.03304561972618103,
    -0.21379755437374115,
    0.009568361565470695,
    0.039750922471284866,
    0.27155572175979614,
    0.18561063706874847,
    0.01446952112019062,
    0.04789935424923897,
    -0.09134704619646072,
    0.05064547061920166,
    -0.24400712549686432,
    0.04417155310511589,
    0.22910931706428528,
    0.005611301865428686,
    0.02965155616402626,
    0.011064720340073109,
    -0.1849665641784668,
    0.036222998052835464,
    0.12881344556808472,
    -0.19199953973293304,
    0.06433316320180893,
    0.11846265941858292,
    -0.04736510291695595,
    -0.0002384028775850311,
    0.00017014145851135254,
    0.1911424696445465,
    0.12470284849405289,
    -0.08413539826869965,
    -0.1773918718099594,
    0.12235712260007858,
    -0.18535375595092773,
    -0.021101659163832664,
    0.06424439698457718,
    -0.1516982764005661,
    -0.22809089720249176,
    -0.20892393589019775,
    0.014569723047316074,
    0.4500952363014221,
    0.16152799129486084,
    -0.13815900683403015,
    0.0705227181315422,
    -0.061163175851106644,
    0.021091924980282784,
    0.059424418956041336,
    0.11151833832263947,
    -0.05257834866642952,
    -0.01325323898345232,
    -0.10958147794008255,
    0.07186984270811081,
    0.19808624684810638,
    0.006816559936851263,
    -0.02854551188647747,
    0.22717972099781036,
    0.02378435619175434,
    -0.08123522996902466,
    0.05200381949543953,
    0.054060377180576324,
    -0.14518655836582184,
    0.02694059908390045,
    -0.15632744133472443,
    -0.024299655109643936,
    -0.06391172111034393,
    -0.02573484741151333,
    -0.01328691653907299,
    0.11195869743824005,
    -0.2417154163122177,
    0.12948165833950043,
    -0.03514084592461586,
    -0.12572699785232544,
    -0.03168869391083717,
    0.0006528007215820253,
    -0.1034017875790596,
    -0.06736225634813309,
    0.13814684748649597,
    -0.2584061026573181,
    0.21161894500255585,
    0.21569357812404633,
    0.0930253267288208,
    0.21458326280117035,
    0.046329643577337265,
    0.08471188694238663,
    0.06562797725200653,
    0.012729225680232048,
    -0.06746038794517517,
    -0.07789158821105957,
    -0.015427612699568272,
    -0.08643261343240738,
    0.049705617129802704,
    -0.014308467507362366
  ]
}