0.133 -0.0147638 -0.18364 0.0452407 0.0918125 0.112048 0.0217995 -0.0216221 0.0927501 -0.168671 0.0479335 0.110812 0.0459457 -0.181534 -0.207643 0.0100967 -0.071664 0.0638553 -0.208232 0.131484 0.200922 -0.041381 0.0921017 0.0492648 -0.0350784 -0.0988756 0.00827723 -0.236189 -0.0798224 0.119668 -0.0397337 0.0592846 0.011503 0.085392 -0.0153153 -0.059551 -0.0409685 0.0925546 -0.0964349 -0.0681903 -0.000146462 -0.0356752 -0.0678709 0.139846 -0.112452 -0.0185805 0.071459 -0.012778 -0.0673018 0.103866 0.0253854 -0.0080931 0.000652584 0.0173211 0.0549975 -0.0546813 0.0369795 -0.0135993 -0.0281804 -0.120344 -0.0199377 -0.0678409 0.174807 -0.0394411 -0.00446341 -0.234011 -0.0248379 0.0887742 0.0125188 0.0598503 0.0139544 -0.0330914 -0.0402242 -0.124504 -0.0845398 0.043042 -0.0578776 0.0221514 -0.113264 0.147697 -0.0602963 0.0607744 -0.0473098 -0.0309071 -0.0590786 0.12124 0.0476314 -0.00243205 -0.0473661 0.0229407 0.0368522 -0.179426 -0.174815 -0.0154041 -0.0698897 -0.042137 -0.053649 -0.00262173 0.0146826 -0.0586261 0.0985169 -0.00779535 -0.00890268 0.122019 -0.025277 -0.0837277 -0.0841007 0.170482 -0.062836 -0.0192635 0.0145932 0.0758357 -0.0982576 0.00742597 0.0217551 0.0986474 -0.168592 -0.0770977 0.0398892 0.113941 -0.0280135 0.119695 -0.00107689 0.0729253 0.0829585 -0.03063 0.0418498 -0.0415398 
0.143181 -0.0155839 -0.192558 0.0662787 0.107827 0.103368 0.0392743 -0.0236101 0.078851 -0.151869 0.0497925 0.13154 0.0459838 -0.188171 -0.210784 0.0179525 -0.0383891 0.0676057 -0.201251 0.147203 0.192403 -0.0554055 0.0704186 0.0618168 -0.0214444 -0.0931515 0.00143456 -0.231879 -0.0697831 0.13176 -0.0454316 0.100909 0.00432935 0.0881608 -0.0315311 -0.0721011 -0.0440312 0.0786432 -0.0861525 -0.078549 0.0138102 -0.0407834 -0.0535504 0.131711 -0.107034 -0.0188495 0.0757719 -0.0198019 -0.0721356 0.0816486 0.0447397 -0.00873864 -0.00422779 -0.00011733 0.0546399 -0.0538152 0.0152856 -0.00735883 -0.0251421 -0.0984758 -0.0175937 -0.0762503 0.162562 -0.0500687 -0.00351365 -0.224216 -0.0307152 0.0757271 -0.00524762 0.0396787 0.00383145 -0.0261869 -0.0459555 -0.117786 -0.0911489 0.0478614 -0.0310161 0.0340666 -0.118141 0.146384 -0.0701983 0.0608492 -0.04572 -0.0361064 -0.0463605 0.114003 0.0504449 -0.00495148 -0.0516964 0.0159347 0.0234718 -0.166699 -0.188172 0.00153687 -0.0660914 -0.0350242 -0.0371396 -0.020935 0.0109454 -0.0645508 0.0872701 -0.0147901 -0.00880527 0.14507 -0.039839 -0.0780905 -0.0782808 0.183244 -0.0574481 -0.0235904 0.0107662 0.0777058 -0.101557 0.00623125 0.0250064 0.0703562 -0.182546 -0.0800204 0.0423969 0.118434 -0.0360117 0.125732 -0.00542438 0.0756789 0.0894142 -0.0267585 0.0320907 -0.0664546 
0.109874 0.000952109 -0.195485 0.0193189 0.116204 0.0962867 0.00943544 -0.035756 0.084462 -0.148114 0.0503885 0.120728 0.0403879 -0.176943 -0.207289 0.0252636 -0.0736417 0.0572076 -0.225574 0.156504 0.163797 -0.0336197 0.0775179 0.0544424 -0.0429412 -0.0694261 0.0306656 -0.208941 -0.0592171 0.0996974 -0.0445722 0.0564538 -0.00476997 0.0708272 -0.0321935 -0.0339432 -0.0584607 0.0866997 -0.112326 -0.0452222 0.01514 -0.0241678 -0.0653731 0.168853 -0.113494 0.0158476 0.0950143 0.0128852 -0.0878262 0.0983099 0.0126385 -0.0194919 -0.03906 -0.00832157 0.0595024 -0.0559891 -0.015571 0.024662 -0.0244042 -0.106963 -0.0317516 -0.0654531 0.199384 -0.00757478 -0.00419824 -0.235548 -0.0340919 0.10603 0.0188383 0.0621854 0.0326178 -0.0152311 -0.00966605 -0.109479 -0.0624499 0.0431865 -0.0738734 0.059864 -0.115517 0.111608 -0.0292871 0.0893834 -0.0635024 -0.0378936 -0.0846292 0.116398 0.0492947 0.0134656 -0.0444463 0.0291791 0.0378261 -0.163843 -0.187522 -0.0257834 -0.0474222 -0.0319943 -0.0494865 -0.0202833 0.0153176 -0.0851866 0.0637882 -0.034053 -0.00943843 0.108154 -0.0655881 -0.0565224 -0.114204 0.177904 -0.0566001 -0.0217825 0.0536516 0.109315 -0.0892471 0.032612 0.00606021 0.0679764 -0.200021 -0.0851413 0.0343016 0.103597 -0.0300056 0.12978 0.00788176 0.0863575 0.0547578 -0.0257742 0.00254991 -0.0696687 
0.0875471 -0.000863144 -0.180302 -0.0138166 0.106232 0.0872869 -0.0036799 -0.0260377 0.0441169 -0.101631 0.0624687 0.127658 0.0684177 -0.175808 -0.190203 0.0512394 -0.0771657 0.0648074 -0.228485 0.171337 0.153381 -0.0313638 0.0717309 0.0644005 -0.0714591 -0.0149689 0.0429281 -0.209379 -0.0384631 0.0848475 -0.0611031 0.0673733 -0.00550947 0.0792184 -0.0490034 -0.0253571 -0.0647679 0.103168 -0.100114 -0.0194599 0.0152148 -0.043876 -0.0596825 0.180875 -0.110573 0.00614358 0.119908 0.0230055 -0.119877 0.0864439 0.0263419 -0.0569842 -0.0788164 -0.000950951 0.0657343 -0.043215 -0.0273354 0.0451466 -0.0169791 -0.101364 -0.0324381 -0.0743012 0.207115 0.0104372 0.0127303 -0.229602 -0.0470445 0.108199 0.021772 0.0479916 0.0155425 -0.0138921 -0.00526613 -0.0919043 -0.042145 0.0260604 -0.0747719 0.0917029 -0.100003 0.0824993 -0.00991019 0.0857834 -0.0632532 -0.0417714 -0.120748 0.113545 0.0741468 0.0174425 -0.0267147 0.0286531 0.0266765 -0.159593 -0.185187 -0.0172888 -0.0505752 -0.00801716 -0.0564306 -0.00874096 0.0166295 -0.0874105 0.0475868 -0.0464859 -0.027315 0.122667 -0.053119 -0.0479891 -0.138961 0.17808 -0.0562084 -0.0513971 0.0397203 0.136343 -0.0851141 0.037004 0.00265071 0.0530043 -0.203539 -0.098401 0.0161186 0.0940629 -0.0198295 0.116143 0.0205792 0.0906499 0.0260258 -0.0156942 -0.0357881 -0.0730603 
0.108221 0.0035641 -0.180492 -0.00654291 0.0853279 0.117012 0.0214543 0.00909142 0.0601541 -0.130847 0.0679986 0.117049 0.0691716 -0.209405 -0.190544 0.012826 -0.0865312 0.0611421 -0.236403 0.147287 0.151374 -0.0174701 0.060105 0.0656647 -0.0818184 -0.0696084 0.0293742 -0.212602 -0.0566746 0.0816623 -0.0545271 0.0371946 -0.00565396 0.0907605 -0.0420138 -0.043715 -0.0552926 0.0547212 -0.117859 -0.0090326 0.0309768 -0.0578412 -0.0690586 0.182335 -0.121961 -0.0103823 0.0891227 0.017661 -0.10996 0.114763 0.018966 -0.0569513 -0.0646935 0.00546076 0.0239242 -0.0402491 -0.0247902 0.0157147 -0.0234644 -0.084843 -0.0376371 -0.0524035 0.187449 -0.00981627 -0.0149971 -0.253543 -0.0237652 0.0662911 0.0059225 0.032697 0.00927338 -0.0428494 -0.0103073 -0.0989488 -0.0540393 0.0361907 -0.0764027 0.0625018 -0.104793 0.115097 -0.0231571 0.0483168 -0.0562102 -0.0184242 -0.101001 0.150119 0.0715743 -0.0256635 -0.0508548 0.0381075 0.0374227 -0.179702 -0.188475 -0.0267361 -0.0639528 -0.0197087 -0.0661399 -0.0240344 -5.15618e-05 -0.0671474 0.0618379 -0.0252407 -0.0182316 0.120327 -0.0337562 -0.0639843 -0.114162 0.197344 -0.0931552 -0.0231742 0.0439529 0.0944105 -0.0780803 0.01581 -0.0236132 0.0696906 -0.177285 -0.0735346 0.0346158 0.105327 -0.0264441 0.0862731 -0.00415789 0.100835 0.0481745 -0.0386372 -0.027297 -0.0605325 
