{
  "descriptor": [
    -0.08215796202421188,
    0.07301801443099976,
    0.07549211382865906,
    -0.04148603603243828,
    -0.0883200466632843,
    0.03101317025721073,
    -0.0981844887137413,
    -0.062158167362213135,
    0.16432850062847137,
    -0.11131802201271057,
    0.16836029291152954,
    0.0015802159905433655,
    -0.20136229693889618,
    0.05210822820663452,
    -0.04064834490418434,
    0.1283067762851715,
    -0.156711146235466,
    -0.14178059995174408,
    -0.04651230573654175,
    -0.034639958292245865,
    0.02021910808980465,
    0.055582672357559204,
    0.027028074488043785,
    0.0498986542224884,
    -0.14088678359985352,
    -0.362901896238327,
    -0.10596907138824463,
    -0.10452406853437424,
    0.07202407717704773,
    -0.10440140217542648,
    -0.07175265997648239,
    0.04559832811355591,
    -0.12746427953243256,
    0.025423018261790276,
    0.04075496271252632,
    0.06154058873653412,
    -0.02199455164372921,
    -0.07056242972612381,
    0.2342602014541626,
    0.10597193241119385,
    -0.2631716728210449,
    -0.005126731935888529,
    0.06275293231010437,
    0.26642778515815735,
    0.17533697187900543,
    0.027438119053840637,
    0.01715262234210968,
    -0.06045403704047203,
    0.10949327796697617,
    -0.2641954720020294,
    0.08081360906362534,
    0.2081468105316162,
    0.089751698076725,
    0.10351642966270447,
    0.08555961400270462,
    -0.13063710927963257,
    0.030013302341103554,
    0.1076197400689125,
    -0.1469278335571289,
    0.08815986663103104,
    0.09531836956739426,
    -0.04458608850836754,
    0.017278194427490234,
    -0.02941093035042286,
    0.19607244431972504,
    0.12743276357650757,
    -0.09974351525306702,
    -0.1366458386182785,
    0.1531376838684082,
    -0.13987216353416443,
    -0.09404810518026352,
    0.06458866596221924,
    -0.1309019923210144,
    -0.20016951858997345,
    -0.22090250253677368,
    0.067831851541996,
    0.406154066324234,
    0.2036893218755722,
    -0.12625403702259064,
    0.07306241989135742,
    -0.0385369136929512,
    -0.07636023312807083,
    0.0521387904882431,
    0.12905310094356537,
    -0.11471131443977356,
    0.02935069054365158,
    -0.010718382894992828,
    0.03507263585925102,
    0.2136940211057663,
    0.02886144258081913,
    0.024933725595474243,
    0.217684805393219,
    -0.01940414495766163,
    0.07090713828802109,
    0.03625975176692009,
    0.06504165381193161,
    -0.11286773532629013,
    -0.016081761568784714,
    -0.15103374421596527,
    -0.04128352925181389,
    0.005567132029682398,
    -0.0478515625,
    0.038777317851781845,
    0.14417664706707,
    -0.2214212566614151,
    0.14521221816539764,
    -0.02757972478866577,
    -0.07739122956991196,
    0.02236916869878769,
    0.0931864008307457,
    -0.06765211373567581,
    -0.045540038496255875,
    0.1365199089050293,
    -0.2261338233947754,
    0.1692882925271988,
    0.19024305045604706,
    0.08065878599882126,
    0.10658242553472519,
    0.11699677258729935,
    0.06326019763946533,
    0.03556674346327782,
    -0.02880783937871456,
    -0.1598045378923416,
    -0.06276198476552963,
    0.06325581669807434,
    -0.044902872294187546,
    -0.020082343369722366,
    0.013521000742912292
  ]
}