0.0671207 -0.0453085 -0.0637123 -0.0349624 0.0811213 0.116841 -0.00834272 0.00769913 0.041431 -0.162642 -0.000615966 0.0772779 0.057823 -0.149597 -0.121819 0.0605674 -0.173734 0.029156 -0.175047 0.117506 0.251834 -0.0171398 0.104307 0.125328 -0.0522002 -0.045408 0.00386906 -0.259644 -0.0329979 0.111544 -0.0327147 0.00558554 0.0170415 0.117556 0.0168566 -0.0115046 -0.0261066 0.103395 -0.080016 -0.0563183 -0.00453829 -0.0736817 -0.00266883 0.107801 -0.052235 -0.00810215 0.142749 -0.00190352 -0.145384 0.113997 -0.0297433 -0.113141 0.0289067 0.0595216 0.147278 0.00670207 0.0639165 0.0689963 -0.0757237 -0.148525 -0.00196162 -0.00207074 0.180886 -0.0121013 0.0363463 -0.142879 -0.0686618 0.0631994 -0.00206857 0.0598084 -0.0541698 -0.0258748 -0.108387 -0.0930469 0.00384792 0.0266249 -0.0369745 0.0375592 -0.0129668 0.112297 0.00127627 0.0608259 -0.0561657 -0.0389909 -0.109399 0.106141 0.0409433 0.0355782 -0.0332757 0.0978217 0.13188 -0.166773 -0.149438 0.0052968 -0.0895075 0.0636025 -0.105758 0.0970349 0.069306 -0.0233205 0.119922 -0.0628971 -0.0693427 0.0709753 -0.0227305 -0.0351587 -0.135368 0.107146 -0.0759891 -0.0773283 -0.00616804 0.121046 -0.092551 -0.0518819 0.0647022 0.172152 -0.0985489 -0.082132 0.0051924 0.155777 0.0511229 0.0821925 0.0360468 0.0410393 -0.0580403 0.0502003 0.0284248 -0.0380119 
0.0339111 -0.046693 -0.0260293 -0.0258018 0.0625731 0.100671 -0.0532666 0.0043695 0.071153 -0.163604 -0.000280299 0.0803154 0.0412396 -0.154854 -0.123752 0.0824834 -0.205174 0.00768721 -0.176175 0.112005 0.265534 -0.0304792 0.125756 0.0994471 -0.0347376 -0.0227154 0.00406563 -0.25938 -0.0398039 0.0909861 0.00108364 0.00223751 0.0376977 0.114164 0.00931476 0.00202105 -0.0453238 0.128351 -0.0637117 -0.0400705 -0.0195748 -0.0813131 -0.0315755 0.0876555 -0.0226696 -0.0294721 0.125629 -0.0231329 -0.115391 0.115086 -0.0307143 -0.079665 0.0239802 0.0581701 0.14049 0.000991275 0.0879021 0.0380807 -0.0882061 -0.144283 -0.00416965 -0.0333011 0.163552 0.0117509 0.0456211 -0.159224 -0.0671958 0.0802366 0.01184 0.0964212 -0.047891 -0.0142707 -0.11641 -0.0929195 0.0101301 0.0114445 -0.0465981 0.0309511 -0.0283662 0.150608 -0.0173043 0.0461918 -0.0281965 -0.0135474 -0.116481 0.0817109 0.0515827 0.0649791 -0.0189348 0.0713137 0.0985598 -0.149899 -0.132752 0.0325631 -0.0946523 0.0537455 -0.114098 0.0974616 0.0588253 -0.0213029 0.115481 -0.0745236 -0.102494 0.0633508 0.0278775 -0.03243 -0.118659 0.0908228 -0.0388388 -0.0929466 -0.0537016 0.125489 -0.111363 -0.0380099 0.0928621 0.181062 -0.0870863 -0.0701816 0.0135628 0.171817 0.0563016 0.108284 0.0320666 0.0229906 -0.0415896 0.0601099 0.0708867 0.00270847 
0.0601671 -0.0568747 -0.0597273 -0.0277283 0.099357 0.115369 -0.00364609 0.000532225 0.0423333 -0.160654 -0.00411845 0.0780793 0.0633088 -0.136017 -0.120346 0.0595107 -0.168954 0.0480847 -0.172824 0.124569 0.266894 -0.037271 0.113326 0.142131 -0.0390516 -0.0657509 -0.0144959 -0.25989 -0.023325 0.116645 -0.0205365 0.00362673 0.0112525 0.109451 0.0205017 -0.00521184 -0.0368762 0.0944147 -0.080527 -0.0708634 3.07576e-05 -0.0602762 -0.000673326 0.101379 -0.060052 -0.0277881 0.139191 0.00725977 -0.124792 0.10906 -0.0403448 -0.125389 0.033989 0.0498846 0.14792 0.0111758 0.0666559 0.0799801 -0.0763328 -0.151321 -0.00133657 0.0122208 0.179024 -0.0134988 0.0358371 -0.127975 -0.0732224 0.058606 -0.0100522 0.0580239 -0.0515393 -0.00665304 -0.108262 -0.0963909 -0.00367145 0.0288405 -0.0309923 0.0382023 -0.00362408 0.105276 -0.00362827 0.0654065 -0.0566324 -0.0361458 -0.10389 0.108807 0.0391385 0.0512988 -0.032353 0.0855851 0.140876 -0.157058 -0.136962 0.000897375 -0.0866356 0.0498432 -0.122344 0.111484 0.0606398 -0.0195842 0.129436 -0.0727531 -0.065522 0.064261 -0.0164426 -0.0207799 -0.127767 0.0982442 -0.0586928 -0.06919 -0.0187792 0.118746 -0.0890767 -0.0459283 0.0643468 0.181022 -0.0925424 -0.0681186 -0.00332599 0.165333 0.0399413 0.0784969 0.0169438 0.0355891 -0.0898211 0.0655544 0.0115176 -0.0311215 
0.0573745 -0.0598616 -0.0431191 -0.0259848 0.104808 0.121945 -0.00635664 -0.0125031 0.0390773 -0.159002 -0.00510724 0.076059 0.066753 -0.11875 -0.101398 0.055026 -0.162301 0.0551932 -0.158105 0.122925 0.270798 -0.0318849 0.111666 0.153818 -0.0284415 -0.063695 -0.025732 -0.261851 -0.0187876 0.12651 -0.00871641 0.00409935 0.0125435 0.106008 0.0389359 0.00877266 -0.031556 0.092585 -0.0705613 -0.0851558 0.00281121 -0.0558982 0.00394542 0.0953374 -0.0653251 -0.0257418 0.14205 0.0123564 -0.123617 0.0961191 -0.0426871 -0.125829 0.0486778 0.0479644 0.161007 0.0182041 0.0628868 0.087784 -0.0800296 -0.15692 -0.0060806 0.0153262 0.176534 -0.0238162 0.0448982 -0.113173 -0.0707695 0.0592388 -0.0179759 0.0618226 -0.0464389 -0.000565298 -0.11608 -0.108968 -0.00354893 0.0311263 -0.0355376 0.0369555 0.0113336 0.107447 -0.000737787 0.0751184 -0.0526303 -0.0373152 -0.0953515 0.0930093 0.0397513 0.0575986 -0.0338028 0.0939979 0.145847 -0.151552 -0.124218 0.0074338 -0.096012 0.0422982 -0.124031 0.120759 0.0643561 -0.0231201 0.137882 -0.0647867 -0.0663959 0.0526623 -0.0219527 -0.010083 -0.121477 0.0819239 -0.0483358 -0.0625854 -0.0206612 0.111951 -0.0975432 -0.0496776 0.0712313 0.183149 -0.0975075 -0.0753802 -0.0158754 0.168992 0.0487492 0.067862 0.0137753 0.0318477 -0.0977479 0.0792175 0.0215458 -0.0254056 
0.0602875 -0.0715462 -0.0453711 -0.0325451 0.084405 0.104008 -0.0154898 0.01005 0.0531979 -0.164969 0.0116376 0.0861628 0.0661661 -0.133497 -0.127842 0.0526025 -0.172329 0.0507286 -0.172461 0.123235 0.271907 -0.02544 0.108309 0.148073 -0.0468949 -0.0492488 0.0108682 -0.250782 -0.0292814 0.116006 -0.0333253 -0.0131039 0.0320869 0.112389 0.0179317 -0.0169882 -0.0340041 0.103484 -0.0803784 -0.0726024 -0.00612123 -0.065114 -0.00869204 0.104935 -0.0596396 -0.0487207 0.126548 -0.00202089 -0.118751 0.109815 -0.0387061 -0.12699 0.0388707 0.0616896 0.147935 0.013237 0.0643897 0.0674655 -0.0880625 -0.155736 0.00280605 -0.00960776 0.178353 0.00813983 0.0256905 -0.127902 -0.0716477 0.0573352 -0.00298209 0.0522678 -0.0560571 -0.0320544 -0.108159 -0.109208 0.00139694 0.0239837 -0.0314548 0.0292175 -0.00160201 0.114016 -0.00496271 0.0626638 -0.0451405 -0.0363656 -0.0941019 0.102492 0.0464051 0.0576766 -0.0232349 0.0904271 0.133713 -0.16204 -0.136904 0.0159534 -0.0960156 0.0463708 -0.134262 0.104968 0.0671077 -0.0268252 0.138501 -0.0694695 -0.0644935 0.0574681 0.00116891 -0.0268293 -0.117448 0.08634 -0.064314 -0.08446 -0.0203081 0.117111 -0.0887286 -0.0418283 0.065909 0.180094 -0.0926827 -0.0685325 -0.0045126 0.155248 0.0394573 0.0740125 0.0137059 0.0269476 -0.0737991 0.0694454 0.0287559 -0.0225581 
0.0522203 -0.0694389 -0.0386008 -0.026826 0.0947782 0.126142 -0.0144162 -0.00677741 0.045998 -0.171625 -0.0102221 0.0749694 0.0623976 -0.124156 -0.104976 0.0450896 -0.172705 0.0463526 -0.152233 0.119637 0.269806 -0.0341672 0.114662 0.153287 -0.0313663 -0.06989 -0.0207938 -0.263781 -0.0320538 0.119199 -0.00536359 -0.0165336 0.017752 0.102818 0.0417652 0.00825595 -0.0300374 0.0858398 -0.075952 -0.0828638 0.00130456 -0.0576183 -0.00240391 0.0894251 -0.0616522 -0.0346045 0.136189 0.0086161 -0.116377 0.107486 -0.0520948 -0.135213 0.0640939 0.0542844 0.157676 0.0191304 0.0683115 0.0814494 -0.0859824 -0.162161 -0.00156368 0.0262639 0.174741 -0.0235714 0.0421333 -0.111275 -0.0637712 0.0533722 -0.0179166 0.0541833 -0.0505372 -0.00911783 -0.116177 -0.112476 0.000850706 0.0336741 -0.0360856 0.0239198 0.0176531 0.119263 -0.00452921 0.0657329 -0.0510368 -0.0342385 -0.0922181 0.0978635 0.0364408 0.0597371 -0.035728 0.0912334 0.147238 -0.151742 -0.11235 0.0122646 -0.10001 0.0405742 -0.127317 0.12101 0.060862 -0.0173747 0.143516 -0.0682447 -0.0724665 0.0410068 -0.0116889 -0.00936419 -0.113592 0.0734549 -0.0660143 -0.056173 -0.0198836 0.104064 -0.0870176 -0.0547214 0.0621257 0.19297 -0.0978054 -0.0613528 -0.018049 0.165664 0.0429072 0.0588879 0.0100562 0.0219169 -0.094473 0.0837992 0.0206999 -0.0207623 
0.0524124 -0.0786828 -0.0322951 -0.0288757 0.109025 0.127611 -0.00700684 -0.00188257 0.057927 -0.175199 -0.0258495 0.0774686 0.0581905 -0.128234 -0.0973344 0.0426018 -0.172426 0.0536655 -0.158947 0.113277 0.270747 -0.0221053 0.108568 0.149463 -0.030169 -0.0808173 -0.0342387 -0.265954 -0.036332 0.119558 0.00634436 -0.00818054 0.0128276 0.101149 0.0551391 0.00822143 -0.0249717 0.0733472 -0.0776303 -0.0900696 0.0142537 -0.0499642 0.00244903 0.0896621 -0.0627112 -0.0340882 0.125996 0.014464 -0.102708 0.105613 -0.0532619 -0.141126 0.0688396 0.0470016 0.159019 0.0171521 0.0633527 0.0787796 -0.0932582 -0.157758 -0.000722098 0.027955 0.160515 -0.0220106 0.0423127 -0.121387 -0.0666229 0.0534921 -0.0186065 0.0531828 -0.0428601 -0.00368727 -0.114403 -0.120687 -0.0136338 0.0423644 -0.0416269 0.0217477 0.0210798 0.11584 0.00359705 0.0751275 -0.0509613 -0.0241267 -0.0827451 0.0905755 0.0407659 0.0692543 -0.0429181 0.0948361 0.147877 -0.145162 -0.118189 0.00944954 -0.103355 0.0463468 -0.128021 0.113753 0.0525871 -0.0125829 0.149491 -0.0726143 -0.0719057 0.0322226 -0.0130214 -0.0187916 -0.117864 0.0638873 -0.0639821 -0.0377183 -0.0195486 0.0915501 -0.0959167 -0.0574407 0.0609843 0.191411 -0.0971237 -0.0608352 -0.0263175 0.167202 0.0503899 0.0676744 0.0094905 0.0222233 -0.0931467 0.0747955 0.0192619 -0.0252036 
0.0496995 -0.0861865 -0.0325291 -0.0301577 0.0931662 0.111035 -0.00739071 0.004716 0.0623685 -0.179782 -0.0273574 0.0719614 0.0545934 -0.147602 -0.107904 0.0382434 -0.197696 0.0415965 -0.166691 0.121272 0.259217 -0.0188084 0.111508 0.141468 -0.0491592 -0.0673287 -0.0223026 -0.26669 -0.0375 0.105334 -0.00970918 -0.0134819 0.0113761 0.105865 0.0507155 -0.00305781 -0.0210088 0.087368 -0.0887285 -0.0864038 0.0132398 -0.0630924 -0.0103464 0.10028 -0.0644327 -0.0362399 0.122815 0.0223275 -0.0955819 0.121452 -0.0639434 -0.144708 0.0647322 0.0570795 0.159155 0.00393926 0.0671847 0.0629397 -0.0945059 -0.160179 0.00762223 0.0226883 0.163697 0.00647788 0.0321455 -0.127078 -0.0580945 0.0406971 -0.000694601 0.0408076 -0.062476 -0.0174709 -0.0993474 -0.0944987 -0.00932079 0.0212159 -0.0424317 0.0192146 0.0230213 0.121214 0.0205528 0.0643866 -0.0628706 -0.0345776 -0.0766187 0.0889232 0.0376122 0.0750601 -0.0348516 0.0953119 0.16209 -0.138283 -0.118376 -0.000426471 -0.111319 0.0487065 -0.128644 0.106088 0.0657331 -0.0166658 0.149484 -0.0759308 -0.0677808 0.0262016 0.000983931 -0.0316249 -0.111351 0.0762978 -0.0622771 -0.0316208 -0.00845108 0.108333 -0.0919932 -0.0567343 0.0498133 0.190299 -0.0815987 -0.0583668 -0.0223817 0.149505 0.0448749 0.0767917 0.0166358 0.0257008 -0.0944249 0.0622107 0.0148658 -0.0286968 
0.0509844 -0.087516 -0.0248058 -0.0271283 0.0835508 0.127355 -0.00236209 0.00437927 0.0452365 -0.176445 -0.0322808 0.072998 0.0566865 -0.143402 -0.0967323 0.0197855 -0.198232 0.0393484 -0.149705 0.117632 0.254026 -0.0220051 0.101887 0.14988 -0.0506834 -0.0674444 -0.0344795 -0.276318 -0.0500181 0.10778 -0.0129377 -0.0256087 0.00159163 0.100922 0.0570933 0.00598689 -0.0270915 0.0781857 -0.097109 -0.0857415 0.0146208 -0.0622035 -0.012152 0.0982885 -0.0689036 -0.0270278 0.130787 0.0162925 -0.108137 0.120909 -0.0543115 -0.152138 0.0734594 0.0580808 0.171365 0.0114055 0.0634649 0.0717903 -0.0827127 -0.163306 0.0127875 0.0393744 0.160214 -0.00780026 0.0463653 -0.126086 -0.0488295 0.0331265 -0.00922223 0.0431113 -0.0556415 -0.0135832 -0.0964686 -0.0969115 -0.00854882 0.0315792 -0.0501412 0.015054 0.0390879 0.123396 0.0134742 0.0572908 -0.0628894 -0.0380572 -0.0811528 0.0858255 0.0435209 0.0654595 -0.0402531 0.100609 0.156177 -0.138004 -0.102544 -0.00424281 -0.122792 0.0461892 -0.115197 0.106001 0.0698698 -0.00994377 0.151295 -0.0567901 -0.0667454 0.0165381 -0.0114108 -0.027015 -0.114283 0.0708922 -0.0803148 -0.0241931 -0.000335364 0.0993716 -0.0866793 -0.0794651 0.0456217 0.197259 -0.0853407 -0.0624277 -0.0312193 0.147429 0.0439124 0.0552387 0.0158313 0.0189448 -0.089065 0.0744175 0.0171833 -0.0261846 
0.0534416 -0.0648215 -0.0432755 -0.0232384 0.0928672 0.127024 -0.0117652 -0.0087216 0.0406922 -0.166758 -0.0262725 0.0723177 0.060158 -0.130987 -0.102013 0.042071 -0.173124 0.0489236 -0.14664 0.119766 0.259268 -0.0231227 0.108624 0.152336 -0.037126 -0.0759882 -0.0251651 -0.266896 -0.0390033 0.129151 -0.0157972 -0.0149072 0.015215 0.10094 0.0564699 0.00959263 -0.0179876 0.0726508 -0.0896748 -0.09069 -0.00224939 -0.0592584 0.0126658 0.0939741 -0.0630861 -0.0167448 0.146557 0.016437 -0.11734 0.118266 -0.0393477 -0.144215 0.0714485 0.0527556 0.171224 0.0177699 0.0664202 0.0680258 -0.0739665 -0.166749 0.00363282 0.0334738 0.162548 -0.024962 0.0455192 -0.123053 -0.0655015 0.040941 -0.0222836 0.0475918 -0.0532025 -0.0133308 -0.111248 -0.115245 -0.00597907 0.0415055 -0.0377399 0.0271255 0.0273592 0.114318 0.0150688 0.0647235 -0.0637324 -0.0317026 -0.0841384 0.095972 0.0254308 0.054313 -0.0369867 0.109217 0.14153 -0.145088 -0.117149 0.00351919 -0.108093 0.0538357 -0.119745 0.121982 0.0653956 -0.0178825 0.152379 -0.0576412 -0.064219 0.0280208 -0.0254229 -0.0207147 -0.119335 0.0685671 -0.0758977 -0.0315135 -0.00877228 0.0962403 -0.0826861 -0.0681914 0.0466077 0.191843 -0.0898491 -0.0627084 -0.0312485 0.157528 0.0465261 0.0572839 0.0211445 0.0181375 -0.0912112 0.0783913 0.0232872 -0.0327901 
0.0479375 -0.0768354 -0.0315248 -0.03305 0.0935188 0.122887 -0.0148157 -0.00494369 0.0432971 -0.166581 -0.0202701 0.0778665 0.0632774 -0.127983 -0.100096 0.0342649 -0.18716 0.0457014 -0.151515 0.123704 0.259469 -0.0269368 0.114019 0.149935 -0.0408482 -0.0620888 -0.0240895 -0.265156 -0.0375708 0.115025 -0.0105927 -0.0193967 0.0145592 0.100562 0.046038 0.0106512 -0.0334271 0.0870184 -0.0870676 -0.0844979 0.00485561 -0.0624731 -0.00795598 0.0978192 -0.0707658 -0.0270481 0.13442 0.0172866 -0.113369 0.115415 -0.0514062 -0.137409 0.0621068 0.0541402 0.166653 0.0132047 0.0648815 0.0768837 -0.0872974 -0.160081 0.00420202 0.0274828 0.170972 -0.00672033 0.0455807 -0.123074 -0.0627274 0.053163 -0.013927 0.0553584 -0.0492875 -0.00867378 -0.107897 -0.105827 -0.00144709 0.034647 -0.045483 0.0210528 0.028779 0.11905 0.00427724 0.0629211 -0.0549035 -0.030144 -0.0902748 0.0856812 0.0422651 0.0688852 -0.0313588 0.098076 0.147465 -0.14345 -0.106985 0.0082226 -0.112029 0.0399548 -0.125859 0.115997 0.0673455 -0.0210396 0.148881 -0.0604798 -0.0702748 0.0265083 -0.0120296 -0.0171248 -0.119708 0.0726786 -0.0625782 -0.0434412 -0.00900171 0.105676 -0.0894282 -0.0611932 0.0547656 0.19385 -0.0902451 -0.0655089 -0.0232602 0.164977 0.0465188 0.0580509 0.0104911 0.0200253 -0.0966566 0.0810971 0.02257 -0.0192832 
0.0514945 -0.042861 -0.0468474 -0.0429079 0.0687581 0.134782 -0.0162536 0.00163359 0.0304107 -0.164324 -0.0235143 0.0571884 0.0704787 -0.137161 -0.107254 0.0529323 -0.186705 0.0211755 -0.156827 0.116209 0.256041 -0.029908 0.105223 0.128397 -0.0547968 -0.0578221 -0.0278123 -0.263007 -0.0376531 0.117058 -0.0196673 -0.0156362 0.00781503 0.104 0.0400531 0.00650595 -0.0159479 0.0954734 -0.0811317 -0.06639 -0.0155061 -0.0726692 0.0131552 0.0899712 -0.0433196 -0.0141784 0.153339 0.0110779 -0.141106 0.126429 -0.0397429 -0.14188 0.0533162 0.070413 0.162838 0.0122841 0.0683166 0.0683921 -0.0671203 -0.174987 0.00347583 0.0337898 0.170368 -0.0306712 0.0447903 -0.122078 -0.0571515 0.0490305 -0.0158701 0.0373592 -0.0544646 -0.0198086 -0.109139 -0.0978234 0.0119068 0.0346416 -0.0395941 0.02291 0.0256536 0.120916 0.020293 0.0451759 -0.0614175 -0.0301293 -0.10541 0.110594 0.0262009 0.0427763 -0.0245107 0.103054 0.132295 -0.162343 -0.115445 0.00177127 -0.106102 0.0607985 -0.106578 0.127677 0.060262 -0.00610589 0.136208 -0.0564337 -0.0747328 0.0497314 -0.0264406 -0.0170627 -0.132802 0.0921037 -0.0872403 -0.0522076 -0.012504 0.102962 -0.0872846 -0.0661567 0.0478958 0.19279 -0.0933145 -0.0557203 -0.0231599 0.150364 0.0416477 0.0534171 0.0433753 0.0238664 -0.0801886 0.0664927 0.0168623 -0.0303158 
0.0398986 -0.0541256 -0.0321926 -0.0533409 0.0513514 0.115914 -0.0123778 0.018086 0.0438745 -0.182081 -0.0324573 0.0523403 0.0633325 -0.156559 -0.113271 0.0235692 -0.221083 -0.0116681 -0.161429 0.117547 0.248224 -0.0269193 0.0871187 0.108758 -0.0655364 -0.0428274 -0.025518 -0.259645 -0.0422759 0.0984675 -0.0217319 -0.0382334 0.00578784 0.101983 0.0396292 -0.00420694 -0.0259888 0.105301 -0.0976836 -0.0654093 -0.00209246 -0.0874178 -0.00621625 0.110207 -0.0349502 -0.00397331 0.137579 0.0119087 -0.13355 0.122737 -0.0669164 -0.134263 0.0578007 0.0695146 0.162646 0.000392251 0.0466555 0.059179 -0.0822154 -0.176707 0.0183507 0.0271817 0.168844 0.0154394 0.0378007 -0.133074 -0.0402683 0.0386441 0.00897304 0.018603 -0.0587363 -0.0381866 -0.0950499 -0.0864875 0.0179889 0.027117 -0.0527055 0.0100725 0.0324928 0.145372 0.0200109 0.0302612 -0.0620446 -0.0270365 -0.0976466 0.0967046 0.0416757 0.0558119 -0.0208656 0.0991132 0.141694 -0.154948 -0.108018 -0.00175252 -0.12819 0.0514784 -0.0986403 0.101524 0.0733106 -0.0105846 0.13139 -0.0502547 -0.0752758 0.0306226 -0.0269031 -0.0263677 -0.127219 0.114745 -0.0874018 -0.0495099 0.0102251 0.0987664 -0.114456 -0.073361 0.0415219 0.199031 -0.0919204 -0.0563502 -0.0149282 0.139703 0.0309727 0.0642716 0.0339109 0.0285453 -0.0677058 0.0550142 0.0220022 -0.0284429 
0.0415887 -0.0571538 -0.0352993 -0.0527592 0.0451876 0.127748 -0.0189046 0.0239317 0.0295214 -0.164229 -0.0230952 0.0498065 0.0615189 -0.165955 -0.108109 0.0147884 -0.217265 -5.80117e-05 -0.141131 0.122692 0.241011 -0.0286252 0.0850549 0.132601 -0.0639452 -0.0386679 -0.0115861 -0.264661 -0.0354259 0.0869745 -0.0284325 -0.0584951 0.00404933 0.0993701 0.0401436 0.000517168 -0.028716 0.0874278 -0.103884 -0.069222 0.00269456 -0.0963873 -0.0107038 0.122797 -0.0479125 -0.0118422 0.147826 0.0217027 -0.141196 0.125021 -0.0616915 -0.136471 0.0563172 0.0660593 0.164786 0.00477645 0.049355 0.0556157 -0.0700034 -0.186737 0.0181945 0.0329206 0.177032 0.0180565 0.0332958 -0.129625 -0.036704 0.0248961 0.0147067 0.0236085 -0.0700438 -0.0372505 -0.0954416 -0.0834486 0.0258973 0.0163277 -0.0571655 0.0342717 0.044853 0.138144 0.0179631 0.0372634 -0.0603963 -0.0358812 -0.0881648 0.103542 0.0413598 0.0593007 -0.0144147 0.103128 0.150034 -0.141604 -0.10656 -0.00542792 -0.130233 0.0392319 -0.0990015 0.108166 0.0735746 -0.0244268 0.137187 -0.0455831 -0.0650006 0.0153259 -0.0264677 -0.0195973 -0.119116 0.105855 -0.0926129 -0.0425621 0.0185364 0.107955 -0.0921271 -0.0859822 0.0382063 0.192013 -0.0911393 -0.0699033 -0.016719 0.131381 0.0337581 0.0457674 0.0334774 0.0254601 -0.0845261 0.063775 0.021927 -0.0215311 
0.0419561 -0.0720939 -0.0127798 -0.0483316 0.050568 0.11339 -0.0164606 0.030993 0.0399097 -0.180165 -0.0271666 0.0600692 0.063491 -0.156996 -0.107181 0.0166308 -0.208303 0.00641446 -0.156795 0.120552 0.25902 -0.0274332 0.0860766 0.126062 -0.0588592 -0.0380061 -0.021806 -0.263292 -0.0436709 0.0910806 -0.0194837 -0.0403634 0.0140423 0.110466 0.041851 -0.010014 -0.0283331 0.108247 -0.0952976 -0.0794065 0.00321283 -0.0837227 -0.00907536 0.111647 -0.0414607 -0.0282119 0.133705 0.00369016 -0.131437 0.119223 -0.0607484 -0.143733 0.0617684 0.0704041 0.164627 0.00241041 0.0481498 0.0544401 -0.0833627 -0.188277 0.0210261 0.0183656 0.15915 0.0197921 0.0371514 -0.128033 -0.0423886 0.0318337 0.00469239 0.0211986 -0.0631277 -0.0441344 -0.0976038 -0.0947494 0.0108837 0.0163037 -0.052395 0.012703 0.0422558 0.146967 0.00462473 0.0365615 -0.0518383 -0.0354284 -0.0841572 0.0829908 0.0508893 0.0679752 -0.0123764 0.0989055 0.142593 -0.149464 -0.107913 0.00599235 -0.131332 0.0508813 -0.103115 0.104741 0.0609427 -0.0148415 0.133902 -0.0479761 -0.0751073 0.0318396 -0.0146279 -0.0283306 -0.11813 0.0980696 -0.0793551 -0.0600778 0.000713723 0.103461 -0.117082 -0.0726442 0.0528485 0.191024 -0.0891846 -0.0726236 -0.0156849 0.137248 0.0332387 0.0644845 0.0275662 0.0221902 -0.0626652 0.0539551 0.0368666 -0.0268849 
0.0440866 -0.0704481 -0.025676 -0.0434187 0.0624637 0.113056 -0.00554292 0.0181647 0.0312417 -0.172646 -0.0282605 0.0645805 0.0622121 -0.154082 -0.105754 0.0219394 -0.211757 0.00990058 -0.152342 0.128709 0.24679 -0.0288334 0.0909344 0.125919 -0.0636599 -0.0428573 -0.025729 -0.264355 -0.0425783 0.099263 -0.0327877 -0.034966 0.00938711 0.106438 0.0437932 -0.00265124 -0.0255357 0.0990916 -0.102796 -0.080864 0.00479364 -0.0836558 -0.00129006 0.109373 -0.0531813 -0.00766273 0.142517 0.011304 -0.13491 0.125105 -0.0620569 -0.149602 0.0544162 0.0684112 0.173467 0.00346427 0.0449587 0.0614858 -0.0841269 -0.166269 0.0204746 0.0280767 0.166951 0.0117324 0.0486522 -0.127777 -0.0529022 0.0302136 -0.00154434 0.0233991 -0.0623391 -0.0337785 -0.094628 -0.0846445 0.0119916 0.027045 -0.0450149 0.0199549 0.0418189 0.127303 0.014206 0.0354987 -0.0666836 -0.0344451 -0.0934432 0.0906331 0.0422182 0.0615267 -0.0211551 0.108147 0.151225 -0.148098 -0.110123 -0.00241815 -0.127155 0.05304 -0.103649 0.103656 0.0762896 -0.0134928 0.133901 -0.0511255 -0.0694433 0.0213554 -0.0211035 -0.0232575 -0.120241 0.104039 -0.0833902 -0.0468748 0.0060798 0.103548 -0.0990341 -0.0789669 0.0458033 0.191206 -0.0807799 -0.0654715 -0.0194147 0.143124 0.0330961 0.0595598 0.0284152 0.0287774 -0.0740587 0.0642806 0.0264508 -0.0349011 
0.0371759 -0.0459439 -0.0357843 -0.059965 0.0500824 0.11131 -0.0176486 0.0292424 0.0535394 -0.178075 -0.0207306 0.0588403 0.065238 -0.155754 -0.123028 0.0291397 -0.214783 -0.0135954 -0.176428 0.115751 0.252034 -0.0333243 0.0909682 0.106379 -0.0622838 -0.0369519 -0.00979109 -0.249623 -0.0357183 0.0891866 -0.0182063 -0.0349784 0.0157426 0.107857 0.0176814 -0.0119569 -0.0315151 0.122824 -0.0983944 -0.0535657 0.00129833 -0.0876904 -0.0129027 0.112462 -0.034732 -0.0186288 0.130677 0.00267088 -0.135877 0.118064 -0.063844 -0.120501 0.0416041 0.0677857 0.152533 0.00250628 0.0437539 0.0604178 -0.0844956 -0.181345 0.00780151 0.00696554 0.174753 0.0206416 0.0315981 -0.133397 -0.0436038 0.0536215 0.011133 0.0297412 -0.0549477 -0.0411254 -0.0969555 -0.0868094 0.0267677 0.0253032 -0.0539795 0.0159698 0.016694 0.142878 0.000343428 0.0337607 -0.0464319 -0.0247549 -0.104342 0.0981799 0.0536623 0.0611296 -0.0117343 0.0887661 0.128869 -0.168352 -0.11538 0.00240868 -0.116656 0.0451778 -0.101317 0.0956928 0.0658554 -0.0173184 0.1212 -0.0574135 -0.0771172 0.0503668 -0.0255624 -0.0271623 -0.135021 0.119263 -0.0798049 -0.0778629 0.00364668 0.111908 -0.121629 -0.0568658 0.0525565 0.189105 -0.101543 -0.0631897 0.00319612 0.146534 0.0327667 0.0751007 0.0286257 0.0327522 -0.0580741 0.0500195 0.0247829 -0.0228262 
0.0418042 -0.044579 -0.0325582 -0.0586804 0.037537 0.115187 -0.0113524 0.0296919 0.0477278 -0.172882 -0.0217026 0.0486026 0.0714521 -0.164526 -0.115515 0.0227557 -0.220591 -0.0258311 -0.171501 0.11588 0.24675 -0.0286301 0.0746202 0.107241 -0.0670133 -0.0300159 -0.0214355 -0.256651 -0.0362469 0.0938076 -0.0201905 -0.0355426 0.00276175 0.106232 0.0258618 -0.0128122 -0.0298535 0.119153 -0.0934122 -0.0557497 -0.000101304 -0.0987274 -0.0147623 0.114795 -0.02402 -0.0148816 0.129649 0.0113576 -0.135796 0.113095 -0.0581814 -0.11945 0.0497854 0.068043 0.158348 -0.00161701 0.03774 0.0553818 -0.0759925 -0.186883 0.0131094 0.00892781 0.169168 0.0231829 0.0272319 -0.133964 -0.0297264 0.0447705 0.0181448 0.00845358 -0.0602547 -0.0430169 -0.0946717 -0.0855983 0.0256937 0.0216901 -0.0579758 0.0140337 0.0287044 0.164516 0.0176745 0.0220287 -0.048395 -0.0283515 -0.0975809 0.0953618 0.0553326 0.0553636 -0.0105939 0.0904678 0.126721 -0.161705 -0.110776 0.00581745 -0.138495 0.0455631 -0.0890827 0.0871156 0.0728321 -0.0190492 0.129233 -0.0447167 -0.0767009 0.0463829 -0.0307787 -0.0322007 -0.13198 0.126431 -0.0832789 -0.0633001 0.0120161 0.107977 -0.131026 -0.0695944 0.046677 0.195186 -0.10688 -0.058483 -0.0110388 0.134038 0.0291167 0.0671165 0.0380555 0.0339931 -0.0561967 0.0487399 0.0230132 -0.0248882 
0.0396596 -0.0586153 -0.0333163 -0.0572735 0.0526904 0.113308 -0.0138099 0.02136 0.0433764 -0.173946 -0.0280169 0.0555542 0.0670991 -0.154392 -0.110176 0.0172604 -0.214688 -0.00414509 -0.16251 0.120708 0.244929 -0.0274963 0.0864163 0.117031 -0.0653757 -0.0348837 -0.0181502 -0.259872 -0.0433183 0.0932055 -0.0236043 -0.0399463 0.00773288 0.105543 0.0367694 -0.00561289 -0.0267673 0.112179 -0.100343 -0.0683876 0.00281818 -0.0863952 -0.0105771 0.117459 -0.0433365 -0.0109836 0.135902 0.0159452 -0.132131 0.120803 -0.0646552 -0.137227 0.053804 0.0680873 0.165257 0.000664078 0.0423942 0.0602895 -0.0787356 -0.185505 0.0165082 0.0189963 0.170347 0.0218189 0.0342772 -0.131815 -0.0396817 0.0453181 0.0139947 0.0187352 -0.0583437 -0.0395428 -0.0919623 -0.0895413 0.0181295 0.0230681 -0.0591123 0.0163112 0.035423 0.141093 0.013435 0.0391563 -0.0594942 -0.0323185 -0.0961217 0.0902673 0.0502577 0.0621423 -0.0117776 0.0975712 0.139909 -0.154705 -0.105577 -0.00531957 -0.129702 0.046819 -0.100374 0.0981727 0.0708713 -0.0209367 0.13082 -0.0495066 -0.0702644 0.0321094 -0.0290212 -0.0303247 -0.132731 0.110284 -0.0852378 -0.0526276 0.0159963 0.108479 -0.115206 -0.0691577 0.0417379 0.192983 -0.0971784 -0.0702061 -0.0149313 0.134283 0.0339751 0.0665038 0.0321665 0.0317077 -0.0700335 0.0508268 0.0198271 -0.0287129 
0.0444017 -0.0800267 -0.0293833 -0.0370977 0.0721013 0.11476 -0.027977 0.00827021 0.05098 -0.186701 -0.0280773 0.0672415 0.0542871 -0.149765 -0.106166 0.0301706 -0.205794 0.0144827 -0.149659 0.122207 0.25302 -0.0161166 0.105659 0.139237 -0.047444 -0.0479355 -0.00748949 -0.266075 -0.0453051 0.100952 -0.00783959 -0.0323111 0.0161439 0.102912 0.0428422 0.00320164 -0.0262514 0.0881032 -0.0933346 -0.0738432 0.00681501 -0.0755427 -0.00933139 0.113775 -0.0533992 -0.0264613 0.137999 0.0164796 -0.108518 0.12465 -0.0579702 -0.141742 0.0710122 0.0610449 0.165002 0.0027681 0.0583853 0.06141 -0.0819014 -0.175802 0.00977687 0.0231002 0.164052 0.0155713 0.0289668 -0.133659 -0.0451459 0.0348737 0.00611891 0.0354336 -0.0661153 -0.0278886 -0.100174 -0.0963293 0.00979703 0.0153259 -0.0511123 0.016117 0.0286186 0.148949 0.0216961 0.0535639 -0.0555161 -0.0347884 -0.0802172 0.0845665 0.0383464 0.0685187 -0.030782 0.0946672 0.148521 -0.13632 -0.115068 0.0049031 -0.121613 0.0502252 -0.116341 0.110833 0.0676381 -0.0248322 0.137103 -0.0622791 -0.0663503 0.0247872 -0.0157707 -0.0284331 -0.119837 0.085328 -0.074885 -0.0406533 0.00384034 0.10757 -0.101692 -0.0668998 0.0402912 0.192021 -0.0850848 -0.0679802 -0.0203048 0.147543 0.0449095 0.070025 0.0232037 0.017276 -0.0862187 0.06084 0.0268945 -0.0200891 
0.0528689 -0.0661278 -0.0402349 -0.0490529 0.0770053 0.12446 -0.0202483 0.0131161 0.0451456 -0.177583 -0.0291135 0.0623902 0.062458 -0.145748 -0.103198 0.0444524 -0.195854 0.0215379 -0.156656 0.114626 0.2546 -0.00346988 0.107058 0.128783 -0.0575224 -0.0572116 -0.00987436 -0.259176 -0.0383406 0.112381 -0.0154275 -0.0231721 0.0174255 0.105823 0.0456506 -0.000900288 -0.0135707 0.0816047 -0.0868663 -0.06961 -0.00435926 -0.0752555 0.00727866 0.108165 -0.0539613 -0.0224057 0.138973 0.0192332 -0.119216 0.133677 -0.0481499 -0.141072 0.0619017 0.067155 0.158434 0.00434182 0.0678154 0.0576636 -0.081621 -0.169544 0.00410276 0.0245031 0.163851 -0.0010394 0.0281579 -0.136737 -0.0568265 0.0394859 -0.00395843 0.0345747 -0.0629239 -0.0305474 -0.107222 -0.101673 0.00444561 0.0256792 -0.0440634 0.0157851 0.025036 0.132914 0.0343125 0.0508937 -0.0566307 -0.0234704 -0.0829823 0.0974671 0.0288192 0.055041 -0.0290473 0.10848 0.145613 -0.147206 -0.13142 0.0064311 -0.112334 0.0620549 -0.118965 0.121525 0.0592706 -0.0152302 0.14438 -0.0602782 -0.0679997 0.0327188 -0.0193372 -0.0315671 -0.12823 0.0840061 -0.0789114 -0.0411218 -0.00179551 0.100185 -0.0954023 -0.0636839 0.0405493 0.191988 -0.0771258 -0.0600984 -0.0224362 0.152217 0.0526388 0.0614476 0.0377867 0.0197549 -0.0848144 0.0536709 0.02727 -0.0231739 
0.053431 -0.069435 -0.044082 -0.0250458 0.105146 0.117314 -0.00672659 -0.0109441 0.0530702 -0.16853 -0.0199547 0.0835859 0.0529753 -0.128394 -0.102141 0.0451136 -0.171425 0.0434256 -0.156615 0.123901 0.256849 -0.0272045 0.111634 0.142705 -0.0338077 -0.0573016 -0.0233219 -0.269401 -0.0381728 0.116954 -0.00622309 0.00506096 0.0186411 0.106735 0.044475 0.0100092 -0.021306 0.0988609 -0.0792129 -0.0894932 0.0130734 -0.0547886 5.48236e-05 0.0921968 -0.067245 -0.0146504 0.137373 0.00795267 -0.113834 0.104556 -0.0518636 -0.129549 0.0582692 0.0508916 0.172795 0.0141454 0.0622639 0.0799486 -0.0905954 -0.154621 -0.00417616 0.0125068 0.171821 -0.022356 0.0506799 -0.120891 -0.0700423 0.0647475 -0.0117459 0.0635848 -0.0445384 -0.00587117 -0.1139 -0.105468 -0.00304105 0.0385284 -0.0415296 0.0312567 0.0125323 0.105865 -0.00674034 0.0809512 -0.0570988 -0.0338282 -0.091659 0.0837416 0.0424798 0.0688783 -0.0338567 0.09649 0.147047 -0.150324 -0.119548 0.004261 -0.0968433 0.0474488 -0.115094 0.107263 0.067462 -0.0249264 0.135809 -0.0701242 -0.071204 0.0402327 -0.0222063 -0.019533 -0.123576 0.0744509 -0.0611232 -0.0501065 -0.0135099 0.110969 -0.0955298 -0.0559488 0.069066 0.18026 -0.0971533 -0.0838722 -0.0143152 0.165622 0.0566378 0.0814447 0.0206787 0.0323395 -0.0854103 0.0722038 0.0290501 -0.0298128 
0.0496598 -0.0806216 -0.0306569 -0.0214954 0.0945778 0.120569 -0.0127804 0.000319927 0.0579366 -0.170425 -0.0163664 0.0824021 0.0534995 -0.135912 -0.103282 0.0476884 -0.182032 0.0446574 -0.154215 0.117721 0.266769 -0.0276712 0.115062 0.151426 -0.0332085 -0.0620639 -0.0194009 -0.270788 -0.0337374 0.111445 -0.00151833 -0.00381851 0.0213069 0.106646 0.040106 0.00466374 -0.0262863 0.0908329 -0.0780257 -0.0836319 0.0138998 -0.0621916 -0.00724727 0.0883396 -0.0644631 -0.0424915 0.130534 0.00463957 -0.103703 0.106223 -0.0494295 -0.133099 0.0640121 0.0556093 0.165681 0.0161946 0.0739093 0.0717857 -0.0931443 -0.157264 -0.00430079 0.0138826 0.165727 -0.0162308 0.0435804 -0.117375 -0.0631827 0.0500723 -0.012225 0.0607812 -0.0569912 -0.00665528 -0.116683 -0.101477 0.000400419 0.0281374 -0.0379786 0.0270303 0.0142651 0.119188 -0.00360187 0.0700256 -0.0457239 -0.0320566 -0.0833216 0.0873381 0.0442347 0.0722596 -0.0364596 0.0900088 0.14693 -0.144829 -0.118107 0.0118581 -0.10259 0.0457606 -0.125595 0.113453 0.0653188 -0.0178163 0.144209 -0.075069 -0.0723748 0.0394046 -0.00208576 -0.0202847 -0.111825 0.0676419 -0.0598519 -0.0537701 -0.0262935 0.109738 -0.0905706 -0.0602628 0.0706227 0.187405 -0.0868278 -0.0705097 -0.014731 0.16805 0.0550069 0.0711329 0.0143716 0.0202184 -0.0912032 0.0798899 0.0293532 -0.0158226 
0.0564896 -0.0522737 -0.0565646 -0.0426722 0.0789935 0.13409 -0.0184923 0.00287265 0.03492 -0.168443 -0.0245892 0.0619994 0.0673762 -0.134003 -0.105444 0.0456147 -0.170262 0.0248453 -0.146801 0.120337 0.249773 -0.0218662 0.109766 0.142141 -0.0514544 -0.0632738 -0.011642 -0.260679 -0.0369984 0.118506 -0.0165812 -0.0196588 0.0191054 0.104034 0.039434 0.00663705 -0.0107117 0.0860148 -0.0898662 -0.0739119 -0.0120888 -0.0705693 0.0124816 0.0954626 -0.0525979 -0.00958092 0.150917 0.0167712 -0.135635 0.129446 -0.042836 -0.140609 0.0665001 0.061788 0.162269 0.0142096 0.0667456 0.0708743 -0.0689866 -0.172003 -0.00145948 0.0352978 0.171303 -0.0329878 0.0382939 -0.124194 -0.0607408 0.0466143 -0.0189185 0.0391194 -0.0594903 -0.0282732 -0.117992 -0.105699 0.010912 0.0376182 -0.0335106 0.0285223 0.0255412 0.11818 0.0142498 0.0524107 -0.0636669 -0.0321153 -0.0898579 0.106808 0.0207421 0.043127 -0.0297 0.108689 0.140418 -0.156691 -0.120217 0.00562956 -0.0957608 0.0620477 -0.110683 0.126879 0.0603494 -0.0157215 0.141802 -0.0571994 -0.0701091 0.0426514 -0.0345236 -0.0195666 -0.132085 0.0785909 -0.0872572 -0.0484598 -0.00297509 0.103526 -0.0784821 -0.0676696 0.0430004 0.189563 -0.0921867 -0.0667557 -0.0203885 0.158786 0.0458162 0.0529465 0.0349446 0.0242277 -0.0866398 0.0668544 0.0190253 -0.0341 
0.051131 -0.0714444 -0.0498692 -0.0354763 0.0858845 0.132683 -0.0110415 -0.00640442 0.0428813 -0.176093 -0.0384384 0.0661011 0.0585165 -0.135633 -0.0946954 0.0332061 -0.187573 0.0272114 -0.141518 0.115714 0.237727 -0.0143231 0.11015 0.142856 -0.0546459 -0.0693583 -0.0230515 -0.273051 -0.0556866 0.116839 -0.0122753 -0.0217458 0.00987214 0.0976156 0.0550034 0.0157792 -0.00802721 0.0704406 -0.0964733 -0.0753725 0.00273423 -0.0635902 0.00669011 0.0940613 -0.0623598 -0.00335892 0.145082 0.0213099 -0.11563 0.131564 -0.0519575 -0.157187 0.0793073 0.0610789 0.170272 0.0146536 0.0674267 0.0716268 -0.0726735 -0.157452 0.004359 0.0485151 0.161662 -0.029778 0.0457594 -0.128609 -0.0547222 0.0401995 -0.0125152 0.0365454 -0.0576044 -0.0175101 -0.106307 -0.102676 0.00278048 0.0434639 -0.0436579 0.0189666 0.0307414 0.114539 0.0252688 0.0571313 -0.0730781 -0.0295688 -0.0904267 0.103699 0.0249383 0.0462184 -0.0474281 0.106617 0.149738 -0.144492 -0.10572 -0.0076039 -0.108177 0.0634897 -0.113999 0.117469 0.071431 -0.00757007 0.145244 -0.0621858 -0.0663675 0.0204347 -0.0264911 -0.0270143 -0.129223 0.0702099 -0.0995862 -0.0165232 0.00267865 0.0935019 -0.0702806 -0.0816868 0.0291119 0.19716 -0.0849224 -0.0606962 -0.0341653 0.151991 0.0516695 0.0519883 0.0291842 0.0222159 -0.0960122 0.0698405 0.00580352 -0.031954 
0.0663058 -0.0507119 -0.0550334 -0.0451038 0.0555719 0.151124 -0.00186721 0.00994575 0.0223468 -0.173013 -0.0238002 0.0545789 0.0707439 -0.143477 -0.102258 0.0284844 -0.183358 0.00645471 -0.14466 0.112396 0.234397 -0.0165899 0.0862386 0.138891 -0.0666272 -0.0588082 -0.0181022 -0.261362 -0.047301 0.112007 -0.0298609 -0.0254212 -0.00194828 0.10729 0.0386145 0.0039109 -0.00539426 0.0753841 -0.0904155 -0.0623254 -0.00280981 -0.0837505 0.0115213 0.0932682 -0.0469911 -0.00908328 0.150954 0.0164306 -0.147719 0.132147 -0.0412882 -0.15019 0.0679418 0.0747565 0.165781 0.0138735 0.0541665 0.0756637 -0.0649977 -0.172994 0.00324339 0.0520502 0.174295 -0.0419313 0.0356535 -0.110297 -0.0404907 0.0289013 -0.0191756 0.0184828 -0.0673237 -0.0340083 -0.106937 -0.0883937 0.0219128 0.0357579 -0.0346784 0.0141747 0.0363156 0.124201 0.0303023 0.0372698 -0.0635525 -0.0430773 -0.0958972 0.118877 0.0267488 0.0257458 -0.0362617 0.115617 0.147756 -0.167835 -0.111104 0.00195787 -0.113645 0.0663701 -0.0935799 0.111121 0.0717817 -0.00399954 0.139048 -0.0465137 -0.0697269 0.0443371 -0.0411839 -0.0166318 -0.133832 0.092437 -0.122926 -0.0413362 0.0139288 0.0990933 -0.0723635 -0.0836811 0.0317136 0.191438 -0.0945742 -0.0546266 -0.0218247 0.139749 0.0440894 0.0289986 0.0496064 0.0248094 -0.0759213 0.0654634 0.00889761 -0.0398819 
0.0596452 -0.0659214 -0.0570302 -0.0308759 0.0904693 0.117946 -0.0185901 -0.00338337 0.0392729 -0.167246 -0.0123575 0.0825947 0.0617657 -0.126614 -0.112694 0.0423996 -0.164188 0.0409888 -0.150739 0.125536 0.248796 -0.0205507 0.118605 0.153048 -0.0440487 -0.0571651 0.00773179 -0.260195 -0.0390986 0.12141 -0.0281208 -0.00897147 0.0288638 0.106642 0.0254389 -0.000383801 -0.0230733 0.0917835 -0.0955241 -0.0752368 -0.00236425 -0.0653676 -0.00153257 0.103698 -0.0727189 -0.0130751 0.14476 0.00700606 -0.126384 0.118929 -0.0339145 -0.130691 0.0608918 0.0552885 0.161819 0.0153224 0.0691655 0.0733686 -0.0710794 -0.158806 -0.00154142 0.0172377 0.172279 -0.0150414 0.0368592 -0.12969 -0.0653483 0.055982 -0.0120138 0.0574374 -0.0585824 -0.026403 -0.112707 -0.108716 0.00740081 0.0380584 -0.0357231 0.0313009 0.00805214 0.111762 -0.000681639 0.0659799 -0.0597885 -0.0393482 -0.0891131 0.098028 0.0338725 0.0482497 -0.0379421 0.100793 0.135896 -0.153687 -0.12648 0.00618329 -0.0958712 0.0541199 -0.118844 0.115163 0.0746216 -0.0311345 0.13997 -0.0602933 -0.0605691 0.0490847 -0.0279643 -0.0289305 -0.132107 0.0804547 -0.0779577 -0.0621228 -0.000940894 0.116965 -0.0782772 -0.0599577 0.0468336 0.1817 -0.0975187 -0.0803566 -0.0115609 0.163372 0.0483089 0.0658239 0.0168951 0.0246763 -0.0820415 0.0720398 0.0213701 -0.0301188 
0.0517668 -0.0727894 -0.0499047 -0.0280287 0.0921684 0.113202 -0.0158361 0.0048361 0.0446916 -0.159219 -0.00991873 0.0824319 0.0598867 -0.138515 -0.114425 0.0458205 -0.174815 0.0481048 -0.150726 0.126757 0.25741 -0.0304669 0.117125 0.153638 -0.0416186 -0.0590586 0.002881 -0.263953 -0.0334649 0.114569 -0.0263216 -0.0162913 0.0293526 0.10596 0.0291133 -0.00396586 -0.0253431 0.086594 -0.0923234 -0.0823801 0.003503 -0.0698078 -0.00103434 0.103034 -0.0718169 -0.0298627 0.14057 0.00834203 -0.118387 0.116111 -0.0419569 -0.138195 0.0550746 0.0549263 0.160769 0.016201 0.0703454 0.0645334 -0.0796326 -0.157058 0.00237789 0.0112849 0.171348 -0.00637938 0.0392218 -0.126903 -0.0720738 0.0490313 -0.00803617 0.0521193 -0.0642322 -0.0206553 -0.112917 -0.1076 0.00467638 0.0329787 -0.0320015 0.0410471 0.0116224 0.107908 -0.00476827 0.063897 -0.0561968 -0.0318809 -0.0876553 0.101517 0.036688 0.0622215 -0.0294425 0.0959549 0.140538 -0.14694 -0.128009 0.0070512 -0.098884 0.0495924 -0.12832 0.115784 0.0699131 -0.0284848 0.144351 -0.0703221 -0.0613981 0.0388232 -0.00901108 -0.0254291 -0.119367 0.0786902 -0.0719441 -0.0583713 -0.0129551 0.114685 -0.0745518 -0.0603501 0.05329 0.181605 -0.0892955 -0.0729009 -0.0140993 0.161587 0.0452432 0.0668115 0.0137786 0.0241294 -0.0900137 0.0769875 0.0200136 -0.0247802 
0.0602482 -0.0520384 -0.0611149 -0.0292718 0.0848728 0.126399 -0.0149424 -0.00968765 0.0410742 -0.16874 -0.00981169 0.0736543 0.0606079 -0.134437 -0.117472 0.0560598 -0.174511 0.0382913 -0.154091 0.111764 0.253217 -0.0181492 0.119724 0.143823 -0.0448677 -0.0669451 0.00477061 -0.261104 -0.0332656 0.127459 -0.0261129 -0.0107472 0.0239178 0.104871 0.0303089 -0.00669948 -0.0168385 0.0820168 -0.0836105 -0.0641016 -0.0097079 -0.0700594 0.00819252 0.0967657 -0.0645381 -0.0188997 0.147466 0.00560446 -0.127845 0.122111 -0.0310049 -0.130313 0.0617922 0.060636 0.150615 0.0182494 0.0803685 0.0709751 -0.0716911 -0.152725 -0.00672195 0.0213743 0.176119 -0.0264216 0.0371336 -0.126003 -0.0663706 0.0452333 -0.0181585 0.0543877 -0.0646136 -0.0238089 -0.116723 -0.104727 0.00987516 0.0358471 -0.030492 0.0256149 -0.000558806 0.115022 0.0133681 0.0557203 -0.0582965 -0.0310447 -0.0960035 0.113718 0.02345 0.0352506 -0.0462172 0.100451 0.13622 -0.158522 -0.132026 0.00523362 -0.0929245 0.058392 -0.123598 0.125332 0.074079 -0.0161734 0.141422 -0.0641114 -0.062244 0.0540733 -0.0172639 -0.0283321 -0.123365 0.0867101 -0.0831034 -0.0590338 -0.00936354 0.108662 -0.0691601 -0.0602198 0.0443995 0.189585 -0.0910081 -0.0552515 -0.0122554 0.162033 0.049291 0.0570757 0.0230103 0.0198579 -0.0835027 0.0744988 0.0162802 -0.0267047 
0.0575019 -0.0528548 -0.0687207 -0.0368198 0.0892267 0.127063 -0.024194 -0.00584732 0.0315315 -0.168293 -0.0133653 0.071022 0.0626231 -0.128693 -0.114036 0.0528711 -0.163916 0.0363591 -0.142542 0.116298 0.254309 -0.0233852 0.118782 0.140004 -0.0357454 -0.0590354 0.00654945 -0.260747 -0.0313412 0.122871 -0.0197644 -0.00969577 0.0259078 0.101811 0.0297722 0.000458702 -0.0197506 0.0816502 -0.0790879 -0.0723903 -0.00677655 -0.0691194 0.0132311 0.106753 -0.0640969 -0.0109471 0.155426 0.00780127 -0.136437 0.113569 -0.0387864 -0.12892 0.0626235 0.0565024 0.149711 0.0152052 0.0740671 0.0728244 -0.0690777 -0.164694 -0.00333034 0.0235043 0.17859 -0.0224272 0.0355132 -0.123431 -0.0675601 0.0544157 -0.00878179 0.0510954 -0.0619842 -0.0238369 -0.120557 -0.113126 0.0123031 0.0350842 -0.0369136 0.0315774 0.00395195 0.116382 0.00218604 0.0649779 -0.0570677 -0.0335454 -0.0969009 0.110448 0.0256074 0.0412159 -0.0397253 0.0954106 0.137412 -0.152813 -0.13324 0.00576081 -0.0903922 0.0539277 -0.117569 0.131966 0.0646824 -0.0283376 0.132855 -0.0651521 -0.0593378 0.0550598 -0.0299627 -0.0219972 -0.130328 0.0936071 -0.0817382 -0.0627507 -0.00543169 0.106689 -0.0796567 -0.0608266 0.0468604 0.180825 -0.100814 -0.0751677 -0.00522808 0.163137 0.049427 0.0595459 0.02423 0.0218582 -0.0883131 0.0667348 0.0171842 -0.0260474 
0.0594002 -0.0514618 -0.0708065 -0.0382447 0.0874335 0.127713 -0.0230895 -0.00708261 0.0369816 -0.171493 -0.0128058 0.0727181 0.058414 -0.131646 -0.117899 0.0507136 -0.166139 0.0381368 -0.147515 0.113107 0.251505 -0.0151737 0.113648 0.136687 -0.0421268 -0.0577481 0.00909846 -0.26021 -0.0379373 0.121822 -0.0257668 -0.0147834 0.0243757 0.101304 0.0356546 -0.000955112 -0.0156634 0.0806433 -0.0813036 -0.0712386 -0.00691926 -0.0637149 0.0129205 0.108623 -0.0642958 -0.00722888 0.153223 0.00742015 -0.136336 0.117378 -0.0369163 -0.130654 0.059874 0.0597313 0.152425 0.0139757 0.0722052 0.0714752 -0.0695464 -0.164605 -0.00124671 0.0215341 0.181008 -0.0207517 0.0352899 -0.131342 -0.0666952 0.0572132 -0.00442774 0.0535806 -0.0552596 -0.0271739 -0.113125 -0.116194 0.00853103 0.0378206 -0.0426213 0.031506 0.000627934 0.110239 0.00761545 0.0706463 -0.0588594 -0.0329602 -0.0990544 0.112494 0.0275838 0.0394846 -0.041156 0.099225 0.136103 -0.158696 -0.134574 0.00117318 -0.0903558 0.0548496 -0.115311 0.125006 0.0652639 -0.0268877 0.133254 -0.0619417 -0.0579586 0.050926 -0.0308395 -0.027502 -0.131341 0.0909659 -0.09222 -0.0570811 0.000932354 0.102619 -0.0767878 -0.0596814 0.0439319 0.180153 -0.103708 -0.0750692 -0.00894464 0.153542 0.0502344 0.0620149 0.0300325 0.0222302 -0.0804768 0.0636577 0.0179707 -0.0298342 
0.0698067 -0.0385484 -0.0629033 -0.0313578 0.0718174 0.126544 -0.0269116 0.00213289 0.0495999 -0.1716 -0.0156752 0.0640086 0.0472306 -0.140284 -0.116833 0.0898276 -0.159235 0.01267 -0.172554 0.0958218 0.258228 -0.0132485 0.116606 0.106198 -0.045296 -0.0427539 -0.00368192 -0.264079 -0.042639 0.106652 -0.0100302 0.0290484 0.0196895 0.122196 0.0179788 -0.00156543 -0.0172076 0.115966 -0.0593886 -0.0479543 -0.0309721 -0.0634753 -0.00221083 0.0771483 -0.0146477 -0.00258264 0.137817 -0.0153922 -0.143703 0.117649 -0.0217866 -0.102841 0.0448296 0.0622811 0.139271 0.00386075 0.0933075 0.0627725 -0.0671956 -0.155295 -0.00471431 0.00423581 0.166135 -0.0394748 0.0391936 -0.137603 -0.0700364 0.08301 -0.00540912 0.0760665 -0.0538912 -0.0240912 -0.125419 -0.097475 -0.0037605 0.022071 -0.0268847 0.0212945 -0.0267709 0.120557 0.00376901 0.058553 -0.0563814 -0.0444757 -0.113719 0.0966145 0.0264146 0.0265826 -0.0353934 0.0930422 0.118639 -0.16458 -0.149087 0.0202355 -0.0683439 0.0970901 -0.0938272 0.107893 0.0537192 -0.00319569 0.119249 -0.0712939 -0.0956819 0.0867824 -0.0193806 -0.0408165 -0.141919 0.0807334 -0.0755512 -0.0850588 -0.0270044 0.124474 -0.0915255 -0.0511637 0.0858025 0.177638 -0.0980029 -0.0769222 0.00706162 0.156961 0.0584628 0.094635 0.0644345 0.0313556 -0.0419614 0.0420877 0.0454126 -0.0423796 
0.0595685 -0.076179 -0.0531401 -0.0250365 0.0940493 0.111056 -0.0154942 -0.00271688 0.0538304 -0.179461 -0.0163238 0.080068 0.0562788 -0.12262 -0.114265 0.0454685 -0.163621 0.0331046 -0.158076 0.12392 0.255814 -0.0311292 0.114878 0.146083 -0.0364543 -0.0585503 -0.00105829 -0.261796 -0.0451164 0.114556 -0.0160331 -0.000862094 0.0259979 0.107964 0.0265322 0.00309581 -0.0227159 0.101027 -0.0891822 -0.0844804 0.00417519 -0.0572206 -0.00283628 0.0918073 -0.0578626 -0.0172184 0.133726 0.00387841 -0.116497 0.109869 -0.049576 -0.132931 0.0690285 0.0544603 0.165023 0.0121757 0.0637305 0.0752271 -0.0811698 -0.162338 0.000671901 0.0148986 0.168519 -0.0156463 0.0363602 -0.115924 -0.0669124 0.06665 -0.00651015 0.0525414 -0.0545846 -0.0235827 -0.114029 -0.11232 0.00428553 0.0390416 -0.0328895 0.0253591 0.00565381 0.114768 -0.00703383 0.0693672 -0.0605331 -0.0451658 -0.0918905 0.095735 0.0370596 0.059609 -0.0378141 0.0918336 0.142609 -0.154913 -0.121206 0.00871163 -0.0933148 0.0576542 -0.116255 0.104801 0.0718123 -0.0282938 0.136749 -0.0738751 -0.0679605 0.0480535 -0.023719 -0.0266486 -0.130164 0.0776145 -0.075682 -0.0645658 -0.00923889 0.115939 -0.0880386 -0.0562247 0.060248 0.182774 -0.105361 -0.0770994 -0.00866583 0.159842 0.0448418 0.0802906 0.0184675 0.0295384 -0.0782782 0.0690976 0.0218961 -0.0342071 
0.0541317 -0.0756804 -0.0539492 -0.0368459 0.0958137 0.117323 -0.0276707 -0.0044685 0.047198 -0.17417 -0.0243777 0.0764543 0.0534778 -0.130163 -0.108481 0.0478942 -0.167192 0.0376266 -0.142526 0.118869 0.254394 -0.015059 0.116906 0.148558 -0.0386463 -0.0514685 0.00648853 -0.265657 -0.0407203 0.114824 -0.011919 -0.0148836 0.026246 0.101192 0.0442692 0.00342646 -0.0168739 0.087444 -0.0824532 -0.0859763 -0.00211135 -0.058506 0.00485632 0.105042 -0.0588087 -0.0165315 0.14185 0.0150038 -0.116897 0.11502 -0.0479487 -0.140085 0.0750988 0.0521024 0.162693 0.0118496 0.0696046 0.0737134 -0.0799642 -0.169461 0.00293024 0.0193555 0.172786 -0.011001 0.0370239 -0.126596 -0.0699305 0.0579344 -0.00366757 0.0485014 -0.0610962 -0.0252257 -0.116793 -0.118286 -0.000828388 0.0317479 -0.0395767 0.0300368 0.0166076 0.117461 0.00838756 0.0745506 -0.0612145 -0.0375185 -0.0837877 0.085509 0.0302139 0.0623114 -0.0332485 0.0983655 0.144054 -0.141478 -0.124598 0.0101832 -0.0914025 0.060364 -0.117797 0.11989 0.0643115 -0.0296708 0.142141 -0.0708179 -0.0682134 0.0353428 -0.0243829 -0.0300058 -0.126104 0.0663386 -0.0765804 -0.0488041 -0.00176283 0.109946 -0.0812111 -0.0584407 0.0527387 0.182885 -0.0997736 -0.0786995 -0.0189126 0.154355 0.0508523 0.0713902 0.0248516 0.0177627 -0.0918204 0.0676342 0.0211633 -0.0330898 
0.0621829 -0.0541484 -0.0570606 -0.0263197 0.0745178 0.10922 -0.0201069 0.0094895 0.0512373 -0.163419 -0.00953094 0.0776186 0.0525834 -0.150814 -0.125113 0.0747929 -0.172341 0.0133583 -0.179036 0.11804 0.254131 -0.0310344 0.112962 0.113815 -0.0503497 -0.0327403 -0.00397864 -0.268885 -0.0441469 0.0987178 -0.0185159 0.0260102 0.0189995 0.120031 0.00667368 -0.00704584 -0.0330522 0.127752 -0.0768051 -0.0541801 -0.0163185 -0.0716472 -0.0207953 0.0872532 -0.0267081 -0.00765936 0.132382 -0.0118673 -0.135835 0.11227 -0.0286703 -0.105399 0.0345152 0.0554206 0.146818 -0.000534098 0.0768713 0.0609005 -0.0731471 -0.148416 0.00351628 -0.00935688 0.167584 -0.0127881 0.043248 -0.146037 -0.0691205 0.0810382 0.00430261 0.0671178 -0.0558883 -0.0227784 -0.113938 -0.0881741 -0.00140772 0.0224583 -0.0317572 0.0325241 -0.0194602 0.125331 -0.0100522 0.0517366 -0.0582812 -0.0447282 -0.113911 0.0919457 0.0439579 0.0448315 -0.0280739 0.0814876 0.118029 -0.157611 -0.140844 0.018149 -0.083005 0.0798945 -0.0952007 0.0873146 0.0646834 -0.0162419 0.118574 -0.073768 -0.0919513 0.0784298 -0.0089849 -0.0419579 -0.137926 0.0950683 -0.0646064 -0.084294 -0.0260239 0.133862 -0.0976962 -0.0534994 0.0816772 0.175176 -0.103317 -0.0832555 0.00865288 0.157359 0.0461216 0.10339 0.0450271 0.0382516 -0.0445578 0.0490095 0.0361569 -0.0403469 
0.0640855 -0.0544106 -0.0638908 -0.0366726 0.0834713 0.125903 -0.0120668 0.00202075 0.0440225 -0.176214 -0.0215157 0.0674032 0.0602684 -0.141316 -0.11289 0.057781 -0.171266 0.0284918 -0.163031 0.110292 0.24905 -0.00857075 0.113805 0.13267 -0.0549928 -0.0653042 -0.00314276 -0.264042 -0.0399347 0.11945 -0.0231778 -0.00153108 0.0188567 0.107718 0.0326287 -0.00660808 -0.00944098 0.0876116 -0.0873732 -0.0607846 -0.00646665 -0.0651557 0.00921754 0.0985073 -0.0555387 -0.00789906 0.14492 0.00642682 -0.131275 0.124685 -0.0342878 -0.138189 0.0600012 0.0626002 0.148112 0.0110769 0.0764804 0.0669724 -0.0682959 -0.155578 -0.00303127 0.0249602 0.165759 -0.0262697 0.0351837 -0.136813 -0.0617055 0.0505769 -0.00842217 0.0434465 -0.0599791 -0.0292311 -0.109889 -0.103524 0.00473999 0.0368821 -0.0369502 0.024668 -3.76744e-05 0.114274 0.021556 0.0585656 -0.0656284 -0.0345596 -0.0961243 0.115586 0.0251972 0.0323894 -0.0513287 0.10096 0.136962 -0.160308 -0.138887 -0.000646227 -0.0922995 0.0719485 -0.112177 0.117355 0.0658778 -0.0104259 0.134223 -0.0673761 -0.06369 0.0596937 -0.0276951 -0.0393817 -0.134852 0.0913384 -0.0905225 -0.0527124 -0.0039825 0.106432 -0.0781415 -0.0646366 0.0411861 0.184214 -0.097242 -0.0649913 -0.0156537 0.153719 0.0494147 0.0693678 0.0347626 0.028123 -0.0741121 0.0546711 0.0105691 -0.038605 
0.0572755 -0.0609649 -0.0396403 -0.0255437 0.0720794 0.104991 -0.0143786 0.0277412 0.0438672 -0.154302 -0.00882314 0.0857332 0.0488116 -0.171566 -0.123921 0.0652337 -0.19553 0.0175384 -0.181653 0.123807 0.253149 -0.0325907 0.117792 0.104612 -0.0571332 -0.0352874 -0.00653836 -0.269262 -0.0443122 0.0881378 -0.0348402 0.0108671 0.0222878 0.122514 0.00652744 -0.0222167 -0.0431593 0.12323 -0.0874194 -0.057784 -0.0109029 -0.0844977 -0.0284205 0.0916582 -0.0430809 -0.0183488 0.125062 -0.0159056 -0.135709 0.126503 -0.02297 -0.106821 0.0201804 0.0576837 0.143943 -0.00642041 0.0773987 0.0441756 -0.0847401 -0.135158 0.0103944 -0.0172386 0.161753 0.00704758 0.0519282 -0.157588 -0.0770698 0.0675742 0.000884683 0.0711339 -0.05959 -0.0222896 -0.105099 -0.0776957 -0.00644871 0.0206876 -0.0317082 0.0284543 -0.0111733 0.128218 -0.0138429 0.031745 -0.0511247 -0.032375 -0.107952 0.0864002 0.0513677 0.0572343 -0.0183831 0.0882812 0.117164 -0.152712 -0.147736 0.0228619 -0.0980714 0.0689798 -0.0987984 0.0816152 0.0624536 -0.0143467 0.124822 -0.0682084 -0.0918885 0.0611487 0.0131701 -0.0452009 -0.122806 0.103972 -0.0561465 -0.083899 -0.0281927 0.133722 -0.0928674 -0.0543924 0.083933 0.174224 -0.0869826 -0.0693072 0.0122879 0.162793 0.041017 0.0993785 0.0372771 0.034692 -0.0315973 0.0511474 0.0531735 -0.0340816 
0.0632343 -0.053823 -0.0624218 -0.0412821 0.0911291 0.133534 -0.0135295 0.00546093 0.0340388 -0.161088 -0.0203019 0.0751842 0.0612074 -0.137443 -0.10806 0.0506026 -0.159324 0.0406869 -0.150157 0.11774 0.248884 -0.0141475 0.114009 0.139235 -0.0506319 -0.0614316 -0.000404276 -0.261827 -0.0382378 0.118948 -0.0253616 -0.00982897 0.0268659 0.107858 0.0376778 -0.00315355 -0.00821572 0.0871029 -0.0863081 -0.0763806 -0.00791692 -0.0644856 0.014263 0.0979562 -0.0661668 -0.00953227 0.150319 0.00640473 -0.141194 0.12784 -0.0311961 -0.138329 0.0550985 0.0612234 0.157793 0.0147572 0.070441 0.0696223 -0.0747467 -0.161303 -0.00214838 0.0207123 0.172792 -0.0354433 0.0464249 -0.133374 -0.0745043 0.0548193 -0.0208551 0.0548772 -0.0547248 -0.0276073 -0.1183 -0.109596 0.00182986 0.0418761 -0.0318157 0.0356563 0.0131741 0.0986369 0.00281791 0.0652488 -0.0606449 -0.0307756 -0.0900214 0.102912 0.02568 0.0439213 -0.0308249 0.110754 0.13508 -0.161986 -0.136798 0.00690937 -0.0845044 0.064932 -0.11084 0.122766 0.0567679 -0.0160103 0.136499 -0.060319 -0.0676865 0.0502073 -0.0307409 -0.0273936 -0.133361 0.0760318 -0.0875874 -0.0562772 -0.00484404 0.107122 -0.0710782 -0.061013 0.052285 0.17569 -0.0945864 -0.0777523 -0.0124306 0.161384 0.0530254 0.0615073 0.0367129 0.0253037 -0.0716762 0.0616723 0.0261763 -0.0395134 
