0.0787172 -0.0409798 -0.0590645 0.00874454 0.00423976 0.189961 0.076071 -0.0215462 -0.0642229 0.0227195 0.049351 0.0855894 0.163188 -0.148454 -0.0599365 -0.0320082 -0.129133 0.138066 -0.0747493 0.114913 0.191225 -0.0757342 0.0665339 0.169538 -0.0899062 -0.0318251 -0.130929 -0.320234 -0.000989092 0.169721 -0.0594015 0.0954606 -0.0504689 0.0976917 0.0340425 -0.027479 -0.0474411 0.0854618 0.0104326 -0.0409391 -0.0296061 -0.152132 -0.0946303 0.0515995 -0.137096 -0.12776 0.10408 0.022761 -0.107739 0.0659834 0.0712309 -0.0885415 0.0109519 0.0684594 0.0629158 0.0396683 0.0923627 0.0474505 -0.0400006 -0.0752263 0.00805434 0.0164883 0.153826 -0.114999 0.0718384 -0.140837 0.0275928 -0.0469402 -0.0825418 0.00502156 -0.0950715 0.0232758 -0.120796 0.00107337 -0.0573042 -0.0255974 -0.0188035 -0.00473248 0.0653947 0.137514 -0.0478282 -0.0197224 -0.0349185 -0.0265164 -0.0589424 0.0558855 0.0858962 -0.0427362 0.0051142 0.0309373 0.0694958 -0.126159 -0.00258214 0.0450875 -0.167637 -0.0573465 -0.0859729 0.0960204 0.0829441 0.0336333 0.173116 0.0453433 -0.084216 0.136554 0.0779449 -0.0266875 -0.0348797 0.0925986 -0.0486934 0.0184563 -0.084564 0.0762193 -0.0493179 -0.124199 0.00972193 0.164936 -0.0409164 -0.0722616 -0.0350432 0.14698 0.0190275 -0.0875735 -0.0249521 0.0203026 -0.0678527 0.0960118 -0.0422491 0.0110399 
0.090148 -0.112199 -0.0473646 -0.0537016 0.0343807 0.151481 0.069979 0.029914 -0.0998884 -0.0119722 0.0300713 0.116467 0.206525 -0.0678044 -0.0733191 -0.0747064 -0.0758532 0.114153 -0.139037 0.174898 0.155367 -0.0932895 0.0942224 0.150433 -0.14876 0.00356512 -0.096086 -0.243449 -0.0248857 0.0783659 -0.0833548 0.0887151 -0.0660081 0.118727 -0.0340588 -0.030945 -0.0858791 0.181443 -0.0406453 -0.0401379 -0.0126891 -0.0837903 -0.147503 0.0512056 -0.166295 -0.151908 0.0475927 0.0358816 -0.0964045 0.107845 0.0180782 -0.145222 -0.0361592 0.0847475 0.0380027 -0.00718955 0.0470704 0.11521 -0.0481438 -0.100201 0.0194909 0.0471035 0.158931 -0.068055 0.0453112 -0.114173 0.025984 0.0284699 -0.0840557 -0.0267124 -0.0653133 -0.0012557 -0.0482901 0.026019 -0.0799875 -0.0308742 -0.011493 -0.054976 0.100187 0.097174 -0.0823897 -0.036393 -0.0410637 -0.0740074 -0.0752611 -0.00757929 0.129418 0.0118124 0.0451125 0.0026219 0.0916419 -0.149994 0.0484194 0.0412247 -0.137155 -0.0601719 -0.0684696 0.0661345 0.0240078 0.0252526 0.126706 0.035392 -0.113986 0.179778 0.0594844 -0.0116826 -0.0898553 0.0797743 -0.0452536 -0.0479089 -0.0507888 0.140327 -0.0536465 -0.011577 -0.00833375 0.129034 -0.0631355 -0.0811948 -0.0294693 0.135073 -0.0473115 -0.0660174 -0.0436046 0.0318812 -0.0614806 0.0420538 -0.105804 -0.036168 
0.0724016 -0.0956923 -0.0532051 -0.0359045 0.0428941 0.140808 0.0400405 0.0368197 -0.12362 0.00396037 0.0411693 0.120543 0.185635 -0.10978 -0.0940469 -0.0189925 -0.0930003 0.107115 -0.101359 0.195516 0.197017 -0.114393 0.105018 0.157475 -0.104279 0.0286193 -0.0937295 -0.271257 0.0394125 0.0911819 -0.077685 0.0619683 -0.0614472 0.0847623 -0.0447085 -0.0279173 -0.132905 0.164024 -0.0297751 -0.0417345 -0.0520198 -0.0792958 -0.136514 0.0770059 -0.146957 -0.14978 0.100589 0.0126284 -0.106565 0.0829351 0.0335015 -0.096596 -0.0428181 0.0556306 0.0487236 -0.0105611 0.0727698 0.105095 -0.0444269 -0.106971 0.0146878 0.0146922 0.193845 -0.0400342 0.0537861 -0.134733 0.000681156 0.0104495 -0.0607969 -0.0100534 -0.0627663 0.0483151 -0.0733657 0.0236024 -0.0664907 -0.0380299 -0.0190296 -0.00458742 0.0800618 0.131921 -0.0757016 -0.0273572 -0.0214016 -0.0517218 -0.0643767 0.00633932 0.114028 0.0472671 0.0589131 -0.028179 0.0747442 -0.0945964 -0.0129667 0.0718629 -0.11047 -0.078462 -0.0557869 0.105758 0.0217226 0.00153419 0.107539 0.0161583 -0.104203 0.155726 0.0244396 0.0183504 -0.0663104 0.0971475 0.0271258 -0.0667228 -0.0637238 0.152167 -0.0623784 -0.0451975 0.0351464 0.149706 -0.0677604 -0.0826263 -0.0322482 0.152416 -0.0693181 -0.0527023 -0.0339457 0.00110584 -0.101098 0.0934381 -0.0675451 -0.00610447 
0.0341194 -0.0639929 0.0555886 -0.0235236 0.0540501 0.183551 0.066653 0.00375861 0.0239975 -0.0296143 -0.0168161 0.0556576 0.124254 -0.130107 0.0058005 -0.0606345 -0.168165 0.149337 -0.148264 0.0409576 0.221498 0.00953246 0.0740958 0.183209 -0.0875267 -0.090238 -0.168515 -0.302849 -0.013796 0.126685 0.0294385 0.0431608 -0.0702097 0.101859 0.0935881 -0.0115869 -0.016778 0.0777598 -0.0335887 -0.0145096 0.0269384 -0.0679961 -0.113807 0.0601085 -0.141792 -0.139767 0.0567456 0.0500005 -0.0262893 0.0560806 0.0423861 -0.120625 0.0241548 0.0557559 0.073985 0.0374906 0.107673 0.0479117 -0.0320049 -0.12898 0.00241833 0.0305674 0.0672306 -0.0636288 0.0496365 -0.173155 0.0658977 -0.0110828 -0.0332787 0.0605066 -0.0359374 0.0433732 -0.0663306 -0.0487026 -0.0862828 -0.0115638 -0.121247 0.00384148 0.0789266 0.119219 0.0014088 0.0765781 -0.0153641 0.0031733 -0.0118749 0.0227874 0.130175 0.0256399 -0.0442015 0.0394648 0.0962065 -0.11331 0.0221243 -0.0238745 -0.194523 -0.0565488 -0.126023 0.083608 0.0423024 0.0607799 0.18744 0.0236508 -0.0703773 0.0916731 0.0788134 -0.0892042 -0.0787913 0.0176555 -0.0194049 0.0671983 -0.0645812 0.0666251 -0.106607 -0.0969439 -0.00205787 0.201724 -0.0535025 -0.0898875 -0.104052 0.111998 0.0664291 -0.00745802 -0.0627708 0.0328059 -0.0967523 0.0488208 -0.0666127 0.0368111 
0.0250119 -0.100423 0.0549949 -0.0317852 0.0367597 0.18485 0.0483011 -0.0106693 -0.0184214 -0.0465907 -0.029662 0.0782436 0.12787 -0.0987169 -0.00906425 -0.0893286 -0.179722 0.140169 -0.10589 0.0611321 0.195321 -0.00385398 0.0684037 0.199133 -0.0940306 -0.0497992 -0.141704 -0.289453 -0.0507723 0.118921 -0.00249538 0.0175905 -0.081234 0.0905377 0.0814476 -0.00154576 -0.0328073 0.0654839 -0.0348519 -0.0147035 0.0280021 -0.0622401 -0.0966044 0.0587937 -0.148234 -0.145836 0.0794608 0.0362834 -0.0342127 0.0740823 0.0385079 -0.157942 0.0429379 0.0809434 0.102626 0.0379798 0.103941 0.0770754 -0.0220596 -0.139136 0.0223054 0.0729218 0.0878914 -0.0524321 0.0410718 -0.145354 0.0722598 -0.0207387 -0.0342212 0.0462362 -0.0421682 0.0396216 -0.0504376 -0.0305311 -0.0696882 -0.000606271 -0.113976 -0.0256429 0.099261 0.113379 -0.00198912 0.0722867 -0.0089501 -0.00965178 -0.0337043 0.0181333 0.134792 0.0282513 -0.0344942 0.0346325 0.102377 -0.104359 0.0675885 -0.0142161 -0.208587 -0.05462 -0.118048 0.101973 0.0630621 0.0468597 0.170759 0.0330577 -0.0752976 0.0893624 0.0714547 -0.0670973 -0.0881447 0.0168627 -0.0754871 0.0691374 -0.0445492 0.0715975 -0.0778381 -0.104781 -0.032977 0.199399 -0.0468898 -0.089487 -0.112129 0.0967005 0.0547411 -0.0393628 -0.0565706 -0.00794363 -0.126761 0.0775807 -0.0850859 0.0404197 
0.0298293 -0.0602404 -0.0498358 -0.0393433 0.0329929 0.187247 0.0174882 -0.0344364 -0.0251947 -0.0175284 0.0010035 0.0525729 0.124639 -0.105269 -0.0610847 -0.0879866 -0.176333 0.146724 -0.0787456 0.0810699 0.188892 -0.0614756 0.102342 0.188051 -0.0528105 -0.0359106 -0.0746466 -0.300692 -0.0139663 0.121609 0.00358523 0.00526408 -0.0555447 0.0630927 0.0691422 -0.0102788 -0.0680501 0.0777809 -0.040749 -0.0621847 -0.00299633 -0.0978585 -0.107565 0.134253 -0.166649 -0.126659 0.107843 0.0745817 -0.0633267 0.0672649 0.0129209 -0.0867555 0.0663759 0.0402158 0.0829969 0.0341261 0.111377 0.085483 0.00532997 -0.2039 -0.00484242 0.0525634 0.169736 -0.0181962 0.0115808 -0.114377 0.0442358 -0.0060099 -0.0140811 0.0640775 -0.0744714 0.0259579 -0.0718733 -0.0505902 -0.0529065 -0.0442249 -0.114423 -0.00833328 0.077517 0.131817 -0.0301372 0.0705065 -0.036125 -0.0393626 -0.0316046 0.0244672 0.0863817 0.0370104 0.0234585 0.0306514 0.113805 -0.0832163 0.0329258 -0.0379418 -0.165584 -0.0982439 -0.114916 0.15296 0.0747694 -0.0251035 0.188636 0.0345552 -0.0251353 0.0713146 0.0257952 -0.0375895 -0.0785928 0.0510093 -0.0252497 0.0483113 0.0040738 0.119933 -0.0692016 -0.101544 -0.0141526 0.185786 -0.0661518 -0.112061 -0.0291083 0.103839 0.0539233 -0.0669651 -0.0474984 -0.0130761 -0.160997 0.072745 -0.055299 0.0586232 
0.0588465 -0.0989577 -0.00186685 -0.075576 0.0670279 0.163163 0.0281809 0.0363347 -0.027392 -0.106968 -0.0573689 0.0838449 0.0937646 -0.116267 -0.0354182 -0.0610333 -0.185414 0.0541538 -0.151316 0.103294 0.186051 -0.00395039 0.117214 0.170877 -0.098481 -0.0242748 -0.0634766 -0.286779 -0.0401251 0.054697 -0.0215947 -0.00533691 -0.0759481 0.0950829 0.0244049 -0.00523834 -0.0898522 0.135002 -0.112164 -0.0140468 0.0107092 -0.0318481 -0.132033 0.122108 -0.130242 -0.0464223 0.0921619 0.0399568 -0.0946464 0.125278 0.00820998 -0.129901 0.0206503 0.0389881 0.118621 -0.00794748 0.072848 0.147814 -0.0186807 -0.173281 0.0197611 0.0603387 0.149402 -0.00210352 0.0425133 -0.171983 0.0201776 0.0521305 -0.00814621 0.0706126 -0.0376469 0.0389655 -0.0327303 -0.0193919 -0.0625044 -0.0154086 -0.115631 -0.0203491 0.0883917 0.13206 0.00538924 0.054784 -0.0513291 -0.0825508 -0.0584636 -0.0248645 0.115589 0.0654918 -0.0121938 0.046897 0.130266 -0.105452 -0.0253303 -0.0259756 -0.135773 -0.00785781 -0.0545601 0.0779671 0.0547494 0.00415464 0.124513 0.00464891 -0.0790688 0.0769262 -0.0475821 -0.0641545 -0.16239 0.0479609 -0.0432981 -0.0130663 0.0575824 0.172372 -0.0986786 -0.069608 0.018832 0.192287 -0.0951568 -0.112323 -0.0456868 0.126269 0.0292258 0.0232096 -0.0120023 0.0141099 -0.0946432 0.0331387 -0.0580166 -0.0306577 
0.0486985 -0.0594378 -0.0120329 -0.0589116 0.0510133 0.184642 0.00397393 -0.00523878 -0.0280208 -0.101222 -0.0551797 0.0648612 0.0619727 -0.137421 -0.0280239 -0.0624652 -0.200866 0.0391803 -0.104612 0.103322 0.161584 -0.00821598 0.120609 0.191653 -0.0711424 -0.0243324 -0.0523208 -0.303704 -0.0344996 0.0642916 -0.0059541 -0.0250228 -0.0715107 0.0827832 0.0414611 0.0170239 -0.0709875 0.104566 -0.0987115 -0.015229 0.0036804 -0.0676776 -0.126917 0.111128 -0.115177 -0.00109211 0.127868 0.049955 -0.122071 0.127219 0.00500206 -0.0930836 0.0580383 0.0257645 0.133926 0.00255673 0.0851197 0.142216 -0.0097786 -0.175652 0.0158168 0.0828938 0.171312 -0.0274721 0.0480327 -0.162782 0.0228471 0.0354066 -0.0119894 0.0967991 -0.052394 0.0409055 -0.0621681 -0.0179309 -0.0191725 -0.0178768 -0.11944 0.00751155 0.0888472 0.143728 0.0022927 0.0710545 -0.0637586 -0.0809482 -0.0484116 -0.00576565 0.0772728 0.0506517 -0.0265824 0.0654894 0.139873 -0.0945672 -0.0144189 -0.0206346 -0.131109 -0.0186968 -0.0473676 0.0876239 0.0836723 -0.0187425 0.1347 0.0106592 -0.0841379 0.0529664 -0.0542663 -0.0418572 -0.138871 0.044639 -0.0611879 0.0103551 0.075153 0.169688 -0.0663491 -0.0983525 0.0136003 0.193095 -0.112782 -0.120091 -0.0350087 0.133142 0.0507636 0.00551375 -0.00470126 0.0060037 -0.104827 0.0674987 -0.0361966 -0.0250935 
0.0466597 -0.0549297 0.0164628 -0.0297564 0.0627811 0.208824 0.0424318 -0.0203151 -0.0326729 -0.0834845 -0.051874 0.0726368 0.0694158 -0.132008 -0.00377709 -0.0525968 -0.180725 0.0829938 -0.0855136 0.0660243 0.188359 0.00486303 0.0783729 0.210209 -0.0630473 -0.0501482 -0.108255 -0.321102 -0.0266706 0.11537 -0.00552029 0.0168763 -0.0860443 0.0838032 0.0648303 0.0210448 -0.0441049 0.0434574 -0.0581257 -0.000278243 0.0308946 -0.0656448 -0.0969104 0.0565172 -0.106755 -0.0109256 0.136754 0.0171216 -0.120663 0.0637495 0.0297126 -0.116585 0.0683763 0.0364378 0.12223 0.0417393 0.10883 0.123366 -0.0188632 -0.126205 0.0294335 0.103078 0.12784 -0.0797586 0.0715609 -0.149853 0.0353117 0.00226449 -0.0260936 0.0870324 -0.0460566 0.0583557 -0.0834643 -0.0384956 -0.0242175 0.0205377 -0.113171 0.0212968 0.0775982 0.105707 -0.00453353 0.106853 -0.0488099 -0.045234 -0.0500138 0.0414211 0.0940283 0.0138982 -0.0838612 0.0643513 0.124529 -0.0939883 -0.0053986 -0.00865724 -0.160814 -0.0067955 -0.0624626 0.0869971 0.0953812 0.0295776 0.147115 0.00340998 -0.0851753 0.0736588 -0.0250567 -0.0458052 -0.121418 0.0361094 -0.108518 0.0411972 0.0203041 0.103279 -0.0594045 -0.148525 0.000683123 0.202526 -0.117946 -0.111822 -0.0783255 0.125352 0.0663026 -0.013226 -0.0207151 -0.00076146 -0.114034 0.107392 -0.0707861 -0.0221566 
0.0558969 -0.0623183 -0.0556617 -0.0699065 0.0297928 0.194135 -0.00250407 0.0400078 -0.0557817 -0.0505155 -0.00665534 0.0746334 0.0836242 -0.19201 -0.0735359 -0.0240747 -0.173905 0.0656283 -0.1003 0.11833 0.181025 -0.0321697 0.0926855 0.151576 -0.108918 0.0357757 -0.0342888 -0.335453 -0.00122009 0.0369609 -0.0302497 0.00488195 -0.0651048 0.0824869 0.0132997 -0.00191602 -0.0717484 0.113836 -0.0592071 -0.00184672 0.00591666 -0.0924014 -0.14838 0.126467 -0.105717 -0.0381578 0.142196 0.0220675 -0.169235 0.0842729 0.00154631 -0.0991977 -0.00416263 0.0449802 0.0713378 0.0101055 0.104328 0.0952139 -0.0238486 -0.163628 0.0274306 0.0401596 0.20581 -0.0294916 0.065135 -0.189172 0.0200624 0.0275029 0.0328975 0.0693685 -0.0682418 0.0154593 -0.0726768 -0.0168468 -0.0279732 -0.0470846 -0.114445 0.0773783 0.0551739 0.106613 -0.0493446 0.0791387 -0.0574916 -0.0690299 -0.0719647 0.0481619 0.108765 0.0473266 -0.00710583 0.0218008 0.124782 -0.0951774 -0.0605902 0.0046662 -0.107997 -0.0244922 -0.0321654 0.0866108 0.0409621 -0.0103482 0.110861 -0.0172312 -0.101271 0.0939191 -0.00304566 -0.0356976 -0.105371 0.0747049 -0.0802854 -0.0206673 0.0121589 0.156997 -0.0509785 -0.106544 0.0373973 0.147884 -0.139828 -0.161878 -0.0223231 0.09077 0.0276232 -0.00276372 0.0231192 0.0190748 -0.0838315 0.0542297 -0.0572127 -0.019186 
-0.027922 -0.000440844 0.0694622 -0.0967275 -0.0470148 0.213737 -0.065507 0.0733491 -0.0750549 0.0324109 0.00929844 0.0140007 0.0755142 -0.174678 0.0239478 -0.067648 -0.222255 0.0408627 -0.014849 0.0410602 0.160844 -0.0260089 0.0867934 0.164802 -0.0574832 0.0481708 -0.0235201 -0.282162 0.0615236 -0.012907 0.0375503 -0.0906385 -0.0390018 0.0555342 0.0131486 0.0255246 -0.0922762 0.0751536 -0.0209663 0.0645717 0.0144853 -0.142189 -0.191163 0.0769947 -0.0855217 -0.0872621 0.124437 0.0109344 -0.168158 0.0239008 0.0146087 -0.00313439 0.0242695 0.0310287 0.016357 0.0579412 0.142424 0.0479268 -0.02374 -0.18329 -0.0155323 0.0473662 0.144758 0.00170211 0.0327156 -0.0980498 0.0793522 0.00188069 0.0255383 0.0990562 -0.0818047 0.0333154 -0.103663 -0.00965924 0.0711407 -0.0627987 -0.169455 0.0637339 0.0981925 0.16909 -0.0893252 0.0521439 0.0405151 -0.000474744 -0.0355007 0.0265449 0.121605 0.0602075 0.0232314 0.0103764 0.0751454 -0.0302511 0.0304748 0.0631356 -0.164144 -0.10453 -0.0528395 0.119498 0.0318052 -0.0271463 0.118544 0.010647 -0.107677 0.0426196 0.0263 0.0165707 -0.0526712 0.0199186 -0.0178809 -0.0480738 -0.00954589 0.139729 -0.051809 -0.145689 0.0603824 0.158484 -0.13061 -0.142663 -0.0075547 0.102029 0.0713206 -0.0953305 -0.0386509 -0.0506603 -0.0927398 0.127773 -0.00469348 0.0903535 
0.00624205 0.0325804 0.0200108 -0.0806202 -0.0390059 0.241399 -0.0218766 0.0614053 -0.141049 0.144268 -0.00675743 -0.00705703 0.113495 -0.138612 0.0981884 -0.0949725 -0.142257 0.057087 0.0594041 0.0250592 0.0997447 -0.0462542 0.0438701 0.162757 -0.0129129 0.0303434 -0.059493 -0.261067 0.070821 0.0417714 0.011889 -0.0220913 -0.0648365 0.0449972 0.0275526 0.0118141 -0.0577253 0.00781011 0.0214791 0.003707 0.0327206 -0.194076 -0.137451 0.0445768 -0.116461 -0.0505008 0.131921 0.0522448 -0.17309 -0.0267029 0.0695315 0.0193199 0.0660558 0.00889146 0.0266857 0.0674156 0.119123 0.021454 0.0204278 -0.183157 -0.0194613 0.0552135 0.0953184 -0.0611026 0.0173348 -0.0085856 0.0853991 0.00313328 -0.0152022 0.0268946 -0.100129 0.0613514 -0.139843 -0.0380166 0.0734058 -0.0242626 -0.135379 0.0514921 0.145861 0.178179 -0.08034 0.0376292 0.0478379 0.0127009 0.0159467 0.00905292 0.103815 0.0244828 0.067389 0.0274798 0.0342725 0.00296311 0.0521672 0.0764967 -0.217746 -0.13163 -0.00897364 0.119288 0.0501792 -0.0743257 0.158948 0.0532657 -0.0536417 0.0406704 -0.0293513 0.0256141 -0.0526068 0.0335898 -0.0288923 0.0138508 0.0208401 0.108775 -0.0528391 -0.187067 0.0322655 0.11111 -0.144617 -0.144328 -0.027467 0.0930902 0.0866131 -0.168905 -0.021787 -0.0444871 -0.0891462 0.133016 -0.0122523 0.0723707 
-0.0450792 0.0614519 0.0637472 -0.0707275 -0.0689718 0.226482 -0.0725241 0.0549117 -0.13622 0.139351 0.0113774 -0.0246887 0.0496388 -0.12113 0.105923 -0.0922909 -0.0975742 0.0678497 0.12766 -0.0385213 0.0820188 -0.0308211 0.0119344 0.180792 0.0250027 0.0541192 -0.0116974 -0.223438 0.0939288 0.00978083 0.0557362 -0.0825121 -0.0407392 0.00736658 0.0345701 0.0357334 -0.0646579 -0.0372 0.0416053 0.0420775 0.0181391 -0.159995 -0.15242 0.0261285 -0.0593139 -0.0305931 0.139438 0.00357986 -0.202132 -0.106845 0.0676522 0.0581912 0.0873971 -0.0286 -0.00766869 0.109138 0.126654 0.0420332 0.00743387 -0.150825 -0.0141093 0.0647779 0.0821713 -0.0650334 0.0398827 0.00513341 0.0939675 -0.0170053 -0.0128937 0.0727485 -0.0808491 0.0465525 -0.151926 -0.0639568 0.108196 -0.0229447 -0.14844 0.10423 0.121399 0.135742 -0.136039 0.0755012 0.0698843 0.0133131 0.0105149 0.00678737 0.0941395 -0.00298205 0.0175053 0.00920478 0.00138132 0.0264149 0.0791968 0.0920288 -0.155922 -0.117486 0.00769427 0.0910788 0.0321102 -0.0580394 0.105673 0.0526919 -0.0808255 0.0176895 -0.00922981 0.0520949 -0.00778546 -0.0387797 -0.043857 -0.0208668 0.0156794 0.0650832 -0.0148284 -0.19584 0.0513282 0.0944576 -0.171294 -0.169481 -0.00324524 0.066263 0.0931994 -0.182492 -0.0633883 -0.089921 -0.0682719 0.17973 -0.0123998 0.0744048 
-0.00683606 -0.0317983 0.0679507 -0.0992534 0.0106325 0.178445 -0.0748399 0.0298915 -0.0683447 -0.0138802 -0.0586617 -0.0107169 0.0545873 -0.118232 0.0829041 -0.0480879 -0.184481 -0.00472514 0.0260092 0.041922 0.158512 0.0282949 0.11507 0.163997 -0.0215447 0.0193231 -0.0394284 -0.302117 0.0288188 0.0282064 0.0586259 -0.100745 -0.0333112 0.0388553 0.0684824 0.0476844 -0.0747331 0.0659081 -0.0368777 0.0273089 -0.0214237 -0.0876708 -0.16823 0.0835941 -0.0640716 0.0465478 0.125237 0.040874 -0.135706 0.0329323 0.0102131 -0.0180415 0.098455 -0.0148405 0.066747 0.0263778 0.144862 0.0715826 -0.00819686 -0.162289 0.0241736 0.0670378 0.0917275 0.0198563 0.0435986 -0.150455 0.0590562 0.0616026 0.0572332 0.0885927 -0.0485222 0.0566483 -0.126285 -0.0864657 0.0351852 -0.0168079 -0.178469 0.0556324 0.122306 0.220512 -0.0225613 0.0607915 -0.00452804 -0.00747109 -0.00923168 -0.0289797 0.0877866 0.0559406 -0.0381765 0.0282757 0.0851313 0.0215984 0.0143618 0.0560767 -0.183859 -0.0546471 -0.0298063 0.119445 0.052385 -0.0602894 0.149361 0.0197639 -0.0974849 -0.0177735 -0.0524841 -0.03141 -0.0976333 -0.00425834 0.00683237 0.0112959 0.0591544 0.114211 -0.0860155 -0.158856 0.0380024 0.211557 -0.158653 -0.150309 -0.0838259 0.126884 0.0658655 -0.0271367 -0.0436467 -0.0267609 -0.126448 0.106151 -0.00256569 0.055405 
0.0322427 -0.0201951 -0.00479438 -0.110962 -0.0147527 0.158275 -0.0870032 0.00947353 -0.00146263 -0.10813 -0.0506414 0.0220418 0.0467266 -0.1315 -0.0222172 -0.0171678 -0.218974 -0.0554404 -0.0828329 0.0525546 0.15608 0.0844334 0.0802969 0.115917 -0.0824129 0.0566704 0.0263084 -0.268691 -0.0608014 0.0636472 -0.00592969 -0.0775071 -0.0249947 0.0833518 0.039587 0.0387743 -0.0394505 0.0988727 -0.0719916 0.0526434 -0.0487101 -0.0899177 -0.108746 0.138983 -0.0162011 0.0658169 0.131169 0.031672 -0.134663 0.120619 0.0365885 -0.0470865 0.0494215 0.0490368 0.131206 0.00175953 0.0816771 0.0732481 -0.000117139 -0.175181 0.0239829 0.0215423 0.135047 0.0395809 0.0138256 -0.233629 0.0448721 0.0927056 0.0834635 0.0857923 -0.03326 -0.015393 -0.0787295 -0.0847299 0.0187433 -0.0127018 -0.154888 0.0193263 0.0472797 0.209313 0.0649477 0.0601135 -0.0292962 -0.0308614 -0.0791611 -0.00575544 0.0806223 0.0153876 -0.0228212 0.0831918 0.0608275 -0.0929015 -0.0597317 0.0249269 -0.166388 0.0432411 -0.0229874 0.0601269 0.0839596 -0.0443874 0.119154 0.0356082 -0.096116 0.0216211 -0.0774166 -0.083633 -0.184681 0.0404315 -0.108022 -0.00618303 0.101169 0.125486 -0.121417 -0.0930507 0.00564324 0.198445 -0.124923 -0.142215 -0.0636963 0.0882555 0.0875271 0.0358921 0.0626994 -0.00244439 -0.0452828 0.0280687 0.0285297 0.00677645 
0.0488923 -0.024468 -0.0189283 -0.12715 0.00490807 0.175276 -0.0695697 0.036726 0.0167435 -0.126705 -0.0363926 0.0263786 0.0557607 -0.131366 -0.0282273 -0.0443446 -0.208703 -0.0336192 -0.113696 0.0552072 0.162313 0.0887953 0.0850981 0.114489 -0.0972175 0.0127822 0.0313314 -0.258272 -0.065055 0.0552499 -0.00181818 -0.099869 -0.0120344 0.0865721 0.0383671 0.0344184 -0.0370127 0.0796086 -0.0983556 0.045024 -0.0351108 -0.0783779 -0.121418 0.159503 -0.0486055 0.0573281 0.111426 0.0369629 -0.144198 0.138639 0.00261372 -0.0535429 0.0369029 0.0467791 0.10243 0.00646184 0.0631711 0.0811651 -0.0182908 -0.168729 0.00610937 0.029966 0.151508 0.0296932 0.00246851 -0.238946 0.0417965 0.0958958 0.0687488 0.0939269 -0.0129642 -0.035087 -0.0730784 -0.104878 0.00644413 0.00215552 -0.16076 0.0115337 0.0424239 0.182842 0.0388961 0.0631439 -0.0403721 -0.0263819 -0.0780049 0.0284339 0.0799686 0.00625519 -0.0302328 0.100589 0.0889319 -0.122355 -0.0765342 0.0090376 -0.146568 0.0238655 -0.0487845 0.0528208 0.0616817 -0.0397855 0.122939 0.0307171 -0.0831771 0.00405768 -0.0803643 -0.0718419 -0.178359 0.0407631 -0.116523 -0.0101878 0.108231 0.106853 -0.106968 -0.0823597 -0.000234 0.194629 -0.126543 -0.139699 -0.0387593 0.100637 0.0854984 0.0221073 0.0405369 0.0246969 -0.03317 0.00993312 0.0285852 0.00341362 
0.0467678 -0.0158844 0.051527 -0.099773 0.0279101 0.212841 -0.0428797 0.025112 -0.0407456 -0.075323 -0.0658288 0.00912498 0.0935297 -0.0749206 0.0896937 -0.104739 -0.147941 -0.000986796 -0.049902 0.066317 0.143032 0.0414325 0.122309 0.19983 -0.0436893 -0.0640351 -0.0573217 -0.265238 -0.0337837 0.0566606 0.0542974 -0.103534 -0.0240952 0.0826181 0.0592633 0.0557815 -0.0214587 0.0741677 -0.0897724 0.0228676 -0.00829552 -0.0628936 -0.131799 0.0691883 -0.114212 0.0311897 0.115324 0.0455888 -0.119506 0.111422 0.0141013 -0.0637611 0.0919332 0.0327122 0.0952544 0.0300141 0.0891219 0.107878 0.00770038 -0.18637 -0.0178722 0.103635 0.0813305 -0.0712456 0.0252115 -0.143232 0.0764189 0.0606788 -0.0233259 0.0792486 -0.0106284 0.0282197 -0.107121 -0.0946501 0.0395143 0.0323687 -0.160302 -0.00534637 0.134185 0.196538 -0.0229805 0.0578102 -0.0137736 -0.017254 -0.00916503 0.00157335 0.075686 0.0133209 -0.0461531 0.0803319 0.0935995 -0.0877499 0.043243 0.0158384 -0.187223 -0.0629631 -0.0493744 0.106228 0.0480734 -0.0418681 0.140618 0.0484354 -0.0761878 0.0203845 -0.0996997 -0.0297266 -0.142509 -0.00708006 -0.0583501 0.0138946 0.0799969 0.102168 -0.0784159 -0.11238 -0.0202555 0.210522 -0.147124 -0.133484 -0.0910074 0.153236 0.0776398 -0.0427229 -0.0495839 0.011671 -0.0851418 0.0700159 -0.00941755 0.0229961 
0.0769265 -0.0049595 0.0617092 -0.0522434 0.0862767 0.259983 0.0388969 -0.0238086 0.000729309 -0.109287 -0.0549242 0.0367225 0.0822214 -0.0757233 0.0708006 -0.111974 -0.143471 0.0727671 -0.112338 0.043836 0.157447 0.0694641 0.0939426 0.197087 -0.0465475 -0.145752 -0.137866 -0.23213 -0.0219426 0.104231 0.0451777 -0.0243819 -0.0705335 0.0884052 0.0879833 0.0420525 -0.00326392 0.0257521 -0.0712216 0.00047657 0.0391982 -0.032945 -0.109689 -0.00433136 -0.156263 -0.0156817 0.073086 0.0493233 -0.0955844 0.106081 0.00587715 -0.0609036 0.0851518 0.0462347 0.078734 0.0282131 0.0786345 0.118239 -0.050864 -0.13651 -0.0337461 0.141986 0.0951486 -0.147822 0.0412003 -0.0993691 0.0729707 0.0242174 -0.0959459 0.100996 0.0222905 0.0562963 -0.0819964 -0.0562697 -0.000950899 0.055991 -0.133247 -0.0589789 0.107553 0.114842 0.00338713 0.110968 -0.00819734 -0.0131404 0.0147351 0.0347344 0.0634623 0.00403905 -0.0914738 0.118366 0.143346 -0.132922 0.0346742 0.0169745 -0.170975 -0.0777858 -0.0796485 0.0804922 0.0533726 0.0231726 0.169946 0.0368362 -0.0793212 0.045937 -0.0747574 -0.00934684 -0.0959322 -0.0164949 -0.0813854 0.0654205 0.0546538 0.0606619 -0.0538344 -0.0895854 -0.01717 0.18566 -0.135734 -0.0648715 -0.0838092 0.15119 0.0835599 -0.0531221 -0.0480077 0.017551 -0.0617798 0.0954044 -0.0249679 -0.00992947 
0.056891 -0.0497825 0.0359105 -0.0622175 0.0836623 0.230458 0.0247499 0.0129157 0.0161085 -0.116149 -0.0528944 0.0452961 0.0921609 -0.0918726 0.0275238 -0.0681875 -0.167498 0.0787012 -0.132945 0.0517225 0.208243 0.0340833 0.0932513 0.198094 -0.051776 -0.127367 -0.129196 -0.276109 -0.0395897 0.100662 0.0534815 -0.0354764 -0.0676502 0.0860617 0.0675048 0.0431121 -0.0407547 0.0267218 -0.0805481 0.0132053 0.02546 -0.0185605 -0.101735 0.0522478 -0.110935 -0.0453989 0.0882463 0.0306678 -0.0820902 0.0968574 -0.00713008 -0.123845 0.0662205 0.0376984 0.0843298 0.0448689 0.0808714 0.132295 -0.027377 -0.147223 -0.01253 0.117111 0.101107 -0.103016 0.0362029 -0.145846 0.0514265 0.037069 -0.0439533 0.0787862 0.0187464 0.0614496 -0.0758184 -0.0913896 -0.0288706 0.050555 -0.136566 -0.0242441 0.0799629 0.119486 -0.00204635 0.0978125 -0.0261103 -0.0127611 -0.0395165 0.0726668 0.0882367 0.0129184 -0.082614 0.0702589 0.124744 -0.128718 -0.00256415 -0.00536191 -0.149681 -0.0268375 -0.105846 0.0865749 0.0323268 0.0437841 0.153226 -0.00164561 -0.0781708 0.0457587 -0.0563965 -0.0245645 -0.133165 -0.0103585 -0.0969392 0.0411087 0.0209434 0.063435 -0.0762171 -0.105867 -0.00870558 0.218833 -0.123584 -0.0752426 -0.0901027 0.14086 0.0684002 -0.0197196 -0.0413095 0.0240342 -0.0999876 0.081532 -0.0585744 0.00377028 
0.0499454 -0.0147576 -0.00547558 -0.101807 -0.00438753 0.164094 0.00499068 0.0819392 0.0525054 -0.165575 -0.0206672 0.0603809 0.0656842 -0.199799 -0.0853849 -0.0682166 -0.221576 -0.0320345 -0.209807 0.0765941 0.172549 0.0507778 0.0738443 0.0529085 -0.150253 -0.028511 -0.0535267 -0.253905 -0.0743314 0.0155696 -0.0200938 -0.0736195 -0.0109469 0.109238 0.0157171 -0.0295103 -0.0324579 0.141293 -0.131369 0.044288 0.00153686 -0.0596652 -0.12643 0.136567 -0.0838356 -0.0219031 0.0715137 -0.0101357 -0.127143 0.161381 -0.0319185 -0.077846 -0.0224118 0.0867399 0.0674069 -0.0187564 0.039372 0.0543017 -0.0738836 -0.150141 -0.0128501 0.0171895 0.151798 0.00394322 0.0325968 -0.242501 0.0533976 0.0486707 0.026837 0.0578905 0.0103441 -0.0574146 -0.0218868 -0.0278536 -0.00905322 0.0142205 -0.155216 -0.0355465 0.0232504 0.153295 -0.0137994 0.0257129 -0.0251261 -0.00255472 -0.0800988 0.0684434 0.112212 0.0165671 -0.0329143 0.071255 0.095301 -0.191694 -0.0753236 -0.0165362 -0.136204 -0.0157314 -0.0462956 0.017899 0.0121965 0.0268578 0.0889041 0.0241272 -0.0878285 0.0556903 -0.0271062 -0.0756046 -0.129026 0.107665 -0.108902 -0.0335034 0.0615235 0.0889741 -0.118235 -0.0560237 0.00196469 0.176535 -0.113425 -0.0931348 -9.1402e-05 0.102137 0.0313092 0.0471298 0.0144027 0.0531791 0.0469684 -0.0187834 0.019111 -0.0135666 
0.0440861 -0.00477174 0.0277904 -0.0909299 0.00151269 0.184402 0.0123875 0.07108 0.0467867 -0.143578 0.0218505 0.0900968 0.0705063 -0.188275 -0.094556 -0.0880934 -0.2397 0.0198861 -0.197025 0.0559112 0.205451 0.0524128 0.0535228 0.0775829 -0.124504 -0.0432493 -0.0529477 -0.228894 -0.044541 0.0569528 -0.0309666 -0.0942437 -0.022908 0.104759 0.0242903 -0.0359461 -0.0642346 0.0912823 -0.0999103 0.0446253 -0.00327809 -0.0693665 -0.133489 0.13827 -0.100489 -0.0746062 0.0592398 -0.0174855 -0.124569 0.149241 -0.0118037 -0.0325307 -0.0546884 0.0815299 0.0601488 0.000184615 0.0299799 0.0669417 -0.110831 -0.123151 -0.00436637 -0.00349104 0.181421 0.011967 0.0282588 -0.244339 0.0478252 0.0322487 0.00424526 0.111485 0.0243128 -0.0313332 -0.032958 -0.0356091 -0.026496 0.0129702 -0.148689 -0.0383774 0.0240793 0.151978 -0.0324747 0.0376618 0.0173096 0.0234089 -0.0821034 0.0585453 0.126497 0.0162677 -0.0164685 0.0840952 0.0914127 -0.201382 -0.069427 0.0168764 -0.146563 -0.0715309 -0.0887074 0.0131511 0.024591 0.0242468 0.106454 0.0473577 -0.0945281 0.0439851 0.0105416 -0.046618 -0.0947535 0.0983431 -0.0949771 -0.033579 0.0406178 0.0605414 -0.119648 -0.0424877 0.0230493 0.184265 -0.0798416 -0.0724484 0.0167037 0.122848 0.0416819 0.0172165 -0.0206551 0.0352726 0.0370752 0.0211301 0.052349 0.0280995 
0.0108892 -0.0220462 0.0438209 -0.0854313 0.0221307 0.215562 -0.0339262 0.0192811 0.00990283 -0.0471865 -0.00211063 0.0873496 0.0661067 -0.102303 -0.0413495 -0.0678061 -0.195394 0.0996883 -0.0693467 0.0333427 0.232083 0.0179442 0.0784166 0.176085 -0.054181 -0.0102076 -0.039699 -0.255962 0.0199086 0.107032 0.0102473 -0.0656959 -0.0127685 0.0528772 0.0733491 0.0193075 -0.10064 0.0738549 -0.0515159 -0.0220297 -0.042186 -0.060769 -0.137512 0.098456 -0.100491 -0.0855139 0.0902595 0.00823205 -0.134343 0.0669124 0.0190729 -0.0135394 0.0433175 0.0260358 0.100503 0.0641026 0.0935674 0.110128 -0.088825 -0.173084 -0.00790303 0.0241996 0.204781 -0.0324553 0.0609118 -0.150301 0.00835713 0.0439309 -0.0417868 0.166277 -0.00491347 0.0244926 -0.114383 -0.0979393 -0.0337427 0.0148425 -0.130199 -0.0104621 0.0806124 0.110701 -0.0619364 0.0921047 0.0173737 -0.0014497 -0.0398084 -0.0280677 0.102001 0.0673114 0.0406475 0.0986093 0.0785642 -0.110967 -0.0177566 0.0716065 -0.1145 -0.0668548 -0.0961995 0.102421 0.0512718 0.00234534 0.182892 0.0393123 -0.126525 -0.00164232 -0.0205809 0.00332836 -0.0850904 -0.0561269 -0.0369762 -0.0307517 0.0187306 0.0985749 -0.0768957 -0.099926 0.0864209 0.205785 -0.0860298 -0.109322 -0.00812515 0.147329 0.0809675 -0.0626731 -0.016278 -0.047332 -0.0755453 0.142282 0.0611027 0.0488541 
0.0218889 0.00575135 0.00162817 -0.0655724 0.0379104 0.201168 -0.00331505 -0.0247357 0.000572993 -0.0688213 -0.0219788 0.0788586 0.0640548 -0.112621 -0.0601553 -0.0625475 -0.205552 0.099714 -0.0740001 0.0268264 0.231001 0.014144 0.0910375 0.158785 -0.0434523 -0.0446092 -0.057655 -0.278373 0.0172922 0.155246 -0.0227818 -0.044291 -0.0267084 0.048089 0.089509 -0.00964676 -0.0868066 0.0638941 -0.051714 -0.0272817 -0.0442998 -0.0688455 -0.100666 0.112893 -0.118746 -0.0264309 0.116078 0.00784954 -0.135258 0.0769545 0.034645 -0.00304839 0.0573954 0.0304125 0.10683 0.0436447 0.120893 0.0993538 -0.0637184 -0.158391 0.0108318 0.0314496 0.19375 -0.034769 0.0620363 -0.187171 -0.000578943 0.0273255 -0.0335551 0.152436 -0.0140462 0.0304251 -0.111914 -0.0953989 -0.0409911 0.0281185 -0.131396 -0.0164103 0.0616821 0.129892 -0.0311514 0.0867732 -0.00504095 0.00910438 -0.0436455 -0.0018734 0.0735444 0.0295921 -0.0048538 0.0901436 0.0751689 -0.11239 -0.038067 0.0205832 -0.130708 -0.067892 -0.0872751 0.126932 0.0845911 -0.00349202 0.186919 0.0529646 -0.0856131 0.0363964 -0.0345721 -0.0361652 -0.095934 0.0279198 -0.0473248 0.000770842 0.0388384 0.0789496 -0.0908004 -0.110265 0.0447116 0.222999 -0.0851826 -0.096145 -0.00881646 0.155694 0.0714417 -0.0382432 -0.0258066 -0.0391926 -0.0854957 0.117006 0.035998 0.0366421 
-0.0469315 0.0330756 0.0750091 -0.0872443 0.0706973 0.195758 -0.0392362 -0.0362687 0.0840441 -0.0659053 0.00110561 0.0358326 0.00618623 -0.0826376 -0.011867 -0.0263186 -0.216032 0.0811526 -0.0938378 -0.0313644 0.239607 0.0188498 0.0757977 0.119008 0.0412192 -0.0176554 -0.0290851 -0.209372 0.0890116 0.0747636 0.112804 -0.0828346 -0.00147665 0.0186391 0.102174 0.0446829 -0.10064 0.0774334 -0.0202062 -0.0205617 0.019758 -0.0368925 -0.10369 0.12147 -0.0791782 -0.0586421 0.0822725 0.0127291 -0.10514 -0.0258039 -0.0464957 0.0348907 0.0401682 -0.0303376 0.0767383 0.0823581 0.0612479 0.133735 -0.111131 -0.179484 -0.0625037 -0.0220849 0.205807 0.00454505 0.0843422 -0.0905534 -0.00876842 0.0663576 -0.0208294 0.218065 0.0306622 0.0676758 -0.108027 -0.125485 0.0114267 -0.00268382 -0.165289 0.0222405 0.0201335 0.0950018 -0.0522424 0.14587 0.0509099 0.0328168 -0.0475603 -0.0480235 0.101408 0.114999 -0.00779482 0.066658 0.0875286 -0.0884767 -0.0436059 0.0231684 -0.0716317 -0.085136 -0.103593 0.120279 0.034565 -0.00164238 0.131127 -0.0106255 -0.0917625 -0.0296192 -0.0358361 0.0301718 -0.0657543 -0.0366178 0.0591091 -0.0631684 0.0158198 0.0909758 -0.132839 -0.0427224 0.139582 0.17887 -0.129456 -0.0863938 0.0139184 0.152374 0.117652 -0.00847856 -0.0435989 -0.0371125 -0.0834362 0.136125 0.0756015 0.0833864 
0.00647402 -0.00117103 0.0704051 -0.0963784 0.0801059 0.201779 0.023384 -0.0127026 0.0440355 -0.084548 -0.011706 0.064326 0.080915 -0.0959949 -0.0342099 -0.0617151 -0.242071 0.0923477 -0.165918 0.00888067 0.2543 0.0314704 0.0620443 0.133435 -0.0326819 -0.0713277 -0.10089 -0.219232 0.0315597 0.119666 0.034174 -0.0728342 -0.0583617 0.0587059 0.0930866 -0.00619717 -0.0908498 0.0735539 -0.032428 -0.00848378 0.010041 -0.0364941 -0.0971609 0.1006 -0.104843 -0.0927733 0.0555145 0.0425042 -0.0819905 0.0492793 -0.0157448 -0.0388495 0.0118446 0.0273394 0.0830264 0.0390455 0.0442408 0.133897 -0.122973 -0.153368 -0.017351 0.0202083 0.18127 0.00250033 0.0525485 -0.1316 0.0159715 0.0617595 -0.0401973 0.118573 0.0359477 0.0606054 -0.0656658 -0.0983066 -0.0310888 0.0387445 -0.150077 -0.0553672 0.0690957 0.13553 0.00991762 0.0811734 0.0372677 0.0429351 -0.0638513 -0.00999075 0.123798 0.0841457 -0.00772012 0.0776722 0.0989729 -0.144315 -0.0161563 0.0298321 -0.161573 -0.0962556 -0.123587 0.077582 0.0478579 0.0289792 0.174926 0.0206488 -0.0925655 0.0124701 -0.0134552 -0.00754926 -0.0977645 0.0293725 -0.00678568 -0.0137376 0.0375636 0.0697095 -0.143461 -0.0274147 0.059093 0.229227 -0.122304 -0.00848758 -0.046643 0.146313 0.0694975 -0.0275736 -0.0570869 -0.0226605 -0.0785862 0.11342 -0.000589798 0.0443424 
