-0.0489585 0.0578338 -0.105569 0.0353867 0.0369852 0.16237 0.0168329 -0.0992172 -0.02565 0.170101 0.115532 0.0258536 0.0574751 -0.0817224 -0.0104679 0.020433 -0.0443152 0.145014 0.0948734 -0.0229461 0.132695 -0.122053 -0.0564278 0.101442 0.0849074 0.0789377 -0.0710681 -0.223824 0.150328 0.120942 0.107021 0.0506359 -0.0550869 -0.100789 0.0760428 0.079981 -0.146645 -0.0574773 0.0787331 -0.0638604 0.00824702 -0.0877983 -0.106351 0.162308 -0.0526754 -0.0747588 0.112284 0.0323728 -0.094021 -0.255086 0.028612 0.0504928 0.0104801 -0.157306 -0.0033483 0.147781 -0.0379612 0.149596 -0.0144839 -0.0292028 -0.0666831 -0.0698097 0.238808 -0.06494 0.149588 -0.0189356 0.00555423 -0.0450792 -0.0252465 0.076733 -0.0121203 0.128507 -0.0972679 -0.126923 -0.0489986 -0.0513393 -0.0697011 0.147233 -0.0274275 0.0310369 -0.092903 0.0725686 -0.0192564 0.00337827 -0.0649178 -0.0400774 0.0814569 -0.014124 0.0198278 -0.0669568 -0.0152621 0.0356491 -0.0475961 0.0223211 -0.0117069 -0.0923015 -0.00568374 0.0412161 0.0300676 0.0173318 0.0741144 0.0213304 -0.0268746 -0.0672309 -0.0256817 0.113886 0.0586957 -0.0302275 0.0938841 0.0181957 -0.0493202 0.00225607 -0.0575886 -0.130349 0.131637 0.0535214 -0.111626 -0.0991508 0.028305 0.0616586 0.0373023 -0.153419 -0.0576147 -0.0298331 -0.0867586 0.195937 -0.0251511 0.0765146 
-0.0347585 0.0407425 -0.0990788 0.0555943 0.0526554 0.190336 0.023775 -0.0953322 -0.0138731 0.159175 0.108201 0.0331153 0.0561057 -0.084904 0.00237983 0.01003 -0.0497766 0.165355 0.0731966 -0.0219142 0.141689 -0.129384 -0.0393345 0.133701 0.105444 0.0314464 -0.082919 -0.232039 0.116539 0.119475 0.120534 0.0544209 -0.0586759 -0.0732483 0.0744651 0.084743 -0.150923 -0.0844208 0.0538062 -0.0836721 0.0305351 -0.0995447 -0.0913884 0.159344 -0.0732714 -0.0983975 0.10415 0.0429507 -0.0833346 -0.220706 0.0489534 0.0219292 0.0166665 -0.157145 0.0166533 0.151 -0.0419484 0.145509 0.00614998 -0.0434659 -0.0750521 -0.0525408 0.217883 -0.0853645 0.141756 -0.0095563 -0.00659626 -0.0406509 -0.051147 0.107375 -0.012202 0.143399 -0.101603 -0.137893 -0.057768 -0.0411381 -0.059443 0.137397 -0.0280231 0.0344631 -0.096892 0.0721504 -0.0139702 -0.0059928 -0.0700131 -0.0244045 0.083731 -0.0115974 0.0140579 -0.0429515 -0.00695591 0.0193309 -0.0519036 0.00402422 -0.0289027 -0.0804749 -0.0302317 0.0442261 0.0260447 0.0110442 0.0978711 0.0181128 -0.0156893 -0.0724502 -0.0178284 0.106518 0.0354487 -0.0376798 0.0729022 0.0246596 -0.0563525 0.0164856 -0.042234 -0.139117 0.132731 0.0521618 -0.0978194 -0.0853505 0.0302282 0.0896296 0.0584469 -0.155954 -0.05648 -0.0195468 -0.0884749 0.192457 -0.0078394 0.0818844 
-0.0331966 0.0335765 -0.086163 0.0586341 0.0555529 0.185878 0.00769205 -0.0977168 -0.00421839 0.139949 0.110166 0.0246594 0.0640652 -0.0777404 -0.00358848 0.0197042 -0.0427519 0.161875 0.0588922 -0.00537026 0.165725 -0.132629 -0.0353242 0.138472 0.109412 0.0335844 -0.0987241 -0.232381 0.122118 0.115561 0.136776 0.0598913 -0.0598979 -0.0744316 0.0741097 0.091658 -0.149774 -0.0641913 0.0606279 -0.0931211 0.0269768 -0.0838565 -0.0982786 0.146078 -0.0601622 -0.11458 0.102612 0.0465159 -0.0721515 -0.224774 0.0329706 0.0261311 0.028994 -0.152303 0.0177237 0.138509 -0.0352386 0.139266 0.00452881 -0.0726994 -0.0775671 -0.0447062 0.213408 -0.080435 0.124624 0.00587387 0.00522699 -0.0305003 -0.0437985 0.0924238 -0.00753421 0.140555 -0.0983652 -0.142514 -0.0508406 -0.0490908 -0.0690848 0.130183 -0.0206082 0.0575448 -0.0861735 0.083551 -0.00698181 -0.0128374 -0.0550844 -0.0196205 0.0825386 0.00675 0.0125816 -0.0542076 0.00218611 0.0254293 -0.0452017 0.0180596 -0.0349457 -0.0924652 -0.0343827 0.0565126 0.00907163 0.00577336 0.106571 0.00939306 -0.0181166 -0.0664185 -0.01852 0.117267 0.0453938 -0.042611 0.0981254 0.0200968 -0.0643538 0.0190943 -0.0594928 -0.128242 0.137894 0.0590041 -0.120493 -0.085833 0.0155596 0.0838964 0.0462903 -0.141241 -0.059095 -0.02545 -0.0987386 0.197175 -0.00585383 0.0864919 
-0.00405524 0.0259229 -0.0861954 0.0740678 0.0538 0.203664 0.0476514 -0.103393 -0.00890288 0.127302 0.088387 0.0347059 0.0451348 -0.0950316 -0.00429696 -0.0103502 -0.0581966 0.159656 0.059305 -0.0259511 0.149406 -0.121169 -0.0378577 0.169394 0.111319 0.015467 -0.10118 -0.240493 0.112071 0.123095 0.121325 0.0710702 -0.0983156 -0.0606834 0.0751844 0.0581837 -0.159499 -0.0752937 0.0522437 -0.0902101 0.0423921 -0.0947055 -0.102501 0.153125 -0.0777059 -0.114931 0.0909982 0.0545312 -0.0626478 -0.193815 0.0647383 0.0380754 0.0463438 -0.153492 0.0369394 0.128235 -0.0205867 0.165239 0.0226315 -0.0741762 -0.0680353 -0.0310148 0.214575 -0.0845936 0.106475 -0.00541681 0.0193992 -0.0509487 -0.0565018 0.118709 -0.0271909 0.157068 -0.0961627 -0.100896 -0.0693221 -0.0615874 -0.0629544 0.112063 -0.0181498 0.0779652 -0.0720711 0.0858022 -0.000804063 -0.0388604 -0.0374399 -0.0495144 0.0830683 -0.00853177 0.00375412 -0.0444804 0.0176532 0.0283348 -0.0429896 -0.0119334 -0.0459499 -0.0889737 -0.01324 0.0476236 0.0383187 -0.00393802 0.121097 0.0310071 -0.00139804 -0.044452 -0.0376065 0.0833198 0.0302052 -0.0284953 0.0824932 0.0378592 -0.0221758 0.0498635 -0.0552649 -0.146553 0.131405 0.0648341 -0.0972362 -0.0848161 0.0256395 0.0908854 0.0602824 -0.141985 -0.0511194 -0.0283982 -0.107806 0.18463 -0.00609859 0.077795 
-0.00215344 0.0103061 -0.0859233 0.039462 0.0573239 0.198582 0.0127283 -0.0647631 -0.023846 0.124763 0.112244 0.0431659 0.0599099 -0.102837 -0.0109717 -0.00272403 -0.0522557 0.161347 0.0626735 -0.00219433 0.174396 -0.106359 -0.0244917 0.179236 0.10133 0.0388945 -0.0436519 -0.244717 0.123533 0.109505 0.109395 0.0136684 -0.0715408 -0.056196 0.0673102 0.0556849 -0.1509 -0.065001 0.0582449 -0.0772686 0.0292584 -0.0912905 -0.107126 0.182468 -0.0899854 -0.133041 0.11141 0.0441747 -0.0752508 -0.178857 0.0590089 0.0243117 0.013439 -0.13166 0.0319688 0.123342 -0.0187393 0.159532 0.0066609 -0.0891648 -0.0634866 -0.0690945 0.235514 -0.0635944 0.101603 -0.0425003 0.00752129 -0.0405904 -0.0269756 0.11198 -0.0298544 0.141164 -0.107851 -0.130667 -0.0558456 -0.0690541 -0.072192 0.154334 -0.00850474 0.084686 -0.0870756 0.0865831 0.0193454 -0.0245041 -0.0367905 -0.0372233 0.0991815 0.0155804 0.0224284 -0.0536585 0.0133367 0.0149741 -0.0675149 0.00780297 -0.0401363 -0.107928 -0.0282448 0.0615537 0.0186668 -0.0186044 0.0977658 0.0258538 -0.0105154 -0.039123 -0.0217634 0.0876803 0.0255156 -0.0282593 0.0803889 -0.000362683 -0.035614 0.0466233 -0.0559622 -0.118197 0.135715 0.0682495 -0.101442 -0.11015 0.0121727 0.0917443 0.0523023 -0.133999 -0.0561948 -0.0298715 -0.107006 0.176164 0.00194731 0.0921803 
0.00072107 -0.0243327 -0.0679388 0.0360812 0.0435002 0.194271 0.00761797 -0.0573226 -0.0319027 0.0866384 0.101677 0.0695651 0.0687439 -0.104219 -0.0418449 -1.1414e-05 -0.0817238 0.128795 0.0535719 0.0275727 0.194984 -0.115429 -0.0224189 0.217178 0.0832231 0.0569552 -0.0250382 -0.250232 0.108352 0.113402 0.0782656 -0.00522919 -0.0700261 -0.0323599 0.0513169 0.0514023 -0.152561 -0.0505027 0.0395409 -0.08971 0.0290839 -0.10327 -0.0906228 0.170638 -0.0749541 -0.14791 0.123979 0.0356944 -0.0847386 -0.14796 0.0505535 -0.0131658 0.035675 -0.103524 0.0828821 0.119427 -0.0189577 0.17146 -0.00468033 -0.112465 -0.0461246 -0.0519928 0.247583 -0.047221 0.0954012 -0.0241048 -0.00209826 -0.0443562 -0.0280634 0.0887037 -0.0623108 0.119432 -0.118722 -0.123657 -0.0268219 -0.054937 -0.0482195 0.142298 0.0174783 0.10624 -0.0722913 0.0652306 0.0272705 -0.038591 -0.051934 -0.0319359 0.107115 0.0372417 0.0273336 -0.0322296 0.0331126 -0.00064683 -0.0571231 0.0358084 -0.0708945 -0.0852787 -0.0391938 0.0646835 0.0502431 -0.0273237 0.118338 0.0137671 -0.0292836 -0.0355805 -0.0190373 0.0899607 0.00856032 -0.0204305 0.039421 -0.0222723 -0.0311055 0.0719363 -0.0458628 -0.123771 0.135023 0.0996903 -0.102837 -0.0870197 -0.000557835 0.102237 0.0411126 -0.135862 -0.0445129 -0.0536298 -0.135704 0.209042 -0.00443083 0.0806246 
-0.0114924 0.00357487 -0.0727994 0.0605377 0.0549353 0.207948 0.0143643 -0.106495 -0.00618218 0.0945302 0.0949445 0.0683766 0.05027 -0.083389 -0.0229657 0.000357448 -0.0600594 0.146565 0.0620472 -0.00315188 0.171213 -0.10665 -0.0270522 0.202083 0.103517 0.0330791 -0.0648396 -0.240968 0.102477 0.133348 0.112201 0.0358382 -0.0689764 -0.0490741 0.0664237 0.0689332 -0.146759 -0.0694947 0.057644 -0.077858 0.0366525 -0.0844417 -0.0901272 0.132859 -0.0747392 -0.132524 0.109432 0.0305665 -0.0640571 -0.176077 0.0592043 0.0125471 0.0598169 -0.124352 0.0604588 0.137515 -0.0132289 0.176789 -0.00959874 -0.0789536 -0.0704598 -0.0310197 0.229805 -0.0942491 0.110832 -0.00761261 0.00940895 -0.0434421 -0.0622383 0.111468 -0.0291192 0.139161 -0.120227 -0.121627 -0.0325247 -0.0335495 -0.0582195 0.112165 -0.00724465 0.0853952 -0.0756226 0.0940751 0.028765 -0.0228417 -0.0487742 -0.0310244 0.0933173 0.00939946 -0.0074715 -0.0369916 0.0132902 0.00132003 -0.0316904 0.0330612 -0.0496761 -0.088354 -0.0370857 0.0546482 0.0440194 -0.00623332 0.120555 0.0142287 -0.0304575 -0.0358063 -0.023648 0.0972722 0.0260611 -0.0485006 0.0433811 0.0120148 -0.0391592 0.0416275 -0.0367942 -0.128468 0.124668 0.0898175 -0.115423 -0.0734549 0.00354601 0.108906 0.0610731 -0.14506 -0.0569014 -0.058779 -0.121166 0.223964 -0.0103004 0.0843923 
0.0110822 -0.0049579 -0.0706721 0.0661094 0.0599357 0.214109 0.0398074 -0.0857181 0.00055189 0.0946024 0.103598 0.0540238 0.0644132 -0.0790071 -0.0022928 -0.0219799 -0.0569239 0.15408 0.0311601 -0.00149637 0.174028 -0.116474 -0.0242077 0.209005 0.108504 0.00206576 -0.0820083 -0.239342 0.0992077 0.120238 0.121203 0.0487754 -0.0904899 -0.0323917 0.0521713 0.067419 -0.157359 -0.0630204 0.0375681 -0.0843296 0.0530924 -0.0879256 -0.112841 0.144037 -0.0913733 -0.148845 0.0840723 0.050986 -0.049826 -0.164599 0.0570395 0.0191415 0.0393117 -0.129473 0.0538966 0.126395 -0.0318389 0.182849 0.00741659 -0.0890312 -0.0779709 -0.0303795 0.221457 -0.0890217 0.0855485 0.000137449 0.0250962 -0.0353271 -0.0602144 0.122317 -0.0265053 0.150331 -0.105137 -0.10788 -0.0501611 -0.0530384 -0.05803 0.104369 -0.00796256 0.0917598 -0.0790812 0.0843231 0.0205154 -0.0493203 -0.038969 -0.0330616 0.104198 0.00548283 -0.00118204 -0.0385396 0.0348617 -0.00923219 -0.0353238 0.0039936 -0.0608531 -0.10225 -0.0421473 0.0390694 0.0399911 -0.0077299 0.122355 0.0218058 -0.0114774 -0.0285541 -0.0313986 0.0938676 0.0108146 -0.0361473 0.0653627 0.00611918 -0.0297036 0.0615879 -0.0587323 -0.122949 0.131836 0.0830708 -0.100251 -0.0836295 0.0181332 0.115543 0.0620543 -0.140068 -0.0663817 -0.0215582 -0.112435 0.192119 -0.00363148 0.0885984 
-0.00220052 -0.00741607 -0.0536518 0.0627794 0.0541757 0.20969 0.023223 -0.0814822 -0.013491 0.112884 0.100223 0.0327369 0.0524915 -0.0884253 0.0231127 -0.00495338 -0.058106 0.156361 0.0562041 -0.0211569 0.165585 -0.099864 -0.0172256 0.177452 0.112652 0.0274756 -0.0865501 -0.253039 0.10792 0.0925307 0.137868 0.046892 -0.0913464 -0.0513964 0.0708616 0.070356 -0.154782 -0.0589366 0.0607783 -0.0743697 0.0499982 -0.0806436 -0.127352 0.14123 -0.0868698 -0.141827 0.0871225 0.0446747 -0.0512337 -0.1922 0.0555578 0.0213706 0.043335 -0.134628 0.0302269 0.117489 -0.00407038 0.162495 0.0125948 -0.0837996 -0.0765914 -0.0369651 0.204083 -0.0756826 0.102723 0.000945501 0.0324401 -0.0310574 -0.0346954 0.118157 -0.021858 0.16263 -0.0965919 -0.110174 -0.0509972 -0.0731343 -0.0874344 0.112404 -0.0118715 0.0981658 -0.0707658 0.0907417 0.0212739 -0.0464369 -0.0351329 -0.0431573 0.106843 0.0140055 -0.0131915 -0.0616434 0.0286379 0.0319475 -0.0389365 0.00463211 -0.0613598 -0.0998113 -0.0287096 0.0525929 0.022313 -0.00195593 0.110013 0.0143799 -0.010463 -0.046883 -0.0156537 0.0869499 0.0324399 -0.0469969 0.0946092 0.0163965 -0.0372983 0.0568517 -0.0544743 -0.139949 0.142666 0.0747747 -0.113677 -0.0926208 0.00339581 0.0892883 0.0626409 -0.137114 -0.0576472 -0.0319322 -0.103541 0.188428 -0.000707503 0.100669 
-0.0164707 0.0260981 -0.0620978 0.0515965 0.0742295 0.206849 0.0112897 -0.0954228 0.0113733 0.094906 0.106871 0.047846 0.0668983 -0.089778 -0.0030166 0.01306 -0.057597 0.156663 0.0114284 0.012855 0.184848 -0.104581 -0.00557053 0.189585 0.10372 0.00392553 -0.0840572 -0.245145 0.115699 0.119191 0.142591 0.0419398 -0.0594665 -0.0387159 0.067466 0.0839003 -0.138875 -0.0423336 0.0432868 -0.0680777 0.0394803 -0.0779805 -0.109108 0.137591 -0.0815686 -0.123547 0.108216 0.0435518 -0.0705963 -0.174762 0.038132 0.0154997 0.0254896 -0.134259 0.0338826 0.130829 -0.028632 0.166951 -0.0108908 -0.0847978 -0.0945555 -0.0425919 0.219863 -0.103512 0.116712 -0.0207086 0.00923414 -0.0245586 -0.0682717 0.116264 -0.00567208 0.143276 -0.111765 -0.129468 -0.0311238 -0.0394781 -0.0759005 0.129716 -0.0124887 0.0842395 -0.0825626 0.0943648 0.0125252 -0.0169047 -0.0512616 -0.0116384 0.0943356 0.0136026 -0.0159484 -0.0402266 0.0202108 -0.0157016 -0.0435591 0.0213642 -0.0435412 -0.0993852 -0.0547441 0.0584021 0.0185728 -0.000887388 0.104555 -0.000581075 -0.0374751 -0.023863 -0.0203409 0.104505 0.0206383 -0.0351366 0.0857754 -0.000624655 -0.0637811 0.049155 -0.0612859 -0.101762 0.130381 0.0820162 -0.13597 -0.0812487 0.00346755 0.124313 0.0581186 -0.118202 -0.0734044 -0.0143074 -0.104423 0.198605 -0.0110034 0.0795916 
-0.0277015 0.0327513 -0.076485 0.0420774 0.0640277 0.189838 0.00459235 -0.0870375 0.00333557 0.125831 0.114103 0.0241573 0.0622155 -0.0972796 0.00471141 0.024748 -0.0579911 0.151653 0.0427342 0.00796845 0.17336 -0.110068 -0.0157975 0.155369 0.101123 0.0278171 -0.0745423 -0.245579 0.132612 0.10748 0.137033 0.0285593 -0.0500383 -0.0629921 0.0837098 0.0873198 -0.137258 -0.0483933 0.0534197 -0.0830349 0.023628 -0.0873434 -0.11057 0.156678 -0.0710384 -0.102945 0.107432 0.0539459 -0.080063 -0.200225 0.0212465 0.0216896 0.0229545 -0.148087 0.0207519 0.130708 -0.0330847 0.145001 -0.0109445 -0.0780298 -0.0867861 -0.0585914 0.226869 -0.0776641 0.126309 -0.0181977 0.000765216 -0.025905 -0.0424254 0.0951973 -0.0114721 0.135289 -0.110476 -0.148064 -0.0365987 -0.0521567 -0.0799614 0.14773 -0.010458 0.0771275 -0.0766882 0.0820851 -0.00708668 -0.0104612 -0.0491978 -0.01477 0.0827953 0.0169988 0.00254878 -0.0412521 0.020899 0.0144624 -0.0591866 0.0244685 -0.0391077 -0.0995503 -0.0446688 0.0597997 0.0142053 -0.00572301 0.106 0.000341338 -0.0298544 -0.0664736 -0.0171762 0.108819 0.0436158 -0.0389547 0.106068 0.0115388 -0.0585343 0.0352875 -0.0559517 -0.116382 0.138653 0.0737961 -0.133626 -0.0867611 0.00358801 0.098793 0.0503615 -0.129886 -0.063595 -0.0101247 -0.100926 0.194088 -0.00313623 0.0815055 
-0.0545455 0.0341146 -0.072582 0.0477993 0.0134111 0.153832 0.0150349 -0.0842487 -0.0108138 0.156424 0.120171 0.0100089 0.0593641 -0.065502 0.0212141 0.0137315 -0.0472288 0.122996 0.100283 -0.0317215 0.139271 -0.116123 -0.0547491 0.120464 0.0932201 0.07623 -0.081756 -0.228988 0.145749 0.106953 0.129879 0.0323896 -0.052179 -0.102313 0.0737881 0.0908121 -0.149906 -0.037473 0.0646874 -0.0567817 0.0114018 -0.0752699 -0.131584 0.151075 -0.0450642 -0.0984541 0.094025 0.0208483 -0.0659225 -0.26609 0.021951 0.0438545 0.0304162 -0.15462 0.0038828 0.149744 -0.0429074 0.153522 -0.0026874 -0.0405179 -0.0803365 -0.0746059 0.213088 -0.0605079 0.142853 0.00469128 0.0330791 -0.0469079 -0.0171896 0.0622403 -0.00818803 0.131629 -0.0902499 -0.12967 -0.0345827 -0.0605641 -0.0845839 0.13043 -0.0188881 0.0646441 -0.0824635 0.0576127 -0.01113 -0.0176106 -0.051996 -0.0502433 0.0936548 -0.0132325 0.00594969 -0.0799769 -0.0166792 0.0447931 -0.0281764 0.020356 -0.0307644 -0.0965039 -0.00700526 0.026146 0.0338086 0.0234912 0.070682 0.0195263 -0.0220875 -0.0850696 -0.0336029 0.116295 0.066641 -0.0549778 0.112507 0.0116574 -0.0500533 0.00961449 -0.0640927 -0.148647 0.140872 0.0694843 -0.11269 -0.0950294 0.0103977 0.055244 0.0321627 -0.155843 -0.0708428 -0.027733 -0.0834169 0.209025 -0.0167347 0.0942841 
-0.0444269 0.0479751 -0.0941014 0.0647535 0.0533768 0.195798 0.0120636 -0.133978 0.0305071 0.125024 0.108582 0.0296427 0.0458511 -0.0635865 -0.0110604 0.0126836 -0.0485393 0.157076 0.051351 -0.031344 0.144903 -0.116526 -0.0582784 0.120116 0.108288 0.0282034 -0.112734 -0.211183 0.107121 0.124575 0.153759 0.0784609 -0.0646395 -0.0843991 0.0864875 0.110176 -0.146482 -0.0854693 0.0680515 -0.0831532 0.0323357 -0.0705871 -0.100489 0.125521 -0.0411193 -0.105686 0.0840451 0.046234 -0.0626537 -0.235522 0.0172565 0.0349044 0.0457483 -0.161407 0.00391045 0.154078 -0.0599568 0.151894 -0.0149888 -0.0465742 -0.0893767 -0.0253772 0.221096 -0.100365 0.129385 0.0184453 0.0188303 -0.0298976 -0.0626345 0.10479 0.0131416 0.131867 -0.0904306 -0.139294 -0.0586543 -0.0328556 -0.0705081 0.0931779 -0.0433958 0.0349363 -0.0764443 0.100667 -0.0159043 -0.00877539 -0.0681547 -0.0184872 0.0740275 -0.0174803 -0.00869357 -0.0431702 0.00459675 0.0107025 -0.0269227 0.0248162 -0.0173957 -0.0782699 -0.0379515 0.0267222 0.0141954 0.0298799 0.105346 0.00560574 -0.0320264 -0.0834215 -0.0232819 0.129297 0.0544973 -0.0662884 0.0706808 0.0464813 -0.0555826 -0.00648385 -0.0504022 -0.124771 0.128178 0.0531551 -0.12509 -0.0624072 0.0300197 0.0752306 0.0605724 -0.15083 -0.0561426 -0.028946 -0.0839177 0.206565 -0.0102671 0.0767628 
-0.051922 0.0550818 -0.108976 0.0212207 0.0485081 0.158584 0.00418643 -0.0839067 -0.00948204 0.164581 0.121267 0.0104335 0.0870894 -0.0702865 -0.00669265 0.0397442 -0.0395422 0.133149 0.0587853 0.0114889 0.161095 -0.134084 -0.0381896 0.113861 0.0867528 0.0643108 -0.0827264 -0.222178 0.163159 0.115326 0.124047 0.0486236 -0.0439528 -0.0876129 0.0631776 0.0938077 -0.140417 -0.0227035 0.0652087 -0.07538 0.00355458 -0.0818614 -0.101585 0.162102 -0.0459571 -0.0995982 0.113075 0.0553258 -0.08241 -0.242291 0.00356247 0.0318471 -5.61392e-07 -0.155813 0.00525117 0.138922 -0.0540321 0.150192 -0.00549932 -0.0708904 -0.0835232 -0.0717596 0.23524 -0.0613659 0.12972 0.00348867 -1.23975e-05 -0.0207139 -0.0239347 0.0503752 -0.0108261 0.12781 -0.0983393 -0.140416 -0.0316562 -0.0548891 -0.0714478 0.149194 -0.012084 0.0467634 -0.0766195 0.0673857 -0.0189569 -0.00237669 -0.0606997 -0.0220176 0.0827818 0.0119899 0.0392715 -0.0681045 -0.0027962 0.0227871 -0.051913 0.0296236 -0.0191017 -0.101402 -0.0268254 0.0577443 0.00809621 0.00514159 0.0821967 0.000188036 -0.0278088 -0.0640729 -0.0409816 0.130555 0.0415962 -0.0302342 0.124399 0.00184032 -0.0616865 0.022454 -0.0735438 -0.106073 0.134901 0.0615711 -0.130221 -0.0898694 0.0102419 0.0726777 0.0281261 -0.13775 -0.0566625 -0.0105287 -0.113856 0.191997 -0.0328235 0.0776234 
0.00622712 0.0089755 -0.121386 0.0244437 0.0657049 0.155636 -0.00427995 -0.0350012 -0.0371478 0.112277 0.124512 0.0640893 0.1015 -0.105061 -0.0742079 0.0492791 -0.0414469 0.136087 0.0141665 0.0696247 0.216552 -0.145347 0.0115841 0.192581 0.0781438 0.0386327 -0.00986827 -0.242041 0.140366 0.122855 0.0678746 0.0161006 -0.0464173 -0.0383437 0.00359537 0.0288671 -0.155634 -0.00322107 0.0415012 -0.0647909 -0.00249349 -0.088491 -0.0875741 0.185046 -0.0760678 -0.143541 0.13863 0.0322993 -0.087399 -0.142485 0.0559103 0.00979291 -0.0284988 -0.105875 0.0401081 0.0956379 -0.00386724 0.150583 0.0158383 -0.112358 -0.0528373 -0.0917372 0.246141 -0.0442768 0.0772827 -0.0661286 -0.0269768 -0.0129915 -0.0141556 0.0638019 -0.0453749 0.129016 -0.118141 -0.124625 -0.0270683 -0.0560585 -0.0400049 0.183838 -0.0105492 0.0994257 -0.0929865 0.0526056 0.0196046 -0.0169889 -0.0591925 0.0106032 0.0958044 0.0396977 0.0495056 -0.0830561 -0.00706728 -0.0167153 -0.0954635 0.0342146 -0.0309764 -0.10773 -0.0452399 0.0893682 0.0161441 -0.0413764 0.0850937 -0.00964785 -0.0180815 0.0342873 -0.0270291 0.0876604 -0.0103931 0.0316152 0.088305 -0.0634411 -0.067129 0.084213 -0.0624821 -0.0716641 0.124793 0.0843365 -0.121345 -0.093753 0.0075086 0.115105 0.000700974 -0.0869663 -0.0553972 -0.0197837 -0.14085 0.170965 -0.0362833 0.073774 
0.0374309 0.000375089 -0.0892219 0.0519409 0.0695152 0.198792 0.0582858 -0.0618986 0.0139439 0.037564 0.113827 0.108717 0.0866461 -0.119122 -0.109876 -0.0254795 -0.0689192 0.160261 -0.061852 0.067398 0.214314 -0.118719 -0.0504914 0.268408 0.054024 -0.0266192 -0.0546462 -0.219608 0.0991502 0.157809 0.0478871 0.042448 -0.0899614 0.0204518 0.00900173 0.023581 -0.141799 -0.0614335 -0.00129539 -0.0758482 0.0577615 -0.100485 -0.0722149 0.149826 -0.0762299 -0.170543 0.112738 0.0452689 -0.0822316 -0.0930289 0.056453 0.00195159 0.00145544 -0.0860283 0.0867327 0.117241 -0.0589654 0.17845 -0.0124684 -0.105971 -0.056093 -0.0216173 0.245181 -0.0732419 0.0257276 -0.0514493 0.0091412 -0.0624887 -0.081402 0.0864368 -0.0516932 0.0856872 -0.100846 -0.0844595 -0.0363088 -0.0224349 -0.0178358 0.130046 -0.00148501 0.0808927 -0.0697936 0.0947465 0.0237642 -0.039817 -0.0485512 0.0368353 0.103652 0.00852666 0.00655857 -0.0018005 0.0530374 -0.0894317 -0.0653812 0.0246755 -0.0714658 -0.0868323 -0.0739531 0.0211055 0.0588476 -0.0236529 0.132274 0.0146223 -0.0222197 0.0539877 -0.0341262 0.0863199 -0.0280393 0.0279183 -0.0103747 -0.0221923 -0.0195435 0.0766584 -0.0661921 -0.0786568 0.0875293 0.0950666 -0.104784 -0.0745629 0.0240376 0.127548 0.0311687 -0.106591 -0.0703012 -0.019285 -0.136914 0.186702 -0.0415754 0.0300765 
0.00163587 0.0293303 -0.101462 0.00872845 0.0190221 0.178508 0.0258067 0.0091254 -0.0139792 0.0920581 0.1133 0.0948084 0.0851246 -0.185002 -0.123109 -0.0465445 -0.110012 0.13485 -0.0391479 0.100689 0.166237 -0.142364 -0.0303688 0.210653 0.0142239 0.0325015 -0.00746149 -0.207016 0.12889 0.0804662 0.0321566 -0.00063951 -0.056193 0.0120082 -0.0181814 -0.00200586 -0.136272 -0.0121511 -0.0229213 -0.0706059 0.0662172 -0.158439 -0.084231 0.210491 -0.118942 -0.198044 0.13466 0.0514319 -0.106302 -0.0447446 0.0408605 0.0203427 -0.0562954 -0.064794 0.0671433 0.0917928 -0.0454529 0.110324 -0.00131669 -0.154928 -0.0639644 -0.0670716 0.267436 -0.0135059 0.0171371 -0.0761775 0.0147913 -0.0973914 -0.0482217 0.0778833 -0.0908515 0.0635118 -0.0779181 -0.0138655 -0.00504187 -0.0869992 -0.0406431 0.173064 0.0200208 0.0767503 -0.105256 0.0622449 0.0379141 -0.0162251 -0.0206657 0.0196333 0.109203 0.0581681 0.101522 -0.0200255 0.043413 -0.0677316 -0.0765258 -0.000208416 -0.0584976 -0.136191 -0.043907 0.063212 0.0209312 -0.0639638 0.0902218 0.0248919 -0.00442946 0.0483098 -0.0156324 0.0869129 -0.00896344 0.0727096 0.0332182 -0.0422769 -0.0173119 0.11516 -0.0675089 -0.0636333 0.0814192 0.0352731 -0.0550789 -0.123574 0.0766762 0.115135 0.0344405 -0.106297 -0.0487115 -0.0178208 -0.136646 0.127455 -0.00344976 0.0685985 
-0.030211 0.0197311 -0.105321 -0.0358661 0.00796712 0.179399 0.00833336 0.00137706 -0.0072717 0.0927279 0.10131 0.065787 0.071565 -0.163837 -0.113726 -0.0379442 -0.176227 0.0951387 0.00272422 0.0842887 0.152339 -0.142351 -0.00870378 0.140651 -0.000601963 0.0816815 0.00185479 -0.22247 0.142419 0.0472676 0.0410356 -0.0377122 -0.0541505 -0.0270062 0.00913895 0.0257348 -0.140322 0.022387 0.000172229 -0.056688 0.0510785 -0.145483 -0.120584 0.201942 -0.110824 -0.16662 0.128449 0.0518792 -0.106716 -0.0638563 -0.0463071 0.0196717 -0.0389365 -0.0509035 0.0587842 0.0881512 -0.0197703 0.12769 -0.0489603 -0.153045 -0.0569902 -0.0519415 0.321676 0.00978873 0.048658 -0.0347272 0.0206271 -0.0649724 0.00255034 0.0753159 -0.084301 0.0812452 -0.0703688 -0.00409032 0.0199178 -0.0974562 -0.068727 0.146991 0.0282375 0.0541022 -0.0956084 0.0688755 0.0126026 -0.0120959 -0.0474242 0.00708993 0.104221 0.0926645 0.119775 -0.0364503 0.0891329 -0.0370109 -0.0544565 0.00811763 -0.0427026 -0.149414 -0.0426577 0.0797602 0.0462759 -0.0403138 0.0823212 -0.0168128 -0.026151 -0.0258186 -0.0181732 0.118526 0.00825042 0.0480682 0.0405481 -0.0318865 0.000736411 0.120147 -0.0444707 -0.0837114 0.100458 0.0679927 -0.0649542 -0.104241 0.0788192 0.0800823 0.0339364 -0.119692 -0.0211928 -0.0274214 -0.162785 0.150141 -0.0120446 0.0919419 
-0.00581918 -0.0126101 -0.166923 -0.0168049 -0.00990493 0.111362 -0.0148819 -0.00530897 -0.0529279 0.0967385 0.103852 0.0873501 0.0918814 -0.102059 -0.140971 -0.00979992 -0.12898 0.0688354 0.0427964 0.116975 0.128077 -0.158145 0.0432289 0.123735 -0.00990382 0.122084 0.0601175 -0.238481 0.115049 0.0644613 -0.00827314 -0.00175025 -0.0378161 -0.0599679 -0.0547774 0.0072257 -0.157623 0.0971795 -0.0040797 -0.0133041 -0.0090886 -0.107965 -0.148408 0.205219 -0.129483 -0.122719 0.146221 0.0125456 -0.0752431 -0.0585622 0.00486166 0.0462059 -0.0435492 -0.0302871 0.0560979 0.0534179 0.0497092 0.133713 0.0209349 -0.139519 -0.0360468 -0.0898387 0.307159 0.0274285 0.0272417 -0.0852044 0.0302214 -0.0166421 0.0705275 0.0659294 -0.0794871 0.100183 -0.0615976 0.0119826 0.0181986 -0.097358 -0.0742489 0.152298 -0.0111355 0.0800686 -0.102704 0.0455355 -0.00438889 -0.0473582 -0.0528228 0.0032598 0.101289 0.0737225 0.11482 -0.124431 0.026479 -0.0113967 -0.0447857 -0.0106522 -0.0173114 -0.158597 -0.00332618 0.100776 0.0845844 -0.0787537 0.0378804 -0.0114933 0.0119243 0.0442691 -0.0458136 0.0676064 -0.0295239 0.0802535 0.0545805 -0.0698432 -0.0118793 0.150302 -0.039854 -0.0844252 0.0757339 0.0736898 -0.06207 -0.142206 0.0719949 0.0655582 -0.0120286 -0.0741251 -0.0174775 -0.0290255 -0.170281 0.12395 -0.0425143 0.109647 
0.0098757 0.0297504 -0.18377 -0.037718 0.0307711 0.0735805 -0.0206785 -0.00830021 -0.0497986 0.11301 0.142442 0.0698635 0.12851 -0.0550833 -0.120723 -0.00511814 -0.043571 0.0637453 0.00576633 0.147043 0.123913 -0.140216 0.0337353 0.119588 0.00576994 0.0896481 0.0720742 -0.183574 0.139966 0.0813161 0.00933468 -0.0211975 -0.0263402 -0.0618384 -0.0773206 0.0211712 -0.151784 0.115603 0.000516434 0.0187551 -0.0355722 -0.0662732 -0.165135 0.215613 -0.124292 -0.074265 0.125408 0.0376896 -0.0638604 -0.0833062 0.00524239 0.0905176 -0.107259 -0.0647944 0.0120994 0.0374816 -0.0125452 0.153312 0.0207127 -0.0977644 -0.0571463 -0.127148 0.282256 0.0220774 0.00970704 -0.134726 0.028029 0.0413381 0.0685055 0.0412739 -0.0104135 0.110645 -0.0517748 -0.0350406 0.00762605 -0.0719656 -0.0754715 0.18738 -0.0245081 0.0910073 -0.107093 0.0350539 -0.00529919 -0.0217345 -0.0610738 0.00580568 0.103159 0.0551243 0.106475 -0.148043 -0.0159671 -0.0334429 -0.0432221 0.00983236 0.00205485 -0.196521 -0.00579048 0.0535693 0.0497995 -0.107616 0.000832921 0.0077492 0.0128123 0.0780263 -0.0851516 0.0802414 -0.0465983 0.0965609 0.114619 -0.090206 0.000390838 0.130819 -0.0783883 0.00641588 0.0485736 0.0617632 -0.1118 -0.140606 0.0348642 0.0798208 -0.0571821 -0.0379457 -0.0679521 0.0315093 -0.145044 0.0963428 -0.0766806 0.0767851 
0.0372547 0.0325836 -0.209906 -0.0313171 0.0823695 0.0791923 -0.0222764 -0.0364663 -0.0398562 0.0444021 0.129718 0.0888138 0.136119 -0.0641931 -0.161834 -0.000521868 -0.0369441 0.0736718 -0.0466441 0.160041 0.164376 -0.118297 0.00651026 0.144133 0.0190266 0.0427449 0.0514518 -0.16459 0.113583 0.136682 -0.00407239 -0.011383 -0.0552391 -0.0447117 -0.0780536 0.0208961 -0.159851 0.0268114 -0.00610186 0.000724448 -0.0173855 -0.0547338 -0.10281 0.241133 -0.103056 -0.0581314 0.139683 0.0651761 -0.0609757 -0.059505 0.013536 0.056669 -0.101467 -0.0737544 0.0290003 0.022473 -0.0611091 0.157742 0.0329402 -0.10344 -0.0362137 -0.0848534 0.269878 0.0432077 -0.0398615 -0.16993 0.0142214 0.0435791 0.0646673 0.00748222 0.00625099 0.0951189 -0.0393573 -0.0818353 -0.0194482 -0.0306371 -0.0704826 0.169409 -0.0404717 0.122154 -0.0511938 0.0615493 -0.00759878 -0.0102356 -0.0723604 0.0575934 0.0943283 0.0302652 0.0694904 -0.114674 -0.00758423 -0.055298 -0.0910579 0.0128855 -0.0282164 -0.166883 -0.0408466 0.0403811 0.0296295 -0.126386 0.0264134 0.00890821 0.0320701 0.0936938 -0.119814 0.0794142 -0.0882241 0.147086 0.0543993 -0.0545871 0.0379474 0.0970837 -0.114784 0.02527 -0.0026766 0.0747688 -0.135464 -0.113314 0.0168891 0.0824165 -0.0693618 -0.00961502 -0.066775 0.0360194 -0.163617 0.0822219 -0.106056 0.0433752 
0.0302564 0.0301725 -0.18872 -0.0279214 0.065333 0.0718262 -0.0066438 -0.0171225 -0.0352154 0.0686973 0.133667 0.0973084 0.131895 -0.100772 -0.161195 0.0045384 -0.0550359 0.066218 -0.0619795 0.173165 0.152737 -0.12785 -0.000824271 0.150636 0.00346157 0.0619608 0.0486638 -0.168115 0.125679 0.111315 -0.0131764 -0.00190911 -0.0591437 -0.0311173 -0.0884695 0.00459918 -0.161234 0.0526485 -0.0127333 0.00440651 -0.00602353 -0.080914 -0.116507 0.230324 -0.0987934 -0.0781263 0.132002 0.0643842 -0.0682956 -0.0518173 0.0198396 0.0595976 -0.118822 -0.0719094 0.0348512 0.0176495 -0.0613696 0.14525 0.0206681 -0.0999033 -0.0384612 -0.103711 0.272351 0.0532042 -0.0321543 -0.162013 0.0124231 0.0278677 0.0546479 0.00397858 -0.0144374 0.0954979 -0.0368875 -0.042481 -0.00956358 -0.0491221 -0.0611523 0.182497 -0.0308021 0.1181 -0.0572481 0.048279 -0.000826506 -0.0140499 -0.0681607 0.0446863 0.107074 0.0495737 0.0883853 -0.113375 -0.00632082 -0.0522903 -0.0888833 0.0210423 -0.0356584 -0.165622 -0.0296593 0.0247517 0.0386744 -0.127578 0.0261583 -0.000699245 0.015553 0.0987008 -0.0959023 0.0739888 -0.0745392 0.151672 0.070019 -0.0647079 0.0252031 0.125766 -0.109002 0.02109 0.0163413 0.0619938 -0.131343 -0.109299 0.0225184 0.0851708 -0.0678459 -0.00612692 -0.0584374 0.0407798 -0.158408 0.0876202 -0.0957412 0.0376119 
0.0506363 0.0601774 -0.204005 -0.0480734 0.0590961 0.127317 0.00891629 -0.0354112 -0.0313736 0.0748941 0.160415 0.0742352 0.127337 -0.078132 -0.133798 -0.0163754 -0.0613163 0.0566699 -0.0353948 0.108907 0.156447 -0.082521 -0.0547958 0.143534 0.0226689 0.046333 0.0461658 -0.146449 0.141093 0.156171 -0.00957375 -0.0301891 -0.0807987 -0.0471349 -0.0598409 0.0274084 -0.158324 -0.0243365 0.0279257 0.0208305 -0.008742 -0.0783972 -0.117248 0.235139 -0.0827266 -0.0619643 0.117761 0.0735786 -0.0814716 -0.0914398 0.0185445 0.0949045 -0.10956 -0.0756769 0.0207859 0.0457322 -0.0989117 0.176696 -0.0109812 -0.0765493 -0.0496686 -0.0863638 0.302212 0.0317025 -0.0461328 -0.137857 0.0362667 0.032645 0.0497501 0.00924605 0.0127926 0.0955917 -0.0489129 -0.0856576 -0.00522967 -0.0263685 -0.0663359 0.151167 -0.0377441 0.127405 -0.0238914 0.0543954 0.0115123 -0.00333694 -0.0734897 0.0561806 0.104808 -0.00408386 0.0672357 -0.0787246 0.00485081 -0.0800865 -0.0976981 0.0471007 -0.0536269 -0.178044 -0.0339308 -0.0121622 0.0506339 -0.101554 0.0496068 0.0356493 0.0194637 0.0568425 -0.137629 0.10766 -0.0654121 0.130735 0.0279564 -0.0454887 0.0739259 0.0672888 -0.11426 0.00764778 0.0188324 0.0854537 -0.137893 -0.0810226 0.0236093 0.0717075 -0.0398147 -0.073194 -0.0505682 0.0317246 -0.131728 0.114518 -0.0786722 0.0451757 
0.0527943 0.0198918 -0.188838 -0.0207994 0.0841178 0.0928764 0.00285748 -0.00868013 -0.0205862 0.0101453 0.125821 0.105142 0.130655 -0.109974 -0.178389 -0.00580036 -0.054985 0.0678475 -0.111272 0.173594 0.1748 -0.119585 0.00612802 0.16685 0.000223991 0.00726071 0.0338482 -0.16648 0.100696 0.113626 -0.0132333 0.000819721 -0.0625373 -0.00271923 -0.102954 -0.000417415 -0.165309 0.0194117 -0.0455049 0.000507322 0.0149068 -0.0754391 -0.103769 0.227138 -0.103826 -0.0775317 0.12448 0.0623566 -0.0767049 -0.0241687 0.0118034 0.0354485 -0.107482 -0.0674428 0.0304213 0.0158619 -0.0675045 0.146734 0.0241081 -0.0999957 -0.0416804 -0.0595071 0.257979 0.0462732 -0.0543379 -0.168026 0.00789119 0.0307886 0.0391691 0.0109586 -0.00781356 0.0720085 -0.0351366 -0.0577607 -0.00988456 -0.0199635 -0.0588555 0.157051 -0.0459193 0.126594 -0.0543237 0.0464797 -0.00527524 -0.0207991 -0.0772193 0.0938989 0.107488 0.0294977 0.0404668 -0.0878781 0.0198849 -0.0843797 -0.111428 0.0104382 -0.0429929 -0.140478 -0.0559476 0.0184362 0.025083 -0.119172 0.0395035 -0.00576185 0.0202429 0.117204 -0.100534 0.067638 -0.0991393 0.177601 0.0274068 -0.071101 0.0370881 0.117769 -0.1101 0.0188705 0.000614857 0.0749444 -0.143882 -0.0924995 0.0358899 0.107304 -0.0672567 -0.000797876 -0.073339 0.0521529 -0.146269 0.0765846 -0.105592 0.0211584 
0.0485456 0.0389614 -0.197958 -0.034745 0.0967679 0.0911357 -0.00731267 -0.0374657 -0.0318447 0.0167331 0.127542 0.120504 0.115887 -0.0846049 -0.177313 0.003097 -0.040297 0.0575203 -0.0823726 0.161007 0.161521 -0.0897205 -0.0122471 0.146234 0.00605842 0.0506004 0.0597969 -0.148559 0.108318 0.132648 -0.0247815 -0.00169979 -0.0599057 -0.0188819 -0.0932212 0.009074 -0.144651 0.030007 -0.0148396 0.0162044 0.0106777 -0.0459357 -0.0845995 0.22662 -0.102539 -0.0459792 0.1473 0.0410063 -0.0858227 -0.0485828 0.0239582 0.0462999 -0.12298 -0.0587194 0.052494 0.022552 -0.0827329 0.174231 0.00473209 -0.0902968 -0.039926 -0.0829535 0.281055 0.0333221 -0.0259345 -0.17085 0.00875651 0.0500087 0.0520981 0.0266109 0.0175318 0.0880362 -0.0292593 -0.0600459 -0.00157638 -0.00783609 -0.0633246 0.171961 -0.0553561 0.0935553 -0.0470072 0.0876416 0.00710773 -0.0113954 -0.0833801 0.059681 0.115135 0.0347845 0.0432312 -0.0873345 0.000440018 -0.0961156 -0.111069 0.0236912 -0.0218385 -0.147435 -0.0308869 0.00980393 0.0352296 -0.115808 0.0045891 0.00267155 0.0148306 0.119215 -0.137075 0.0773541 -0.105308 0.159021 0.0160826 -0.07783 0.0563655 0.104808 -0.115483 0.0445302 0.00466183 0.0592492 -0.160228 -0.109951 0.0161349 0.0831475 -0.0567568 0.0153113 -0.0529185 0.0384748 -0.129536 0.0862835 -0.102707 0.0121693 
0.0572038 0.0414296 -0.190462 -0.0330574 0.0861785 0.111053 0.0105882 -0.0234947 -0.0224391 0.0219989 0.126933 0.089943 0.126655 -0.101779 -0.165291 -0.00172707 -0.0600496 0.0500211 -0.0902052 0.16551 0.177877 -0.122806 0.00738727 0.133703 0.0137149 0.0303329 0.0285222 -0.161538 0.132935 0.112106 0.00718661 0.00307017 -0.071629 -0.00875078 -0.0759992 0.00505985 -0.147203 0.059416 -0.00351775 -0.0215222 0.00428322 -0.0758938 -0.107295 0.215398 -0.104161 -0.0792068 0.122918 0.0681116 -0.0851654 -0.0371118 -0.0135265 0.0681774 -0.108532 -0.0612809 0.0420478 0.00819512 -0.0668862 0.167966 -0.0132981 -0.115078 -0.0525838 -0.0775616 0.304234 0.0166276 -0.0220071 -0.133043 0.00519678 0.0403503 0.0273924 0.0280465 -0.00840038 0.0928636 -0.0541736 -0.0342856 -0.0068349 -0.0468901 -0.0440648 0.153193 -0.0285723 0.120083 -0.0595274 0.0474859 0.0073321 -0.0227899 -0.0661177 0.0453218 0.0987983 0.0563348 0.0778441 -0.0837186 0.0470815 -0.0904281 -0.103812 0.0292316 -0.0226927 -0.166663 -0.0316926 0.0336289 0.0248032 -0.107821 0.0314883 0.00117988 -0.00284302 0.1076 -0.110439 0.094892 -0.0741064 0.161768 0.0725695 -0.0753735 0.0360507 0.125832 -0.120199 0.0424557 0.0437607 0.0690959 -0.136063 -0.0903694 0.045374 0.110932 -0.0580041 -0.00654324 -0.0468979 0.0497847 -0.139571 0.0816254 -0.0708205 0.0242595 
0.0477379 0.0509583 -0.17794 -0.0411165 0.0728416 0.111522 -0.0115473 -0.0403817 -0.0347281 0.0226537 0.128524 0.0836608 0.106458 -0.0734891 -0.142802 -0.000901238 -0.0591422 0.0276135 -0.0538185 0.150113 0.150822 -0.102507 0.0266975 0.11814 0.020814 0.0683244 0.0566788 -0.156216 0.140341 0.0901045 0.0276601 -0.0128638 -0.0686633 -0.0261286 -0.0756883 0.0220452 -0.144252 0.100786 0.0169537 0.0142508 -0.00977942 -0.0477396 -0.129363 0.211418 -0.109837 -0.0664979 0.129929 0.0474572 -0.0763987 -0.044 -0.0133607 0.0917796 -0.113053 -0.0544851 0.0380396 0.00965763 -0.047202 0.198785 -0.0134242 -0.110265 -0.0682592 -0.0911329 0.318222 0.0026074 -0.000777599 -0.127986 0.0255851 0.0471717 0.0399159 0.0644075 0.0027426 0.117342 -0.047408 -0.00104546 0.0126784 -0.073643 -0.0619172 0.152424 -0.0314959 0.115283 -0.0630758 0.0591187 0.0187065 -0.0319772 -0.0638287 -0.000202975 0.0997873 0.0631963 0.0744245 -0.109775 0.0416701 -0.0764055 -0.0764587 0.0253913 0.0112151 -0.182896 -0.0074499 0.0484294 0.0323041 -0.100695 -0.0160382 0.00863932 -0.0114069 0.111147 -0.12412 0.100276 -0.0679593 0.132157 0.102985 -0.0933396 0.0417096 0.144833 -0.113492 0.0613938 0.0549434 0.0639565 -0.125777 -0.111607 0.0455287 0.103206 -0.0442454 -0.00118412 -0.0423349 0.0363575 -0.13576 0.0817692 -0.0582246 0.0442922 
0.0544364 0.0624052 -0.178556 -0.0457221 0.0665041 0.102647 0.0031847 -0.024866 -0.0368681 0.0353973 0.131224 0.0890551 0.10993 -0.0952104 -0.155558 -0.00141179 -0.058597 0.0165412 -0.0817867 0.154486 0.13574 -0.100275 0.0035529 0.11811 0.00841697 0.0691992 0.0651215 -0.132171 0.140301 0.0843749 0.00196028 -0.00904065 -0.0782391 -0.0107197 -0.0964486 0.00175248 -0.149176 0.0909718 0.00364418 0.0181764 -0.00400057 -0.072153 -0.120773 0.216677 -0.0963006 -0.0585358 0.120132 0.0577853 -0.0903321 -0.0329797 0.00484413 0.0983571 -0.133816 -0.0610461 0.0373647 0.000228854 -0.0757773 0.185146 -0.00698534 -0.103203 -0.0624267 -0.098758 0.308533 0.0229553 -0.0185286 -0.135037 0.0188603 0.0494938 0.0339503 0.0490696 -0.00414613 0.102366 -0.0372847 0.00721679 0.012688 -0.0663767 -0.0496352 0.160056 -0.031789 0.117103 -0.051147 0.0417617 0.0208891 -0.0325688 -0.0697131 0.00152151 0.107054 0.0560102 0.0850637 -0.0913122 0.0291344 -0.0854286 -0.0903042 0.0343853 -0.000832487 -0.168694 0.00290242 0.0136025 0.0368162 -0.115533 -0.0107948 0.016022 -0.0136428 0.1211 -0.127725 0.0870956 -0.080382 0.155844 0.0916246 -0.0991166 0.0592231 0.154638 -0.116811 0.0683288 0.051458 0.0488622 -0.135562 -0.0961206 0.0506397 0.0977855 -0.0521501 0.00240808 -0.0359901 0.047596 -0.120005 0.0708935 -0.0621693 0.0207391 
0.0458002 0.0249798 -0.145819 -0.0291628 0.091134 0.0682444 -0.02432 -0.0256193 -0.0249051 -0.0125376 0.0986779 0.114655 0.0971772 -0.0629731 -0.164042 0.00711069 -0.0338878 0.025033 -0.115308 0.176324 0.143488 -0.109414 0.0585392 0.127003 0.0124819 0.0627107 0.0623471 -0.128953 0.0938304 0.0498014 0.0154284 0.013431 -0.0548237 0.0106569 -0.13219 0.000483673 -0.154748 0.150923 -0.0339384 0.026691 0.00402176 -0.0149525 -0.120909 0.180086 -0.10381 -0.0693971 0.11531 0.0255157 -0.0548606 -0.00635102 0.0147387 0.0630115 -0.128616 -0.0510483 0.0512201 -0.00988107 -0.0354293 0.186104 0.0203719 -0.12175 -0.0565672 -0.0833861 0.257688 0.0310386 -0.0159711 -0.139735 0.0107809 0.0873918 0.0418989 0.080476 0.0185109 0.10751 -0.0108652 0.0211725 0.0143784 -0.0531487 -0.0623663 0.141823 -0.0461078 0.0967204 -0.0850659 0.0762229 0.028312 -0.0455618 -0.0765294 -0.0084255 0.122922 0.0920509 0.0601913 -0.123291 0.0125242 -0.0839074 -0.0623598 0.0098883 0.0190506 -0.149755 -0.00737698 0.0310985 0.0189091 -0.114827 -0.038103 -0.010142 -0.0110495 0.165455 -0.117629 0.0555788 -0.119998 0.13371 0.0989762 -0.131706 0.0397918 0.191659 -0.117547 0.0964442 0.0458614 0.0425206 -0.150802 -0.117641 0.0380974 0.105783 -0.060554 0.0782397 -0.0621877 0.0378512 -0.118069 0.057027 -0.080674 0.0164755 
0.056589 0.0325307 -0.152148 -0.00937086 0.0848011 0.0548307 -0.00504735 -0.0284331 -0.00702754 0.00285943 0.118933 0.111412 0.111625 -0.0992403 -0.182532 0.0158245 -0.0304365 0.0424771 -0.141799 0.199869 0.156703 -0.127111 0.0426523 0.13399 -0.00258875 0.0491258 0.03782 -0.139473 0.105138 0.0717735 -0.00388105 0.0393248 -0.0528486 0.0203277 -0.123063 -0.0196799 -0.145439 0.153497 -0.0310961 -0.00484869 -0.00307621 -0.0470325 -0.118785 0.17535 -0.091167 -0.0831981 0.106658 0.0449275 -0.0611408 -0.00107362 0.0140563 0.0729748 -0.129341 -0.0511787 0.0483682 -0.0234915 -0.0461904 0.142249 0.00940393 -0.120041 -0.0495886 -0.101546 0.255776 0.0360753 -0.0265769 -0.147216 0.00487981 0.0670441 0.0260664 0.0431695 -0.00178523 0.0802373 -0.0210157 0.0205124 -0.00101547 -0.0636999 -0.0413296 0.148703 -0.0416676 0.111815 -0.0752644 0.0588441 0.0103014 -0.0473166 -0.0577942 0.0121308 0.105557 0.0830838 0.0768755 -0.103587 0.0152843 -0.0902662 -0.0785345 0.0226417 -0.00314853 -0.152548 -0.0166943 0.0160998 0.0215728 -0.123092 -0.000950042 -0.0103988 -0.0153229 0.167548 -0.089209 0.0508121 -0.090339 0.15755 0.113753 -0.11248 0.0198724 0.185788 -0.123723 0.0901708 0.0472188 0.0384269 -0.151614 -0.106282 0.0406973 0.105126 -0.0761878 0.0778793 -0.05477 0.0566876 -0.107782 0.0521926 -0.0679659 0.000564608 
0.0578395 0.0370313 -0.179628 -0.0156243 0.0840476 0.0677378 -0.0177356 -0.0499614 -0.042928 0.0126173 0.116512 0.114178 0.102954 -0.0777848 -0.174857 0.0149853 -0.034975 0.0446541 -0.0853034 0.183961 0.14076 -0.107912 0.0529734 0.121573 0.00728385 0.064178 0.0681468 -0.150937 0.100005 0.0958494 -0.0206545 0.0169266 -0.0523315 -0.0081333 -0.108148 -0.00762674 -0.152927 0.128153 -0.0153025 0.0165456 -0.0263567 -0.0390371 -0.117021 0.198491 -0.115431 -0.0439246 0.133594 0.0316905 -0.0663909 -0.00547539 0.0395946 0.0888166 -0.126735 -0.049857 0.0501353 -0.0189587 -0.0222593 0.160685 0.022992 -0.100078 -0.0437374 -0.103472 0.274032 0.0282385 -0.0100298 -0.17554 0.00489919 0.0689419 0.0434665 0.0716973 0.0110538 0.104716 -0.0262479 0.00316612 -0.00378228 -0.0515179 -0.0562505 0.156133 -0.0497815 0.114002 -0.0663721 0.0617747 0.0108894 -0.0382452 -0.0701855 0.00348627 0.0978219 0.0640079 0.0660715 -0.112468 -0.00235932 -0.0751125 -0.0813751 0.0174947 0.00341696 -0.163514 -0.00348137 0.0369065 0.0411805 -0.130702 -0.0145904 0.0141442 -0.0015675 0.154335 -0.108028 0.050794 -0.0944572 0.155093 0.0984215 -0.100596 0.0351698 0.168413 -0.106767 0.0771423 0.0304664 0.0511222 -0.138705 -0.115028 0.0329279 0.101779 -0.0681956 0.0529059 -0.0462156 0.036219 -0.111778 0.0620285 -0.0631276 0.0200661 
0.0405515 0.0527746 -0.158049 -0.0385144 0.0765669 0.0737452 -0.00354446 -0.0295155 -0.0138239 0.0119256 0.111506 0.0947945 0.116125 -0.0695433 -0.165339 0.0204337 -0.0593033 0.0106085 -0.12778 0.165331 0.14728 -0.126174 0.0444507 0.0946721 0.00778187 0.0618387 0.0434515 -0.121754 0.123161 0.0657105 0.0152224 0.0359377 -0.0610703 0.00279226 -0.126005 -0.0065688 -0.149475 0.159099 -0.00662315 0.0179929 -0.00143969 -0.0472355 -0.117271 0.16905 -0.0936834 -0.0753193 0.102685 0.0388049 -0.0683299 -0.0274445 -0.00413844 0.086682 -0.129341 -0.0456523 0.0394209 -0.00973466 -0.0433347 0.175339 -0.00480093 -0.122376 -0.0680369 -0.0956766 0.280172 0.026243 -0.0182217 -0.101928 0.00470558 0.0906133 0.0309457 0.0545849 0.00818511 0.103793 -0.0258753 0.0250947 0.0278883 -0.0537468 -0.0492374 0.122603 -0.0466334 0.104431 -0.0709992 0.0462578 0.02865 -0.0339284 -0.0788765 0.00764525 0.112294 0.0864913 0.0805034 -0.114608 0.018828 -0.0996348 -0.0695434 0.0271742 0.00554618 -0.160204 -0.0120175 0.0341642 0.0298673 -0.104431 -0.0183985 -0.0185118 -0.0209528 0.164972 -0.109203 0.0726353 -0.102861 0.163067 0.116198 -0.134944 0.0232336 0.184453 -0.129442 0.094272 0.0643988 0.0476894 -0.153663 -0.0823614 0.0571313 0.109725 -0.0551379 0.0514294 -0.0457162 0.0467912 -0.114246 0.0638279 -0.0744402 0.0220505 
0.0541487 0.0360376 -0.151857 -0.0191517 0.0874234 0.0667034 -0.00563298 -0.0365013 -0.0106671 -0.0167715 0.102082 0.112222 0.103216 -0.0934955 -0.181224 0.0132436 -0.054653 0.0265767 -0.15236 0.189279 0.144024 -0.119066 0.059737 0.109297 -0.00567316 0.0452285 0.0372119 -0.133772 0.096874 0.0593615 0.000881744 0.0410035 -0.060402 0.0175799 -0.123873 -0.0161326 -0.156931 0.16149 -0.0358293 0.0100301 -0.000285892 -0.0420489 -0.127838 0.173539 -0.103244 -0.0616071 0.103115 0.0419782 -0.0675628 0.00765506 0.00751574 0.0771511 -0.12534 -0.0509206 0.0403586 -0.0284084 -0.0367561 0.158708 0.00741324 -0.116253 -0.056428 -0.0833755 0.265263 0.0376866 -0.0197685 -0.142956 0.00433049 0.0832758 0.0212403 0.0648851 0.0102867 0.0871808 -0.0116449 0.0306211 0.00598413 -0.052887 -0.0542634 0.117774 -0.0483481 0.113985 -0.0689063 0.0514413 0.0117137 -0.0472387 -0.0736592 0.00700992 0.106783 0.0819759 0.0601476 -0.101979 0.0239745 -0.0964424 -0.0746061 0.0163684 0.000585594 -0.148022 -0.0124783 0.021614 0.0269199 -0.11568 -0.00990839 -0.00968669 -0.0207573 0.171483 -0.09797 0.0492316 -0.104596 0.170146 0.110212 -0.118443 0.035609 0.194261 -0.123899 0.0959707 0.0451423 0.0464878 -0.159218 -0.0902743 0.0538933 0.113827 -0.0683237 0.0744428 -0.053726 0.0507732 -0.0981015 0.0486643 -0.0705781 0.000895138 
0.0694172 0.025129 -0.170953 -0.0355715 0.111555 0.0983848 0.0033543 -0.0366501 -0.0232561 -0.0271251 0.0927018 0.113104 0.11301 -0.118981 -0.181823 0.0227329 -0.0776338 0.0509005 -0.157834 0.175538 0.18085 -0.0959835 0.0326486 0.12299 -0.00947289 0.022307 0.0209231 -0.168868 0.0801504 0.10307 -0.0206034 0.026232 -0.0809575 0.022773 -0.0835413 -0.0104394 -0.154136 0.0753784 -0.0312239 -0.00459997 0.00607804 -0.0547451 -0.0894092 0.203741 -0.0917315 -0.0400864 0.130922 0.0587339 -0.104621 0.00557248 0.00971116 0.0225664 -0.114476 -0.0504334 0.0522174 -0.0172503 -0.0581511 0.164247 -0.00643809 -0.111391 -0.026749 -0.0544658 0.274166 0.0416714 -0.0180601 -0.170895 -0.0156877 0.078991 0.0256142 0.0388443 0.00777714 0.0794258 -0.0263853 -0.0387918 -0.0220309 -0.0150164 -0.0619574 0.120129 -0.0457464 0.115247 -0.0291458 0.068693 -0.0128103 -0.0332778 -0.107394 0.0584524 0.104955 0.0523114 0.0335227 -0.0577505 0.0398576 -0.109772 -0.121381 0.0192585 -0.0364251 -0.107342 -0.0413678 0.0196183 0.0255309 -0.104903 0.0265877 -0.0178287 -0.0197506 0.139317 -0.105742 0.0501303 -0.127917 0.188452 0.0357889 -0.0818585 0.0554256 0.150145 -0.124996 0.0581252 0.0214158 0.0773631 -0.177384 -0.0778497 0.0253179 0.107941 -0.0592648 0.0522321 -0.0335881 0.0557194 -0.107264 0.0570218 -0.0919223 -0.0217804 
0.0682362 0.00237956 -0.187396 -0.0131181 0.115346 0.0842807 0.00401356 -0.0410959 -0.016153 -0.0328606 0.0807149 0.11413 0.115334 -0.118624 -0.186891 0.0107188 -0.0741637 0.0613322 -0.13814 0.185158 0.184076 -0.117555 0.0428671 0.142003 -0.00210109 -0.00457832 0.0136509 -0.191825 0.0601764 0.121789 -0.0241737 0.0194026 -0.0694504 0.00809171 -0.0746085 -0.0083035 -0.16139 0.0499889 -0.0577021 -0.0294763 0.00271402 -0.0565935 -0.0905157 0.212082 -0.103259 -0.0265311 0.131709 0.0643074 -0.0819428 0.00693513 0.010022 0.0125628 -0.0802639 -0.0623311 0.0584658 -0.0160418 -0.0437892 0.14196 0.0150082 -0.109639 -0.0135093 -0.042216 0.251987 0.0524091 -0.0256662 -0.189111 -0.0192425 0.0685979 0.032525 0.0222596 0.00299758 0.0747504 -0.0339682 -0.0710222 -0.0351916 0.00780101 -0.0633916 0.122368 -0.0426254 0.133547 -0.0368626 0.0575258 -0.0328523 -0.0291406 -0.0954364 0.0780635 0.091462 0.0449463 0.0182698 -0.0664796 0.0322588 -0.0884544 -0.11699 0.00250882 -0.0547321 -0.11087 -0.0512081 0.0266878 0.0382118 -0.118371 0.0543353 -0.015857 0.0046443 0.117647 -0.103197 0.0369041 -0.123026 0.192663 0.0246013 -0.0509585 0.0512544 0.129871 -0.115887 0.0251985 -0.00235291 0.0993637 -0.171801 -0.0774498 0.016294 0.116808 -0.0747734 0.0474462 -0.0548315 0.0535525 -0.125112 0.0647209 -0.101525 -0.0139039 
0.042041 0.0493987 -0.199462 -0.0434596 0.0902482 0.100182 0.00574668 -0.0377789 -0.0492517 0.0725928 0.126561 0.0824918 0.142071 -0.0650369 -0.153464 0.0204797 -0.0445199 0.0844065 -0.0640307 0.127907 0.186898 -0.120719 -0.0189365 0.148205 0.0270832 0.031801 0.0194374 -0.15996 0.1349 0.16498 -0.0158902 0.00552056 -0.0814191 -0.0407483 -0.071717 0.0113447 -0.176747 0.00433562 0.0169209 0.00100021 -0.0310095 -0.0631881 -0.0904017 0.217037 -0.0676642 -0.0534893 0.131549 0.0653737 -0.0924479 -0.0875795 0.0317472 0.0578305 -0.105223 -0.0887962 0.0205605 0.0374056 -0.0664797 0.178445 0.0177112 -0.0874408 -0.0204812 -0.0717342 0.272253 0.033105 -0.0284793 -0.145306 -0.0120597 0.0580558 0.035297 0.0062108 0.0130562 0.106926 -0.0550901 -0.0996949 -0.0306313 -0.00754237 -0.0474399 0.151962 -0.0336555 0.106652 -0.0400439 0.0543782 -0.00611596 -0.00168996 -0.0919984 0.0583931 0.0965861 0.0133315 0.0701525 -0.0912486 -0.017141 -0.0677736 -0.100932 0.0404416 -0.0366458 -0.137202 -0.0431922 0.0275399 0.0345501 -0.0965039 0.0535226 0.00987521 0.00556341 0.09835 -0.123913 0.0875943 -0.0974663 0.142229 0.04575 -0.0632543 0.0408747 0.0862594 -0.115925 0.0179393 0.0197052 0.0933119 -0.155733 -0.0712596 0.00561359 0.0890018 -0.0668859 -0.0307379 -0.0579675 0.0272566 -0.15662 0.111316 -0.114741 0.0173741 
0.0444975 0.059616 -0.209552 -0.0514729 0.090888 0.114998 -0.00131983 -0.0550141 -0.0472557 0.101325 0.140005 0.0486776 0.143926 -0.0146093 -0.107578 0.0371934 -0.0188741 0.0879191 -0.0319602 0.0974885 0.175365 -0.116061 0.0101621 0.12315 0.0419669 0.0299459 0.0201189 -0.164037 0.15039 0.157297 0.0218445 0.00685984 -0.075956 -0.0669215 -0.0558158 0.0455554 -0.171749 0.0305022 0.0461377 0.0172203 -0.0626472 -0.0304758 -0.124074 0.201388 -0.0743825 -0.0383514 0.116446 0.0698449 -0.0816656 -0.11611 0.021469 0.0885556 -0.107686 -0.099273 -0.00869428 0.0464161 -0.0392436 0.202125 0.015914 -0.067198 -0.0424915 -0.0775642 0.283444 -0.00789395 0.00108346 -0.125908 -0.00916955 0.0951426 0.0376177 0.0469 0.0398278 0.141701 -0.069558 -0.107832 -0.0365866 -0.0240699 -0.0567431 0.151231 -0.0403723 0.0851681 -0.0492297 0.0563978 -0.0176247 -0.0109361 -0.0965478 0.0366 0.0807766 0.000795462 0.0628949 -0.112534 -0.0181235 -0.0552836 -0.0832072 0.0332273 0.0050505 -0.154327 -0.0375279 0.0456591 0.0298661 -0.0700639 0.0392563 0.0120716 0.00141963 0.0794328 -0.125743 0.102995 -0.0874462 0.0918582 0.0960144 -0.0667132 0.0225433 0.0822308 -0.0955765 0.0247516 0.0504335 0.099411 -0.146527 -0.0798089 0.0036981 0.0954932 -0.0545593 -0.0493026 -0.0562432 0.0375921 -0.152065 0.111016 -0.105661 0.042594 
0.0497798 0.0616198 -0.21885 -0.0316651 0.0902457 0.100984 -0.00299728 -0.0700064 -0.0820847 0.117766 0.12978 0.0547673 0.149959 -0.0200676 -0.117565 0.0664007 -0.0064485 0.090864 -0.0191813 0.118118 0.173949 -0.141006 0.0274408 0.111271 0.0478652 0.0480098 0.00524736 -0.171721 0.147238 0.166123 0.00393991 0.0448869 -0.0803493 -0.061495 -0.0613401 0.0304475 -0.172253 0.0533705 0.0678255 -0.00417939 -0.0862598 -0.0393789 -0.0957776 0.181011 -0.064158 -0.0440937 0.136184 0.0626694 -0.0912666 -0.101295 0.0454564 0.0804965 -0.104318 -0.0920244 -0.000251069 0.0275687 -0.0147982 0.18899 0.0304459 -0.07356 -0.0304489 -0.0754592 0.278432 -0.0198419 0.0112712 -0.108547 -0.0288968 0.0913756 0.022835 0.0289666 0.019011 0.151888 -0.0755392 -0.0804499 -0.0438124 -0.0372489 -0.0294028 0.138601 -0.0336238 0.0899296 -0.0471639 0.0397846 -0.024556 -0.0217524 -0.0987275 0.0246247 0.0592622 0.00371704 0.0853741 -0.121741 -0.0301033 -0.0378453 -0.082042 0.0456825 0.0100554 -0.137486 -0.0214232 0.0758882 0.0247227 -0.0748089 0.0360747 0.00653786 -0.00450038 0.105205 -0.115293 0.0992323 -0.081524 0.107923 0.114392 -0.0688798 -0.00125273 0.0997006 -0.0865718 0.0268113 0.0594645 0.0870369 -0.136561 -0.0681267 0.00417286 0.0966989 -0.0660547 -0.0393689 -0.0303576 0.023227 -0.15923 0.109019 -0.0988305 0.0313314 
