{
  "descriptor": [
    -0.10317333042621613,
    0.06747018545866013,
    0.13812392950057983,
    -0.1025397926568985,
    -0.15564727783203125,
    0.022839123383164406,
    -0.048554737120866776,
    -0.09000973403453827,
    0.18013028800487518,
    -0.11967943608760834,
    0.21776430308818817,
    -0.03705247491598129,
    -0.24760571122169495,
    0.054192207753658295,
    -0.06237255409359932,
    0.12560519576072693,
    -0.125332772731781,
    -0.17414875328540802,
    0.0045687612146139145,
    -0.0753331184387207,
    0.059831634163856506,
    0.14548788964748383,
    -0.0066607361659407616,
    0.07598189264535904,
    -0.13399234414100647,
    -0.3569455146789551,
    -0.08349944651126862,
    -0.10543892532587051,
    0.030476007610559464,
    -0.1342698186635971,
    -0.02860954776406288,
    0.12424079328775406,
    -0.1403355747461319,
    0.010679922066628933,
    0.027024535462260246,
    0.06289922446012497,
    -0.061373110860586166,
    -0.11983279138803482,
    0.2587038278579712,
    0.12242718786001205,
    -0.22146113216876984,
    -0.012963675893843174,
    0.05504552274942398,
    0.2803035080432892,
    0.09667807072401047,
    -0.0507192462682724,
    0.023899519816040993,
    -0.03912293538451195,
    0.11217872053384781,
    -0.27044379711151123,
    0.0060309418477118015,
    0.2320982813835144,
    0.07918442040681839,
    0.08290398120880127,
    0.07899656146764755,
    -0.11586472392082214,
    0.008877281099557877,
    0.09519091993570328,
    -0.17403295636177063,
    0.08609100431203842,
    0.06937187910079956,
    -0.0897233858704567,
    0.007180507760494947,
    -0.0710974633693695,
    0.17341797053813934,
    0.10264232009649277,
    -0.08717910200357437,
    -0.09840983152389526,
    0.11841414123773575,
    -0.109926737844944,
    -0.168868288397789,
    0.07847359776496887,
    -0.16002532839775085,
    -0.1365772932767868,
    -0.2015804946422577,
    0.04204413294792175,
    0.39877504110336304,
    0.09711793810129166,
    -0.1341153383255005,
    0.06757404655218124,
    -0.02956944890320301,
    -0.07476247847080231,
    0.005520803388208151,
    0.08973468840122223,
    -0.11266560107469559,
    0.04922610893845558,
    -0.020053403452038765,
    0.059176377952098846,
    0.22396394610404968,
    0.030378157272934914,
    0.012170528061687946,
    0.24675631523132324,
    -0.0014106743037700653,
    0.0869566798210144,
    0.08346404135227203,
    0.07328277081251144,
    -0.07665388286113739,
    -0.06427603960037231,
    -0.12583230435848236,
    -0.012575948610901833,
    -0.012702172622084618,
    -0.09577417373657227,
    -0.009521559812128544,
    0.13326112926006317,
    -0.2617858350276947,
    0.1543971747159958,
    -0.02201463095843792,
    -0.09946192800998688,
    -0.04019756242632866,
    0.040454212576150894,
    -0.08038771152496338,
    0.013375237584114075,
    0.14530999958515167,
    -0.2241004854440689,
    0.15170015394687653,
    0.16445547342300415,
    0.05189409852027893,
    0.12189001590013504,
    0.07695746421813965,
    -0.01605549082159996,
    -0.025993263348937035,
    -0.0641840398311615,
    -0.12154930830001831,
    -0.11985877901315689,
    0.10796971619129181,
    -0.020236851647496223,
    -0.01825697161257267,
    -0.0018747636349871755
  ]
}