{
  "descriptor": [
    -0.0641658827662468,
    0.07499175518751144,
    0.08801372349262238,
    -0.07453612238168716,
    -0.14948368072509766,
    0.005960395559668541,
    -0.013745120726525784,
    -0.09147759526968002,
    0.16775940358638763,
    -0.14148245751857758,
    0.1638472080230713,
    -0.07449552416801453,
    -0.22005952894687653,
    0.060881756246089935,
    -0.05922598019242287,
    0.11639326810836792,
    -0.12977495789527893,
    -0.1890050321817398,
    -0.01738649792969227,
    -0.07243619859218597,
    0.04307138919830322,
    0.10105975717306137,
    -0.019046980887651443,
    0.09863325953483582,
    -0.13215745985507965,
    -0.3017556369304657,
    -0.0708402693271637,
    -0.10814834386110306,
    -0.009912863373756409,
    -0.12298597395420074,
    -0.036155395209789276,
    0.13103871047496796,
    -0.08620679378509521,
    0.02898288145661354,
    0.019045663997530937,
    0.020761944353580475,
    -0.029056861996650696,
    -0.08325427025556564,
    0.24833139777183533,
    0.11143691837787628,
    -0.21864135563373566,
    -0.016300681978464127,
    0.05213131755590439,
    0.30747416615486145,
    0.11462930589914322,
    -0.05345054715871811,
    0.02164563722908497,
    -0.05177674815058708,
    0.1503034085035324,
    -0.2799105644226074,
    0.03452906012535095,
    0.20219704508781433,
    0.07663378864526749,
    0.09367939084768295,
    0.1107545793056488,
    -0.12087944895029068,
    -0.005406218580901623,
    0.09456396847963333,
    -0.11409203708171844,
    0.11418429017066956,
    0.06514445692300797,
    -0.06511730700731277,
    0.02409534528851509,
    -0.10749159753322601,
    0.17457248270511627,
    0.08605549484491348,
    -0.0774303674697876,
    -0.09444563090801239,
    0.09499106556177139,
    -0.1303601861000061,
    -0.18322163820266724,
    0.08717092126607895,
    -0.14795054495334625,
    -0.14903973042964935,
    -0.21576237678527832,
    0.047684065997600555,
    0.4046280086040497,
    0.1699451357126236,
    -0.13521695137023926,
    0.046460166573524475,
    -0.018163543194532394,
    -0.05155323073267937,
    0.054017651826143265,
    0.11178869754076004,
    -0.1095762774348259,
    0.0515301339328289,
    -0.026395298540592194,
    0.04789263755083084,
    0.21086816489696503,
    0.007706479635089636,
    -0.03517422080039978,
    0.22933177649974823,
    -0.0072282603941857815,
    0.07292979955673218,
    0.05524694174528122,
    0.03850974887609482,
    -0.06738213449716568,
    -0.03240611404180527,
    -0.12161115556955338,
    -0.008675859309732914,
    -0.00569183612242341,
    -0.08962631970643997,
    -0.006429160479456186,
    0.12022487074136734,
    -0.23761779069900513,
    0.13431914150714874,
    -0.041337091475725174,
    -0.06536252051591873,
    -0.06264739483594894,
    0.07642123103141785,
    -0.07630161195993423,
    0.025196390226483345,
    0.13083003461360931,
    -0.23096983134746552,
    0.10599726438522339,
    0.1467237025499344,
    0.04926670342683792,
    0.12090767174959183,
    0.042438194155693054,
    0.007980707101523876,
    -0.01841176487505436,
    -0.0505642294883728,
    -0.08724918961524963,
    -0.08808155357837677,
    0.12008225917816162,
    0.022353697568178177,
    -0.014568044804036617,
    0.00990750826895237
  ]
}