{
  "descriptor": [
    -0.0702919065952301,
    0.10841090977191925,
    0.033517517149448395,
    -0.09019813686609268,
    -0.13395868241786957,
    0.05326074734330177,
    -0.01580340787768364,
    -0.09293031692504883,
    0.1956719160079956,
    -0.09745067358016968,
    0.17337949573993683,
    -0.09214553236961365,
    -0.2793240249156952,
    -0.0026323371566832066,
    -0.0263444222509861,
    0.17943572998046875,
    -0.20271775126457214,
    -0.21929191052913666,
    -0.11137238144874573,
    -0.09186974912881851,
    0.08816876262426376,
    0.07582493126392365,
    0.02400043047964573,
    0.044037751853466034,
    -0.14127536118030548,
    -0.3327999413013458,
    -0.01658727042376995,
    -0.09761343151330948,
    0.08350683003664017,
    -0.05917863920331001,
    -0.07806506007909775,
    0.12518028914928436,
    -0.15207286179065704,
    -0.04177023097872734,
    0.07635100185871124,
    0.0964055061340332,
    -0.0007626608712598681,
    -0.1521713137626648,
    0.24283067882061005,
    -0.0450504831969738,
    -0.25567176938056946,
    0.0038827823009341955,
    0.1788550168275833,
    0.19770507514476776,
    0.19568972289562225,
    -0.0018982053734362125,
    0.022558733820915222,
    -0.058977097272872925,
    0.09110637754201889,
    -0.39762505888938904,
    0.08817994594573975,
    0.17362183332443237,
    0.07611522823572159,
    0.12964582443237305,
    0.09342972934246063,
    -0.3207228183746338,
    -0.010259325616061687,
    0.135959655046463,
    -0.189884215593338,
    0.09984520822763443,
    0.02646791562438011,
    -0.12111843377351761,
    0.02671918086707592,
    -0.03314422816038132,
    0.20179703831672668,
    0.11276549100875854,
    -0.09251655638217926,
    -0.1753097027540207,
    0.17148083448410034,
    -0.1264287233352661,
    -0.030314529314637184,
    0.1602044552564621,
    -0.10133059322834015,
    -0.2169349640607834,
    -0.2073681801557541,
    0.02894505113363266,
    0.3891249895095825,
    0.1800537258386612,
    -0.18663638830184937,
    0.06135198846459389,
    -0.08032827079296112,
    -0.05252155289053917,
    0.03455673158168793,
    0.06236196681857109,
    0.007433534599840641,
    -0.041308678686618805,
    -0.1805466264486313,
    -0.001580198178999126,
    0.26743829250335693,
    -0.06485344469547272,
    -0.007875889539718628,
    0.3331342339515686,
    0.05554506555199623,
    -0.02652727998793125,
    0.029588496312499046,
    0.1722557693719864,
    -0.1381470412015915,
    -0.02632148377597332,
    -0.19435225427150726,
    -0.06906700879335403,
    0.03463522717356682,
    -0.06647779047489166,
    -0.0653136670589447,
    0.10459089279174805,
    -0.22584332525730133,
    0.10479694604873657,
    -0.06720059365034103,
    -0.07825321704149246,
    -0.1083211675286293,
    -0.11962547898292542,
    0.013330413959920406,
    0.034715794026851654,
    0.17580007016658783,
    -0.27292487025260925,
    0.14027778804302216,
    0.2054319828748703,
    0.0695602297782898,
    0.2558121383190155,
    0.06014654412865639,
    0.023010896518826485,
    0.10818497836589813,
    -0.1533627063035965,
    -0.16148903965950012,
    -0.11433234810829163,
    0.05254240334033966,
    0.004248603247106075,
    -0.04977458715438843,
    0.11971888691186905
  ]
}