0.105089 0.0140921 -0.0925181 0.0269161 0.0177061 0.0949563 0.0334506 0.0214815 -0.0782045 -0.0520377 0.0258615 0.0802949 0.104937 -0.0920452 -0.118301 0.0307089 -0.0474101 0.0198589 -0.132641 0.225177 0.135881 -0.138777 0.138731 0.133582 -0.0700861 -0.0670281 -0.0289728 -0.173347 -0.0328524 0.0996673 -0.102991 0.0291799 0.027357 0.132001 -0.0946032 -0.0256284 -0.0451492 0.196834 -0.139474 -0.0596001 -0.101392 -0.0920168 0.000893936 0.0397566 -0.0838519 -0.0338203 0.154834 -0.0249404 -0.162823 0.227697 0.0650187 -0.0786883 -0.0549259 0.0742441 0.151445 -0.0135817 0.0208049 0.0759673 0.0293446 -0.122693 -0.0302506 0.00631244 0.16454 -0.144913 0.0626378 -0.0871952 -0.0703226 -0.000231194 -0.162704 0.0540401 -0.0493852 -0.00119126 -0.0872371 0.0659692 0.00694115 0.00565101 0.105656 0.0214014 0.0406175 0.0626923 -0.0762145 -0.0877618 -0.0776003 -0.0884719 -0.0694233 0.0480634 -0.0283843 -0.00679974 0.102326 0.0851106 0.0498939 -0.187507 -0.0703352 0.00509373 0.00789193 0.0319002 -0.0129118 0.102001 0.0458281 -0.0104551 0.0429282 0.0304913 -0.0641353 0.141374 -0.0684217 0.0372384 -0.106431 0.0962908 -0.00702896 -0.134854 -0.0422891 0.186284 0.00375057 -0.00475543 0.06107 0.0842721 0.0212516 -0.0492786 0.0459897 0.20067 -0.0504848 0.0141234 0.0451308 0.0593589 -0.0142205 0.050554 0.0750767 -0.0725124 
0.0618677 0.0256966 -0.0828073 0.00697201 -0.017072 0.112384 -0.00164431 0.0443516 -0.100427 0.0391126 0.0640838 0.0711934 0.12434 -0.0947974 -0.103065 0.0345467 -0.0583316 0.0503689 -0.0857629 0.205501 0.135224 -0.174329 0.12434 0.158168 -0.0539858 -0.0250837 0.000636442 -0.178843 9.08016e-05 0.0787062 -0.092085 -0.00296855 0.0417346 0.115973 -0.102676 -0.00497903 -0.0634307 0.173508 -0.11168 -0.0530358 -0.0992069 -0.13913 -0.0191082 0.0530939 -0.0829554 -0.0791944 0.17286 -0.0182502 -0.185623 0.174065 0.0740579 -0.0620574 -0.0719472 0.0659635 0.136427 0.0290652 0.0230951 0.0637047 0.0382659 -0.139336 -0.0389997 -0.0190146 0.179849 -0.132844 0.0676027 -0.0515741 -0.0751128 0.00477071 -0.146961 0.0691225 -0.0712411 0.0103917 -0.114961 0.042445 0.0388122 -0.0150521 0.0940676 0.0779573 0.0589516 0.0405639 -0.121395 -0.0862713 -0.0471581 -0.0741443 -0.0929987 0.0543707 -0.00179393 0.0103189 0.149098 0.066979 0.0219786 -0.165456 -0.0452956 0.0226804 -0.00222206 0.00464999 -0.0308866 0.122939 0.0452162 -0.031715 0.0506654 0.0262452 -0.0695795 0.115146 -0.025763 0.0715201 -0.0947224 0.0610373 -0.00318206 -0.161662 -0.0760677 0.192307 0.0270636 -0.0284545 0.086643 0.0683434 0.018304 -0.0716089 0.0570972 0.191439 -0.0257584 -0.0476939 0.0335646 0.0404943 -0.0430009 0.0969862 0.0768043 -0.0240336 
0.0618677 0.0256966 -0.0828073 0.00697201 -0.017072 0.112384 -0.00164431 0.0443516 -0.100427 0.0391126 0.0640838 0.0711934 0.12434 -0.0947974 -0.103065 0.0345467 -0.0583316 0.0503689 -0.0857629 0.205501 0.135224 -0.174329 0.12434 0.158168 -0.0539858 -0.0250837 0.000636442 -0.178843 9.08016e-05 0.0787062 -0.092085 -0.00296855 0.0417346 0.115973 -0.102676 -0.00497903 -0.0634307 0.173508 -0.11168 -0.0530358 -0.0992069 -0.13913 -0.0191082 0.0530939 -0.0829554 -0.0791944 0.17286 -0.0182502 -0.185623 0.174065 0.0740579 -0.0620574 -0.0719472 0.0659635 0.136427 0.0290652 0.0230951 0.0637047 0.0382659 -0.139336 -0.0389997 -0.0190146 0.179849 -0.132844 0.0676027 -0.0515741 -0.0751128 0.00477071 -0.146961 0.0691225 -0.0712411 0.0103917 -0.114961 0.042445 0.0388122 -0.0150521 0.0940676 0.0779573 0.0589516 0.0405639 -0.121395 -0.0862713 -0.0471581 -0.0741443 -0.0929987 0.0543707 -0.00179393 0.0103189 0.149098 0.066979 0.0219786 -0.165456 -0.0452956 0.0226804 -0.00222206 0.00464999 -0.0308866 0.122939 0.0452162 -0.031715 0.0506654 0.0262452 -0.0695795 0.115146 -0.025763 0.0715201 -0.0947224 0.0610373 -0.00318206 -0.161662 -0.0760677 0.192307 0.0270636 -0.0284545 0.086643 0.0683434 0.018304 -0.0716089 0.0570972 0.191439 -0.0257584 -0.0476939 0.0335646 0.0404943 -0.0430009 0.0969862 0.0768043 -0.0240336 
0.052188 0.0337185 -0.0515197 0.0258055 -0.0243481 0.0795774 0.0162601 0.0550129 -0.0519066 0.0113078 0.0641707 0.0839381 0.0990609 -0.116088 -0.115513 0.0481896 -0.0768458 0.0286852 -0.119233 0.197266 0.144398 -0.181906 0.122062 0.11081 -0.0600832 -0.0286633 -0.0277016 -0.174447 -0.00545077 0.0689744 -0.0870926 0.02956 0.0643109 0.123072 -0.110815 -0.0297242 -0.0442814 0.224007 -0.0986034 -0.0404151 -0.0896715 -0.129644 -0.0206132 0.00313477 -0.0619866 -0.0864909 0.149977 -0.0699706 -0.17403 0.173339 0.0500166 -0.0471295 -0.0828544 0.0899455 0.129884 0.021432 0.0349875 0.0330754 -0.0122657 -0.108575 -0.0418264 -0.0518382 0.15868 -0.143974 0.0849227 -0.0492266 -0.0742849 0.00307739 -0.153094 0.0610253 -0.056778 0.00211378 -0.119291 0.0766153 0.0484586 -0.00830014 0.100928 0.0493334 0.0296165 0.0370621 -0.148311 -0.0896134 -0.0367344 -0.0516556 -0.0855469 0.0645864 0.00195739 0.0178045 0.1392 0.049115 0.0134577 -0.187662 -0.0507952 0.0297416 0.0128835 0.00761271 -0.0328463 0.101092 0.0440752 0.0030087 0.0209814 -0.00879581 -0.0882532 0.141395 0.00643902 0.0658087 -0.0639477 0.0800731 0.0121253 -0.184641 -0.117943 0.175209 0.00788791 -0.0235553 0.114117 0.0639598 0.0262494 -0.0609202 0.0801309 0.202993 -0.0282521 0.00463861 0.0332783 0.0559159 0.00898697 0.0827012 0.103979 -0.0210557 
0.0818945 0.000628443 -0.0761615 0.0562394 -0.0214336 0.0639921 0.00108192 0.0456689 -0.0597978 -0.00491286 0.0567532 0.092545 0.0881203 -0.106672 -0.129733 0.0272542 -0.0526874 0.0296559 -0.0984293 0.226009 0.131039 -0.171846 0.160405 0.128744 -0.0657434 -0.037766 -0.00544499 -0.188006 -0.0258718 0.0663229 -0.103079 0.0149492 0.0604675 0.108379 -0.111441 -0.0275829 -0.0741222 0.228472 -0.140884 -0.0581012 -0.130105 -0.09959 -0.0690275 0.0373699 -0.0881056 -0.0659196 0.135093 -0.0490108 -0.1354 0.217681 0.0760997 -0.0218353 -0.0706788 0.0676915 0.13169 -0.0169496 0.0520397 0.0305681 0.0220677 -0.105214 -0.0325084 -0.0478321 0.158552 -0.111838 0.0718219 -0.110478 -0.0692918 0.00608034 -0.135129 0.0869931 -0.0506681 0.00583233 -0.0913489 0.0808192 0.00354004 -0.027306 0.0928538 0.041361 0.0283877 0.0771441 -0.129855 -0.107717 -0.0641524 -0.0891773 -0.0565365 0.0249361 -0.0166003 0.016559 0.131613 0.0391018 0.0155346 -0.149582 -0.0522585 0.0248855 0.0184333 -0.0103318 -0.0149482 0.0927973 0.0466748 -0.0258932 0.0441737 0.0292846 -0.0692697 0.109609 -0.00691284 0.0342597 -0.0567307 0.0648658 0.0477175 -0.149154 -0.0877418 0.199727 0.0249799 -0.0229891 0.0937803 0.0765615 0.0466505 -0.0731022 0.0761969 0.20133 -0.0654415 0.0177582 0.0262326 0.0525805 0.012351 0.067536 0.126413 -0.0214972 
0.0818945 0.000628443 -0.0761615 0.0562394 -0.0214336 0.0639921 0.00108192 0.0456689 -0.0597978 -0.00491286 0.0567532 0.092545 0.0881203 -0.106672 -0.129733 0.0272542 -0.0526874 0.0296559 -0.0984293 0.226009 0.131039 -0.171846 0.160405 0.128744 -0.0657434 -0.037766 -0.00544499 -0.188006 -0.0258718 0.0663229 -0.103079 0.0149492 0.0604675 0.108379 -0.111441 -0.0275829 -0.0741222 0.228472 -0.140884 -0.0581012 -0.130105 -0.09959 -0.0690275 0.0373699 -0.0881056 -0.0659196 0.135093 -0.0490108 -0.1354 0.217681 0.0760997 -0.0218353 -0.0706788 0.0676915 0.13169 -0.0169496 0.0520397 0.0305681 0.0220677 -0.105214 -0.0325084 -0.0478321 0.158552 -0.111838 0.0718219 -0.110478 -0.0692918 0.00608034 -0.135129 0.0869931 -0.0506681 0.00583233 -0.0913489 0.0808192 0.00354004 -0.027306 0.0928538 0.041361 0.0283877 0.0771441 -0.129855 -0.107717 -0.0641524 -0.0891773 -0.0565365 0.0249361 -0.0166003 0.016559 0.131613 0.0391018 0.0155346 -0.149582 -0.0522585 0.0248855 0.0184333 -0.0103318 -0.0149482 0.0927973 0.0466748 -0.0258932 0.0441737 0.0292846 -0.0692697 0.109609 -0.00691284 0.0342597 -0.0567307 0.0648658 0.0477175 -0.149154 -0.0877418 0.199727 0.0249799 -0.0229891 0.0937803 0.0765615 0.0466505 -0.0731022 0.0761969 0.20133 -0.0654415 0.0177582 0.0262326 0.0525805 0.012351 0.067536 0.126413 -0.0214972 
0.0818945 0.000628443 -0.0761615 0.0562394 -0.0214336 0.0639921 0.00108192 0.0456689 -0.0597978 -0.00491286 0.0567532 0.092545 0.0881203 -0.106672 -0.129733 0.0272542 -0.0526874 0.0296559 -0.0984293 0.226009 0.131039 -0.171846 0.160405 0.128744 -0.0657434 -0.037766 -0.00544499 -0.188006 -0.0258718 0.0663229 -0.103079 0.0149492 0.0604675 0.108379 -0.111441 -0.0275829 -0.0741222 0.228472 -0.140884 -0.0581012 -0.130105 -0.09959 -0.0690275 0.0373699 -0.0881056 -0.0659196 0.135093 -0.0490108 -0.1354 0.217681 0.0760997 -0.0218353 -0.0706788 0.0676915 0.13169 -0.0169496 0.0520397 0.0305681 0.0220677 -0.105214 -0.0325084 -0.0478321 0.158552 -0.111838 0.0718219 -0.110478 -0.0692918 0.00608034 -0.135129 0.0869931 -0.0506681 0.00583233 -0.0913489 0.0808192 0.00354004 -0.027306 0.0928538 0.041361 0.0283877 0.0771441 -0.129855 -0.107717 -0.0641524 -0.0891773 -0.0565365 0.0249361 -0.0166003 0.016559 0.131613 0.0391018 0.0155346 -0.149582 -0.0522585 0.0248855 0.0184333 -0.0103318 -0.0149482 0.0927973 0.0466748 -0.0258932 0.0441737 0.0292846 -0.0692697 0.109609 -0.00691284 0.0342597 -0.0567307 0.0648658 0.0477175 -0.149154 -0.0877418 0.199727 0.0249799 -0.0229891 0.0937803 0.0765615 0.0466505 -0.0731022 0.0761969 0.20133 -0.0654415 0.0177582 0.0262326 0.0525805 0.012351 0.067536 0.126413 -0.0214972 
0.0823229 0.0316437 -0.0810135 0.0381139 0.011434 0.125766 0.052195 0.0212672 -0.0529875 -0.0520514 0.0390326 0.0608623 0.0926419 -0.106083 -0.103477 0.020248 -0.0792005 0.027909 -0.115802 0.19131 0.158262 -0.183267 0.125041 0.0951267 -0.0343836 -0.0866164 -0.0807715 -0.191209 -0.0225816 0.0864689 -0.0494081 0.0349365 0.0199607 0.122307 -0.0586074 -0.00773906 -0.037042 0.189834 -0.0938431 -0.0866958 -0.0673566 -0.106849 0.00264798 0.0130119 -0.0839155 -0.0622411 0.150354 -0.0435351 -0.168093 0.188869 0.00381501 -0.0663757 -0.0502874 0.0787979 0.134108 0.00739181 0.0166397 0.0736496 -0.0234818 -0.116963 -0.0484312 0.00424111 0.186553 -0.188911 0.0990314 -0.0271475 -0.0701133 -0.0103375 -0.176695 0.0615188 -0.0394255 0.0215925 -0.111926 0.0682116 0.018524 -0.00853731 0.103737 0.00663317 0.0371059 0.0510806 -0.136982 -0.0921318 -0.0633923 -0.0679129 -0.0891546 0.0684834 -0.0217647 0.00301981 0.108151 0.0679104 0.0781745 -0.197641 -0.051601 -0.00693955 0.0162345 -0.00683311 -0.0258734 0.117356 0.0269839 0.0232115 0.0224338 0.00554821 -0.0769468 0.125439 -0.0253286 0.0867781 -0.0564806 0.100873 0.00319599 -0.131399 -0.0877155 0.146548 -0.00850831 -0.0238868 0.106698 0.0805521 0.0380019 -0.0402988 0.0920421 0.218081 -0.0318288 -0.008042 0.0398946 0.0760678 0.000752948 0.0644342 0.107495 -0.0373524 
0.0823229 0.0316437 -0.0810135 0.0381139 0.011434 0.125766 0.052195 0.0212672 -0.0529875 -0.0520514 0.0390326 0.0608623 0.0926419 -0.106083 -0.103477 0.020248 -0.0792005 0.027909 -0.115802 0.19131 0.158262 -0.183267 0.125041 0.0951267 -0.0343836 -0.0866164 -0.0807715 -0.191209 -0.0225816 0.0864689 -0.0494081 0.0349365 0.0199607 0.122307 -0.0586074 -0.00773906 -0.037042 0.189834 -0.0938431 -0.0866958 -0.0673566 -0.106849 0.00264798 0.0130119 -0.0839155 -0.0622411 0.150354 -0.0435351 -0.168093 0.188869 0.00381501 -0.0663757 -0.0502874 0.0787979 0.134108 0.00739181 0.0166397 0.0736496 -0.0234818 -0.116963 -0.0484312 0.00424111 0.186553 -0.188911 0.0990314 -0.0271475 -0.0701133 -0.0103375 -0.176695 0.0615188 -0.0394255 0.0215925 -0.111926 0.0682116 0.018524 -0.00853731 0.103737 0.00663317 0.0371059 0.0510806 -0.136982 -0.0921318 -0.0633923 -0.0679129 -0.0891546 0.0684834 -0.0217647 0.00301981 0.108151 0.0679104 0.0781745 -0.197641 -0.051601 -0.00693955 0.0162345 -0.00683311 -0.0258734 0.117356 0.0269839 0.0232115 0.0224338 0.00554821 -0.0769468 0.125439 -0.0253286 0.0867781 -0.0564806 0.100873 0.00319599 -0.131399 -0.0877155 0.146548 -0.00850831 -0.0238868 0.106698 0.0805521 0.0380019 -0.0402988 0.0920421 0.218081 -0.0318288 -0.008042 0.0398946 0.0760678 0.000752948 0.0644342 0.107495 -0.0373524 
0.075649 0.0215521 -0.0567919 0.0276538 -0.0191342 0.0901727 0.0864413 0.101989 -0.0697252 0.00178979 0.0470392 0.0499508 0.128241 -0.132287 -0.0659719 0.0157307 -0.0699246 0.0180048 -0.125611 0.188449 0.149445 -0.18961 0.0998419 0.098543 -0.051855 -0.0938231 -0.0917175 -0.198285 -0.00462495 0.0816789 -0.0709486 0.0516913 0.0387499 0.134386 -0.0884119 -0.0512274 -0.0305791 0.187612 -0.101572 -0.0771201 -0.0563501 -0.152223 6.85815e-05 0.0140012 -0.0758933 -0.0755372 0.125268 -0.0462137 -0.170686 0.166069 0.0253625 -0.0814981 -0.0571075 0.07341 0.102485 0.0137589 0.000766771 0.0254692 -0.0125389 -0.100032 -0.0464106 -0.0278694 0.117671 -0.159576 0.0674196 -0.0257773 -0.0680146 -0.032785 -0.172811 -0.0258459 -0.0675584 -0.000637351 -0.126129 0.0645802 0.026913 0.000997074 0.113069 0.0104054 0.0620334 0.08914 -0.139229 -0.154516 -0.0555852 -0.050392 -0.0630177 0.0915697 -0.000972341 -0.014214 0.121674 0.0514745 0.0478779 -0.186643 -0.0678019 0.00992454 -0.0326763 0.0111608 -0.0311544 0.0914023 0.0229894 0.00976614 0.0389202 0.000464756 -0.062957 0.148278 -0.011196 0.0583423 -0.0564152 0.13407 0.0196971 -0.150435 -0.111175 0.141664 -0.0375207 -0.0563271 0.0918407 0.0772144 0.0433837 -0.0359248 0.0802437 0.222347 -0.0392046 -0.0170401 0.0126956 0.10723 0.0117625 0.0387764 0.0833519 -0.0393208 
0.075649 0.0215521 -0.0567919 0.0276538 -0.0191342 0.0901727 0.0864413 0.101989 -0.0697252 0.00178979 0.0470392 0.0499508 0.128241 -0.132287 -0.0659719 0.0157307 -0.0699246 0.0180048 -0.125611 0.188449 0.149445 -0.18961 0.0998419 0.098543 -0.051855 -0.0938231 -0.0917175 -0.198285 -0.00462495 0.0816789 -0.0709486 0.0516913 0.0387499 0.134386 -0.0884119 -0.0512274 -0.0305791 0.187612 -0.101572 -0.0771201 -0.0563501 -0.152223 6.85815e-05 0.0140012 -0.0758933 -0.0755372 0.125268 -0.0462137 -0.170686 0.166069 0.0253625 -0.0814981 -0.0571075 0.07341 0.102485 0.0137589 0.000766771 0.0254692 -0.0125389 -0.100032 -0.0464106 -0.0278694 0.117671 -0.159576 0.0674196 -0.0257773 -0.0680146 -0.032785 -0.172811 -0.0258459 -0.0675584 -0.000637351 -0.126129 0.0645802 0.026913 0.000997074 0.113069 0.0104054 0.0620334 0.08914 -0.139229 -0.154516 -0.0555852 -0.050392 -0.0630177 0.0915697 -0.000972341 -0.014214 0.121674 0.0514745 0.0478779 -0.186643 -0.0678019 0.00992454 -0.0326763 0.0111608 -0.0311544 0.0914023 0.0229894 0.00976614 0.0389202 0.000464756 -0.062957 0.148278 -0.011196 0.0583423 -0.0564152 0.13407 0.0196971 -0.150435 -0.111175 0.141664 -0.0375207 -0.0563271 0.0918407 0.0772144 0.0433837 -0.0359248 0.0802437 0.222347 -0.0392046 -0.0170401 0.0126956 0.10723 0.0117625 0.0387764 0.0833519 -0.0393208 
0.0703815 0.0658665 -0.0680485 0.0328177 -0.0136494 0.101927 0.0280601 0.0468838 -0.0838986 0.00233145 0.0348514 0.0693844 0.0681966 -0.131583 -0.108315 0.0195768 -0.0584368 0.0275464 -0.0474251 0.183758 0.146876 -0.169098 0.119842 0.0736695 -0.0290551 -0.0362081 -0.0357646 -0.184339 0.0122647 0.0924614 -0.0890669 0.0207447 0.0574335 0.104993 -0.0457337 -0.052115 -0.0110856 0.209752 -0.0564052 -0.0997541 -0.0987698 -0.122386 0.0110683 0.0139492 -0.0911871 -0.0466085 0.170776 -0.0737438 -0.188717 0.173835 0.0471335 0.00608601 -0.0494607 0.0903879 0.14207 -0.00647505 0.0636875 0.0123873 -0.0323543 -0.135643 -0.0323067 -0.0547293 0.177205 -0.16938 0.102427 -0.0526432 -0.0806825 -0.0214122 -0.160221 0.0659736 -0.0567789 0.00608218 -0.14081 0.0699029 0.0248783 -0.0158749 0.102943 0.040528 0.0565743 0.063798 -0.165565 -0.0767118 -0.025334 -0.0340347 -0.0248348 0.0135247 -0.0350238 0.0307051 0.165195 0.0643147 0.0318662 -0.161392 -0.064294 0.030168 0.0195204 -0.0401774 0.0140091 0.144997 0.0261433 -0.0188459 0.0259394 0.0358029 -0.0725753 0.12995 -0.0277589 0.0665522 -0.0175094 0.0894946 0.0403608 -0.144019 -0.0837872 0.13866 -0.0116041 -0.0273375 0.122389 0.0526886 0.0446515 -0.0888078 0.0944951 0.195747 -0.0245474 0.00249438 0.0578709 0.0334356 0.0326105 0.0681771 0.168743 -0.0262905 
0.0703815 0.0658665 -0.0680485 0.0328177 -0.0136494 0.101927 0.0280601 0.0468838 -0.0838986 0.00233145 0.0348514 0.0693844 0.0681966 -0.131583 -0.108315 0.0195768 -0.0584368 0.0275464 -0.0474251 0.183758 0.146876 -0.169098 0.119842 0.0736695 -0.0290551 -0.0362081 -0.0357646 -0.184339 0.0122647 0.0924614 -0.0890669 0.0207447 0.0574335 0.104993 -0.0457337 -0.052115 -0.0110856 0.209752 -0.0564052 -0.0997541 -0.0987698 -0.122386 0.0110683 0.0139492 -0.0911871 -0.0466085 0.170776 -0.0737438 -0.188717 0.173835 0.0471335 0.00608601 -0.0494607 0.0903879 0.14207 -0.00647505 0.0636875 0.0123873 -0.0323543 -0.135643 -0.0323067 -0.0547293 0.177205 -0.16938 0.102427 -0.0526432 -0.0806825 -0.0214122 -0.160221 0.0659736 -0.0567789 0.00608218 -0.14081 0.0699029 0.0248783 -0.0158749 0.102943 0.040528 0.0565743 0.063798 -0.165565 -0.0767118 -0.025334 -0.0340347 -0.0248348 0.0135247 -0.0350238 0.0307051 0.165195 0.0643147 0.0318662 -0.161392 -0.064294 0.030168 0.0195204 -0.0401774 0.0140091 0.144997 0.0261433 -0.0188459 0.0259394 0.0358029 -0.0725753 0.12995 -0.0277589 0.0665522 -0.0175094 0.0894946 0.0403608 -0.144019 -0.0837872 0.13866 -0.0116041 -0.0273375 0.122389 0.0526886 0.0446515 -0.0888078 0.0944951 0.195747 -0.0245474 0.00249438 0.0578709 0.0334356 0.0326105 0.0681771 0.168743 -0.0262905 
0.0993266 0.0855356 -0.0788789 0.0410811 0.00620677 0.108757 0.0578132 0.00938153 -0.0907795 -0.0213346 0.0294088 0.0720751 0.0873885 -0.0948505 -0.0991766 0.00446311 -0.0232199 0.0059508 -0.0883387 0.19043 0.116953 -0.152206 0.131613 0.0795362 -0.0414345 -0.0729742 -0.0647152 -0.158148 -0.00455791 0.105383 -0.0864912 0.0365462 0.0322064 0.116156 -0.0697139 -0.0469304 -0.0186229 0.22522 -0.0934664 -0.0605931 -0.0980404 -0.0868996 0.00369792 -8.02731e-05 -0.1087 -0.0183522 0.151895 -0.0604801 -0.170463 0.200515 0.0796267 0.004428 -0.0715654 0.0774516 0.135349 -0.017746 0.0359314 0.0661625 0.000697803 -0.103783 -0.050708 -0.0229878 0.159372 -0.202562 0.113064 -0.0759146 -0.0609111 -0.00622949 -0.197067 0.0828926 -0.0218767 0.0231247 -0.102622 0.0906036 0.0183609 0.00757203 0.104185 0.0111244 0.0414014 0.0627735 -0.139177 -0.100706 -0.0364056 -0.0516405 -0.03963 0.00219164 -0.0326453 -0.0098596 0.116212 0.0699999 0.0186724 -0.193516 -0.0444334 0.00595908 0.0192388 -0.0398259 0.0336261 0.113336 0.0290075 0.00247935 0.00733854 0.0769747 -0.0618771 0.168354 -0.0723485 0.0520183 -0.0545447 0.115614 0.0346521 -0.138658 -0.0538592 0.150843 -0.0107348 0.00485029 0.087868 0.0586977 0.0310321 -0.0566532 0.0782746 0.217522 -0.0448902 0.00714263 0.0350036 0.0556681 0.050015 0.0515445 0.127961 -0.0565277 
0.0993266 0.0855356 -0.0788789 0.0410811 0.00620677 0.108757 0.0578132 0.00938153 -0.0907795 -0.0213346 0.0294088 0.0720751 0.0873885 -0.0948505 -0.0991766 0.00446311 -0.0232199 0.0059508 -0.0883387 0.19043 0.116953 -0.152206 0.131613 0.0795362 -0.0414345 -0.0729742 -0.0647152 -0.158148 -0.00455791 0.105383 -0.0864912 0.0365462 0.0322064 0.116156 -0.0697139 -0.0469304 -0.0186229 0.22522 -0.0934664 -0.0605931 -0.0980404 -0.0868996 0.00369792 -8.02731e-05 -0.1087 -0.0183522 0.151895 -0.0604801 -0.170463 0.200515 0.0796267 0.004428 -0.0715654 0.0774516 0.135349 -0.017746 0.0359314 0.0661625 0.000697803 -0.103783 -0.050708 -0.0229878 0.159372 -0.202562 0.113064 -0.0759146 -0.0609111 -0.00622949 -0.197067 0.0828926 -0.0218767 0.0231247 -0.102622 0.0906036 0.0183609 0.00757203 0.104185 0.0111244 0.0414014 0.0627735 -0.139177 -0.100706 -0.0364056 -0.0516405 -0.03963 0.00219164 -0.0326453 -0.0098596 0.116212 0.0699999 0.0186724 -0.193516 -0.0444334 0.00595908 0.0192388 -0.0398259 0.0336261 0.113336 0.0290075 0.00247935 0.00733854 0.0769747 -0.0618771 0.168354 -0.0723485 0.0520183 -0.0545447 0.115614 0.0346521 -0.138658 -0.0538592 0.150843 -0.0107348 0.00485029 0.087868 0.0586977 0.0310321 -0.0566532 0.0782746 0.217522 -0.0448902 0.00714263 0.0350036 0.0556681 0.050015 0.0515445 0.127961 -0.0565277 
0.0403459 0.0366262 -0.0881099 0.00716012 -0.0186532 0.0880781 -0.0227528 0.0504131 -0.079604 0.0584087 0.062215 0.0656689 0.117435 -0.117431 -0.118587 0.0675607 -0.0508078 0.0475301 -0.0921194 0.212747 0.123635 -0.201677 0.145734 0.124398 -0.0678884 -0.021714 3.29757e-05 -0.175897 0.00200912 0.04494 -0.0683408 -0.00872933 0.0569182 0.102908 -0.107692 -0.00599255 -0.0618616 0.190768 -0.105264 -0.0413553 -0.118706 -0.13501 -0.0210163 0.0432961 -0.0596315 -0.0914839 0.162372 -0.0177505 -0.171921 0.183726 0.0673061 -0.0679391 -0.0980626 0.055299 0.101961 0.0190495 0.0373548 0.0380201 0.0331916 -0.112485 -0.0423572 -0.0308438 0.166728 -0.133152 0.0903194 -0.0788072 -0.0962047 0.00838673 -0.147287 0.0624204 -0.0715802 0.0127658 -0.114053 0.052542 0.0306159 -0.0268052 0.104396 0.10644 0.0419522 0.0291837 -0.13649 -0.107835 -0.0535042 -0.0467103 -0.104296 0.0625675 -0.0164731 0.0222527 0.158862 0.0396355 -0.00632178 -0.15038 -0.0459144 0.0274293 0.03441 0.0117386 -0.035772 0.126127 0.00708998 -0.0152054 0.0309143 -0.000234019 -0.092382 0.113592 0.0229396 0.0681164 -0.0714312 0.0598798 0.025507 -0.157376 -0.123247 0.187004 0.0539058 -0.00515653 0.0871145 0.0573476 0.0243208 -0.0492644 0.0600848 0.197006 -0.0464526 -0.0224361 0.0286254 0.045005 -0.0365109 0.0797574 0.0620802 -0.0211902 
0.0403459 0.0366262 -0.0881099 0.00716012 -0.0186532 0.0880781 -0.0227528 0.0504131 -0.079604 0.0584087 0.062215 0.0656689 0.117435 -0.117431 -0.118587 0.0675607 -0.0508078 0.0475301 -0.0921194 0.212747 0.123635 -0.201677 0.145734 0.124398 -0.0678884 -0.021714 3.29757e-05 -0.175897 0.00200912 0.04494 -0.0683408 -0.00872933 0.0569182 0.102908 -0.107692 -0.00599255 -0.0618616 0.190768 -0.105264 -0.0413553 -0.118706 -0.13501 -0.0210163 0.0432961 -0.0596315 -0.0914839 0.162372 -0.0177505 -0.171921 0.183726 0.0673061 -0.0679391 -0.0980626 0.055299 0.101961 0.0190495 0.0373548 0.0380201 0.0331916 -0.112485 -0.0423572 -0.0308438 0.166728 -0.133152 0.0903194 -0.0788072 -0.0962047 0.00838673 -0.147287 0.0624204 -0.0715802 0.0127658 -0.114053 0.052542 0.0306159 -0.0268052 0.104396 0.10644 0.0419522 0.0291837 -0.13649 -0.107835 -0.0535042 -0.0467103 -0.104296 0.0625675 -0.0164731 0.0222527 0.158862 0.0396355 -0.00632178 -0.15038 -0.0459144 0.0274293 0.03441 0.0117386 -0.035772 0.126127 0.00708998 -0.0152054 0.0309143 -0.000234019 -0.092382 0.113592 0.0229396 0.0681164 -0.0714312 0.0598798 0.025507 -0.157376 -0.123247 0.187004 0.0539058 -0.00515653 0.0871145 0.0573476 0.0243208 -0.0492644 0.0600848 0.197006 -0.0464526 -0.0224361 0.0286254 0.045005 -0.0365109 0.0797574 0.0620802 -0.0211902 
0.0166467 0.0738717 -0.0716293 0.0450674 -0.019787 0.095262 -0.0182615 0.00590613 -0.0457853 0.0352685 0.0756658 0.0622344 0.0998799 -0.152053 -0.128798 0.101649 -0.0922327 0.0662986 -0.104797 0.172597 0.174341 -0.200869 0.128066 0.12542 -0.0395038 -0.0592565 -0.0362763 -0.205082 0.0145905 0.0964212 -0.0502733 0.0193073 0.063098 0.0965355 -0.0736762 -0.00362495 -0.0495282 0.131623 -0.0784177 -0.0298972 -0.0956933 -0.152606 0.0156683 0.0235569 -0.0363736 -0.0834474 0.186284 -0.0426193 -0.177494 0.135602 0.0688059 -0.0748512 -0.0789762 0.0532526 0.0919237 0.0484607 0.0615309 0.00416053 0.0109692 -0.0837929 -0.0383234 -0.0286352 0.148053 -0.140299 0.109826 -0.0838858 -0.0954982 -0.0271977 -0.144826 0.061446 -0.0791612 0.0151652 -0.135175 0.0150777 0.0473371 -0.00136101 0.0874491 0.118736 -0.00262744 0.0386664 -0.121582 -0.0879098 -0.0539109 -0.00715721 -0.127392 0.141143 -0.0273291 -0.0151226 0.0800135 0.0447242 -0.0122949 -0.162154 -0.0672402 0.0248025 -0.00784945 0.0224236 -0.0812114 0.137704 0.0343912 0.0180872 0.0510265 -0.0279667 -0.0859943 0.119681 0.0663463 0.0652958 -0.046083 0.1044 -0.00515638 -0.136127 -0.172648 0.133011 0.0370141 -0.0453102 0.0766339 0.0873813 0.00556221 -0.0194458 0.052572 0.205307 -0.0252702 -0.0171543 0.00983254 0.0415009 -0.0327567 0.11124 0.0511505 -0.00574156 
0.0166467 0.0738717 -0.0716293 0.0450674 -0.019787 0.095262 -0.0182615 0.00590613 -0.0457853 0.0352685 0.0756658 0.0622344 0.0998799 -0.152053 -0.128798 0.101649 -0.0922327 0.0662986 -0.104797 0.172597 0.174341 -0.200869 0.128066 0.12542 -0.0395038 -0.0592565 -0.0362763 -0.205082 0.0145905 0.0964212 -0.0502733 0.0193073 0.063098 0.0965355 -0.0736762 -0.00362495 -0.0495282 0.131623 -0.0784177 -0.0298972 -0.0956933 -0.152606 0.0156683 0.0235569 -0.0363736 -0.0834474 0.186284 -0.0426193 -0.177494 0.135602 0.0688059 -0.0748512 -0.0789762 0.0532526 0.0919237 0.0484607 0.0615309 0.00416053 0.0109692 -0.0837929 -0.0383234 -0.0286352 0.148053 -0.140299 0.109826 -0.0838858 -0.0954982 -0.0271977 -0.144826 0.061446 -0.0791612 0.0151652 -0.135175 0.0150777 0.0473371 -0.00136101 0.0874491 0.118736 -0.00262744 0.0386664 -0.121582 -0.0879098 -0.0539109 -0.00715721 -0.127392 0.141143 -0.0273291 -0.0151226 0.0800135 0.0447242 -0.0122949 -0.162154 -0.0672402 0.0248025 -0.00784945 0.0224236 -0.0812114 0.137704 0.0343912 0.0180872 0.0510265 -0.0279667 -0.0859943 0.119681 0.0663463 0.0652958 -0.046083 0.1044 -0.00515638 -0.136127 -0.172648 0.133011 0.0370141 -0.0453102 0.0766339 0.0873813 0.00556221 -0.0194458 0.052572 0.205307 -0.0252702 -0.0171543 0.00983254 0.0415009 -0.0327567 0.11124 0.0511505 -0.00574156 
0.0166467 0.0738717 -0.0716293 0.0450674 -0.019787 0.095262 -0.0182615 0.00590613 -0.0457853 0.0352685 0.0756658 0.0622344 0.0998799 -0.152053 -0.128798 0.101649 -0.0922327 0.0662986 -0.104797 0.172597 0.174341 -0.200869 0.128066 0.12542 -0.0395038 -0.0592565 -0.0362763 -0.205082 0.0145905 0.0964212 -0.0502733 0.0193073 0.063098 0.0965355 -0.0736762 -0.00362495 -0.0495282 0.131623 -0.0784177 -0.0298972 -0.0956933 -0.152606 0.0156683 0.0235569 -0.0363736 -0.0834474 0.186284 -0.0426193 -0.177494 0.135602 0.0688059 -0.0748512 -0.0789762 0.0532526 0.0919237 0.0484607 0.0615309 0.00416053 0.0109692 -0.0837929 -0.0383234 -0.0286352 0.148053 -0.140299 0.109826 -0.0838858 -0.0954982 -0.0271977 -0.144826 0.061446 -0.0791612 0.0151652 -0.135175 0.0150777 0.0473371 -0.00136101 0.0874491 0.118736 -0.00262744 0.0386664 -0.121582 -0.0879098 -0.0539109 -0.00715721 -0.127392 0.141143 -0.0273291 -0.0151226 0.0800135 0.0447242 -0.0122949 -0.162154 -0.0672402 0.0248025 -0.00784945 0.0224236 -0.0812114 0.137704 0.0343912 0.0180872 0.0510265 -0.0279667 -0.0859943 0.119681 0.0663463 0.0652958 -0.046083 0.1044 -0.00515638 -0.136127 -0.172648 0.133011 0.0370141 -0.0453102 0.0766339 0.0873813 0.00556221 -0.0194458 0.052572 0.205307 -0.0252702 -0.0171543 0.00983254 0.0415009 -0.0327567 0.11124 0.0511505 -0.00574156 
0.0206334 0.0804496 -0.0684236 0.0612391 -0.00539531 0.0860967 -0.0125034 0.00459824 -0.0113383 0.00340448 0.0741725 0.0519739 0.0845988 -0.160943 -0.136787 0.1145 -0.0957358 0.0549411 -0.12786 0.158204 0.205283 -0.207666 0.136565 0.112651 -0.0102369 -0.0930718 -0.0446962 -0.205178 0.0297447 0.0992915 -0.0209152 0.0357718 0.0607589 0.0936161 -0.0773768 -0.0201354 -0.0569106 0.127615 -0.0665585 -0.0311046 -0.0851137 -0.142293 0.0150361 0.0153134 -0.0195421 -0.0891087 0.166339 -0.0562274 -0.156207 0.118662 0.0534062 -0.0536654 -0.0678218 0.0400914 0.065585 0.0418436 0.0756519 -0.00580661 0.00230482 -0.0820513 -0.0380853 -0.0345107 0.133801 -0.128117 0.0912196 -0.0844425 -0.0925057 -0.029949 -0.130554 0.0652481 -0.0777465 0.024036 -0.142097 0.00689412 0.0431409 -0.00765259 0.0861987 0.108708 -0.0353727 0.0679589 -0.126857 -0.0801542 -0.0454617 0.00217293 -0.11189 0.160822 -0.032468 -0.0141574 0.0490188 0.0192058 -0.00390951 -0.16055 -0.090078 0.0202654 -0.00194099 0.0132181 -0.0927849 0.141119 0.0264604 0.0254898 0.047027 -0.0533497 -0.0798056 0.143927 0.0732178 0.0558099 -0.0314695 0.130679 0.0190467 -0.143773 -0.191207 0.125888 0.00882616 -0.0379771 0.0904782 0.0949699 -0.00832361 -0.0048931 0.0680216 0.218512 -0.0337527 0.0195511 -0.0093692 0.0497479 -0.0304671 0.0963362 0.0494241 0.00304427 
0.0206334 0.0804496 -0.0684236 0.0612391 -0.00539531 0.0860967 -0.0125034 0.00459824 -0.0113383 0.00340448 0.0741725 0.0519739 0.0845988 -0.160943 -0.136787 0.1145 -0.0957358 0.0549411 -0.12786 0.158204 0.205283 -0.207666 0.136565 0.112651 -0.0102369 -0.0930718 -0.0446962 -0.205178 0.0297447 0.0992915 -0.0209152 0.0357718 0.0607589 0.0936161 -0.0773768 -0.0201354 -0.0569106 0.127615 -0.0665585 -0.0311046 -0.0851137 -0.142293 0.0150361 0.0153134 -0.0195421 -0.0891087 0.166339 -0.0562274 -0.156207 0.118662 0.0534062 -0.0536654 -0.0678218 0.0400914 0.065585 0.0418436 0.0756519 -0.00580661 0.00230482 -0.0820513 -0.0380853 -0.0345107 0.133801 -0.128117 0.0912196 -0.0844425 -0.0925057 -0.029949 -0.130554 0.0652481 -0.0777465 0.024036 -0.142097 0.00689412 0.0431409 -0.00765259 0.0861987 0.108708 -0.0353727 0.0679589 -0.126857 -0.0801542 -0.0454617 0.00217293 -0.11189 0.160822 -0.032468 -0.0141574 0.0490188 0.0192058 -0.00390951 -0.16055 -0.090078 0.0202654 -0.00194099 0.0132181 -0.0927849 0.141119 0.0264604 0.0254898 0.047027 -0.0533497 -0.0798056 0.143927 0.0732178 0.0558099 -0.0314695 0.130679 0.0190467 -0.143773 -0.191207 0.125888 0.00882616 -0.0379771 0.0904782 0.0949699 -0.00832361 -0.0048931 0.0680216 0.218512 -0.0337527 0.0195511 -0.0093692 0.0497479 -0.0304671 0.0963362 0.0494241 0.00304427 
0.0339913 0.0757466 -0.0583323 0.0407946 -0.0133223 0.0860333 0.00188525 0.0426979 -0.0238457 0.0154676 0.0860679 0.0570602 0.0869444 -0.174238 -0.122371 0.0888992 -0.093056 0.0288507 -0.143438 0.191596 0.163771 -0.197654 0.120908 0.108273 -0.0407494 -0.0715964 -0.0318852 -0.179951 0.0218223 0.0603003 -0.0442465 0.00461233 0.057341 0.120251 -0.0971204 -0.0212133 -0.0492019 0.16076 -0.0983885 -0.0321578 -0.0780484 -0.152918 -0.000801974 0.0257016 -0.0309844 -0.089067 0.155196 -0.0396809 -0.178283 0.158976 0.0402072 -0.0651122 -0.10721 0.0481169 0.0839439 0.0277813 0.0114044 0.00606705 -0.0103595 -0.0807655 -0.0492709 -0.0489472 0.153974 -0.134438 0.0977616 -0.0748895 -0.0920651 -0.0256303 -0.150101 0.0536651 -0.0740896 0.0118992 -0.119153 0.0453094 0.0505402 -0.0211818 0.10399 0.111645 -0.00235056 0.0528462 -0.12738 -0.104302 -0.0515655 -0.0187417 -0.105188 0.12373 -0.0184154 0.00273765 0.0979636 0.0504352 0.0164949 -0.180011 -0.0871847 0.0289178 0.00719999 0.0150275 -0.0636848 0.0940716 0.021891 0.0114567 0.0222051 -0.039394 -0.0935403 0.11867 0.0462786 0.0713562 -0.0371009 0.120953 0.0204221 -0.156795 -0.150241 0.155629 0.0206069 -0.0156772 0.102476 0.0648307 0.00410285 -0.0122789 0.0722789 0.21193 -0.0412407 0.0173097 0.00940637 0.0834663 0.000225467 0.0799046 0.0741154 -0.0276165 
0.0339913 0.0757466 -0.0583323 0.0407946 -0.0133223 0.0860333 0.00188525 0.0426979 -0.0238457 0.0154676 0.0860679 0.0570602 0.0869444 -0.174238 -0.122371 0.0888992 -0.093056 0.0288507 -0.143438 0.191596 0.163771 -0.197654 0.120908 0.108273 -0.0407494 -0.0715964 -0.0318852 -0.179951 0.0218223 0.0603003 -0.0442465 0.00461233 0.057341 0.120251 -0.0971204 -0.0212133 -0.0492019 0.16076 -0.0983885 -0.0321578 -0.0780484 -0.152918 -0.000801974 0.0257016 -0.0309844 -0.089067 0.155196 -0.0396809 -0.178283 0.158976 0.0402072 -0.0651122 -0.10721 0.0481169 0.0839439 0.0277813 0.0114044 0.00606705 -0.0103595 -0.0807655 -0.0492709 -0.0489472 0.153974 -0.134438 0.0977616 -0.0748895 -0.0920651 -0.0256303 -0.150101 0.0536651 -0.0740896 0.0118992 -0.119153 0.0453094 0.0505402 -0.0211818 0.10399 0.111645 -0.00235056 0.0528462 -0.12738 -0.104302 -0.0515655 -0.0187417 -0.105188 0.12373 -0.0184154 0.00273765 0.0979636 0.0504352 0.0164949 -0.180011 -0.0871847 0.0289178 0.00719999 0.0150275 -0.0636848 0.0940716 0.021891 0.0114567 0.0222051 -0.039394 -0.0935403 0.11867 0.0462786 0.0713562 -0.0371009 0.120953 0.0204221 -0.156795 -0.150241 0.155629 0.0206069 -0.0156772 0.102476 0.0648307 0.00410285 -0.0122789 0.0722789 0.21193 -0.0412407 0.0173097 0.00940637 0.0834663 0.000225467 0.0799046 0.0741154 -0.0276165 
0.0563565 0.0450045 -0.0832729 0.0734011 0.0033191 0.0876949 0.00889534 0.0287283 0.0258641 -0.0547054 0.068336 0.0640507 0.045723 -0.199695 -0.151963 0.0627156 -0.123608 0.0113953 -0.143009 0.194747 0.188938 -0.198622 0.136919 0.1027 -0.0251643 -0.0937436 -0.0282005 -0.225777 -0.00312502 0.0563623 -0.0383586 0.00392453 0.0516018 0.107059 -0.0773074 -0.0268432 -0.0500314 0.155751 -0.12069 -0.0673317 -0.0500448 -0.138397 -0.027089 0.0431245 -0.0499645 -0.0624917 0.146731 -0.0480539 -0.144416 0.164514 0.00339557 -0.0480055 -0.0643291 0.0455576 0.102078 0.0064864 0.034425 -0.00495788 -0.0254581 -0.0931367 -0.0341888 -0.0451421 0.170345 -0.109993 0.0882314 -0.104969 -0.0776803 -0.0284426 -0.104043 0.0779088 -0.0769508 0.0122667 -0.113859 0.0390242 0.0362246 -0.0220471 0.0789641 0.0996814 -0.0289136 0.0894774 -0.135111 -0.0779411 -0.0673472 -0.0315878 -0.0780422 0.134639 -0.0192081 0.0211106 0.0534679 0.0343958 0.05903 -0.170461 -0.104617 -0.00200258 -0.00292738 -0.0135623 -0.0595109 0.0851518 0.0458256 0.000468903 0.0393355 -0.0529604 -0.0697368 0.0950256 0.0413125 0.0445472 -0.0205058 0.145539 0.00980118 -0.125414 -0.130777 0.150653 0.00374933 -0.0428591 0.105647 0.0867902 -0.00865943 -0.0337362 0.0894437 0.209374 -0.0470818 0.0599395 0.00378608 0.08843 0.0110635 0.0684977 0.0922638 -0.0158686 
0.0563565 0.0450045 -0.0832729 0.0734011 0.0033191 0.0876949 0.00889534 0.0287283 0.0258641 -0.0547054 0.068336 0.0640507 0.045723 -0.199695 -0.151963 0.0627156 -0.123608 0.0113953 -0.143009 0.194747 0.188938 -0.198622 0.136919 0.1027 -0.0251643 -0.0937436 -0.0282005 -0.225777 -0.00312502 0.0563623 -0.0383586 0.00392453 0.0516018 0.107059 -0.0773074 -0.0268432 -0.0500314 0.155751 -0.12069 -0.0673317 -0.0500448 -0.138397 -0.027089 0.0431245 -0.0499645 -0.0624917 0.146731 -0.0480539 -0.144416 0.164514 0.00339557 -0.0480055 -0.0643291 0.0455576 0.102078 0.0064864 0.034425 -0.00495788 -0.0254581 -0.0931367 -0.0341888 -0.0451421 0.170345 -0.109993 0.0882314 -0.104969 -0.0776803 -0.0284426 -0.104043 0.0779088 -0.0769508 0.0122667 -0.113859 0.0390242 0.0362246 -0.0220471 0.0789641 0.0996814 -0.0289136 0.0894774 -0.135111 -0.0779411 -0.0673472 -0.0315878 -0.0780422 0.134639 -0.0192081 0.0211106 0.0534679 0.0343958 0.05903 -0.170461 -0.104617 -0.00200258 -0.00292738 -0.0135623 -0.0595109 0.0851518 0.0458256 0.000468903 0.0393355 -0.0529604 -0.0697368 0.0950256 0.0413125 0.0445472 -0.0205058 0.145539 0.00980118 -0.125414 -0.130777 0.150653 0.00374933 -0.0428591 0.105647 0.0867902 -0.00865943 -0.0337362 0.0894437 0.209374 -0.0470818 0.0599395 0.00378608 0.08843 0.0110635 0.0684977 0.0922638 -0.0158686 
0.0563565 0.0450045 -0.0832729 0.0734011 0.0033191 0.0876949 0.00889534 0.0287283 0.0258641 -0.0547054 0.068336 0.0640507 0.045723 -0.199695 -0.151963 0.0627156 -0.123608 0.0113953 -0.143009 0.194747 0.188938 -0.198622 0.136919 0.1027 -0.0251643 -0.0937436 -0.0282005 -0.225777 -0.00312502 0.0563623 -0.0383586 0.00392453 0.0516018 0.107059 -0.0773074 -0.0268432 -0.0500314 0.155751 -0.12069 -0.0673317 -0.0500448 -0.138397 -0.027089 0.0431245 -0.0499645 -0.0624917 0.146731 -0.0480539 -0.144416 0.164514 0.00339557 -0.0480055 -0.0643291 0.0455576 0.102078 0.0064864 0.034425 -0.00495788 -0.0254581 -0.0931367 -0.0341888 -0.0451421 0.170345 -0.109993 0.0882314 -0.104969 -0.0776803 -0.0284426 -0.104043 0.0779088 -0.0769508 0.0122667 -0.113859 0.0390242 0.0362246 -0.0220471 0.0789641 0.0996814 -0.0289136 0.0894774 -0.135111 -0.0779411 -0.0673472 -0.0315878 -0.0780422 0.134639 -0.0192081 0.0211106 0.0534679 0.0343958 0.05903 -0.170461 -0.104617 -0.00200258 -0.00292738 -0.0135623 -0.0595109 0.0851518 0.0458256 0.000468903 0.0393355 -0.0529604 -0.0697368 0.0950256 0.0413125 0.0445472 -0.0205058 0.145539 0.00980118 -0.125414 -0.130777 0.150653 0.00374933 -0.0428591 0.105647 0.0867902 -0.00865943 -0.0337362 0.0894437 0.209374 -0.0470818 0.0599395 0.00378608 0.08843 0.0110635 0.0684977 0.0922638 -0.0158686 
0.0282824 0.0793262 -0.0724509 0.0359654 -0.00453746 0.0932831 0.00360397 0.00458154 -0.00206726 -0.0290367 0.0728267 0.0400726 0.0920796 -0.158777 -0.132758 0.115805 -0.115315 0.0304975 -0.157924 0.164902 0.199196 -0.186056 0.113472 0.0954649 -0.0370846 -0.0950609 -0.0517078 -0.191793 0.019011 0.0971871 -0.0330032 0.0313073 0.0487098 0.114008 -0.063145 -0.00762306 -0.029566 0.124779 -0.0743305 -0.0360455 -0.0728878 -0.151054 0.0423108 0.0170308 -0.00527814 -0.0685746 0.165688 -0.0319148 -0.177984 0.136281 0.00996245 -0.0953439 -0.0710342 0.0571064 0.080314 0.0381658 0.0261871 0.00610142 -0.0252467 -0.0775852 -0.0409996 -0.0161384 0.151997 -0.136534 0.093296 -0.0605618 -0.0945709 -0.0300463 -0.138649 0.032804 -0.0805389 -0.00210217 -0.129934 0.00786042 0.0533903 -0.000465123 0.0968583 0.0938266 -0.0220159 0.0538566 -0.0835229 -0.0880035 -0.0702326 -0.00709292 -0.135016 0.180152 -0.0367952 -0.0238566 0.0454109 0.0635971 0.0392773 -0.194277 -0.100151 0.018081 -0.0119628 0.0431911 -0.0969733 0.118294 0.0360139 0.0350049 0.0464041 -0.0653431 -0.0932004 0.123295 0.0590626 0.0689201 -0.0441177 0.145945 -0.019198 -0.133375 -0.166916 0.11686 0.00533917 -0.0301168 0.0797926 0.0964459 -0.0094723 0.0179343 0.0592441 0.204637 -0.0275016 0.0145999 0.0168902 0.0789346 -0.0278551 0.0848708 0.0369296 -0.0292519 
0.0282824 0.0793262 -0.0724509 0.0359654 -0.00453746 0.0932831 0.00360397 0.00458154 -0.00206726 -0.0290367 0.0728267 0.0400726 0.0920796 -0.158777 -0.132758 0.115805 -0.115315 0.0304975 -0.157924 0.164902 0.199196 -0.186056 0.113472 0.0954649 -0.0370846 -0.0950609 -0.0517078 -0.191793 0.019011 0.0971871 -0.0330032 0.0313073 0.0487098 0.114008 -0.063145 -0.00762306 -0.029566 0.124779 -0.0743305 -0.0360455 -0.0728878 -0.151054 0.0423108 0.0170308 -0.00527814 -0.0685746 0.165688 -0.0319148 -0.177984 0.136281 0.00996245 -0.0953439 -0.0710342 0.0571064 0.080314 0.0381658 0.0261871 0.00610142 -0.0252467 -0.0775852 -0.0409996 -0.0161384 0.151997 -0.136534 0.093296 -0.0605618 -0.0945709 -0.0300463 -0.138649 0.032804 -0.0805389 -0.00210217 -0.129934 0.00786042 0.0533903 -0.000465123 0.0968583 0.0938266 -0.0220159 0.0538566 -0.0835229 -0.0880035 -0.0702326 -0.00709292 -0.135016 0.180152 -0.0367952 -0.0238566 0.0454109 0.0635971 0.0392773 -0.194277 -0.100151 0.018081 -0.0119628 0.0431911 -0.0969733 0.118294 0.0360139 0.0350049 0.0464041 -0.0653431 -0.0932004 0.123295 0.0590626 0.0689201 -0.0441177 0.145945 -0.019198 -0.133375 -0.166916 0.11686 0.00533917 -0.0301168 0.0797926 0.0964459 -0.0094723 0.0179343 0.0592441 0.204637 -0.0275016 0.0145999 0.0168902 0.0789346 -0.0278551 0.0848708 0.0369296 -0.0292519 
0.0266204 0.0804337 -0.0661747 0.0273556 -0.00123209 0.0889223 0.032024 0.0242478 0.00639878 -0.0590261 0.0454023 0.0363989 0.0652612 -0.199274 -0.135325 0.0780694 -0.16953 -0.0125369 -0.163129 0.169767 0.192771 -0.19185 0.118182 0.0477721 -0.0380259 -0.0986245 -0.0694798 -0.213019 0.0181216 0.0700996 -0.0366001 0.00537713 0.0313469 0.101145 -0.0452744 -0.0352657 -0.0426704 0.154163 -0.0861746 -0.0509013 -0.0467448 -0.156995 0.0177156 0.0360729 -0.0308183 -0.0315253 0.151604 -0.037263 -0.183947 0.144285 -0.0343292 -0.0693731 -0.0660557 0.0531979 0.081964 0.00466867 0.0187926 0.00834999 -0.0593884 -0.0801992 -0.03316 -0.0201705 0.173972 -0.104361 0.104833 -0.075955 -0.0926907 -0.0336544 -0.117911 0.0236086 -0.0673492 0.00972027 -0.113281 0.0356837 0.0546961 0.000759385 0.0700265 0.064851 -0.00801873 0.0918247 -0.0958648 -0.106057 -0.0707267 0.00478035 -0.120639 0.157707 -0.0255562 0.00598308 0.0474575 0.0509013 0.0667058 -0.189832 -0.106188 0.00234946 -0.0289893 0.00338295 -0.0656538 0.098951 0.046601 0.0245248 0.034062 -0.0631985 -0.0894461 0.104076 0.038249 0.0602117 -0.0279683 0.199346 0.00360158 -0.121618 -0.126937 0.117901 -0.0257332 -0.0361612 0.0902008 0.106681 -0.0226544 0.0235433 0.0811414 0.208084 -0.044192 0.0395877 0.00981034 0.0909713 -0.00365953 0.0672106 0.0576658 -0.0325475 
0.0266204 0.0804337 -0.0661747 0.0273556 -0.00123209 0.0889223 0.032024 0.0242478 0.00639878 -0.0590261 0.0454023 0.0363989 0.0652612 -0.199274 -0.135325 0.0780694 -0.16953 -0.0125369 -0.163129 0.169767 0.192771 -0.19185 0.118182 0.0477721 -0.0380259 -0.0986245 -0.0694798 -0.213019 0.0181216 0.0700996 -0.0366001 0.00537713 0.0313469 0.101145 -0.0452744 -0.0352657 -0.0426704 0.154163 -0.0861746 -0.0509013 -0.0467448 -0.156995 0.0177156 0.0360729 -0.0308183 -0.0315253 0.151604 -0.037263 -0.183947 0.144285 -0.0343292 -0.0693731 -0.0660557 0.0531979 0.081964 0.00466867 0.0187926 0.00834999 -0.0593884 -0.0801992 -0.03316 -0.0201705 0.173972 -0.104361 0.104833 -0.075955 -0.0926907 -0.0336544 -0.117911 0.0236086 -0.0673492 0.00972027 -0.113281 0.0356837 0.0546961 0.000759385 0.0700265 0.064851 -0.00801873 0.0918247 -0.0958648 -0.106057 -0.0707267 0.00478035 -0.120639 0.157707 -0.0255562 0.00598308 0.0474575 0.0509013 0.0667058 -0.189832 -0.106188 0.00234946 -0.0289893 0.00338295 -0.0656538 0.098951 0.046601 0.0245248 0.034062 -0.0631985 -0.0894461 0.104076 0.038249 0.0602117 -0.0279683 0.199346 0.00360158 -0.121618 -0.126937 0.117901 -0.0257332 -0.0361612 0.0902008 0.106681 -0.0226544 0.0235433 0.0811414 0.208084 -0.044192 0.0395877 0.00981034 0.0909713 -0.00365953 0.0672106 0.0576658 -0.0325475 
0.0110452 0.067219 -0.0824717 0.0582474 0.00270162 0.0842892 -0.00128359 0.00220333 -0.00261479 -0.0404912 0.0270665 0.0544042 0.0673556 -0.172689 -0.148969 0.103022 -0.134914 0.0344136 -0.105386 0.151554 0.214287 -0.210207 0.136284 0.0496565 -0.0177187 -0.120202 -0.0766028 -0.226271 -0.0148414 0.117822 -0.0372621 0.0200614 0.0633822 0.070591 -0.0323686 -0.0235212 -0.0364158 0.0893707 -0.0625098 -0.057383 -0.0788174 -0.140861 0.0544025 0.00648242 -0.0243543 -0.0456782 0.168914 -0.0691252 -0.150891 0.130266 0.0182416 -0.0829345 -0.0373448 0.0590683 0.0754573 0.025615 0.0856654 -0.0371687 -0.0318901 -0.0580714 -0.00574577 -0.00639508 0.121238 -0.128862 0.122375 -0.105087 -0.113707 -0.0395514 -0.120253 0.0313464 -0.0599463 0.0168869 -0.140222 -0.0262187 0.0291622 0.0476563 0.0811571 0.0750949 -0.0283898 0.0796369 -0.120756 -0.101042 -0.0593315 0.0531497 -0.124468 0.19262 -0.0459113 -0.0141546 0.0261343 0.0277951 -0.00327437 -0.164604 -0.0966399 0.0115718 -0.0284439 0.0138002 -0.0882046 0.1463 0.0233556 0.047769 0.0617206 -0.0565878 -0.080875 0.102296 0.0861741 0.0483457 -0.0148535 0.164917 -0.0301163 -0.0934289 -0.193428 0.0497886 0.00863382 -0.0637202 0.0614273 0.123264 -0.00165465 0.0360595 0.0541407 0.213071 -0.046744 0.0198279 -0.00210182 0.0384232 -0.00698978 0.0918213 0.0511168 0.00287056 
0.0110452 0.067219 -0.0824717 0.0582474 0.00270162 0.0842892 -0.00128359 0.00220333 -0.00261479 -0.0404912 0.0270665 0.0544042 0.0673556 -0.172689 -0.148969 0.103022 -0.134914 0.0344136 -0.105386 0.151554 0.214287 -0.210207 0.136284 0.0496565 -0.0177187 -0.120202 -0.0766028 -0.226271 -0.0148414 0.117822 -0.0372621 0.0200614 0.0633822 0.070591 -0.0323686 -0.0235212 -0.0364158 0.0893707 -0.0625098 -0.057383 -0.0788174 -0.140861 0.0544025 0.00648242 -0.0243543 -0.0456782 0.168914 -0.0691252 -0.150891 0.130266 0.0182416 -0.0829345 -0.0373448 0.0590683 0.0754573 0.025615 0.0856654 -0.0371687 -0.0318901 -0.0580714 -0.00574577 -0.00639508 0.121238 -0.128862 0.122375 -0.105087 -0.113707 -0.0395514 -0.120253 0.0313464 -0.0599463 0.0168869 -0.140222 -0.0262187 0.0291622 0.0476563 0.0811571 0.0750949 -0.0283898 0.0796369 -0.120756 -0.101042 -0.0593315 0.0531497 -0.124468 0.19262 -0.0459113 -0.0141546 0.0261343 0.0277951 -0.00327437 -0.164604 -0.0966399 0.0115718 -0.0284439 0.0138002 -0.0882046 0.1463 0.0233556 0.047769 0.0617206 -0.0565878 -0.080875 0.102296 0.0861741 0.0483457 -0.0148535 0.164917 -0.0301163 -0.0934289 -0.193428 0.0497886 0.00863382 -0.0637202 0.0614273 0.123264 -0.00165465 0.0360595 0.0541407 0.213071 -0.046744 0.0198279 -0.00210182 0.0384232 -0.00698978 0.0918213 0.0511168 0.00287056 
0.0110452 0.067219 -0.0824717 0.0582474 0.00270162 0.0842892 -0.00128359 0.00220333 -0.00261479 -0.0404912 0.0270665 0.0544042 0.0673556 -0.172689 -0.148969 0.103022 -0.134914 0.0344136 -0.105386 0.151554 0.214287 -0.210207 0.136284 0.0496565 -0.0177187 -0.120202 -0.0766028 -0.226271 -0.0148414 0.117822 -0.0372621 0.0200614 0.0633822 0.070591 -0.0323686 -0.0235212 -0.0364158 0.0893707 -0.0625098 -0.057383 -0.0788174 -0.140861 0.0544025 0.00648242 -0.0243543 -0.0456782 0.168914 -0.0691252 -0.150891 0.130266 0.0182416 -0.0829345 -0.0373448 0.0590683 0.0754573 0.025615 0.0856654 -0.0371687 -0.0318901 -0.0580714 -0.00574577 -0.00639508 0.121238 -0.128862 0.122375 -0.105087 -0.113707 -0.0395514 -0.120253 0.0313464 -0.0599463 0.0168869 -0.140222 -0.0262187 0.0291622 0.0476563 0.0811571 0.0750949 -0.0283898 0.0796369 -0.120756 -0.101042 -0.0593315 0.0531497 -0.124468 0.19262 -0.0459113 -0.0141546 0.0261343 0.0277951 -0.00327437 -0.164604 -0.0966399 0.0115718 -0.0284439 0.0138002 -0.0882046 0.1463 0.0233556 0.047769 0.0617206 -0.0565878 -0.080875 0.102296 0.0861741 0.0483457 -0.0148535 0.164917 -0.0301163 -0.0934289 -0.193428 0.0497886 0.00863382 -0.0637202 0.0614273 0.123264 -0.00165465 0.0360595 0.0541407 0.213071 -0.046744 0.0198279 -0.00210182 0.0384232 -0.00698978 0.0918213 0.0511168 0.00287056 
0.0487251 0.0645175 -0.0990359 0.0702497 0.01964 0.0705542 0.037347 -0.00328933 0.0115478 -0.0654784 0.0355491 0.0627173 0.0585694 -0.173066 -0.146144 0.0847097 -0.109612 0.0105847 -0.159838 0.182101 0.178212 -0.202041 0.145902 0.0641255 -0.0355787 -0.113664 -0.0775553 -0.225995 -0.00226858 0.0836108 -0.0419982 0.0766978 0.0435509 0.103897 -0.0721174 -0.0328826 -0.0369493 0.172284 -0.10286 -0.0492207 -0.0506404 -0.119625 0.00710828 -0.00097939 -0.0428816 -0.0195391 0.149948 -0.0548339 -0.152621 0.143462 0.00078339 -0.0617661 -0.0478516 0.0458852 0.0819154 0.00163084 0.0627297 0.00357626 -0.0271013 -0.0562874 -0.0350622 -0.0117292 0.140946 -0.135561 0.106627 -0.090441 -0.0889407 -0.023709 -0.126097 0.0541738 -0.0641115 0.0133214 -0.112906 0.0530996 0.0353567 0.0100033 0.0810505 0.0605698 -0.0431053 0.0608261 -0.120099 -0.0795112 -0.0899368 -0.0192958 -0.102534 0.160955 -0.0374079 -0.013607 0.0139385 0.0275352 0.0491272 -0.177249 -0.0963846 -0.0206 0.00662975 0.0150468 -0.055532 0.101836 0.0507516 0.0348235 0.0324504 -0.067252 -0.0709799 0.14606 0.0341003 0.0323898 -0.0402666 0.182864 0.00655986 -0.116297 -0.149848 0.130196 -0.00806946 -0.0482889 0.084433 0.0954994 -0.0173195 -0.0107172 0.0894679 0.219267 -0.0466057 0.0675725 0.00205766 0.0900768 0.000124593 0.0567183 0.0404903 -0.0404701 
0.0487251 0.0645175 -0.0990359 0.0702497 0.01964 0.0705542 0.037347 -0.00328933 0.0115478 -0.0654784 0.0355491 0.0627173 0.0585694 -0.173066 -0.146144 0.0847097 -0.109612 0.0105847 -0.159838 0.182101 0.178212 -0.202041 0.145902 0.0641255 -0.0355787 -0.113664 -0.0775553 -0.225995 -0.00226858 0.0836108 -0.0419982 0.0766978 0.0435509 0.103897 -0.0721174 -0.0328826 -0.0369493 0.172284 -0.10286 -0.0492207 -0.0506404 -0.119625 0.00710828 -0.00097939 -0.0428816 -0.0195391 0.149948 -0.0548339 -0.152621 0.143462 0.00078339 -0.0617661 -0.0478516 0.0458852 0.0819154 0.00163084 0.0627297 0.00357626 -0.0271013 -0.0562874 -0.0350622 -0.0117292 0.140946 -0.135561 0.106627 -0.090441 -0.0889407 -0.023709 -0.126097 0.0541738 -0.0641115 0.0133214 -0.112906 0.0530996 0.0353567 0.0100033 0.0810505 0.0605698 -0.0431053 0.0608261 -0.120099 -0.0795112 -0.0899368 -0.0192958 -0.102534 0.160955 -0.0374079 -0.013607 0.0139385 0.0275352 0.0491272 -0.177249 -0.0963846 -0.0206 0.00662975 0.0150468 -0.055532 0.101836 0.0507516 0.0348235 0.0324504 -0.067252 -0.0709799 0.14606 0.0341003 0.0323898 -0.0402666 0.182864 0.00655986 -0.116297 -0.149848 0.130196 -0.00806946 -0.0482889 0.084433 0.0954994 -0.0173195 -0.0107172 0.0894679 0.219267 -0.0466057 0.0675725 0.00205766 0.0900768 0.000124593 0.0567183 0.0404903 -0.0404701 
0.0487251 0.0645175 -0.0990359 0.0702497 0.01964 0.0705542 0.037347 -0.00328933 0.0115478 -0.0654784 0.0355491 0.0627173 0.0585694 -0.173066 -0.146144 0.0847097 -0.109612 0.0105847 -0.159838 0.182101 0.178212 -0.202041 0.145902 0.0641255 -0.0355787 -0.113664 -0.0775553 -0.225995 -0.00226858 0.0836108 -0.0419982 0.0766978 0.0435509 0.103897 -0.0721174 -0.0328826 -0.0369493 0.172284 -0.10286 -0.0492207 -0.0506404 -0.119625 0.00710828 -0.00097939 -0.0428816 -0.0195391 0.149948 -0.0548339 -0.152621 0.143462 0.00078339 -0.0617661 -0.0478516 0.0458852 0.0819154 0.00163084 0.0627297 0.00357626 -0.0271013 -0.0562874 -0.0350622 -0.0117292 0.140946 -0.135561 0.106627 -0.090441 -0.0889407 -0.023709 -0.126097 0.0541738 -0.0641115 0.0133214 -0.112906 0.0530996 0.0353567 0.0100033 0.0810505 0.0605698 -0.0431053 0.0608261 -0.120099 -0.0795112 -0.0899368 -0.0192958 -0.102534 0.160955 -0.0374079 -0.013607 0.0139385 0.0275352 0.0491272 -0.177249 -0.0963846 -0.0206 0.00662975 0.0150468 -0.055532 0.101836 0.0507516 0.0348235 0.0324504 -0.067252 -0.0709799 0.14606 0.0341003 0.0323898 -0.0402666 0.182864 0.00655986 -0.116297 -0.149848 0.130196 -0.00806946 -0.0482889 0.084433 0.0954994 -0.0173195 -0.0107172 0.0894679 0.219267 -0.0466057 0.0675725 0.00205766 0.0900768 0.000124593 0.0567183 0.0404903 -0.0404701 
0.0291814 0.111808 -0.0560195 0.0688446 -0.0342623 0.116704 0.0349528 0.0271745 -0.0282697 -0.0109005 0.0480209 0.0516482 0.0575339 -0.23097 -0.107155 0.0805696 -0.141835 1.0276e-05 -0.12442 0.133976 0.162759 -0.176407 0.120901 0.0504771 -0.0297367 -0.0860742 -0.0883915 -0.233738 0.0121552 0.0738681 -0.0362149 0.0593125 0.0291785 0.108946 -0.0648546 -0.0575617 -0.0169814 0.138347 -0.0520689 -0.00158115 -0.0417755 -0.165387 0.0127492 -0.00746265 -0.0471113 -0.0668946 0.175517 -0.0829872 -0.171524 0.144702 0.0669372 -0.0365013 -0.076386 0.0727054 0.0670481 0.0124594 0.0877578 -0.0321498 -0.0163715 -0.0660556 -0.0474035 -0.0357359 0.119498 -0.156693 0.114382 -0.0887884 -0.0536427 -0.0692005 -0.128279 0.0505392 -0.082764 0.0361618 -0.123679 0.0890944 0.0607974 -0.0150887 0.0610494 0.0682709 -0.0262181 0.100441 -0.112841 -0.100587 -0.028016 0.0189113 -0.0841568 0.157228 -0.0171353 -0.0295226 0.0323253 0.0179094 0.00385234 -0.171152 -0.0952954 0.00169446 -0.0398348 -0.0077808 -0.0329223 0.117693 0.0317681 0.0506416 0.0142838 -0.0347424 -0.0704416 0.162772 0.0637512 0.0314065 -0.0142563 0.194128 -0.00715756 -0.108923 -0.163867 0.114954 -0.0122096 -0.0688938 0.081826 0.0743721 0.00301074 -0.00558778 0.0881219 0.200841 -0.0117961 0.0282486 0.0289832 0.0613405 0.0381661 0.0553444 0.0783192 -0.000132151 
0.0291814 0.111808 -0.0560195 0.0688446 -0.0342623 0.116704 0.0349528 0.0271745 -0.0282697 -0.0109005 0.0480209 0.0516482 0.0575339 -0.23097 -0.107155 0.0805696 -0.141835 1.0276e-05 -0.12442 0.133976 0.162759 -0.176407 0.120901 0.0504771 -0.0297367 -0.0860742 -0.0883915 -0.233738 0.0121552 0.0738681 -0.0362149 0.0593125 0.0291785 0.108946 -0.0648546 -0.0575617 -0.0169814 0.138347 -0.0520689 -0.00158115 -0.0417755 -0.165387 0.0127492 -0.00746265 -0.0471113 -0.0668946 0.175517 -0.0829872 -0.171524 0.144702 0.0669372 -0.0365013 -0.076386 0.0727054 0.0670481 0.0124594 0.0877578 -0.0321498 -0.0163715 -0.0660556 -0.0474035 -0.0357359 0.119498 -0.156693 0.114382 -0.0887884 -0.0536427 -0.0692005 -0.128279 0.0505392 -0.082764 0.0361618 -0.123679 0.0890944 0.0607974 -0.0150887 0.0610494 0.0682709 -0.0262181 0.100441 -0.112841 -0.100587 -0.028016 0.0189113 -0.0841568 0.157228 -0.0171353 -0.0295226 0.0323253 0.0179094 0.00385234 -0.171152 -0.0952954 0.00169446 -0.0398348 -0.0077808 -0.0329223 0.117693 0.0317681 0.0506416 0.0142838 -0.0347424 -0.0704416 0.162772 0.0637512 0.0314065 -0.0142563 0.194128 -0.00715756 -0.108923 -0.163867 0.114954 -0.0122096 -0.0688938 0.081826 0.0743721 0.00301074 -0.00558778 0.0881219 0.200841 -0.0117961 0.0282486 0.0289832 0.0613405 0.0381661 0.0553444 0.0783192 -0.000132151 
0.0270941 0.0437198 -0.0111567 -0.0076302 -0.0117092 0.21887 0.0696718 0.0730714 0.0100864 -0.103882 -0.00759824 0.0433198 0.0628685 -0.226535 -0.0243681 -0.0131275 -0.226539 -0.0481265 -0.153838 0.0645056 0.171372 -0.0852924 0.0742597 0.0767838 -0.0416322 -0.119173 -0.12778 -0.269898 -0.0481199 0.0338806 0.0521921 -0.0372757 -0.038675 0.118124 -0.0153488 -0.00481583 -0.0204015 0.0504199 -0.0850162 0.0445898 0.0576972 -0.144516 -0.0143235 0.0557467 -0.077859 -0.0840231 0.14161 -0.0539999 -0.135843 0.150861 0.000959035 -0.137402 -0.0464348 0.0703316 0.0863999 0.0416339 0.01329 0.0819829 -0.0451011 -0.0858941 -0.069163 0.0408294 0.126996 -0.163371 0.108939 -0.111721 0.00585806 -0.0586949 -0.10137 0.0468353 -0.031623 0.0676425 -0.0904236 0.0423079 0.0566036 0.0240204 -0.0316977 0.0115594 0.0175791 0.140517 -0.0751082 -0.0835336 0.0033585 0.0365131 -0.125228 0.152322 0.0762487 -0.0319775 -0.0406123 0.0322697 0.0643968 -0.214899 -0.0637438 -0.0409088 -0.107025 -0.000357182 -0.050675 0.0637198 0.0121996 0.101233 0.0126599 -0.0261822 -0.0769786 0.0987734 0.00752095 0.0288935 -0.0885512 0.160346 -0.114373 -0.0519036 -0.0708829 0.058633 -0.0558689 -0.0953308 0.0424222 0.144268 -0.0157986 0.00818611 0.0379393 0.209161 0.0511119 -0.017537 0.00462614 0.0743656 0.0100869 0.0389596 0.0188827 0.0261343 
0.0270941 0.0437198 -0.0111567 -0.0076302 -0.0117092 0.21887 0.0696718 0.0730714 0.0100864 -0.103882 -0.00759824 0.0433198 0.0628685 -0.226535 -0.0243681 -0.0131275 -0.226539 -0.0481265 -0.153838 0.0645056 0.171372 -0.0852924 0.0742597 0.0767838 -0.0416322 -0.119173 -0.12778 -0.269898 -0.0481199 0.0338806 0.0521921 -0.0372757 -0.038675 0.118124 -0.0153488 -0.00481583 -0.0204015 0.0504199 -0.0850162 0.0445898 0.0576972 -0.144516 -0.0143235 0.0557467 -0.077859 -0.0840231 0.14161 -0.0539999 -0.135843 0.150861 0.000959035 -0.137402 -0.0464348 0.0703316 0.0863999 0.0416339 0.01329 0.0819829 -0.0451011 -0.0858941 -0.069163 0.0408294 0.126996 -0.163371 0.108939 -0.111721 0.00585806 -0.0586949 -0.10137 0.0468353 -0.031623 0.0676425 -0.0904236 0.0423079 0.0566036 0.0240204 -0.0316977 0.0115594 0.0175791 0.140517 -0.0751082 -0.0835336 0.0033585 0.0365131 -0.125228 0.152322 0.0762487 -0.0319775 -0.0406123 0.0322697 0.0643968 -0.214899 -0.0637438 -0.0409088 -0.107025 -0.000357182 -0.050675 0.0637198 0.0121996 0.101233 0.0126599 -0.0261822 -0.0769786 0.0987734 0.00752095 0.0288935 -0.0885512 0.160346 -0.114373 -0.0519036 -0.0708829 0.058633 -0.0558689 -0.0953308 0.0424222 0.144268 -0.0157986 0.00818611 0.0379393 0.209161 0.0511119 -0.017537 0.00462614 0.0743656 0.0100869 0.0389596 0.0188827 0.0261343 
0.0270941 0.0437198 -0.0111567 -0.0076302 -0.0117092 0.21887 0.0696718 0.0730714 0.0100864 -0.103882 -0.00759824 0.0433198 0.0628685 -0.226535 -0.0243681 -0.0131275 -0.226539 -0.0481265 -0.153838 0.0645056 0.171372 -0.0852924 0.0742597 0.0767838 -0.0416322 -0.119173 -0.12778 -0.269898 -0.0481199 0.0338806 0.0521921 -0.0372757 -0.038675 0.118124 -0.0153488 -0.00481583 -0.0204015 0.0504199 -0.0850162 0.0445898 0.0576972 -0.144516 -0.0143235 0.0557467 -0.077859 -0.0840231 0.14161 -0.0539999 -0.135843 0.150861 0.000959035 -0.137402 -0.0464348 0.0703316 0.0863999 0.0416339 0.01329 0.0819829 -0.0451011 -0.0858941 -0.069163 0.0408294 0.126996 -0.163371 0.108939 -0.111721 0.00585806 -0.0586949 -0.10137 0.0468353 -0.031623 0.0676425 -0.0904236 0.0423079 0.0566036 0.0240204 -0.0316977 0.0115594 0.0175791 0.140517 -0.0751082 -0.0835336 0.0033585 0.0365131 -0.125228 0.152322 0.0762487 -0.0319775 -0.0406123 0.0322697 0.0643968 -0.214899 -0.0637438 -0.0409088 -0.107025 -0.000357182 -0.050675 0.0637198 0.0121996 0.101233 0.0126599 -0.0261822 -0.0769786 0.0987734 0.00752095 0.0288935 -0.0885512 0.160346 -0.114373 -0.0519036 -0.0708829 0.058633 -0.0558689 -0.0953308 0.0424222 0.144268 -0.0157986 0.00818611 0.0379393 0.209161 0.0511119 -0.017537 0.00462614 0.0743656 0.0100869 0.0389596 0.0188827 0.0261343 
0.0270941 0.0437198 -0.0111567 -0.0076302 -0.0117092 0.21887 0.0696718 0.0730714 0.0100864 -0.103882 -0.00759824 0.0433198 0.0628685 -0.226535 -0.0243681 -0.0131275 -0.226539 -0.0481265 -0.153838 0.0645056 0.171372 -0.0852924 0.0742597 0.0767838 -0.0416322 -0.119173 -0.12778 -0.269898 -0.0481199 0.0338806 0.0521921 -0.0372757 -0.038675 0.118124 -0.0153488 -0.00481583 -0.0204015 0.0504199 -0.0850162 0.0445898 0.0576972 -0.144516 -0.0143235 0.0557467 -0.077859 -0.0840231 0.14161 -0.0539999 -0.135843 0.150861 0.000959035 -0.137402 -0.0464348 0.0703316 0.0863999 0.0416339 0.01329 0.0819829 -0.0451011 -0.0858941 -0.069163 0.0408294 0.126996 -0.163371 0.108939 -0.111721 0.00585806 -0.0586949 -0.10137 0.0468353 -0.031623 0.0676425 -0.0904236 0.0423079 0.0566036 0.0240204 -0.0316977 0.0115594 0.0175791 0.140517 -0.0751082 -0.0835336 0.0033585 0.0365131 -0.125228 0.152322 0.0762487 -0.0319775 -0.0406123 0.0322697 0.0643968 -0.214899 -0.0637438 -0.0409088 -0.107025 -0.000357182 -0.050675 0.0637198 0.0121996 0.101233 0.0126599 -0.0261822 -0.0769786 0.0987734 0.00752095 0.0288935 -0.0885512 0.160346 -0.114373 -0.0519036 -0.0708829 0.058633 -0.0558689 -0.0953308 0.0424222 0.144268 -0.0157986 0.00818611 0.0379393 0.209161 0.0511119 -0.017537 0.00462614 0.0743656 0.0100869 0.0389596 0.0188827 0.0261343 
0.0270941 0.0437198 -0.0111567 -0.0076302 -0.0117092 0.21887 0.0696718 0.0730714 0.0100864 -0.103882 -0.00759824 0.0433198 0.0628685 -0.226535 -0.0243681 -0.0131275 -0.226539 -0.0481265 -0.153838 0.0645056 0.171372 -0.0852924 0.0742597 0.0767838 -0.0416322 -0.119173 -0.12778 -0.269898 -0.0481199 0.0338806 0.0521921 -0.0372757 -0.038675 0.118124 -0.0153488 -0.00481583 -0.0204015 0.0504199 -0.0850162 0.0445898 0.0576972 -0.144516 -0.0143235 0.0557467 -0.077859 -0.0840231 0.14161 -0.0539999 -0.135843 0.150861 0.000959035 -0.137402 -0.0464348 0.0703316 0.0863999 0.0416339 0.01329 0.0819829 -0.0451011 -0.0858941 -0.069163 0.0408294 0.126996 -0.163371 0.108939 -0.111721 0.00585806 -0.0586949 -0.10137 0.0468353 -0.031623 0.0676425 -0.0904236 0.0423079 0.0566036 0.0240204 -0.0316977 0.0115594 0.0175791 0.140517 -0.0751082 -0.0835336 0.0033585 0.0365131 -0.125228 0.152322 0.0762487 -0.0319775 -0.0406123 0.0322697 0.0643968 -0.214899 -0.0637438 -0.0409088 -0.107025 -0.000357182 -0.050675 0.0637198 0.0121996 0.101233 0.0126599 -0.0261822 -0.0769786 0.0987734 0.00752095 0.0288935 -0.0885512 0.160346 -0.114373 -0.0519036 -0.0708829 0.058633 -0.0558689 -0.0953308 0.0424222 0.144268 -0.0157986 0.00818611 0.0379393 0.209161 0.0511119 -0.017537 0.00462614 0.0743656 0.0100869 0.0389596 0.0188827 0.0261343 
0.0270941 0.0437198 -0.0111567 -0.0076302 -0.0117092 0.21887 0.0696718 0.0730714 0.0100864 -0.103882 -0.00759824 0.0433198 0.0628685 -0.226535 -0.0243681 -0.0131275 -0.226539 -0.0481265 -0.153838 0.0645056 0.171372 -0.0852924 0.0742597 0.0767838 -0.0416322 -0.119173 -0.12778 -0.269898 -0.0481199 0.0338806 0.0521921 -0.0372757 -0.038675 0.118124 -0.0153488 -0.00481583 -0.0204015 0.0504199 -0.0850162 0.0445898 0.0576972 -0.144516 -0.0143235 0.0557467 -0.077859 -0.0840231 0.14161 -0.0539999 -0.135843 0.150861 0.000959035 -0.137402 -0.0464348 0.0703316 0.0863999 0.0416339 0.01329 0.0819829 -0.0451011 -0.0858941 -0.069163 0.0408294 0.126996 -0.163371 0.108939 -0.111721 0.00585806 -0.0586949 -0.10137 0.0468353 -0.031623 0.0676425 -0.0904236 0.0423079 0.0566036 0.0240204 -0.0316977 0.0115594 0.0175791 0.140517 -0.0751082 -0.0835336 0.0033585 0.0365131 -0.125228 0.152322 0.0762487 -0.0319775 -0.0406123 0.0322697 0.0643968 -0.214899 -0.0637438 -0.0409088 -0.107025 -0.000357182 -0.050675 0.0637198 0.0121996 0.101233 0.0126599 -0.0261822 -0.0769786 0.0987734 0.00752095 0.0288935 -0.0885512 0.160346 -0.114373 -0.0519036 -0.0708829 0.058633 -0.0558689 -0.0953308 0.0424222 0.144268 -0.0157986 0.00818611 0.0379393 0.209161 0.0511119 -0.017537 0.00462614 0.0743656 0.0100869 0.0389596 0.0188827 0.0261343 
0.0270941 0.0437198 -0.0111567 -0.0076302 -0.0117092 0.21887 0.0696718 0.0730714 0.0100864 -0.103882 -0.00759824 0.0433198 0.0628685 -0.226535 -0.0243681 -0.0131275 -0.226539 -0.0481265 -0.153838 0.0645056 0.171372 -0.0852924 0.0742597 0.0767838 -0.0416322 -0.119173 -0.12778 -0.269898 -0.0481199 0.0338806 0.0521921 -0.0372757 -0.038675 0.118124 -0.0153488 -0.00481583 -0.0204015 0.0504199 -0.0850162 0.0445898 0.0576972 -0.144516 -0.0143235 0.0557467 -0.077859 -0.0840231 0.14161 -0.0539999 -0.135843 0.150861 0.000959035 -0.137402 -0.0464348 0.0703316 0.0863999 0.0416339 0.01329 0.0819829 -0.0451011 -0.0858941 -0.069163 0.0408294 0.126996 -0.163371 0.108939 -0.111721 0.00585806 -0.0586949 -0.10137 0.0468353 -0.031623 0.0676425 -0.0904236 0.0423079 0.0566036 0.0240204 -0.0316977 0.0115594 0.0175791 0.140517 -0.0751082 -0.0835336 0.0033585 0.0365131 -0.125228 0.152322 0.0762487 -0.0319775 -0.0406123 0.0322697 0.0643968 -0.214899 -0.0637438 -0.0409088 -0.107025 -0.000357182 -0.050675 0.0637198 0.0121996 0.101233 0.0126599 -0.0261822 -0.0769786 0.0987734 0.00752095 0.0288935 -0.0885512 0.160346 -0.114373 -0.0519036 -0.0708829 0.058633 -0.0558689 -0.0953308 0.0424222 0.144268 -0.0157986 0.00818611 0.0379393 0.209161 0.0511119 -0.017537 0.00462614 0.0743656 0.0100869 0.0389596 0.0188827 0.0261343 
0.0270941 0.0437198 -0.0111567 -0.0076302 -0.0117092 0.21887 0.0696718 0.0730714 0.0100864 -0.103882 -0.00759824 0.0433198 0.0628685 -0.226535 -0.0243681 -0.0131275 -0.226539 -0.0481265 -0.153838 0.0645056 0.171372 -0.0852924 0.0742597 0.0767838 -0.0416322 -0.119173 -0.12778 -0.269898 -0.0481199 0.0338806 0.0521921 -0.0372757 -0.038675 0.118124 -0.0153488 -0.00481583 -0.0204015 0.0504199 -0.0850162 0.0445898 0.0576972 -0.144516 -0.0143235 0.0557467 -0.077859 -0.0840231 0.14161 -0.0539999 -0.135843 0.150861 0.000959035 -0.137402 -0.0464348 0.0703316 0.0863999 0.0416339 0.01329 0.0819829 -0.0451011 -0.0858941 -0.069163 0.0408294 0.126996 -0.163371 0.108939 -0.111721 0.00585806 -0.0586949 -0.10137 0.0468353 -0.031623 0.0676425 -0.0904236 0.0423079 0.0566036 0.0240204 -0.0316977 0.0115594 0.0175791 0.140517 -0.0751082 -0.0835336 0.0033585 0.0365131 -0.125228 0.152322 0.0762487 -0.0319775 -0.0406123 0.0322697 0.0643968 -0.214899 -0.0637438 -0.0409088 -0.107025 -0.000357182 -0.050675 0.0637198 0.0121996 0.101233 0.0126599 -0.0261822 -0.0769786 0.0987734 0.00752095 0.0288935 -0.0885512 0.160346 -0.114373 -0.0519036 -0.0708829 0.058633 -0.0558689 -0.0953308 0.0424222 0.144268 -0.0157986 0.00818611 0.0379393 0.209161 0.0511119 -0.017537 0.00462614 0.0743656 0.0100869 0.0389596 0.0188827 0.0261343 
0.0270941 0.0437198 -0.0111567 -0.0076302 -0.0117092 0.21887 0.0696718 0.0730714 0.0100864 -0.103882 -0.00759824 0.0433198 0.0628685 -0.226535 -0.0243681 -0.0131275 -0.226539 -0.0481265 -0.153838 0.0645056 0.171372 -0.0852924 0.0742597 0.0767838 -0.0416322 -0.119173 -0.12778 -0.269898 -0.0481199 0.0338806 0.0521921 -0.0372757 -0.038675 0.118124 -0.0153488 -0.00481583 -0.0204015 0.0504199 -0.0850162 0.0445898 0.0576972 -0.144516 -0.0143235 0.0557467 -0.077859 -0.0840231 0.14161 -0.0539999 -0.135843 0.150861 0.000959035 -0.137402 -0.0464348 0.0703316 0.0863999 0.0416339 0.01329 0.0819829 -0.0451011 -0.0858941 -0.069163 0.0408294 0.126996 -0.163371 0.108939 -0.111721 0.00585806 -0.0586949 -0.10137 0.0468353 -0.031623 0.0676425 -0.0904236 0.0423079 0.0566036 0.0240204 -0.0316977 0.0115594 0.0175791 0.140517 -0.0751082 -0.0835336 0.0033585 0.0365131 -0.125228 0.152322 0.0762487 -0.0319775 -0.0406123 0.0322697 0.0643968 -0.214899 -0.0637438 -0.0409088 -0.107025 -0.000357182 -0.050675 0.0637198 0.0121996 0.101233 0.0126599 -0.0261822 -0.0769786 0.0987734 0.00752095 0.0288935 -0.0885512 0.160346 -0.114373 -0.0519036 -0.0708829 0.058633 -0.0558689 -0.0953308 0.0424222 0.144268 -0.0157986 0.00818611 0.0379393 0.209161 0.0511119 -0.017537 0.00462614 0.0743656 0.0100869 0.0389596 0.0188827 0.0261343 
0.0270941 0.0437198 -0.0111567 -0.0076302 -0.0117092 0.21887 0.0696718 0.0730714 0.0100864 -0.103882 -0.00759824 0.0433198 0.0628685 -0.226535 -0.0243681 -0.0131275 -0.226539 -0.0481265 -0.153838 0.0645056 0.171372 -0.0852924 0.0742597 0.0767838 -0.0416322 -0.119173 -0.12778 -0.269898 -0.0481199 0.0338806 0.0521921 -0.0372757 -0.038675 0.118124 -0.0153488 -0.00481583 -0.0204015 0.0504199 -0.0850162 0.0445898 0.0576972 -0.144516 -0.0143235 0.0557467 -0.077859 -0.0840231 0.14161 -0.0539999 -0.135843 0.150861 0.000959035 -0.137402 -0.0464348 0.0703316 0.0863999 0.0416339 0.01329 0.0819829 -0.0451011 -0.0858941 -0.069163 0.0408294 0.126996 -0.163371 0.108939 -0.111721 0.00585806 -0.0586949 -0.10137 0.0468353 -0.031623 0.0676425 -0.0904236 0.0423079 0.0566036 0.0240204 -0.0316977 0.0115594 0.0175791 0.140517 -0.0751082 -0.0835336 0.0033585 0.0365131 -0.125228 0.152322 0.0762487 -0.0319775 -0.0406123 0.0322697 0.0643968 -0.214899 -0.0637438 -0.0409088 -0.107025 -0.000357182 -0.050675 0.0637198 0.0121996 0.101233 0.0126599 -0.0261822 -0.0769786 0.0987734 0.00752095 0.0288935 -0.0885512 0.160346 -0.114373 -0.0519036 -0.0708829 0.058633 -0.0558689 -0.0953308 0.0424222 0.144268 -0.0157986 0.00818611 0.0379393 0.209161 0.0511119 -0.017537 0.00462614 0.0743656 0.0100869 0.0389596 0.0188827 0.0261343 
0.0270941 0.0437198 -0.0111567 -0.0076302 -0.0117092 0.21887 0.0696718 0.0730714 0.0100864 -0.103882 -0.00759824 0.0433198 0.0628685 -0.226535 -0.0243681 -0.0131275 -0.226539 -0.0481265 -0.153838 0.0645056 0.171372 -0.0852924 0.0742597 0.0767838 -0.0416322 -0.119173 -0.12778 -0.269898 -0.0481199 0.0338806 0.0521921 -0.0372757 -0.038675 0.118124 -0.0153488 -0.00481583 -0.0204015 0.0504199 -0.0850162 0.0445898 0.0576972 -0.144516 -0.0143235 0.0557467 -0.077859 -0.0840231 0.14161 -0.0539999 -0.135843 0.150861 0.000959035 -0.137402 -0.0464348 0.0703316 0.0863999 0.0416339 0.01329 0.0819829 -0.0451011 -0.0858941 -0.069163 0.0408294 0.126996 -0.163371 0.108939 -0.111721 0.00585806 -0.0586949 -0.10137 0.0468353 -0.031623 0.0676425 -0.0904236 0.0423079 0.0566036 0.0240204 -0.0316977 0.0115594 0.0175791 0.140517 -0.0751082 -0.0835336 0.0033585 0.0365131 -0.125228 0.152322 0.0762487 -0.0319775 -0.0406123 0.0322697 0.0643968 -0.214899 -0.0637438 -0.0409088 -0.107025 -0.000357182 -0.050675 0.0637198 0.0121996 0.101233 0.0126599 -0.0261822 -0.0769786 0.0987734 0.00752095 0.0288935 -0.0885512 0.160346 -0.114373 -0.0519036 -0.0708829 0.058633 -0.0558689 -0.0953308 0.0424222 0.144268 -0.0157986 0.00818611 0.0379393 0.209161 0.0511119 -0.017537 0.00462614 0.0743656 0.0100869 0.0389596 0.0188827 0.0261343 
0.0270941 0.0437198 -0.0111567 -0.0076302 -0.0117092 0.21887 0.0696718 0.0730714 0.0100864 -0.103882 -0.00759824 0.0433198 0.0628685 -0.226535 -0.0243681 -0.0131275 -0.226539 -0.0481265 -0.153838 0.0645056 0.171372 -0.0852924 0.0742597 0.0767838 -0.0416322 -0.119173 -0.12778 -0.269898 -0.0481199 0.0338806 0.0521921 -0.0372757 -0.038675 0.118124 -0.0153488 -0.00481583 -0.0204015 0.0504199 -0.0850162 0.0445898 0.0576972 -0.144516 -0.0143235 0.0557467 -0.077859 -0.0840231 0.14161 -0.0539999 -0.135843 0.150861 0.000959035 -0.137402 -0.0464348 0.0703316 0.0863999 0.0416339 0.01329 0.0819829 -0.0451011 -0.0858941 -0.069163 0.0408294 0.126996 -0.163371 0.108939 -0.111721 0.00585806 -0.0586949 -0.10137 0.0468353 -0.031623 0.0676425 -0.0904236 0.0423079 0.0566036 0.0240204 -0.0316977 0.0115594 0.0175791 0.140517 -0.0751082 -0.0835336 0.0033585 0.0365131 -0.125228 0.152322 0.0762487 -0.0319775 -0.0406123 0.0322697 0.0643968 -0.214899 -0.0637438 -0.0409088 -0.107025 -0.000357182 -0.050675 0.0637198 0.0121996 0.101233 0.0126599 -0.0261822 -0.0769786 0.0987734 0.00752095 0.0288935 -0.0885512 0.160346 -0.114373 -0.0519036 -0.0708829 0.058633 -0.0558689 -0.0953308 0.0424222 0.144268 -0.0157986 0.00818611 0.0379393 0.209161 0.0511119 -0.017537 0.00462614 0.0743656 0.0100869 0.0389596 0.0188827 0.0261343 
0.0270941 0.0437198 -0.0111567 -0.0076302 -0.0117092 0.21887 0.0696718 0.0730714 0.0100864 -0.103882 -0.00759824 0.0433198 0.0628685 -0.226535 -0.0243681 -0.0131275 -0.226539 -0.0481265 -0.153838 0.0645056 0.171372 -0.0852924 0.0742597 0.0767838 -0.0416322 -0.119173 -0.12778 -0.269898 -0.0481199 0.0338806 0.0521921 -0.0372757 -0.038675 0.118124 -0.0153488 -0.00481583 -0.0204015 0.0504199 -0.0850162 0.0445898 0.0576972 -0.144516 -0.0143235 0.0557467 -0.077859 -0.0840231 0.14161 -0.0539999 -0.135843 0.150861 0.000959035 -0.137402 -0.0464348 0.0703316 0.0863999 0.0416339 0.01329 0.0819829 -0.0451011 -0.0858941 -0.069163 0.0408294 0.126996 -0.163371 0.108939 -0.111721 0.00585806 -0.0586949 -0.10137 0.0468353 -0.031623 0.0676425 -0.0904236 0.0423079 0.0566036 0.0240204 -0.0316977 0.0115594 0.0175791 0.140517 -0.0751082 -0.0835336 0.0033585 0.0365131 -0.125228 0.152322 0.0762487 -0.0319775 -0.0406123 0.0322697 0.0643968 -0.214899 -0.0637438 -0.0409088 -0.107025 -0.000357182 -0.050675 0.0637198 0.0121996 0.101233 0.0126599 -0.0261822 -0.0769786 0.0987734 0.00752095 0.0288935 -0.0885512 0.160346 -0.114373 -0.0519036 -0.0708829 0.058633 -0.0558689 -0.0953308 0.0424222 0.144268 -0.0157986 0.00818611 0.0379393 0.209161 0.0511119 -0.017537 0.00462614 0.0743656 0.0100869 0.0389596 0.0188827 0.0261343 
0.0270941 0.0437198 -0.0111567 -0.0076302 -0.0117092 0.21887 0.0696718 0.0730714 0.0100864 -0.103882 -0.00759824 0.0433198 0.0628685 -0.226535 -0.0243681 -0.0131275 -0.226539 -0.0481265 -0.153838 0.0645056 0.171372 -0.0852924 0.0742597 0.0767838 -0.0416322 -0.119173 -0.12778 -0.269898 -0.0481199 0.0338806 0.0521921 -0.0372757 -0.038675 0.118124 -0.0153488 -0.00481583 -0.0204015 0.0504199 -0.0850162 0.0445898 0.0576972 -0.144516 -0.0143235 0.0557467 -0.077859 -0.0840231 0.14161 -0.0539999 -0.135843 0.150861 0.000959035 -0.137402 -0.0464348 0.0703316 0.0863999 0.0416339 0.01329 0.0819829 -0.0451011 -0.0858941 -0.069163 0.0408294 0.126996 -0.163371 0.108939 -0.111721 0.00585806 -0.0586949 -0.10137 0.0468353 -0.031623 0.0676425 -0.0904236 0.0423079 0.0566036 0.0240204 -0.0316977 0.0115594 0.0175791 0.140517 -0.0751082 -0.0835336 0.0033585 0.0365131 -0.125228 0.152322 0.0762487 -0.0319775 -0.0406123 0.0322697 0.0643968 -0.214899 -0.0637438 -0.0409088 -0.107025 -0.000357182 -0.050675 0.0637198 0.0121996 0.101233 0.0126599 -0.0261822 -0.0769786 0.0987734 0.00752095 0.0288935 -0.0885512 0.160346 -0.114373 -0.0519036 -0.0708829 0.058633 -0.0558689 -0.0953308 0.0424222 0.144268 -0.0157986 0.00818611 0.0379393 0.209161 0.0511119 -0.017537 0.00462614 0.0743656 0.0100869 0.0389596 0.0188827 0.0261343 
0.0270941 0.0437198 -0.0111567 -0.0076302 -0.0117092 0.21887 0.0696718 0.0730714 0.0100864 -0.103882 -0.00759824 0.0433198 0.0628685 -0.226535 -0.0243681 -0.0131275 -0.226539 -0.0481265 -0.153838 0.0645056 0.171372 -0.0852924 0.0742597 0.0767838 -0.0416322 -0.119173 -0.12778 -0.269898 -0.0481199 0.0338806 0.0521921 -0.0372757 -0.038675 0.118124 -0.0153488 -0.00481583 -0.0204015 0.0504199 -0.0850162 0.0445898 0.0576972 -0.144516 -0.0143235 0.0557467 -0.077859 -0.0840231 0.14161 -0.0539999 -0.135843 0.150861 0.000959035 -0.137402 -0.0464348 0.0703316 0.0863999 0.0416339 0.01329 0.0819829 -0.0451011 -0.0858941 -0.069163 0.0408294 0.126996 -0.163371 0.108939 -0.111721 0.00585806 -0.0586949 -0.10137 0.0468353 -0.031623 0.0676425 -0.0904236 0.0423079 0.0566036 0.0240204 -0.0316977 0.0115594 0.0175791 0.140517 -0.0751082 -0.0835336 0.0033585 0.0365131 -0.125228 0.152322 0.0762487 -0.0319775 -0.0406123 0.0322697 0.0643968 -0.214899 -0.0637438 -0.0409088 -0.107025 -0.000357182 -0.050675 0.0637198 0.0121996 0.101233 0.0126599 -0.0261822 -0.0769786 0.0987734 0.00752095 0.0288935 -0.0885512 0.160346 -0.114373 -0.0519036 -0.0708829 0.058633 -0.0558689 -0.0953308 0.0424222 0.144268 -0.0157986 0.00818611 0.0379393 0.209161 0.0511119 -0.017537 0.00462614 0.0743656 0.0100869 0.0389596 0.0188827 0.0261343 
0.0270941 0.0437198 -0.0111567 -0.0076302 -0.0117092 0.21887 0.0696718 0.0730714 0.0100864 -0.103882 -0.00759824 0.0433198 0.0628685 -0.226535 -0.0243681 -0.0131275 -0.226539 -0.0481265 -0.153838 0.0645056 0.171372 -0.0852924 0.0742597 0.0767838 -0.0416322 -0.119173 -0.12778 -0.269898 -0.0481199 0.0338806 0.0521921 -0.0372757 -0.038675 0.118124 -0.0153488 -0.00481583 -0.0204015 0.0504199 -0.0850162 0.0445898 0.0576972 -0.144516 -0.0143235 0.0557467 -0.077859 -0.0840231 0.14161 -0.0539999 -0.135843 0.150861 0.000959035 -0.137402 -0.0464348 0.0703316 0.0863999 0.0416339 0.01329 0.0819829 -0.0451011 -0.0858941 -0.069163 0.0408294 0.126996 -0.163371 0.108939 -0.111721 0.00585806 -0.0586949 -0.10137 0.0468353 -0.031623 0.0676425 -0.0904236 0.0423079 0.0566036 0.0240204 -0.0316977 0.0115594 0.0175791 0.140517 -0.0751082 -0.0835336 0.0033585 0.0365131 -0.125228 0.152322 0.0762487 -0.0319775 -0.0406123 0.0322697 0.0643968 -0.214899 -0.0637438 -0.0409088 -0.107025 -0.000357182 -0.050675 0.0637198 0.0121996 0.101233 0.0126599 -0.0261822 -0.0769786 0.0987734 0.00752095 0.0288935 -0.0885512 0.160346 -0.114373 -0.0519036 -0.0708829 0.058633 -0.0558689 -0.0953308 0.0424222 0.144268 -0.0157986 0.00818611 0.0379393 0.209161 0.0511119 -0.017537 0.00462614 0.0743656 0.0100869 0.0389596 0.0188827 0.0261343 
0.0270941 0.0437198 -0.0111567 -0.0076302 -0.0117092 0.21887 0.0696718 0.0730714 0.0100864 -0.103882 -0.00759824 0.0433198 0.0628685 -0.226535 -0.0243681 -0.0131275 -0.226539 -0.0481265 -0.153838 0.0645056 0.171372 -0.0852924 0.0742597 0.0767838 -0.0416322 -0.119173 -0.12778 -0.269898 -0.0481199 0.0338806 0.0521921 -0.0372757 -0.038675 0.118124 -0.0153488 -0.00481583 -0.0204015 0.0504199 -0.0850162 0.0445898 0.0576972 -0.144516 -0.0143235 0.0557467 -0.077859 -0.0840231 0.14161 -0.0539999 -0.135843 0.150861 0.000959035 -0.137402 -0.0464348 0.0703316 0.0863999 0.0416339 0.01329 0.0819829 -0.0451011 -0.0858941 -0.069163 0.0408294 0.126996 -0.163371 0.108939 -0.111721 0.00585806 -0.0586949 -0.10137 0.0468353 -0.031623 0.0676425 -0.0904236 0.0423079 0.0566036 0.0240204 -0.0316977 0.0115594 0.0175791 0.140517 -0.0751082 -0.0835336 0.0033585 0.0365131 -0.125228 0.152322 0.0762487 -0.0319775 -0.0406123 0.0322697 0.0643968 -0.214899 -0.0637438 -0.0409088 -0.107025 -0.000357182 -0.050675 0.0637198 0.0121996 0.101233 0.0126599 -0.0261822 -0.0769786 0.0987734 0.00752095 0.0288935 -0.0885512 0.160346 -0.114373 -0.0519036 -0.0708829 0.058633 -0.0558689 -0.0953308 0.0424222 0.144268 -0.0157986 0.00818611 0.0379393 0.209161 0.0511119 -0.017537 0.00462614 0.0743656 0.0100869 0.0389596 0.0188827 0.0261343 
0.0270941 0.0437198 -0.0111567 -0.0076302 -0.0117092 0.21887 0.0696718 0.0730714 0.0100864 -0.103882 -0.00759824 0.0433198 0.0628685 -0.226535 -0.0243681 -0.0131275 -0.226539 -0.0481265 -0.153838 0.0645056 0.171372 -0.0852924 0.0742597 0.0767838 -0.0416322 -0.119173 -0.12778 -0.269898 -0.0481199 0.0338806 0.0521921 -0.0372757 -0.038675 0.118124 -0.0153488 -0.00481583 -0.0204015 0.0504199 -0.0850162 0.0445898 0.0576972 -0.144516 -0.0143235 0.0557467 -0.077859 -0.0840231 0.14161 -0.0539999 -0.135843 0.150861 0.000959035 -0.137402 -0.0464348 0.0703316 0.0863999 0.0416339 0.01329 0.0819829 -0.0451011 -0.0858941 -0.069163 0.0408294 0.126996 -0.163371 0.108939 -0.111721 0.00585806 -0.0586949 -0.10137 0.0468353 -0.031623 0.0676425 -0.0904236 0.0423079 0.0566036 0.0240204 -0.0316977 0.0115594 0.0175791 0.140517 -0.0751082 -0.0835336 0.0033585 0.0365131 -0.125228 0.152322 0.0762487 -0.0319775 -0.0406123 0.0322697 0.0643968 -0.214899 -0.0637438 -0.0409088 -0.107025 -0.000357182 -0.050675 0.0637198 0.0121996 0.101233 0.0126599 -0.0261822 -0.0769786 0.0987734 0.00752095 0.0288935 -0.0885512 0.160346 -0.114373 -0.0519036 -0.0708829 0.058633 -0.0558689 -0.0953308 0.0424222 0.144268 -0.0157986 0.00818611 0.0379393 0.209161 0.0511119 -0.017537 0.00462614 0.0743656 0.0100869 0.0389596 0.0188827 0.0261343 
0.0270941 0.0437198 -0.0111567 -0.0076302 -0.0117092 0.21887 0.0696718 0.0730714 0.0100864 -0.103882 -0.00759824 0.0433198 0.0628685 -0.226535 -0.0243681 -0.0131275 -0.226539 -0.0481265 -0.153838 0.0645056 0.171372 -0.0852924 0.0742597 0.0767838 -0.0416322 -0.119173 -0.12778 -0.269898 -0.0481199 0.0338806 0.0521921 -0.0372757 -0.038675 0.118124 -0.0153488 -0.00481583 -0.0204015 0.0504199 -0.0850162 0.0445898 0.0576972 -0.144516 -0.0143235 0.0557467 -0.077859 -0.0840231 0.14161 -0.0539999 -0.135843 0.150861 0.000959035 -0.137402 -0.0464348 0.0703316 0.0863999 0.0416339 0.01329 0.0819829 -0.0451011 -0.0858941 -0.069163 0.0408294 0.126996 -0.163371 0.108939 -0.111721 0.00585806 -0.0586949 -0.10137 0.0468353 -0.031623 0.0676425 -0.0904236 0.0423079 0.0566036 0.0240204 -0.0316977 0.0115594 0.0175791 0.140517 -0.0751082 -0.0835336 0.0033585 0.0365131 -0.125228 0.152322 0.0762487 -0.0319775 -0.0406123 0.0322697 0.0643968 -0.214899 -0.0637438 -0.0409088 -0.107025 -0.000357182 -0.050675 0.0637198 0.0121996 0.101233 0.0126599 -0.0261822 -0.0769786 0.0987734 0.00752095 0.0288935 -0.0885512 0.160346 -0.114373 -0.0519036 -0.0708829 0.058633 -0.0558689 -0.0953308 0.0424222 0.144268 -0.0157986 0.00818611 0.0379393 0.209161 0.0511119 -0.017537 0.00462614 0.0743656 0.0100869 0.0389596 0.0188827 0.0261343 
