{
  "descriptor": [
    -0.06979033350944519,
    0.08919090032577515,
    0.13164232671260834,
    -0.05545427277684212,
    -0.04857248067855835,
    -0.010504594072699547,
    -0.021834637969732285,
    -0.039479367434978485,
    0.09991119056940079,
    -0.07268834859132767,
    0.21549594402313232,
    -0.08359044045209885,
    -0.22067877650260925,
    -0.0016603178810328245,
    -0.07043339312076569,
    0.12032373994588852,
    -0.09436766058206558,
    -0.13573496043682098,
    -0.05553620308637619,
    -0.09274326264858246,
    0.06624487787485123,
    0.10471661388874054,
    0.006264685187488794,
    0.010859223082661629,
    -0.1442400962114334,
    -0.3105250895023346,
    -0.07400944083929062,
    -0.07707266509532928,
    -0.02257363125681877,
    -0.16778132319450378,
    -0.0019893161952495575,
    0.1341441571712494,
    -0.14474719762802124,
    0.022707048803567886,
    0.01909550651907921,
    0.07420384138822556,
    -0.030038082972168922,
    -0.08968547731637955,
    0.22151263058185577,
    0.08273060619831085,
    -0.15730297565460205,
    0.04171983525156975,
    0.06070774793624878,
    0.2959478795528412,
    0.16380025446414948,
    -0.027931079268455505,
    -0.02186485193669796,
    -0.025698307901620865,
    0.10122035443782806,
    -0.27886366844177246,
    0.01975332200527191,
    0.20047643780708313,
    0.05198949575424194,
    0.10708457231521606,
    0.10996770858764648,
    -0.08557707816362381,
    0.01697567291557789,
    0.05205826833844185,
    -0.13797451555728912,
    0.0385885089635849,
    0.028794294223189354,
    -0.1004660502076149,
    -0.007298550568521023,
    -0.1266890913248062,
    0.12783412635326385,
    0.08628590404987335,
    -0.09706182777881622,
    -0.08661265671253204,
    0.10847997665405273,
    -0.11270512640476227,
    -0.0917092114686966,
    0.08379437029361725,
    -0.1310112178325653,
    -0.12010016292333603,
    -0.21371249854564667,
    0.07811377942562103,
    0.35813599824905396,
    0.11229946464300156,
    -0.1527198851108551,
    0.07179073989391327,
    -0.006780687719583511,
    -0.05300772935152054,
    0.023123813793063164,
    0.07996197789907455,
    -0.0784965381026268,
    0.023688120767474174,
    -0.030763376504182816,
    0.06291109323501587,
    0.18100519478321075,
    0.004222117830067873,
    -0.03863844275474548,
    0.18508045375347137,
    -0.05991922691464424,
    0.06139739602804184,
    0.0655604898929596,
    0.034238867461681366,
    -0.0770447701215744,
    -0.028827184811234474,
    -0.098873071372509,
    0.03439906984567642,
    -0.013734452426433563,
    -0.14242127537727356,
    -0.05309441685676575,
    0.11795321851968765,
    -0.1735052764415741,
    0.13479332625865936,
    -0.03664618730545044,
    -0.05667376518249512,
    -0.040708027780056,
    0.03765358775854111,
    -0.05905085802078247,
    0.04239971190690994,
    0.11561086028814316,
    -0.2547009289264679,
    0.1617749184370041,
    0.14779920876026154,
    -0.03164336830377579,
    0.10482207685709,
    0.06334636360406876,
    0.07422620803117752,
    -0.03329498693346977,
    -0.003207499859854579,
    -0.1252060979604721,
    -0.1190011277794838,
    0.05927572771906853,
    0.02614501118659973,
    -0.016477636992931366,
    -0.004967346787452698
  ]
}