{
  "descriptor": [
    -0.09379688650369644,
    0.02552339993417263,
    0.09230613708496094,
    -0.06601537764072418,
    -0.1561225801706314,
    0.03757033497095108,
    -0.0832771360874176,
    -0.039187006652355194,
    0.1594112068414688,
    -0.14782515168190002,
    0.16789710521697998,
    -0.02859100140631199,
    -0.2194688469171524,
    0.10694785416126251,
    -0.057955361902713776,
    0.17110559344291687,
    -0.12854638695716858,
    -0.2168135792016983,
    -0.05738105624914169,
    -0.1062072291970253,
    -0.026994140818715096,
    0.08356925845146179,
    -0.052316755056381226,
    0.08700954169034958,
    -0.15003782510757446,
    -0.3717246353626251,
    -0.08797591924667358,
    -0.09782343357801437,
    0.08088026195764542,
    -0.09929463267326355,
    -0.07898956537246704,
    0.07982257008552551,
    -0.16135883331298828,
    0.02731119468808174,
    0.10078238695859909,
    0.06926887482404709,
    -0.04855690896511078,
    -0.14333513379096985,
    0.24496868252754211,
    0.1056366041302681,
    -0.23349305987358093,
    -0.0032040432561188936,
    0.08445772528648376,
    0.24935384094715118,
    0.15067258477210999,
    0.004432064946740866,
    0.06307846307754517,
    -0.08497892320156097,
    0.17590315639972687,
    -0.247367262840271,
    0.039862241595983505,
    0.20859993994235992,
    0.05071378871798515,
    0.10892610996961594,
    0.0547492541372776,
    -0.15029166638851166,
    0.004100206308066845,
    0.10741996765136719,
    -0.15927626192569733,
    0.08437411487102509,
    0.05622914433479309,
    -0.0642031654715538,
    -0.0457783043384552,
    -0.07583107799291611,
    0.1813250631093979,
    0.10389690846204758,
    -0.09335353970527649,
    -0.16439062356948853,
    0.2721612751483917,
    -0.16316470503807068,
    -0.07379411906003952,
    0.08403348177671432,
    -0.12921108305454254,
    -0.15696609020233154,
    -0.17320846021175385,
    0.0482628308236599,
    0.4141882061958313,
    0.14200858771800995,
    -0.10245699435472488,
    0.07791455090045929,
    0.021153228357434273,
    -0.07631833851337433,
    -0.007618880830705166,
    0.1492462456226349,
    -0.10295696556568146,
    0.024485360831022263,
    0.007549391593784094,
    0.07013953477144241,
    0.2915550768375397,
    0.05969834327697754,
    0.04429825395345688,
    0.20383352041244507,
    0.006204704288393259,
    0.045869242399930954,
    0.0940321609377861,
    0.1223389133810997,
    -0.13289305567741394,
    -0.09695291519165039,
    -0.15670818090438843,
    -0.04378749057650566,
    -0.01370059885084629,
    -0.027499107643961906,
    -0.006626747082918882,
    0.1467096209526062,
    -0.18444527685642242,
    0.17589019238948822,
    -0.07851793617010117,
    -0.08851363509893417,
    -0.06897386908531189,
    0.04543183743953705,
    -0.02976982295513153,
    -0.014626751653850079,
    0.12999629974365234,
    -0.18545861542224884,
    0.12006153911352158,
    0.14777062833309174,
    0.09019555896520615,
    0.11059027910232544,
    0.06372243165969849,
    0.009305311366915703,
    0.022708753123879433,
    -0.08307558298110962,
    -0.20411305129528046,
    -0.13055667281150818,
    0.05192854627966881,
    -0.058107662945985794,
    -0.033135659992694855,
    0.0013991289306432009
  ]
}