0.107027 -0.063223 -0.154365 0.00765614 0.147634 0.0880231 0.00820482 -0.0399757 -0.106042 -0.0730458 -0.00422911 0.157784 0.0736623 -0.086286 -0.158381 -0.0387349 -0.0393927 0.0581586 -0.12184 0.220804 0.0883505 -0.0899036 0.112755 0.111814 -0.0103384 0.0023727 0.0232071 -0.151687 -0.0467776 0.0463706 -0.0650984 0.00871278 -0.107077 0.0417814 -0.0819483 -0.0187087 -0.18584 0.0840411 -0.108396 -0.0546889 -0.00416692 0.00251727 -0.0853129 0.197123 -0.170492 -0.00633572 0.106135 0.0610655 -0.0512588 0.137478 0.0798282 -0.0383136 -0.0909252 -0.0499937 0.0886081 -0.0920405 -0.0356394 0.168977 0.0715928 -0.0969153 0.0141073 0.0148213 0.211764 0.0380809 0.0127448 -0.225065 -0.0348754 0.0895027 -0.0193075 0.0882003 0.0343254 0.113415 0.0463131 -0.000248269 -0.104282 0.00872273 -0.0393558 0.0468426 -0.00271125 0.124878 -0.034921 0.0142258 -0.0216584 -0.0706889 -0.0818627 -0.0667459 0.0869907 0.086076 0.0378469 -0.0444738 0.0234036 -0.0547802 -0.0797074 -0.0214034 -0.045136 -0.084495 0.0289186 0.022592 0.00184507 -0.129565 0.00891447 0.0553426 -0.00769859 0.118592 -0.116054 -0.0105282 -0.155303 0.154985 0.02845 -0.0273943 0.119296 0.1871 -0.0617367 0.0854122 -0.0254317 0.0538681 -0.113784 -0.0571004 -0.00649938 0.120213 -0.103114 0.0688359 -0.0306425 0.00533272 -0.0649589 0.0053529 -0.0616474 -0.062082 
0.109115 -0.053372 -0.132165 -0.00267541 0.131331 0.101687 0.0193167 -0.0506112 -0.120688 -0.0835212 -0.0124279 0.162325 0.0613781 -0.0928396 -0.14882 -0.0332382 -0.0674887 0.0395116 -0.121391 0.19618 0.0835709 -0.0554757 0.0904103 0.102831 -0.0172136 0.0388426 0.0248923 -0.157315 -0.0474118 0.0575887 -0.0839862 0.0177588 -0.126822 0.0519017 -0.0684889 -0.0327127 -0.177635 0.0990742 -0.0854101 -0.0328229 -0.00467327 0.000380681 -0.0709359 0.189899 -0.152055 0.00522594 0.123081 0.0390382 -0.0766419 0.136016 0.0976874 -0.0480061 -0.0871066 -0.0310933 0.108278 -0.0882043 -0.0411393 0.194217 0.0573551 -0.100009 0.0212989 0.00943838 0.222698 0.0341958 0.0245886 -0.211787 -0.0260842 0.0818405 -0.0250036 0.0860285 0.0299437 0.112549 0.0507051 0.0205211 -0.0932741 0.00385246 -0.0487042 0.0162166 0.00185889 0.130769 -0.00229145 0.0242424 -0.0134365 -0.0811647 -0.0918847 -0.0961229 0.0964595 0.0707424 0.0324891 -0.0284329 0.0221596 -0.0689973 -0.0823088 -0.0131066 -0.0566537 -0.0570251 0.0496959 0.0143531 0.027317 -0.111164 -0.00646824 0.0630306 -0.0224832 0.131469 -0.13744 -0.0184451 -0.166852 0.157132 -0.00229595 -0.0373854 0.14644 0.194608 -0.0754974 0.0766446 -0.0159204 0.0577066 -0.122626 -0.053686 -0.0142924 0.101783 -0.0809494 0.0689348 0.001042 -0.0102738 -0.043466 0.0107597 -0.0515979 -0.0791775 
0.105757 -0.0701178 -0.138012 0.00621173 0.135271 0.10169 0.0116775 -0.051583 -0.111599 -0.0972 -0.0217345 0.164586 0.0613407 -0.092075 -0.15577 -0.0409885 -0.0705351 0.0484676 -0.114065 0.201878 0.0957297 -0.0721663 0.110754 0.109452 -0.015252 0.0192552 0.0223004 -0.17262 -0.0650157 0.0588404 -0.0767113 0.00862156 -0.113232 0.0495292 -0.0611951 -0.0272339 -0.177711 0.0950071 -0.10057 -0.0511209 -0.00746079 0.00191576 -0.074998 0.190443 -0.162844 -0.000222701 0.121491 0.0397048 -0.0644991 0.144561 0.0869085 -0.0575358 -0.0653431 -0.0305576 0.112469 -0.0869071 -0.0216793 0.181664 0.0599827 -0.109839 0.0250387 0.0214285 0.217956 0.0321614 0.0300688 -0.218225 -0.0300854 0.0809543 -0.0226943 0.0926015 0.0250208 0.108013 0.0416324 0.00547939 -0.0998387 0.0115171 -0.0488952 0.0138517 0.00376708 0.134817 -0.0208599 0.0197582 -0.0210214 -0.0784842 -0.0899914 -0.0840041 0.0892517 0.0785453 0.0274179 -0.0299664 0.0299716 -0.0659544 -0.075102 -0.0203115 -0.0590923 -0.0613185 0.0363509 0.0316449 0.0253413 -0.111528 0.0111425 0.0589826 -0.0189492 0.119857 -0.120203 -0.0226659 -0.161593 0.149771 -0.00469369 -0.0278018 0.130781 0.18736 -0.0673487 0.0655893 -0.0206673 0.0729304 -0.114526 -0.0560552 -0.01032 0.114383 -0.0848385 0.0680259 -0.0108611 -0.0153986 -0.0537452 0.0142344 -0.0493179 -0.0677065 
0.111523 -0.0561875 -0.150589 -0.00973661 0.142889 0.117564 0.0165465 -0.0145714 -0.124027 -0.0750185 0.00369207 0.143331 0.0820214 -0.0595916 -0.129992 -0.05046 -0.0216645 0.0223112 -0.109372 0.197262 0.0898206 -0.0859784 0.101779 0.0908138 0.0114968 0.0213973 0.0241136 -0.136474 -0.0372136 0.0205198 -0.0332707 0.00338336 -0.117784 0.0542715 -0.0954721 -0.0133364 -0.172867 0.104806 -0.0801989 -0.0447053 0.0229628 0.0085404 -0.0811753 0.188994 -0.178151 -0.0256262 0.0978382 0.0498397 -0.0508467 0.115972 0.0711634 -0.0276447 -0.10328 -0.0347103 0.0874478 -0.0857611 -0.0432683 0.198632 0.0694259 -0.117919 -0.0140221 0.00457504 0.21851 0.00811447 0.011574 -0.179037 -0.0184547 0.106756 -0.00622181 0.0894851 0.0423811 0.131761 0.0412438 0.00847601 -0.0772368 0.00165666 -0.0484964 0.0363476 0.00341885 0.136555 -0.0594579 0.00703152 0.0276078 -0.0675618 -0.0836015 -0.086096 0.119839 0.0974635 0.0486972 -0.0666337 0.0295044 -0.0744678 -0.0649577 -0.0223499 -0.0417502 -0.1102 0.0512883 0.0302306 -0.0188556 -0.126991 -0.0229051 0.0735277 -0.00380278 0.145179 -0.138322 0.00455617 -0.164925 0.159124 0.0297263 -0.061416 0.123521 0.187418 -0.091341 0.105857 0.0010623 0.041217 -0.114426 -0.0714255 0.00400066 0.1224 -0.0852658 0.0596529 -0.0255451 0.0106134 -0.0588966 -0.0049032 -0.0507126 -0.0364903 
0.106157 -0.052443 -0.130605 -0.00862043 0.125698 0.127073 0.0170437 -0.0118866 -0.114815 -0.0760493 0.0181732 0.146415 0.0716925 -0.0818148 -0.121563 -0.0656106 -0.0433995 0.0223656 -0.110062 0.192585 0.0800186 -0.0692753 0.0960243 0.107171 0.00266786 0.0306931 0.0327628 -0.143979 -0.0353451 0.00584702 -0.031606 -0.0174614 -0.114311 0.0626809 -0.0884221 -0.0127552 -0.165645 0.105386 -0.0881131 -0.0294571 0.0364536 -0.00342857 -0.0969779 0.200083 -0.190518 -0.0370415 0.102561 0.0465055 -0.0543711 0.126527 0.0696824 -0.0260486 -0.111969 -0.0269618 0.0940649 -0.0775524 -0.0487016 0.195879 0.0608673 -0.117491 -0.0234739 -0.00581954 0.228026 0.0126192 0.0140375 -0.186012 -0.00188841 0.0848242 -0.00496721 0.106743 0.0359553 0.126633 0.0462707 0.0310988 -0.0624526 -0.0190735 -0.0658079 0.0472712 0.00615092 0.138467 -0.0606165 0.015188 0.0343573 -0.0723132 -0.0796363 -0.0888907 0.129837 0.0942774 0.0434489 -0.0583632 0.0411264 -0.0787144 -0.0603573 -0.0336811 -0.0482343 -0.121647 0.0477303 0.0233089 -0.00930421 -0.128195 -0.0309255 0.0804663 -0.00160851 0.132662 -0.127076 0.00561429 -0.151758 0.153733 0.0249384 -0.0591933 0.129739 0.195403 -0.0854783 0.0956808 0.0023178 0.0362893 -0.102171 -0.0880435 0.00932061 0.120403 -0.0668027 0.0535942 -0.0279782 0.0150096 -0.0545073 -0.00123031 -0.032946 -0.0221442 
0.107478 -0.0667873 -0.159727 0.0102881 0.132722 0.100217 -0.00617148 -0.0386032 -0.0949361 -0.090748 0.0184474 0.166206 0.0659593 -0.0667429 -0.171291 -0.0410395 -0.0222264 0.0419065 -0.114095 0.207881 0.0947862 -0.0864143 0.108557 0.101556 0.00422182 0.0318814 0.0537892 -0.140139 -0.0565367 0.0297578 -0.0525275 0.00432683 -0.0888373 0.0521861 -0.100072 -0.0160273 -0.174629 0.113183 -0.0932036 -0.0462524 0.00570227 0.0150913 -0.0887834 0.188789 -0.171147 -0.0323547 0.10383 0.0320241 -0.0458923 0.124362 0.0772608 -0.020015 -0.0930557 -0.0270897 0.0962951 -0.083583 -0.0295069 0.177682 0.063718 -0.118054 -0.00624324 -0.00808014 0.230204 0.0218906 0.00920294 -0.197071 -0.022768 0.105859 -0.00145305 0.110256 0.0398996 0.108225 0.0410079 0.00482723 -0.0779338 -0.000377077 -0.0465415 0.0408037 -0.0228889 0.124545 -0.0667576 0.0306266 0.0169278 -0.0787847 -0.0880243 -0.0747818 0.108226 0.0952983 0.0429095 -0.0635066 0.0179051 -0.0777054 -0.0685094 -0.0156985 -0.0263455 -0.102479 0.0359871 0.025018 -0.00251981 -0.13343 -0.0151317 0.0622231 -0.00568796 0.139109 -0.11531 -0.00421737 -0.153061 0.141951 0.01502 -0.0640037 0.113083 0.191072 -0.0698149 0.105144 -0.00199066 0.0382502 -0.119117 -0.0814365 0.0133472 0.114912 -0.0870889 0.0747931 -0.0249276 -0.00569737 -0.0468232 0.00853894 -0.0352296 -0.0362435 
0.102003 -0.0709283 -0.144004 0.00271952 0.135716 0.105265 -0.00295381 -0.0518546 -0.0996801 -0.0978586 -0.0112628 0.170437 0.0501863 -0.0780532 -0.157312 -0.0436386 -0.0556834 0.0490711 -0.106107 0.191389 0.0895162 -0.0600602 0.10302 0.114548 -0.00525081 0.0301561 0.05119 -0.159121 -0.0708403 0.0507938 -0.0695716 -0.00609509 -0.103563 0.0472081 -0.0665927 -0.0158876 -0.1763 0.0886356 -0.104405 -0.0436336 -0.000375544 0.0156257 -0.0789459 0.198962 -0.163293 0.000549106 0.118444 0.0355905 -0.0622025 0.132827 0.089176 -0.0495776 -0.0710104 -0.0355162 0.115904 -0.0762422 -0.0336856 0.189423 0.0626214 -0.113878 0.0157166 0.00959222 0.225452 0.0315889 0.0260221 -0.217069 -0.028698 0.0972554 -0.0110869 0.114964 0.0376085 0.108099 0.0440902 -0.0117862 -0.0937807 0.0141651 -0.0588306 0.0278841 -0.00868211 0.1226 -0.0319626 0.0411714 -0.00876827 -0.0834547 -0.0953638 -0.0914121 0.0998433 0.0820376 0.0270077 -0.0300009 0.0196476 -0.0687551 -0.0759388 -0.020359 -0.0441222 -0.0658429 0.0376241 0.0200435 0.0230413 -0.123483 0.000573153 0.0600536 -0.0140351 0.110569 -0.130467 -0.0195359 -0.169374 0.127817 -0.0176833 -0.0369646 0.143317 0.186776 -0.0626306 0.0751819 -0.0139295 0.0605039 -0.126485 -0.0734398 -0.00833938 0.106375 -0.0750131 0.0717741 -0.0137193 -0.0169505 -0.0465418 0.0171505 -0.0414677 -0.061362 
0.0988772 -0.0598376 -0.128193 0.00401635 0.130524 0.0976933 0.00315952 -0.0462845 -0.112745 -0.0849819 -0.00950987 0.16885 0.0582794 -0.0879218 -0.155575 -0.0420095 -0.0616853 0.0509619 -0.118771 0.200761 0.0813629 -0.0600737 0.10234 0.113263 -0.0155884 0.0338084 0.0364971 -0.151854 -0.0562397 0.0451568 -0.0758395 0.00225966 -0.112969 0.0495487 -0.0759007 -0.0256967 -0.18271 0.0978375 -0.101932 -0.0288794 -0.00148375 0.0103921 -0.0817172 0.194847 -0.163965 -0.0116805 0.12077 0.034333 -0.0608576 0.142882 0.0997384 -0.0458331 -0.0908567 -0.0319302 0.105434 -0.084289 -0.0331516 0.185359 0.0679764 -0.105738 0.0159204 0.00856755 0.216465 0.0396206 0.0219777 -0.223009 -0.0218343 0.0803265 -0.0197571 0.105462 0.0351498 0.11328 0.0583523 0.0196186 -0.0930029 0.00168452 -0.0564978 0.0274154 -0.0034466 0.124083 -0.0209825 0.0305595 -0.0043316 -0.0774671 -0.0884571 -0.0945476 0.100664 0.0815162 0.0341958 -0.0381521 0.0141706 -0.0640601 -0.0730721 -0.0210154 -0.0486565 -0.0703741 0.0409284 0.0211772 0.0169047 -0.11771 -0.0106445 0.0656991 -0.0154187 0.127387 -0.124126 -0.018838 -0.163835 0.142404 0.00167907 -0.0374202 0.136373 0.195144 -0.0666335 0.0836931 -0.0228717 0.0519815 -0.114503 -0.0646465 -0.0116056 0.103768 -0.0818368 0.0733798 -0.0149574 -0.0178118 -0.0484507 0.0117768 -0.0485911 -0.0614473 
0.0990985 -0.0627455 -0.120038 0.0104438 0.132224 0.0906161 0.00812192 -0.0448682 -0.115696 -0.0846616 -0.0134149 0.171734 0.0578454 -0.0806331 -0.151474 -0.044774 -0.0554623 0.0463507 -0.124704 0.208998 0.0723762 -0.0669926 0.108095 0.109066 -0.016744 0.0291857 0.0256032 -0.142334 -0.059947 0.0345243 -0.0757385 0.0103486 -0.113932 0.0532489 -0.0839885 -0.0226185 -0.185017 0.107406 -0.110108 -0.0310518 0.00158213 0.0141916 -0.0830986 0.181341 -0.166364 -0.00987657 0.113692 0.0344798 -0.056078 0.149153 0.0995733 -0.0451396 -0.0987076 -0.0319769 0.10852 -0.0910771 -0.0366538 0.186002 0.0680373 -0.0967637 0.014908 0.0151573 0.206951 0.037602 0.0274701 -0.216578 -0.0242346 0.0835241 -0.0292714 0.108681 0.0406718 0.11953 0.066109 0.0349839 -0.0911024 0.00356337 -0.0487489 0.0227309 0.000257665 0.117284 -0.0264055 0.0214761 -0.00531129 -0.0802385 -0.0880922 -0.100363 0.100341 0.0874771 0.0332498 -0.0397139 0.014273 -0.0628826 -0.0640903 -0.0208254 -0.0471439 -0.0708482 0.046419 0.014155 0.0135432 -0.114097 -0.016425 0.0666741 -0.0178051 0.128106 -0.122905 -0.0163834 -0.164598 0.143515 0.012201 -0.0419505 0.131128 0.202991 -0.0623659 0.0892109 -0.0207085 0.0461412 -0.108357 -0.058004 -0.00977267 0.111181 -0.0883976 0.0782016 -0.0188027 -0.0142524 -0.0432425 0.00987429 -0.046669 -0.0663207 
0.100905 -0.064873 -0.124733 0.0113955 0.134567 0.0933482 0.0101852 -0.0497813 -0.104247 -0.0796335 -0.00396761 0.173966 0.059147 -0.0817971 -0.155676 -0.0442573 -0.0575232 0.0518363 -0.124008 0.2086 0.0825517 -0.072392 0.104103 0.115466 -0.0142897 0.0276724 0.0259207 -0.148358 -0.0537412 0.0434552 -0.0731003 0.00816672 -0.112883 0.0485495 -0.0779933 -0.0196514 -0.187888 0.105852 -0.104641 -0.039202 -0.00262121 0.0114426 -0.0921258 0.183861 -0.165346 -0.0145027 0.108948 0.0400905 -0.0552354 0.139554 0.0920222 -0.0364257 -0.0953477 -0.0370227 0.109496 -0.0866562 -0.0403497 0.188191 0.0566579 -0.0959079 0.0134497 0.00681356 0.221114 0.0365806 0.0282973 -0.21603 -0.0267389 0.0875484 -0.0288446 0.112276 0.0410964 0.119971 0.0562526 0.0240484 -0.0959963 0.00301687 -0.0470447 0.0278605 4.41069e-05 0.119136 -0.0314799 0.0242373 -0.00716515 -0.0811299 -0.0884217 -0.100139 0.10171 0.0900441 0.0369363 -0.0384458 0.0186051 -0.0643738 -0.0648921 -0.013811 -0.0468047 -0.0796383 0.0396199 0.0101918 0.0193131 -0.116361 -0.00449424 0.0636635 -0.0224617 0.118333 -0.118078 -0.0100773 -0.156482 0.136943 0.0192185 -0.0400192 0.127868 0.199618 -0.0628611 0.0863979 -0.00953498 0.0533377 -0.112408 -0.0577549 -0.00764551 0.115128 -0.0884111 0.0727772 -0.0226258 -0.0109792 -0.046686 0.0202799 -0.0414798 -0.0622521 
0.101001 -0.0629436 -0.130912 0.0101064 0.137772 0.0946947 0.00895212 -0.0437222 -0.105656 -0.0888857 -0.00730242 0.170445 0.0577297 -0.0814713 -0.155281 -0.0456073 -0.05334 0.0474974 -0.127941 0.210263 0.0786867 -0.0747594 0.108868 0.112012 -0.0121036 0.0193099 0.0270422 -0.14442 -0.0567099 0.0345084 -0.0681287 0.00845074 -0.111338 0.0524779 -0.0862407 -0.0179286 -0.184451 0.101842 -0.111508 -0.0354825 0.00739498 0.0136407 -0.0855257 0.184093 -0.168816 -0.0124833 0.111499 0.0383875 -0.0548948 0.144659 0.0852017 -0.0435217 -0.096741 -0.0359959 0.1039 -0.0867627 -0.0395336 0.188515 0.0634953 -0.0984504 0.00837059 0.0168784 0.215341 0.0318819 0.0234624 -0.210879 -0.0256178 0.0860372 -0.0278285 0.109345 0.0398131 0.118547 0.0598903 0.0276459 -0.0882978 0.00483887 -0.0471911 0.0279671 -0.00468873 0.114477 -0.0359527 0.024961 -0.00759135 -0.0800027 -0.0895715 -0.0862017 0.0992469 0.0881318 0.0299076 -0.0412438 0.0235765 -0.0682768 -0.0674689 -0.0240362 -0.0407827 -0.0770891 0.0384626 0.0152675 0.0120227 -0.115865 -0.0149997 0.0576587 -0.0156378 0.126863 -0.123061 -0.00892002 -0.162338 0.145998 0.0111662 -0.0428828 0.128998 0.199897 -0.0611993 0.09043 -0.0179987 0.0476526 -0.111344 -0.0593235 -0.00142902 0.116459 -0.0875358 0.0762564 -0.0238682 -0.00670937 -0.0495717 0.0107573 -0.0505264 -0.0632905 
0.102498 -0.0662516 -0.129595 0.015773 0.137567 0.0876119 0.00987837 -0.0494759 -0.10441 -0.0865517 -0.00909858 0.174513 0.0564885 -0.0841349 -0.16178 -0.0428126 -0.0497269 0.0510897 -0.124572 0.212294 0.0827968 -0.0755578 0.104239 0.112396 -0.0120596 0.0247652 0.0259664 -0.148561 -0.058647 0.0438476 -0.0749761 0.0132884 -0.10964 0.0506507 -0.0808001 -0.0240445 -0.185127 0.10514 -0.108085 -0.0445493 -0.00105608 0.0138535 -0.085057 0.182899 -0.161969 -0.00904193 0.110997 0.0351811 -0.0557431 0.13976 0.0917559 -0.0409315 -0.0905282 -0.0379623 0.109128 -0.0890032 -0.0394048 0.182512 0.0610886 -0.0976514 0.0181686 0.00925306 0.213372 0.0361036 0.028081 -0.217756 -0.0286269 0.0861503 -0.0270322 0.105735 0.0398259 0.114572 0.0569414 0.0210747 -0.09775 0.00719049 -0.0430764 0.0290164 -0.00362118 0.117732 -0.0349985 0.0260146 -0.0106203 -0.0819747 -0.0854459 -0.0957436 0.0976641 0.0888329 0.0335567 -0.0398216 0.0166436 -0.0635582 -0.0687817 -0.0160513 -0.0438489 -0.0731053 0.0427416 0.00978117 0.0161425 -0.117482 -0.00710799 0.0607208 -0.0200016 0.124463 -0.120476 -0.0147272 -0.157731 0.142076 0.0132457 -0.0394635 0.127504 0.196842 -0.0643116 0.0865111 -0.0138836 0.0491154 -0.116927 -0.0603245 -0.00683161 0.112779 -0.0933085 0.0820723 -0.0220807 -0.011013 -0.0421675 0.0147327 -0.0447149 -0.0703406 
0.0988252 -0.0662478 -0.12968 0.0121897 0.140155 0.0953614 0.0132618 -0.0442217 -0.0971758 -0.0890044 -0.0122137 0.170084 0.0599141 -0.0872154 -0.155049 -0.0495028 -0.0597455 0.0527663 -0.129579 0.210842 0.0867547 -0.080395 0.111536 0.118324 -0.0146984 0.0082304 0.0169746 -0.155968 -0.0593154 0.0408658 -0.0651612 0.00621576 -0.108318 0.0520647 -0.0763978 -0.0168956 -0.182696 0.0991989 -0.119438 -0.0455331 0.00644345 0.00973098 -0.0881481 0.18583 -0.171089 -0.0111367 0.110462 0.0429076 -0.0530879 0.145014 0.0807854 -0.0485191 -0.0882668 -0.0395133 0.109373 -0.0828352 -0.0375616 0.18344 0.0610779 -0.100501 0.0118315 0.0186778 0.212644 0.0318088 0.0293952 -0.218343 -0.0281744 0.0834348 -0.029863 0.109703 0.0380371 0.116115 0.0534769 0.0179351 -0.0947049 0.0105592 -0.0482608 0.0306705 -5.79867e-05 0.115988 -0.0397053 0.0230276 -0.0153252 -0.0761591 -0.0866137 -0.0838396 0.0980785 0.0891432 0.0285261 -0.0356621 0.0273369 -0.0678486 -0.0661072 -0.0279823 -0.0471196 -0.0764172 0.031592 0.0171651 0.0147625 -0.112606 -0.00123646 0.0575581 -0.0170598 0.117117 -0.117807 -0.0121481 -0.160283 0.142963 0.0118185 -0.0338419 0.123936 0.195212 -0.0623195 0.0788849 -0.0172633 0.0583222 -0.109619 -0.0606189 -0.00439467 0.12355 -0.087672 0.0760919 -0.0294657 -0.00277276 -0.0533387 0.0141544 -0.0498015 -0.0621719 
0.10294 -0.0590214 -0.133789 0.00725154 0.135354 0.105189 0.0171794 -0.0451013 -0.103868 -0.0902765 -0.00770908 0.168142 0.0605338 -0.0909257 -0.153992 -0.0509086 -0.0648079 0.0442394 -0.126679 0.205728 0.0830719 -0.0743412 0.103071 0.112895 -0.0142239 0.0148199 0.0198369 -0.153447 -0.0544741 0.0426625 -0.0649412 0.0056655 -0.116433 0.0528518 -0.0769163 -0.0179271 -0.18186 0.0939999 -0.108228 -0.0393695 0.00859071 0.00202129 -0.0854256 0.188278 -0.169021 -0.00990291 0.113292 0.0439341 -0.062055 0.144262 0.0792609 -0.0424718 -0.090577 -0.0367184 0.106633 -0.0838972 -0.0430257 0.191779 0.0545756 -0.0985601 0.00748522 0.0196505 0.225097 0.027038 0.0259144 -0.211803 -0.024018 0.0811004 -0.0324063 0.105453 0.0355646 0.116282 0.0500331 0.0256172 -0.0887145 0.00653716 -0.0475589 0.025013 -0.000339462 0.12326 -0.0342544 0.0188515 -0.0101766 -0.077023 -0.0907025 -0.0827973 0.0986493 0.0822729 0.0283823 -0.0338166 0.0324582 -0.072679 -0.0690404 -0.0221151 -0.0482544 -0.0778501 0.0368499 0.0152794 0.0163666 -0.112631 -0.00640745 0.0613043 -0.0198533 0.121775 -0.124074 -0.00614293 -0.159662 0.152262 0.00629881 -0.0357948 0.131819 0.193597 -0.0650563 0.0800252 -0.015542 0.0571155 -0.109803 -0.0567479 0.00224913 0.123484 -0.082522 0.066241 -0.0225065 -0.00341823 -0.0515414 0.0145353 -0.047537 -0.0623881 
0.105331 -0.0667139 -0.128821 0.0077307 0.136754 0.102067 0.0180991 -0.0467136 -0.117529 -0.0904748 -0.0102469 0.167526 0.0606491 -0.0822542 -0.151757 -0.0426206 -0.0633755 0.0449633 -0.122118 0.204845 0.0862269 -0.0727004 0.102199 0.108956 -0.0127678 0.0260472 0.0183189 -0.154392 -0.0556406 0.0437053 -0.072867 0.012193 -0.123994 0.054289 -0.0767875 -0.0204699 -0.183952 0.0987684 -0.0980875 -0.0387062 0.00587213 0.00880185 -0.0781866 0.182438 -0.1635 -0.00969959 0.117349 0.0361653 -0.0635224 0.140781 0.0846795 -0.05266 -0.0914258 -0.0294999 0.10984 -0.085962 -0.0382204 0.198214 0.0571843 -0.0972884 0.0164979 0.020822 0.222554 0.0270673 0.0294169 -0.204747 -0.027737 0.082067 -0.0275669 0.101459 0.0341889 0.121935 0.0543892 0.0284773 -0.0920895 0.00364198 -0.0431988 0.0199042 0.000789576 0.118501 -0.0267809 0.0211197 -0.00990308 -0.0827849 -0.0965793 -0.0882668 0.10077 0.0832655 0.0291355 -0.0386289 0.0325808 -0.0703031 -0.0688151 -0.0214344 -0.0484646 -0.0683179 0.0419004 0.019066 0.0198615 -0.106499 -0.0129748 0.0600456 -0.0216246 0.128442 -0.123761 -0.008076 -0.162695 0.151722 0.00214368 -0.040509 0.129999 0.195349 -0.0663255 0.0809993 -0.0122219 0.0566999 -0.107576 -0.0548866 -0.00571531 0.114185 -0.0855931 0.0695101 -0.0137404 -0.00803913 -0.053305 0.0151855 -0.0519791 -0.0664948 
0.115735 -0.0454477 -0.130202 -0.0160236 0.137229 0.126831 0.0300618 -0.0347685 -0.140955 -0.0905609 -0.023139 0.131342 0.0771597 -0.0699575 -0.116239 -0.0454593 -0.0628288 0.0282979 -0.121435 0.188062 0.0859972 -0.0620871 0.11302 0.0855746 -0.00668224 0.0154538 -0.00212707 -0.156664 -0.0416783 0.0378797 -0.0540411 0.0191312 -0.137239 0.0637667 -0.0656376 -0.0210515 -0.162982 0.110874 -0.0791733 -0.0369226 0.0106003 0.00261204 -0.061161 0.181185 -0.173563 -0.00149877 0.12368 0.0489969 -0.0750415 0.143898 0.0759508 -0.0568552 -0.0883713 -0.0163423 0.100557 -0.0911835 -0.0260991 0.208699 0.0677271 -0.121807 0.00143588 0.0355039 0.217364 0.0028053 0.0248039 -0.177247 -0.01738 0.0857317 -0.0269016 0.0905974 0.0287424 0.129128 0.0474576 0.0374103 -0.0808961 -0.00784909 -0.050507 7.31836e-05 0.0165206 0.128606 -0.0111975 0.0103102 -0.00543074 -0.0823331 -0.0872879 -0.0874002 0.095446 0.0748587 0.0341086 -0.0336007 0.0564893 -0.0809889 -0.0686291 -0.040128 -0.0546721 -0.0708101 0.0503091 0.0518407 0.00811169 -0.0982655 -0.0209828 0.0703699 -0.0100877 0.147703 -0.147367 -0.00562319 -0.177405 0.168771 0.0140818 -0.0444356 0.138394 0.19886 -0.0887663 0.084601 -0.0119599 0.0587551 -0.0995988 -0.0581393 -0.003431 0.115798 -0.0671467 0.0591723 0.00417665 0.00622574 -0.0606964 -0.0133762 -0.0535013 -0.0613379 
0.11461 -0.0438857 -0.129645 -0.0234538 0.133485 0.141271 0.0330799 -0.0308859 -0.146587 -0.0927206 -0.025093 0.135786 0.0761063 -0.0828757 -0.116313 -0.0495058 -0.0730335 0.0338864 -0.120909 0.174734 0.0825676 -0.0428285 0.0989842 0.0957693 -0.0168532 0.0129291 0.00843758 -0.157218 -0.0477021 0.0455394 -0.065867 0.00598294 -0.143332 0.067054 -0.0617351 -0.0257828 -0.160926 0.0770975 -0.087047 -0.0221732 0.0170559 -0.004754 -0.0513885 0.192848 -0.171797 0.00222008 0.131877 0.0479156 -0.0893474 0.149042 0.0895534 -0.0766678 -0.0887166 -0.017517 0.0974583 -0.0777044 -0.0350899 0.213378 0.0722351 -0.114706 0.00758196 0.0463018 0.215726 0.00399025 0.0223079 -0.188304 -0.0167368 0.0713502 -0.0319044 0.0876896 0.022315 0.118973 0.050225 0.0274312 -0.0825218 0.00257846 -0.0543172 0.000313185 0.0142251 0.124087 0.00318769 0.0124614 -0.00708144 -0.076017 -0.0965638 -0.0755392 0.0986927 0.0547668 0.0204521 -0.0163994 0.053503 -0.0871698 -0.0788007 -0.0401952 -0.0627236 -0.0519789 0.0456447 0.0455228 0.0114544 -0.0907789 -0.0168051 0.074789 -0.00868315 0.142367 -0.150816 -0.011143 -0.18556 0.168583 -0.0253879 -0.0356107 0.153769 0.185868 -0.0781581 0.0718336 -0.0297778 0.0619531 -0.100471 -0.052367 -0.0105207 0.109036 -0.0584818 0.0436383 0.00569136 0.000333528 -0.0597001 -0.00904875 -0.066156 -0.0691538 
0.116841 -0.0428071 -0.117657 -0.0400928 0.131932 0.150127 0.037184 -0.0190475 -0.152547 -0.0969607 -0.0314848 0.127188 0.0768895 -0.0719609 -0.0992316 -0.0590469 -0.0734096 0.0166008 -0.12425 0.166679 0.0698489 -0.0232448 0.0898416 0.083065 -0.0241535 0.0158834 0.00585374 -0.141404 -0.0515788 0.0326288 -0.0642346 -0.0061228 -0.15381 0.0716837 -0.0582697 -0.0183795 -0.154537 0.078976 -0.0894096 -0.0129364 0.0233824 0.00230657 -0.0512212 0.18803 -0.169947 0.0118041 0.122033 0.0531599 -0.0919275 0.152835 0.0839639 -0.0799342 -0.0962522 -0.0111351 0.099894 -0.0805113 -0.0508936 0.222969 0.0681929 -0.113416 0.00401614 0.0549145 0.21101 -0.000366289 0.0233656 -0.182326 -0.00939094 0.0816627 -0.0308871 0.0838345 0.0345572 0.120514 0.0605188 0.0307796 -0.0794285 0.00768732 -0.0590975 -0.0108767 0.0252865 0.120774 0.0145569 0.00687015 -0.000236332 -0.0754354 -0.0996584 -0.0869975 0.106604 0.0566911 0.0214826 -0.00667208 0.0585595 -0.0939797 -0.0715405 -0.0383853 -0.0678139 -0.0496301 0.0567893 0.0330112 0.00477089 -0.084821 -0.0245177 0.0865157 -0.0147072 0.134565 -0.165208 -0.00831694 -0.194544 0.161916 -0.0337616 -0.0341513 0.170474 0.181349 -0.0828934 0.0804373 -0.0321329 0.0598428 -0.100627 -0.0474051 -0.0194327 0.101242 -0.0558146 0.0374225 0.0135851 0.00498746 -0.0493218 -0.0167312 -0.0666846 -0.0745342 
0.108782 -0.0106876 -0.141388 -0.0424011 0.127893 0.163855 0.0263446 -0.0392159 -0.16749 -0.0587599 -0.00988042 0.106153 0.0905531 -0.0522728 -0.0920539 -0.0430124 -0.0707283 0.0225757 -0.0893874 0.157312 0.083842 -0.0533537 0.101279 0.0778397 0.00816748 0.0294614 -0.00026047 -0.1509 -0.00461678 0.0444521 -0.0391505 0.00804684 -0.157203 0.0478901 -0.0588394 -0.00373967 -0.163392 0.0883042 -0.0390125 -0.0164811 0.0106495 -0.0113778 -0.0532609 0.185331 -0.174229 -0.00341055 0.139458 0.0622775 -0.0947533 0.116875 0.0717364 -0.0343418 -0.0959722 -0.0152822 0.0871205 -0.0736687 -0.023377 0.238223 0.0653733 -0.12813 -0.0168813 0.0441988 0.248529 -0.018238 0.0212865 -0.141842 -0.0090654 0.0882685 -0.0240341 0.0988283 0.0264279 0.154521 0.0309863 0.0424671 -0.0573024 -0.0207195 -0.0603462 0.00320793 0.022869 0.124262 -0.000309546 0.0129688 0.0153241 -0.0738394 -0.0980788 -0.0819362 0.0977642 0.062114 0.0460282 -0.03956 0.0654515 -0.0825188 -0.0623521 -0.0353783 -0.0489454 -0.0903434 0.0530628 0.081535 0.00738504 -0.0948009 -0.0296389 0.0822011 -0.00625252 0.147601 -0.167018 0.027334 -0.179199 0.17039 0.0145903 -0.0504779 0.14702 0.189799 -0.0905376 0.082558 -0.00198497 0.0612126 -0.0940333 -0.0570788 0.00474184 0.115729 -0.0425581 0.0132357 0.0178777 0.00113565 -0.0914938 0.00344421 -0.0597619 -0.0329304 
0.105273 -0.00868205 -0.133964 -0.0430728 0.130749 0.167123 0.0313603 -0.0465886 -0.164222 -0.0599323 -0.0116181 0.106356 0.0922596 -0.0458006 -0.0840498 -0.048636 -0.0764842 0.0266225 -0.0904155 0.154141 0.0844817 -0.0483658 0.100061 0.0815198 0.0067213 0.0260401 -0.0120628 -0.153038 -0.00412046 0.0506555 -0.0367917 0.00958354 -0.158959 0.0462905 -0.049472 0.00205604 -0.159814 0.089285 -0.0389143 -0.0154263 0.0151313 -0.00748427 -0.0541829 0.179723 -0.180663 -0.00103154 0.140957 0.0631526 -0.093765 0.113804 0.0671537 -0.036389 -0.0929297 -0.0127145 0.0928683 -0.06909 -0.024151 0.243933 0.0592251 -0.126226 -0.0204741 0.0483065 0.248505 -0.0236979 0.0259874 -0.137257 -0.00468774 0.0887934 -0.0278651 0.101482 0.0333716 0.159082 0.0319982 0.0426543 -0.0547394 -0.0153867 -0.0676205 -0.00256452 0.0277327 0.119838 0.00290687 0.0200254 0.01426 -0.0720047 -0.0982822 -0.0817118 0.100012 0.0612087 0.0404095 -0.0357114 0.0700733 -0.0852021 -0.0542041 -0.0396943 -0.0553835 -0.0946852 0.0489728 0.0832319 0.0129657 -0.0909637 -0.0275679 0.0829452 -0.00564704 0.143356 -0.170358 0.0316647 -0.180284 0.166957 0.0148394 -0.0441076 0.148477 0.185651 -0.0932021 0.0781281 -0.0034735 0.0675499 -0.0945778 -0.0579305 -0.000649292 0.118394 -0.0360413 0.00990475 0.0145297 0.00336806 -0.0951195 0.00958765 -0.0613132 -0.0295502 
0.098884 -0.0115729 -0.145468 -0.0416514 0.130655 0.150117 0.035635 -0.0578002 -0.157523 -0.0587861 -0.0103254 0.119832 0.0845662 -0.0561386 -0.101529 -0.0425164 -0.0913659 0.0209296 -0.0884781 0.155372 0.0775717 -0.0505415 0.086012 0.0767217 0.00349852 0.0406726 0.00180787 -0.151208 -0.00727479 0.0620721 -0.0553815 0.00865258 -0.159239 0.0372506 -0.0498616 -0.00494924 -0.166178 0.0779459 -0.0372357 -0.0145985 0.0168042 -0.0137462 -0.0487489 0.190966 -0.173275 0.0144148 0.143435 0.0612086 -0.0946846 0.105836 0.0648319 -0.0399151 -0.093681 -0.0194756 0.0998324 -0.0695352 -0.0397954 0.243295 0.0502036 -0.110502 -0.00887197 0.0375557 0.257523 -0.00142196 0.02763 -0.145546 -0.0149382 0.0881012 -0.0189701 0.0857371 0.0314825 0.154897 0.0370441 0.0356697 -0.0557852 -0.00434694 -0.0666667 0.00121724 0.0187286 0.120002 0.0124999 0.0208599 0.00694816 -0.0665608 -0.111273 -0.0805204 0.101616 0.0586433 0.0371675 -0.0370251 0.0596051 -0.0801055 -0.0645035 -0.0365852 -0.05927 -0.0875568 0.0508232 0.0645381 0.0311814 -0.0989587 -0.0272404 0.0720129 -0.00386905 0.133516 -0.172294 0.0259005 -0.179741 0.181139 -0.00264811 -0.0378497 0.161347 0.179548 -0.0889299 0.071591 -0.00970936 0.0689288 -0.104074 -0.0468885 -0.0026895 0.106824 -0.0415439 0.0135222 0.0158235 0.00116774 -0.095915 0.0175676 -0.0721486 -0.0401347 
0.116847 -0.0422199 -0.140839 -0.0184867 0.147638 0.133907 0.0414312 -0.038779 -0.139845 -0.0777322 -0.0113652 0.12987 0.0902457 -0.0502366 -0.108484 -0.0528471 -0.0508173 0.0310673 -0.117968 0.182666 0.0852861 -0.0657958 0.102081 0.0946466 0.00128852 0.00375127 -0.0120691 -0.145476 -0.0290149 0.0475682 -0.0438153 0.0193238 -0.147567 0.0532188 -0.0721358 -0.00847781 -0.171437 0.0896975 -0.0745039 -0.0306258 0.0201476 0.00759014 -0.0678431 0.179247 -0.181119 -0.00497692 0.114438 0.062007 -0.0622427 0.12425 0.070551 -0.0444271 -0.0958505 -0.0278829 0.0934635 -0.0839592 -0.0367339 0.223529 0.0690323 -0.108308 -0.0093145 0.0420125 0.220189 -0.00427435 0.0125905 -0.16713 -0.0110744 0.093804 -0.0259735 0.0864598 0.042954 0.146505 0.0461766 0.0294806 -0.0787948 0.00319154 -0.0531346 0.00484189 0.0147034 0.125589 -0.0119316 0.0113416 0.00325432 -0.0737054 -0.0892137 -0.0735465 0.104332 0.0694407 0.0276397 -0.0468337 0.0557266 -0.0782922 -0.0627581 -0.0408666 -0.0556878 -0.0905103 0.0435834 0.0469676 0.00671788 -0.100897 -0.0181314 0.0728357 0.000169176 0.146484 -0.15948 0.0110467 -0.181489 0.170464 0.019314 -0.0378298 0.140129 0.186424 -0.0896564 0.0853518 -0.0162709 0.0642111 -0.0998956 -0.0509185 -0.0080943 0.1223 -0.0693043 0.0413526 -0.0101518 0.0140608 -0.0831056 -0.00199988 -0.0729562 -0.0468745 
0.104677 0.00281269 -0.160188 -0.0489235 0.136761 0.169625 0.0372568 -0.0574869 -0.159857 -0.0531653 -0.00390638 0.106694 0.0912795 -0.0260591 -0.0889611 -0.047768 -0.0660486 0.0250032 -0.075057 0.140105 0.0773808 -0.0442212 0.087255 0.0756864 0.0127825 0.0279134 0.000854993 -0.140437 0.00780805 0.0674169 -0.039748 0.0102704 -0.158542 0.0282115 -0.0515161 0.00730326 -0.159953 0.0726615 -0.0308574 -0.0109786 0.0156679 8.41869e-05 -0.0518141 0.184666 -0.182483 0.0150198 0.139949 0.065422 -0.094225 0.090897 0.0601684 -0.0209428 -0.0905896 -0.0221041 0.0892129 -0.0577015 -0.0333027 0.260492 0.0555946 -0.114802 -0.0269195 0.0468685 0.265773 -0.0310488 0.0218223 -0.126437 -0.00660024 0.0972837 -0.022911 0.101021 0.0426777 0.163703 0.0275104 0.0300935 -0.0518716 -0.00168257 -0.0663212 0.000500427 0.0159259 0.103278 0.00429182 0.0304062 0.014147 -0.0693672 -0.10135 -0.0767848 0.0972419 0.0499537 0.0369687 -0.0397131 0.0659232 -0.0864512 -0.0595042 -0.0411467 -0.0385732 -0.101217 0.0526759 0.0783987 0.0212926 -0.0934751 -0.0287861 0.0817005 0.00411358 0.136969 -0.193633 0.0428675 -0.182754 0.163522 0.00296282 -0.0415613 0.163953 0.170892 -0.0871116 0.077711 -0.00568898 0.065867 -0.101225 -0.0564392 0.00425692 0.112506 -0.0339278 -0.00261495 0.0134201 0.00363629 -0.103598 0.0202617 -0.0741406 -0.0285406 
0.122178 -0.0354631 -0.140412 -0.0114446 0.144464 0.148827 0.0562234 -0.0422255 -0.137044 -0.0776823 -0.00454469 0.129815 0.0937112 -0.0717132 -0.108361 -0.0478387 -0.064491 0.0415664 -0.125543 0.17297 0.104682 -0.0694949 0.0923828 0.107569 0.00174678 -0.0123298 -0.0244017 -0.166465 -0.0267822 0.069852 -0.0478198 0.0268626 -0.149306 0.0612646 -0.0604425 -0.0161554 -0.170708 0.0691841 -0.0714071 -0.0368161 0.0203042 -0.0139812 -0.0589475 0.182636 -0.173592 -0.00505454 0.123444 0.0593804 -0.0866844 0.120068 0.0759464 -0.0560404 -0.087017 -0.032773 0.0923775 -0.0706267 -0.0415041 0.222452 0.0587013 -0.102559 -0.00679633 0.0436512 0.225428 -0.0149684 0.0201771 -0.166259 -0.0209525 0.0791147 -0.0446864 0.081322 0.0312743 0.136663 0.0277204 0.0141849 -0.0808701 0.00810301 -0.0461012 0.0019382 0.0128416 0.134131 -0.0104951 0.00225619 -0.00649231 -0.0741505 -0.0996133 -0.0525238 0.101466 0.0437548 0.0142457 -0.0278859 0.0614141 -0.0916402 -0.0789844 -0.0364103 -0.0671362 -0.0725305 0.0313156 0.0464609 0.0147177 -0.088642 -0.000243696 0.0703406 -0.00533968 0.145725 -0.151863 0.0108086 -0.176701 0.182167 0.00301468 -0.0389083 0.131994 0.175629 -0.0901106 0.06019 -0.0072549 0.0792042 -0.103625 -0.0409144 -0.0018477 0.137132 -0.0595747 0.0265266 -0.0112209 0.0207393 -0.0763872 0.00836139 -0.0661974 -0.0535599 
0.116386 -0.00872964 -0.149923 -0.0219378 0.135384 0.153901 0.049334 -0.0484213 -0.119537 -0.0752284 0.00110468 0.122896 0.0882325 -0.0890384 -0.113745 -0.0376476 -0.0806571 0.0293941 -0.132562 0.164644 0.105456 -0.0655131 0.0971727 0.0882733 -0.0010523 -0.00469531 -0.0166293 -0.170585 -0.0122772 0.0689481 -0.0417139 0.0282756 -0.13854 0.0582834 -0.0524368 -0.0211299 -0.156896 0.089437 -0.0592923 -0.0323653 0.0174617 -0.0267106 -0.0597603 0.188481 -0.174323 0.00149937 0.129517 0.0615285 -0.0975491 0.119129 0.0663056 -0.0355667 -0.0905876 -0.0276129 0.0877429 -0.072183 -0.0348851 0.212159 0.0432226 -0.112949 -0.0197172 0.0253343 0.244071 -0.0164595 0.0238746 -0.166881 -0.0205314 0.0831209 -0.0391036 0.0897295 0.0276259 0.130274 0.0182894 0.0197521 -0.0662346 -0.000315205 -0.0578321 0.00542253 0.0055375 0.138619 -0.00778985 0.00824355 -0.00442579 -0.0661726 -0.0974944 -0.0504414 0.0955127 0.0458136 0.0210746 -0.022591 0.0626716 -0.103411 -0.0874162 -0.0374046 -0.0603721 -0.0844645 0.0324549 0.0547512 0.0191669 -0.0950807 -0.00165247 0.0637559 -0.00818215 0.148492 -0.151061 0.00968818 -0.170271 0.194573 0.0155193 -0.043875 0.130825 0.1806 -0.0967508 0.0668598 0.00164986 0.07651 -0.114227 -0.0454687 0.0120581 0.138374 -0.0445575 0.0328394 -0.00126596 0.0271131 -0.0692656 0.000802672 -0.0526172 -0.0469331 
0.117459 -0.00559339 -0.15706 -0.0178505 0.138653 0.138429 0.0394059 -0.0556942 -0.1354 -0.0719739 -0.0045971 0.12154 0.0851197 -0.0642131 -0.112008 -0.0360276 -0.0530854 0.0299313 -0.11168 0.169538 0.09343 -0.064188 0.104767 0.0842842 0.0108827 0.00532351 -0.00602538 -0.157154 -0.00871675 0.0700041 -0.0464846 0.0327589 -0.132962 0.048157 -0.0602817 -0.0217182 -0.15656 0.101057 -0.0547556 -0.0329033 0.00704771 -0.00773112 -0.0538173 0.185284 -0.178233 0.0142671 0.134609 0.055522 -0.0872081 0.114971 0.0787062 -0.019313 -0.0887484 -0.0279904 0.0905138 -0.0809317 -0.0223404 0.212198 0.0627942 -0.118325 -0.0173647 0.0229085 0.234534 -0.0156485 0.017326 -0.165294 -0.0170132 0.0900733 -0.0306414 0.0938917 0.0350498 0.137997 0.023083 0.0240192 -0.0656389 -0.00160861 -0.0574589 0.00957397 0.00511629 0.133823 -0.0107274 0.019152 8.34875e-06 -0.0718865 -0.0831406 -0.0683617 0.0866877 0.0515833 0.0279183 -0.0370806 0.0479668 -0.0877403 -0.0807469 -0.0419487 -0.0484599 -0.0940512 0.0491249 0.0662472 0.0173622 -0.11029 -0.0151952 0.0726593 0.00530591 0.160212 -0.168677 0.00730859 -0.17389 0.188515 0.0301601 -0.0476081 0.138509 0.18553 -0.0976979 0.0786751 -0.0047201 0.0637551 -0.112674 -0.0601382 0.00717412 0.130265 -0.0534698 0.0441586 -0.000114533 0.0161418 -0.0732235 -0.00497742 -0.052652 -0.0464541 
0.116983 -0.0403309 -0.135961 -0.0152017 0.136539 0.128296 0.0165708 -0.0242584 -0.13628 -0.100626 -0.0212755 0.121227 0.0821697 -0.0623441 -0.115955 -0.0459889 -0.0407839 0.0328416 -0.12442 0.189418 0.0917859 -0.0705263 0.13575 0.0873615 -0.00301428 -0.00928377 0.000729266 -0.157219 -0.0430071 0.0273678 -0.0436678 0.0120814 -0.117521 0.0607802 -0.0755432 -0.021809 -0.163181 0.120129 -0.0954898 -0.0360713 0.00371661 0.0095052 -0.0733759 0.179286 -0.181343 0.00349051 0.1174 0.0460764 -0.0743791 0.148262 0.0742534 -0.0453813 -0.0834578 -0.0199206 0.082137 -0.0932473 -0.00243313 0.190278 0.0839354 -0.129804 -0.00451167 0.0436379 0.199152 -0.00350128 0.0171599 -0.185471 -0.013741 0.0968201 -0.0216565 0.101635 0.0334825 0.118746 0.038914 0.0216974 -0.0751208 -0.000530626 -0.0578923 0.00717602 0.011793 0.133684 -0.0340675 0.00662096 -0.00724662 -0.0810115 -0.0800615 -0.0658716 0.0882201 0.0702694 0.0223151 -0.0428504 0.0496293 -0.0808519 -0.0671003 -0.0480117 -0.0458736 -0.0803646 0.0467905 0.0673743 -0.00933744 -0.106746 -0.0146453 0.0708431 -0.00283526 0.158476 -0.140992 -0.0119695 -0.179115 0.169247 0.0252076 -0.0549689 0.125431 0.197737 -0.0816499 0.0853047 -0.0184329 0.0617363 -0.109461 -0.0669403 0.00350299 0.128477 -0.0766753 0.061769 -0.0146164 0.00925087 -0.0577294 -0.0220642 -0.055573 -0.0514105 
0.122593 -0.0483955 -0.125288 -0.00660074 0.142718 0.119264 0.0177599 0.00205492 -0.125986 -0.090549 -0.0138583 0.122497 0.0834967 -0.0635696 -0.106952 -0.0362902 -0.0154382 0.0390149 -0.140685 0.204054 0.0950431 -0.0783818 0.140625 0.110098 -0.0026027 -0.020406 -0.00453182 -0.150894 -0.0337427 0.0100704 -0.0338726 0.0261631 -0.107062 0.074586 -0.100828 -0.0218171 -0.163588 0.131651 -0.109567 -0.0351744 0.00991578 0.0136881 -0.078684 0.166405 -0.176397 -0.0215724 0.10668 0.0434394 -0.0650262 0.154824 0.0763758 -0.0464747 -0.0979325 -0.0261266 0.0792233 -0.0900679 -0.00480672 0.182852 0.0917556 -0.129066 -0.0161609 0.0362267 0.179449 -0.0111236 0.00309366 -0.177272 -0.0160942 0.092876 -0.0293379 0.104392 0.0293717 0.120278 0.0354553 0.0366354 -0.0713489 -0.0115081 -0.0419856 0.0251584 0.0114579 0.122854 -0.0477355 0.0105092 -0.00354484 -0.0889932 -0.0620711 -0.0575281 0.0898573 0.0788062 0.0302464 -0.0451721 0.0512947 -0.0773621 -0.0748669 -0.0469971 -0.0263365 -0.0744272 0.0412244 0.0613636 -0.0274044 -0.107096 -0.0186695 0.0549328 -0.00201123 0.167736 -0.139048 -0.00847202 -0.17946 0.150257 0.049463 -0.0740378 0.105512 0.21792 -0.0745701 0.088387 -0.00245907 0.0482557 -0.0982856 -0.0821207 0.0082922 0.140674 -0.0762492 0.0773742 -0.0207668 0.0247603 -0.0647226 -0.027743 -0.0489982 -0.0523541 
0.12152 -0.0568249 -0.125135 -0.00488861 0.14766 0.110029 0.0174928 0.00543772 -0.129334 -0.0903849 -0.020083 0.131403 0.0817111 -0.0584113 -0.113833 -0.0344743 -0.00474751 0.0372844 -0.142902 0.213938 0.0871251 -0.0799811 0.138155 0.0993811 -0.00789267 -0.0133945 -0.00541506 -0.138691 -0.0425844 0.0036345 -0.0430648 0.0327496 -0.105263 0.0761867 -0.10897 -0.0228934 -0.164915 0.136978 -0.114496 -0.0389239 0.00946591 0.0247188 -0.0736011 0.157622 -0.173222 -0.022453 0.101991 0.0382039 -0.0601313 0.161079 0.0791607 -0.0520782 -0.104798 -0.0236365 0.0829623 -0.095499 -0.0107953 0.1801 0.0913954 -0.124154 -0.0102811 0.0373895 0.172758 -0.00912919 0.00724844 -0.177773 -0.0221984 0.0983849 -0.0304751 0.0997299 0.036764 0.118934 0.0468519 0.0424638 -0.0792113 -0.0040829 -0.0323197 0.0214007 0.0111995 0.108324 -0.050172 0.0110877 -0.00254866 -0.0869909 -0.0627747 -0.0655231 0.0909264 0.0882395 0.0393498 -0.046469 0.0429522 -0.0762453 -0.0731032 -0.0421536 -0.0195547 -0.068304 0.0490189 0.0515776 -0.0362451 -0.104059 -0.0244999 0.0542978 -0.00626736 0.168297 -0.140413 -0.0088473 -0.182003 0.14326 0.0443481 -0.0732903 0.105176 0.216917 -0.070535 0.0998199 -0.00443618 0.0371555 -0.095855 -0.0790099 0.00500301 0.133244 -0.0863829 0.0857703 -0.0140958 0.0195612 -0.0558652 -0.0306852 -0.0510517 -0.0624661 
0.121329 -0.0635141 -0.128792 -0.0140398 0.143514 0.120123 0.0187746 0.00399298 -0.147676 -0.0830586 -0.033174 0.1323 0.0858475 -0.0446461 -0.103396 -0.0483553 -0.00288647 0.0393963 -0.112931 0.201977 0.0785381 -0.0654198 0.13099 0.107498 -0.0116583 0.000768167 0.00585629 -0.143603 -0.0494208 0.0141534 -0.0539116 0.0187455 -0.110295 0.0715159 -0.0944965 -0.0218048 -0.156389 0.126679 -0.112682 -0.0400524 0.00768743 0.0294162 -0.0663978 0.169281 -0.184821 -0.0158566 0.111026 0.0401637 -0.0595444 0.157617 0.0934652 -0.0631521 -0.0916289 -0.0167383 0.0991996 -0.0886101 -0.00703124 0.191566 0.104265 -0.135232 -0.00362978 0.0421482 0.172603 -0.0127076 0.0122218 -0.181464 -0.0171429 0.0941102 -0.0230811 0.0976015 0.0335458 0.12002 0.0462829 0.0313601 -0.0847471 0.00242967 -0.0416133 0.0198859 0.0271803 0.105637 -0.0417913 0.0159547 0.00327124 -0.0869631 -0.0578086 -0.0871452 0.0972653 0.0856931 0.0450779 -0.0424737 0.0361917 -0.0710088 -0.0622776 -0.0503384 -0.0302039 -0.0710274 0.0603488 0.0626278 -0.0277745 -0.106389 -0.0178399 0.0760111 0.00388029 0.160495 -0.155329 -0.0169463 -0.190487 0.128211 0.0207185 -0.0588738 0.124018 0.204743 -0.0690539 0.0885076 -0.0172653 0.0419325 -0.0884011 -0.0916762 -0.0106568 0.119561 -0.0776884 0.0682511 -0.00656899 0.00445804 -0.0647041 -0.0264344 -0.0567479 -0.0583474 
0.128209 -0.066488 -0.132411 -0.0114851 0.145505 0.126894 0.0293117 0.00366683 -0.153234 -0.0771076 -0.0372954 0.124647 0.0872349 -0.0420352 -0.0972385 -0.0448012 0.0104577 0.0457625 -0.106147 0.200548 0.0818601 -0.06857 0.14314 0.0896916 -0.0199998 0.00678392 -0.00812164 -0.156912 -0.0489613 0.00868765 -0.0555785 0.0409961 -0.103499 0.0798967 -0.082531 -0.0265737 -0.130012 0.157573 -0.102223 -0.0597764 0.00788223 0.0333852 -0.063051 0.151257 -0.197176 -0.0181875 0.112827 0.0348969 -0.0663434 0.156621 0.0864206 -0.0679122 -0.0849941 0.00113186 0.10661 -0.0915945 0.0140097 0.183984 0.0948675 -0.145979 -0.00298823 0.0374537 0.176039 -0.0382852 0.0343415 -0.165019 -0.0215753 0.0974568 -0.0240457 0.106903 0.0251467 0.115172 0.0383259 0.0458264 -0.0907734 -0.00854323 -0.0333313 0.0186667 0.0318757 0.0800766 -0.0546499 0.0244214 -0.00161168 -0.0988414 -0.0461981 -0.0983429 0.0922832 0.0936706 0.0556173 -0.0366816 0.0559702 -0.0789082 -0.0589387 -0.0607884 -0.0184454 -0.0726181 0.0706958 0.0803121 -0.0294143 -0.0927185 -0.0134152 0.0779756 0.00248686 0.167392 -0.145424 -0.0221894 -0.179979 0.117582 0.026962 -0.0596126 0.108367 0.209025 -0.0637017 0.0863634 0.00377284 0.0319225 -0.0775043 -0.112285 -0.00557059 0.116174 -0.0703299 0.0751149 0.0119825 0.00947229 -0.0555972 -0.0353255 -0.0425717 -0.0620454 
0.123176 -0.050645 -0.130931 -0.0110479 0.141864 0.131702 0.0273631 -0.00230002 -0.135951 -0.0944295 -0.0341923 0.119853 0.0839489 -0.0521325 -0.096932 -0.0505984 -0.0137272 0.0403736 -0.124305 0.193607 0.0828883 -0.0703226 0.148832 0.0966667 -0.0153027 -0.0170397 -0.00840843 -0.161694 -0.0546725 0.0098847 -0.0424623 0.0259188 -0.101563 0.0789923 -0.0815139 -0.0205704 -0.137813 0.143572 -0.117758 -0.0460477 0.0141726 0.0224009 -0.068325 0.161977 -0.198102 -0.00458993 0.115861 0.036667 -0.0742253 0.162558 0.0762564 -0.0677675 -0.0822058 -0.00811428 0.0966168 -0.0841986 0.00725817 0.1878 0.097091 -0.140381 -0.0124624 0.046959 0.177187 -0.035958 0.0297393 -0.172124 -0.0175472 0.0945982 -0.0311205 0.113658 0.0295318 0.112494 0.0365072 0.0349173 -0.0770757 -0.000227051 -0.0470363 0.0136732 0.0220275 0.0956589 -0.0546601 0.0156149 -0.010683 -0.0921193 -0.0607025 -0.072303 0.0894809 0.0749571 0.032163 -0.0309723 0.0578198 -0.0893105 -0.0603992 -0.072629 -0.0257149 -0.0695591 0.0543294 0.0774692 -0.0200323 -0.0935466 -0.0175133 0.071011 0.00591649 0.162728 -0.147151 -0.0194468 -0.186256 0.137249 0.0187382 -0.0600497 0.114146 0.206696 -0.0662026 0.0780735 -0.00741219 0.045271 -0.0883252 -0.0995655 0.00527459 0.131479 -0.0628351 0.0712921 -0.00609248 0.0220018 -0.0546062 -0.0342991 -0.0472966 -0.0564591 
0.12233 -0.0568923 -0.125149 -0.00621278 0.139274 0.129025 0.0265184 -0.00356218 -0.13165 -0.104314 -0.0324964 0.11356 0.0837481 -0.0490586 -0.0968564 -0.0483775 -0.0239275 0.0386387 -0.128154 0.193271 0.0934464 -0.0836396 0.157989 0.0939992 -0.0091023 -0.0245311 -0.0147464 -0.167507 -0.0569976 0.005601 -0.035144 0.0262557 -0.100401 0.0791695 -0.0807643 -0.0180865 -0.14329 0.150254 -0.116846 -0.0525978 0.0128396 0.0193514 -0.0722405 0.157838 -0.196031 -0.00752809 0.113562 0.0343555 -0.0744439 0.161949 0.0624329 -0.0691269 -0.075577 -0.00568224 0.0955391 -0.0857434 0.0132791 0.18734 0.0916256 -0.143241 -0.0109331 0.0500444 0.178546 -0.0326005 0.0305099 -0.159293 -0.0197555 0.0967694 -0.0294947 0.117453 0.0264067 0.113434 0.0321384 0.0345546 -0.073442 -0.00536481 -0.0457155 0.00553627 0.0215325 0.102057 -0.0603369 0.00912837 -0.0159571 -0.0991748 -0.0672182 -0.0632536 0.086056 0.0771468 0.0276641 -0.0344605 0.0704118 -0.0903476 -0.0574025 -0.075138 -0.0274848 -0.070058 0.0461079 0.0841681 -0.015019 -0.0905401 -0.0160462 0.0618846 0.00484138 0.159725 -0.135576 -0.0152614 -0.182623 0.143568 0.0274714 -0.0682951 0.103712 0.210737 -0.0684672 0.072619 0.00351321 0.0539079 -0.0860972 -0.0945883 0.0144525 0.139453 -0.063976 0.0725748 -0.0112612 0.0260189 -0.056486 -0.0320804 -0.040299 -0.0499196 
0.132248 -0.0643682 -0.138512 -0.00281259 0.151628 0.132316 0.0433994 -0.00622416 -0.139768 -0.0843798 -0.0300213 0.117058 0.0930569 -0.0396863 -0.0917617 -0.0398126 -0.00326978 0.0509552 -0.118868 0.195981 0.102987 -0.0911933 0.15721 0.086367 -0.00951001 -0.0224245 -0.0329133 -0.172274 -0.0477898 0.0212029 -0.0422067 0.0560436 -0.102296 0.0824944 -0.0779566 -0.020062 -0.133271 0.158075 -0.0961637 -0.0706952 0.00653498 0.0237491 -0.0652962 0.139865 -0.199958 -0.0196445 0.109782 0.0390545 -0.0694513 0.154019 0.0645997 -0.0653339 -0.0767572 -0.000918943 0.102125 -0.087821 0.0230519 0.185832 0.0786773 -0.138978 -0.0102042 0.0448049 0.182971 -0.0506046 0.037235 -0.145415 -0.0301963 0.103442 -0.0346557 0.11433 0.0237018 0.121922 0.0193649 0.0419053 -0.0882494 -0.00777051 -0.0266603 0.00365328 0.0253276 0.0848638 -0.0660395 0.0158477 -0.0149714 -0.100417 -0.0583376 -0.0698663 0.0825305 0.0837185 0.043619 -0.0346121 0.0784314 -0.0888719 -0.0611171 -0.0667325 -0.0199235 -0.0747128 0.0480654 0.0918107 -0.0210184 -0.0826396 -0.00216437 0.0621956 0.00216937 0.166779 -0.131939 -0.0116157 -0.176936 0.132517 0.0415686 -0.064611 0.08664 0.207907 -0.0667342 0.0739647 0.0211375 0.0519132 -0.0689953 -0.101717 0.0138469 0.143505 -0.0620915 0.0701592 0.00270255 0.0287873 -0.0648876 -0.0301979 -0.035079 -0.0522535 
0.137546 -0.0509575 -0.135876 -0.00360557 0.144457 0.136495 0.0434813 -0.0054494 -0.130689 -0.105698 -0.0302803 0.106068 0.0882712 -0.0517996 -0.0928298 -0.0463936 -0.0143817 0.0371494 -0.133855 0.1921 0.0947063 -0.0771574 0.151453 0.0902972 -0.0135294 -0.0333923 -0.0306621 -0.17013 -0.0524876 0.0154197 -0.0349665 0.0462075 -0.11009 0.0859052 -0.0783128 -0.0200839 -0.129014 0.148182 -0.107082 -0.0542144 0.0163764 0.019253 -0.0662333 0.148503 -0.19404 -0.00640066 0.111979 0.040919 -0.0743879 0.163424 0.0597224 -0.067449 -0.0751399 -0.00129386 0.0933028 -0.0891202 0.0144431 0.186812 0.0883327 -0.139902 -0.0153051 0.0548848 0.1793 -0.0507852 0.0238824 -0.153735 -0.0135952 0.091913 -0.0337227 0.106618 0.0232584 0.113061 0.0284289 0.0464586 -0.0783804 -0.00964532 -0.0364379 0.00144029 0.0197742 0.0986894 -0.0503256 0.012551 -0.02178 -0.102904 -0.0583858 -0.0541255 0.0794925 0.0658552 0.0248974 -0.0297068 0.0847834 -0.0961081 -0.0639019 -0.0779688 -0.0248947 -0.0665476 0.0490383 0.0821075 -0.0177919 -0.0816941 -0.0130836 0.0631075 0.00688124 0.17166 -0.143523 -0.0154207 -0.182407 0.148815 0.0265791 -0.0584793 0.103989 0.207121 -0.0729419 0.0716969 0.00224779 0.0530094 -0.0785847 -0.0958895 0.0141464 0.137633 -0.0605691 0.0733201 0.000751577 0.0380881 -0.0581658 -0.0420303 -0.0441567 -0.0577435 
0.13343 -0.0498539 -0.134998 -0.0159306 0.142925 0.149695 0.0462494 0.000320886 -0.135542 -0.106001 -0.0352839 0.109888 0.0859395 -0.0544214 -0.0906307 -0.0571891 -0.0198268 0.0315364 -0.128602 0.18322 0.0847534 -0.0630497 0.144612 0.0891539 -0.0233715 -0.0266102 -0.0211383 -0.165215 -0.0545571 0.00831843 -0.0377941 0.0309896 -0.113121 0.0881454 -0.0740955 -0.0201414 -0.120509 0.140506 -0.11208 -0.0459571 0.027598 0.0206107 -0.0629387 0.15323 -0.201987 -0.00565904 0.11439 0.0404733 -0.0805232 0.166595 0.0585491 -0.076648 -0.0767222 0.00349941 0.0972522 -0.0818176 0.00840065 0.198211 0.0852821 -0.141603 -0.0176973 0.0617085 0.18714 -0.056339 0.0314276 -0.153557 -0.0111086 0.0878459 -0.034669 0.10879 0.0224369 0.109763 0.0333947 0.0505567 -0.0732033 -0.0044599 -0.0411556 0.00180413 0.0248038 0.0854038 -0.0489575 0.0151471 -0.0146244 -0.0981453 -0.0608122 -0.0612094 0.0882273 0.0669585 0.0246464 -0.0217108 0.0883789 -0.104387 -0.0603013 -0.081822 -0.0229107 -0.0655787 0.0533645 0.080517 -0.018427 -0.0748939 -0.016894 0.0707828 0.00629092 0.166195 -0.150649 -0.0152862 -0.185407 0.142279 0.00387789 -0.0544974 0.118517 0.2022 -0.0659218 0.0740927 -0.00429517 0.0491623 -0.0768745 -0.0966488 0.0121448 0.131035 -0.0529839 0.062771 0.00535622 0.0325066 -0.0579856 -0.0409861 -0.0511875 -0.0597072 
0.123324 -0.051365 -0.129382 -0.0114093 0.144735 0.136212 0.0443198 -0.00642825 -0.140808 -0.107465 -0.0408518 0.101106 0.0901655 -0.0355831 -0.0773621 -0.0648696 -0.0357254 0.0236334 -0.116277 0.17592 0.0893736 -0.0809518 0.14433 0.0822071 0.00857826 -0.0401163 -0.0319448 -0.164533 -0.0543796 0.0206699 -0.0228578 0.0193332 -0.123485 0.0665198 -0.0721272 -0.0107441 -0.151808 0.118365 -0.108406 -0.0480262 0.0243089 0.0170547 -0.0655638 0.169628 -0.20075 0.00956437 0.11117 0.0455913 -0.0666306 0.145197 0.0541136 -0.0664086 -0.0696592 -0.0166393 0.0899999 -0.0855761 -0.00381448 0.203274 0.0970492 -0.133306 -0.013428 0.0638051 0.174631 -0.0305981 0.0216041 -0.153612 -0.00725145 0.0958849 -0.0230068 0.102444 0.0388242 0.135472 0.0348186 0.0240374 -0.0759881 0.00565121 -0.0566186 -0.00976636 0.0249105 0.124448 -0.0477208 -0.004044 -0.0150124 -0.0884068 -0.0715449 -0.0581679 0.0893345 0.0630173 0.0150957 -0.0435628 0.0753609 -0.0818732 -0.055009 -0.0842887 -0.0482591 -0.0801255 0.0484305 0.0801805 -0.00887362 -0.092706 -0.0224862 0.0714884 0.0216316 0.149892 -0.161438 -0.00755203 -0.192372 0.166599 0.0264172 -0.0517191 0.122812 0.189681 -0.0911814 0.0609326 -0.00982796 0.0669051 -0.0828108 -0.0788698 0.0103739 0.141751 -0.0616148 0.0578016 -0.0214106 0.034812 -0.0692234 -0.0358543 -0.0535336 -0.0400206 
0.128351 -0.0509252 -0.131037 -0.0129096 0.138331 0.143651 0.0436328 0.00628065 -0.13014 -0.107405 -0.0268545 0.101924 0.0936156 -0.0573451 -0.089057 -0.0594798 -0.0343652 0.0368828 -0.133571 0.175009 0.102138 -0.0764993 0.145168 0.0898314 -0.00754893 -0.0427618 -0.0268252 -0.176474 -0.0513637 0.0148161 -0.0271362 0.0215481 -0.115288 0.077286 -0.0753937 -0.0219983 -0.145507 0.125678 -0.113735 -0.0430888 0.0246884 0.0100391 -0.076832 0.171361 -0.200113 -0.00608843 0.108147 0.0411061 -0.0770641 0.149016 0.0562446 -0.068201 -0.0753355 -0.0115236 0.0773016 -0.0805049 0.00851925 0.190553 0.0916179 -0.137576 -0.0146161 0.0553379 0.17874 -0.0329446 0.0188108 -0.164926 -0.00730392 0.0900404 -0.0219988 0.104063 0.0288087 0.115114 0.0298437 0.0222184 -0.0767311 -0.00208453 -0.0584787 -0.000407357 0.0174281 0.119076 -0.0552211 0.000514447 -0.0149705 -0.0916749 -0.0703455 -0.0411505 0.0948252 0.0578355 0.0126058 -0.0380386 0.0793403 -0.0953806 -0.0654484 -0.0828215 -0.0433496 -0.0755127 0.0388188 0.0788236 -0.0152452 -0.0848518 -0.0114705 0.067418 0.0160817 0.16076 -0.14123 -0.0173648 -0.185889 0.164803 0.0185559 -0.0593228 0.111413 0.193071 -0.0847665 0.0589001 -0.00495688 0.0668831 -0.0884676 -0.0877953 0.0162065 0.140185 -0.0604821 0.0587465 -0.0211416 0.0401333 -0.0599935 -0.0385316 -0.0542893 -0.0417544 
