-0.0243729 0.0934868 -0.144963 0.0291108 0.0444974 0.147154 0.0344157 -0.118983 -0.0746594 0.0442222 -0.00164534 0.0416509 0.0942597 -0.025905 -0.0466389 -0.0337634 -0.103484 0.0618509 0.0255063 0.108348 0.10546 -0.181 0.0974288 0.13644 0.0470452 -0.0101454 -0.0919437 -0.230597 0.0714918 0.142644 0.0209277 0.0722591 -0.0176304 -0.0186835 0.0155073 0.0566284 -0.0685493 0.105477 -0.0679969 -0.0961197 0.0186587 -0.091672 0.00161237 0.135797 -0.176458 0.0131825 0.215072 0.0309243 -0.123043 -0.0119193 -0.00464499 -0.0178601 0.0386393 -0.0310624 0.155782 0.0826633 0.03059 0.156536 0.0681932 -0.171781 -0.0773134 0.0334682 0.228027 -0.113397 0.109922 0.0131688 -0.00982599 -0.0280484 -0.0807318 0.0972169 -0.0485544 0.107103 -0.0833658 0.00618414 0.0625759 0.0057378 -0.0598485 0.0687164 0.0338447 0.0306563 -0.095759 0.0537684 -0.0636339 -0.0416787 -0.0557873 0.007389 0.0121546 0.0109139 0.0521476 -0.00060373 0.0586041 -0.0701341 0.00399901 -0.117808 -0.0375685 -0.115895 -0.00289566 0.197335 0.109241 -0.0600284 0.0554619 0.0382515 0.055447 0.0505822 -0.149529 0.0847998 -0.0876942 0.110466 0.0430697 -0.0193242 0.0133199 0.134126 -0.0617975 -0.112739 0.031181 0.0802249 -0.0452691 -0.138329 0.0596973 0.161218 0.0501494 -0.0705294 -0.0253823 0.0166869 -0.172653 0.130537 -0.0115478 0.0595293 
0.0459811 0.0675158 -0.106557 -0.00633101 0.135185 0.218821 -0.00122992 -0.117453 -0.122987 -0.0255097 -0.0198047 0.101467 0.0484175 -0.121798 -0.0290672 -0.0331705 -0.0670876 0.113737 -0.0115719 0.128152 0.110029 -0.0335993 0.0772799 0.13401 0.0213531 0.00866382 -0.0634124 -0.245101 0.0246775 0.120409 0.0143833 0.0411396 -0.0440693 0.0376214 0.0900433 0.0488692 -0.0446983 0.027424 -0.0288779 -0.0990237 0.0472688 -0.0518564 0.0347285 0.145533 -0.196921 0.0527502 0.247654 0.0355417 -0.182287 0.0596269 0.0476924 -0.0661934 0.0135313 -0.0264948 0.142769 0.0367919 0.00201086 0.158061 0.0117274 -0.148202 -0.0622463 0.0565435 0.237859 -0.131532 0.138821 -0.101971 -0.0402029 -0.0130267 -0.115244 0.130069 -0.00446396 0.0784207 -0.0674286 -0.0325873 -0.00596682 0.0258917 -0.0990919 0.0633689 0.0468273 0.0350324 -0.0500995 0.128257 -0.0295898 -0.0192376 -0.0556438 -0.0286551 0.0383645 0.0214069 -4.11212e-05 0.0860792 0.0858835 -0.0845764 -0.0680128 -0.0442279 -0.0405568 -0.0660722 0.0181373 0.170089 0.0203528 -0.071106 0.0337204 0.0613805 -0.00159018 0.0606385 -0.144543 0.0601868 -0.0901195 0.0913084 -0.0185626 0.0220956 0.0728556 0.0996878 -0.0621745 -0.0494716 0.0235115 0.0461303 -0.116665 -0.161075 0.0138 0.154905 0.0850064 -0.0439939 0.0227087 -0.011273 -0.0852984 0.0832684 0.0329355 -0.0247345 
-0.00975718 0.0762047 -0.0809595 0.00563769 0.071232 0.179103 -0.029241 -0.129516 -0.145413 0.00998007 -0.0369785 0.0843295 0.0493889 -0.113748 -0.00106809 -0.0400166 -0.108099 0.0679627 0.0336512 0.146469 0.0431199 -0.0540587 0.0692733 0.126038 -0.00274228 0.065455 -0.0616806 -0.252041 -0.000974628 0.0925261 0.000899309 0.050818 -0.0321206 0.0175496 0.0867209 0.085019 -0.0234213 0.0495739 -0.0621999 -0.0888452 0.0494336 -0.0979106 0.0274169 0.144319 -0.179803 0.102705 0.276718 0.0376635 -0.198997 0.0528914 0.0449848 -0.0907433 0.0290777 -0.0188926 0.179221 0.0489812 -0.026968 0.128175 0.0515253 -0.148259 -0.0552912 0.0618414 0.205679 -0.109797 0.1579 -0.0772752 -0.014704 -0.0374998 -0.097275 0.100186 -0.0408008 0.0637898 -0.0492685 -0.00603642 0.0406565 0.0138986 -0.112305 0.0826022 0.0729869 0.043283 -0.0314519 0.093827 -0.0759819 -0.0387826 -0.0673267 -0.038226 0.0238377 0.00949679 0.00794514 0.0928872 0.0697175 -0.0529274 -0.0190883 -0.0670263 -0.0839515 -0.0391442 0.0428032 0.160446 0.0750316 -0.0887201 0.0129357 0.0713411 0.00334401 0.0102717 -0.148238 0.0625887 -0.0996975 0.0937409 -0.0364277 0.0435356 0.0717529 0.117181 -0.0480286 -0.106669 -0.00732205 0.0274929 -0.0964618 -0.187091 0.00505525 0.12742 0.095465 -0.0555379 0.0356092 0.00223762 -0.0859454 0.0973737 0.0317161 -0.018997 
0.0198145 0.0512318 -0.0621382 -0.00657388 0.0834816 0.163434 -0.0684531 -0.173644 -0.122848 -0.0741746 -0.104018 0.0467932 0.0117332 -0.0276671 0.0904762 -0.0678495 -0.0596547 -0.0149577 0.0909871 0.103962 -0.0254828 0.0298098 0.0632234 0.0860896 0.0251359 0.0613382 -0.0875029 -0.219173 -0.0733936 0.0842802 0.0413247 0.0964154 -0.0198123 0.0102799 0.102333 0.12951 0.0390056 -9.80034e-05 -0.0144239 -0.0708423 0.05933 -0.0517351 0.0522914 0.0435492 -0.124675 0.208477 0.246978 0.0389407 -0.141557 0.0549366 0.01123 -0.0729682 0.159124 -0.00480284 0.178793 0.0295838 0.00722328 0.116737 0.0538962 -0.129761 -0.04678 0.148733 0.103246 -0.129843 0.100262 -0.0122101 0.0391048 0.0147332 -0.0545765 0.0628409 -0.0154777 0.037797 -0.0699934 -0.019192 0.0739216 0.0542031 -0.132752 -0.0268516 0.0697678 0.0863042 0.0296085 0.1374 -0.0839362 -0.0405913 -0.00933971 -0.0200058 -0.00793703 -0.0328443 -0.0743631 0.107775 0.0940552 -0.0186845 0.0261703 -0.0400286 -0.088941 0.00558217 0.0665205 0.151 0.085333 -0.0946577 0.0120472 0.0601678 0.0238146 -0.00716137 -0.212607 0.0574232 -0.121043 0.0498574 -0.0895552 0.106611 0.132694 0.0577018 -0.0668137 -0.148492 -0.0509607 0.0360707 -0.120491 -0.202579 -0.0198182 0.0966686 0.146017 -0.0229167 0.0672874 -0.0057733 -0.0796781 0.0566633 0.0424287 -0.0167432 
0.0366712 0.0954817 -0.0272391 0.00520045 0.0434388 0.149392 -0.113144 -0.13906 -0.192357 -0.0675037 -0.091524 0.00262813 0.0203382 -0.00189374 0.0656137 -0.0118088 0.0126076 0.0180174 0.0895953 0.125967 0.00910097 0.0209745 0.122201 0.0918168 0.00655799 0.089334 -0.0840638 -0.190499 -0.00870007 0.0400721 0.0120444 0.121521 -0.0271314 0.0313439 0.0725392 0.120736 0.0355632 0.109242 0.00834317 -0.0516458 -0.0198591 -0.00542014 0.033796 -0.00909259 -0.100974 0.181396 0.267564 0.0195938 -0.170443 0.0839064 0.0558443 0.00626653 0.100982 0.0323875 0.145595 -0.0165043 0.125972 0.0819912 0.105266 -0.184102 -0.0355163 0.149497 0.0929043 -0.147897 0.0794909 -0.0202415 0.0582017 0.0154167 -0.05539 0.131212 -0.032885 0.0325642 -0.0607657 0.0562584 0.0725448 -0.0269556 -0.115969 0.0189758 0.0854668 0.0554394 0.0185856 0.159353 -0.0634659 -0.0805472 0.0198579 -0.0441878 -0.0443232 -0.00213898 -0.03428 0.0822829 0.0820745 -0.00259557 0.0411332 -0.0379728 -0.0216831 -0.0202963 0.103495 0.235269 0.0347769 -0.0939499 -0.012756 0.0966372 0.00693063 0.100571 -0.174187 0.0491248 -0.092718 0.0285604 0.0112192 0.02741 0.0772055 0.121722 -0.0536494 -0.0838734 -0.0158194 0.0178485 -0.0917412 -0.254752 -0.0111795 0.0706877 0.101471 0.0034637 0.105128 -0.0353417 -0.0751211 0.0404588 0.0748233 -0.0209969 
0.0754434 0.033588 -0.0107722 0.009427 0.0936283 0.207102 -0.0395397 -0.127425 -0.127107 -0.147343 -0.11145 0.0287854 -0.0064156 -0.0554613 0.0514485 -0.0406152 -0.0630656 0.00181614 -0.0303762 0.114484 0.0191028 0.0322173 0.141042 0.067031 -0.00531997 0.0513364 -0.121361 -0.207471 -0.0518356 -0.0208386 0.0556915 0.125318 -0.0934612 0.0786724 0.0752148 0.0946761 0.00992973 0.146149 -0.0231856 -0.0588517 0.0661039 0.00293484 -0.0198728 -0.00420302 -0.143755 0.113587 0.189672 0.03294 -0.130086 0.1238 0.00645943 -0.0350905 0.0826984 0.0380386 0.144519 -0.0490557 0.0927228 0.137756 0.0538821 -0.183838 -0.0644984 0.161475 0.129962 -0.161193 0.104075 -0.0199473 0.0612142 0.0324628 -0.0734559 0.164772 -0.0118191 0.0696464 -0.0123851 0.110389 0.0267758 -0.037229 -0.121501 -0.0434586 0.0696859 0.0566239 0.0237497 0.145726 -0.0393604 -0.101295 -0.00231875 -0.0819144 0.0126309 0.0506433 -0.0592304 0.0799484 0.153441 -0.0512255 0.0357485 -0.0718711 -0.0391398 -0.0169831 0.102422 0.172378 0.0271209 -0.0393634 -0.0150019 0.0682002 -0.0257721 0.114042 -0.144776 0.0212477 -0.104573 0.0493488 0.00280338 0.0355041 0.0978502 0.173214 -0.0617174 -0.02561 0.0212179 0.0235585 -0.105031 -0.190201 0.00650098 0.086188 0.103502 0.0336235 0.106522 -0.009828 -0.0302422 0.00457454 0.0556444 -0.0410554 
0.0669542 0.0304975 -0.0283655 0.0285908 0.0846926 0.192348 -0.0173139 -0.115424 -0.121235 -0.131149 -0.11032 0.0390968 -0.00916474 -0.0804724 0.0666853 -0.0499876 -0.0435118 0.00696288 0.00433143 0.118412 0.00819154 0.0206434 0.129381 0.108668 -0.000579064 0.0285514 -0.112762 -0.23673 -0.0522648 0.00246338 0.0701061 0.122924 -0.0680978 0.0729792 0.08686 0.0861397 0.0239024 0.117235 -0.046519 -0.0735309 0.0606303 -0.0114373 -0.00849823 0.0219681 -0.145563 0.122048 0.206969 0.0248851 -0.135396 0.121754 0.00856974 -0.063579 0.11461 0.00561274 0.148422 -0.0195199 0.0650225 0.143445 0.0611023 -0.172251 -0.0780068 0.149677 0.126233 -0.187509 0.11161 -0.0251459 0.0573713 -0.0158699 -0.105713 0.134731 -0.0343792 0.0543151 -0.0414652 0.0942689 0.01956 -0.033453 -0.102723 -0.0293398 0.0743859 0.0676742 -0.0013881 0.123879 -0.0760039 -0.113196 0.0140542 -0.0775246 -0.00806738 0.00909219 -0.0639902 0.0847537 0.151753 -0.0398794 0.0187837 -0.0814106 -0.014668 0.00742231 0.0986491 0.166324 0.0293107 -0.0461378 -0.0142156 0.0553359 -0.0165441 0.0914133 -0.164073 0.0212913 -0.088155 0.0327309 -0.00549507 0.0484351 0.0951955 0.163951 -0.0511883 -0.0770344 0.0132757 0.0266989 -0.0813687 -0.210795 0.0243652 0.113611 0.111896 0.0178484 0.0855938 0.0104754 -0.0437089 0.00996314 0.0593002 -0.0597937 
0.0856906 0.00175225 -0.0746628 -0.00823926 0.104034 0.180113 -0.00269463 -0.0952285 -0.100334 -0.150948 -0.0920824 0.0600271 0.0150115 -0.0954637 0.000298693 -0.0282428 -0.0908523 -0.0228353 -0.0650867 0.147561 0.0563801 -0.0140139 0.12823 0.0551545 -0.0138725 0.0630821 -0.0982083 -0.242897 -0.0530773 -0.00760377 0.0404428 0.114921 -0.0914368 0.0978739 0.0427969 0.062684 -0.0044593 0.179018 -0.0309962 -0.0703934 0.0710605 -0.0109178 -0.017825 0.0555675 -0.13857 0.0793373 0.18644 0.0229923 -0.127437 0.127926 -0.0275396 -0.0784056 0.0389296 0.0414173 0.16185 -0.0522849 0.0471358 0.162501 0.0188965 -0.185373 -0.0491397 0.0982896 0.185336 -0.135005 0.103328 -0.047203 0.0293985 0.0566076 -0.039738 0.114413 -0.0193794 0.0736462 -0.0211524 0.107303 0.0105618 -0.037088 -0.101153 -0.0241082 0.0524191 0.0670153 -0.0118017 0.118526 -0.0491354 -0.105534 -0.0449578 -0.0687517 0.0455724 0.0678213 -0.017462 0.0447677 0.157757 -0.0914888 -0.00909463 -0.082134 -0.0297048 -0.0147579 0.0852189 0.134523 0.0300454 -0.0412659 -0.0353316 0.0229425 -0.0305373 0.12503 -0.1566 0.0159875 -0.135258 0.0982449 -0.0175082 0.00262608 0.0968104 0.190012 -0.0934501 -0.0159425 0.0476488 0.0375752 -0.104445 -0.191515 0.0243116 0.101811 0.078468 0.0742222 0.109882 0.0341769 -0.0458014 -0.0203782 0.0298855 -0.0525184 
0.0714342 0.0474103 -0.018765 0.0171241 0.0692535 0.207281 -0.0109239 -0.116034 -0.0822854 -0.149528 -0.0954165 0.0343908 0.00527502 -0.10533 0.04385 -0.0316608 -0.0849592 -0.0158952 -0.0648356 0.11252 0.0398655 0.00775058 0.118731 0.0966502 -0.000747178 0.0303758 -0.119088 -0.236258 -0.0450744 -0.00261747 0.0860848 0.137699 -0.0902142 0.102696 0.0703485 0.0764896 0.0225838 0.151129 -0.0263773 -0.0620983 0.0712169 -0.046078 -0.0149149 0.0205606 -0.115765 0.0836376 0.18766 0.0295535 -0.144492 0.120171 -0.000159243 -0.060332 0.0819197 0.0218468 0.147348 -0.0274608 0.0422561 0.143492 0.036584 -0.189935 -0.0803159 0.119519 0.144196 -0.179797 0.101228 -0.0126852 0.0601762 0.00544771 -0.100287 0.136605 -0.0430019 0.0541616 -0.0468311 0.107477 0.0336008 -0.0543139 -0.0975886 -0.0348656 0.0633028 0.092735 0.00379803 0.115663 -0.0553552 -0.11565 -0.0139651 -0.0687309 0.0156448 0.0239953 -0.0554929 0.0852775 0.154457 -0.0882668 0.0107588 -0.0710872 -0.0383456 0.0104361 0.0813767 0.142392 0.0341242 -0.0330063 -0.0138529 0.0338109 -0.0463512 0.126391 -0.139253 0.0184901 -0.106183 0.0679134 -0.00437531 0.0164163 0.0767985 0.186316 -0.0870155 -0.0449068 0.0419842 0.0270867 -0.10651 -0.184092 0.0386407 0.118215 0.117938 0.0454165 0.0964232 0.0300164 -0.0229014 -0.00379029 0.0575367 -0.0590236 
0.01563 0.0736919 0.0808298 0.0628433 0.0556064 0.199088 -0.0702655 -0.164715 -0.0947062 -0.128639 -0.0938589 0.0168323 -0.0356268 -0.0445931 0.110394 -0.0383045 -0.033549 0.0338037 0.0217345 0.0551273 0.0024033 0.0485261 0.121095 0.126461 0.0456927 0.0173413 -0.123044 -0.175534 -0.0171375 -0.011047 0.118688 0.148801 -0.0485077 0.0586893 0.101091 0.116963 0.0499852 0.0678921 0.00363363 -0.0479941 0.0916782 -0.0315847 0.00513943 -0.0783878 -0.118222 0.101686 0.195986 0.00199711 -0.133478 0.0576294 0.0192471 -0.00484587 0.16142 0.0107419 0.112436 0.0129118 0.103945 0.0831837 0.0512223 -0.152741 -0.101761 0.173089 0.051991 -0.200088 0.104954 0.062897 0.0959621 -0.0491509 -0.135676 0.192834 -0.048109 0.0414749 -0.0679454 0.0905525 0.0914873 -0.0331197 -0.117141 -0.0435285 0.0545546 0.059679 0.00187018 0.173826 -0.0231709 -0.0813219 0.0497978 -0.0451729 -0.0253628 -9.61948e-05 -0.136546 0.102876 0.139496 -0.00842427 0.0654648 -0.0347621 -0.0322339 -0.00542305 0.0591849 0.196731 0.0445996 -0.0429523 -0.00738739 0.0333513 -0.0261772 0.0907732 -0.0884533 0.0512949 -0.0225719 -0.00170786 0.0183641 0.0370772 0.0287201 0.12523 -0.0327574 -0.0962033 0.0243044 -0.00413408 -0.102251 -0.187292 0.0319559 0.112074 0.163847 -0.00693716 0.0518703 -0.0377406 -0.031789 0.071469 0.0896379 -0.00523066 
0.0307928 0.0516489 0.0459714 0.0727402 0.073286 0.189692 -0.0595248 -0.209448 -0.0972909 -0.132466 -0.0948818 0.0384202 -0.032505 -0.0138361 0.0944918 -0.0347612 -0.0329339 0.0309521 0.0346149 0.0719174 -0.0162475 0.053425 0.106434 0.12709 0.0408086 0.0280982 -0.127411 -0.17101 -0.0463107 0.0222301 0.0882344 0.161423 -0.0593791 0.0422763 0.100179 0.132582 0.0370487 0.0411274 -0.0012142 -0.0523852 0.0821499 -0.0116166 0.019931 -0.0748976 -0.116694 0.130283 0.201075 0.0158016 -0.114907 0.0618042 0.0229755 -0.0230641 0.171486 0.00861667 0.141424 0.00773096 0.0807033 0.104606 0.0582298 -0.128286 -0.0892033 0.193495 0.0652334 -0.189823 0.100242 0.0619262 0.0866447 -0.0297796 -0.123543 0.175991 -0.0277199 0.0572474 -0.0499442 0.0838138 0.0796034 -0.00327799 -0.111376 -0.0637089 0.0476043 0.0481448 0.0440191 0.182073 -0.0461036 -0.0907485 0.0299929 -0.0414686 -0.0301522 -0.0127534 -0.147424 0.107825 0.138918 0.000528041 0.0678212 -0.0330144 -0.0437664 0.00977094 0.0612983 0.17885 0.0739374 -0.0524528 0.00647748 0.0367772 -0.0109331 0.0610234 -0.121208 0.0557514 -0.045624 -0.00355686 -0.0139088 0.0710945 0.0598681 0.112917 -0.0180476 -0.106822 -0.00420853 0.0122698 -0.104369 -0.165024 0.00132719 0.0993185 0.151727 -0.0102228 0.0663385 -0.0391219 -0.0564422 0.0864962 0.0704822 -0.0126833 
0.047008 0.0255809 0.0051306 0.0438571 0.118555 0.189168 -0.01379 -0.163607 -0.124847 -0.133568 -0.0939279 0.0521158 -0.0146962 -0.0455684 0.0431086 -0.0156175 -0.0480511 0.0496356 -0.00358667 0.108977 0.0440718 0.0158616 0.131151 0.0849287 0.0180009 0.052242 -0.147381 -0.213991 -0.00337911 0.0133404 0.0722372 0.157561 -0.0843645 0.0543216 0.101851 0.0980384 -0.00200353 0.123518 -0.00322099 -0.0854679 0.0701702 0.0194648 -0.00723566 -0.0204073 -0.145051 0.106895 0.199879 0.0103753 -0.133896 0.0662192 -0.0285443 -0.0350338 0.108268 0.00624704 0.133444 -0.0163236 0.0989677 0.153018 0.0213411 -0.141164 -0.0742799 0.159643 0.147325 -0.175134 0.140136 0.0153185 0.0458734 0.000387742 -0.0998127 0.175791 -0.0155292 0.0816442 -0.0374317 0.104011 0.0168629 -0.0271472 -0.104566 -0.0358559 0.0511163 0.0172574 0.000768561 0.169226 -0.0528881 -0.0986595 -0.00095906 -0.0766106 0.000371058 0.0459648 -0.0919785 0.0698372 0.180817 -0.0110314 0.02971 -0.0542001 -0.00289241 -0.0137967 0.0756714 0.201244 0.0432583 -0.0273186 -0.0128235 0.0307933 -0.0311927 0.0919838 -0.126981 0.0496515 -0.0440326 0.0335864 0.0441497 0.0355736 0.0468962 0.149756 -0.0516628 -0.0604083 0.0524994 0.0290026 -0.0998814 -0.185547 0.0148456 0.11004 0.102861 0.0229488 0.0731307 -0.0156244 -0.0740323 0.0618079 0.0514881 -0.0352118 
-0.000983138 0.0202966 -0.0415637 0.0314964 0.0888402 0.133474 -0.0712071 -0.202041 -0.106179 -0.107679 -0.0957066 0.0682283 -0.00207342 0.026256 0.0771494 -0.034912 -0.0360484 -0.0193687 0.103406 0.103411 -0.0134966 -0.000131127 0.110874 0.0830705 0.044151 0.0819813 -0.0874908 -0.213338 -0.0535623 0.0641787 0.0779461 0.141472 0.00758256 0.0119843 0.080079 0.153623 0.0241761 0.0592101 -0.0217933 -0.0809962 0.0516294 -0.0124142 0.0396387 0.00135102 -0.126653 0.186422 0.23333 0.00854119 -0.122079 0.0268164 -0.0322296 -0.0636079 0.172828 -0.0148489 0.183314 0.04116 0.0276281 0.154176 0.0307564 -0.102402 -0.0770665 0.144831 0.118343 -0.160843 0.149489 0.0414885 0.0299665 0.015137 -0.0818522 0.126748 -0.0257354 0.0534697 -0.0882803 0.022105 0.0750121 0.0314614 -0.0958836 -0.0443867 0.039793 0.043556 -0.00967157 0.137337 -0.0911028 -0.0749531 -0.0188918 -0.0614581 -0.0140653 -0.00831136 -0.0974739 0.082063 0.122132 0.0035459 0.0414146 -0.034793 -0.0151142 0.0209892 0.0572727 0.18016 0.0967782 -0.0647495 -0.0209123 0.0195064 0.00098152 -0.00211975 -0.184714 0.0809032 -0.0852357 0.00736272 -0.0251001 0.0536581 0.0688331 0.0851754 -0.051536 -0.142763 0.00950257 0.0335762 -0.0831322 -0.208693 0.0191536 0.135368 0.141579 0.00091497 0.0521558 -0.00619596 -0.0913525 0.0895699 0.0650223 -0.000593215 
0.0395338 0.00623846 -0.055823 0.0360312 0.118084 0.150233 -0.0137098 -0.194148 -0.116286 -0.11434 -0.0879783 0.083498 0.00458113 -0.0155486 0.0190805 -0.0182722 -0.053235 0.0297881 0.0424876 0.134236 0.0446049 -0.00515817 0.114166 0.0921139 0.011534 0.0757652 -0.115718 -0.22817 -0.0230785 0.0803022 0.0335699 0.134382 -0.0452794 0.0256809 0.103756 0.106913 0.00201784 0.109864 -0.0164982 -0.1111 0.0354114 0.0218481 0.0297222 0.0281191 -0.151094 0.132574 0.23175 0.0223757 -0.117524 0.0637549 -0.0252181 -0.0633944 0.118719 0.00621777 0.202083 -0.00310663 0.0599433 0.168291 0.0115004 -0.137093 -0.0582548 0.129247 0.179625 -0.1451 0.142246 0.000119903 0.0120167 0.0119845 -0.0807706 0.129392 -0.00891678 0.0765228 -0.0519169 0.062096 0.0155068 0.00697127 -0.0926699 -0.0304995 0.0601669 0.0221471 0.0179036 0.158299 -0.0811577 -0.0916418 -0.0164907 -0.083013 -0.00891179 0.040792 -0.0544941 0.0795773 0.152443 -0.0126464 0.0141566 -0.05361 -0.016972 -0.016393 0.0663905 0.192349 0.080004 -0.0529676 0.00605499 0.0346982 -0.00336277 0.0333547 -0.177864 0.0610754 -0.0724225 0.0274964 0.0159131 0.0566273 0.0779227 0.125059 -0.0553123 -0.0897995 0.0304146 0.0573126 -0.0790453 -0.187754 -0.00989721 0.115453 0.0930647 0.015365 0.0766388 -0.0163348 -0.109366 0.0836226 0.0554926 -0.0268511 
0.0492216 0.0108216 -0.0492075 0.0309588 0.110129 0.174211 -0.0340979 -0.180001 -0.12684 -0.10504 -0.0582701 0.070587 0.00908483 -0.0272474 0.0168635 -0.00976285 -0.0488694 0.0607666 0.0405304 0.133603 0.0633089 0.00230282 0.125429 0.0896946 0.0128957 0.0790725 -0.102537 -0.231973 -0.00153419 0.0633395 0.0382855 0.117138 -0.0437474 0.0270139 0.117672 0.104991 -0.00346581 0.121496 0.0027172 -0.114799 0.0241094 0.0235746 0.0102977 0.0328173 -0.161688 0.0987572 0.232073 0.0236105 -0.139363 0.064411 -0.0274628 -0.0508151 0.107542 0.013446 0.170566 -0.0106559 0.0822146 0.156605 0.00353862 -0.156628 -0.0658341 0.122477 0.203985 -0.149295 0.142889 0.00340512 0.0144424 0.0139872 -0.0813849 0.143371 -0.00763164 0.0718371 -0.052589 0.0515393 0.0128491 -0.0207805 -0.104087 -0.0221806 0.061665 0.0232874 0.00965588 0.166538 -0.0696753 -0.0984851 -0.0134198 -0.0764475 -0.0130119 0.0495028 -0.0428679 0.0745678 0.165653 -0.0108724 0.00719268 -0.0395998 -0.00952348 -0.0383387 0.0589979 0.214957 0.0562932 -0.0557404 0.007827 0.036524 -0.0136911 0.0340733 -0.151539 0.0726358 -0.0450595 0.0179952 0.0371264 0.0401834 0.0616818 0.13291 -0.0400062 -0.0732205 0.0485651 0.0498479 -0.0928561 -0.189438 -0.00453496 0.106577 0.0868915 -0.00533496 0.0823449 -0.0264809 -0.0984093 0.0848791 0.0728566 -0.0141369 
0.000993284 0.00115499 -0.0159871 0.0503737 0.0927095 0.127364 -0.0615003 -0.195485 -0.109046 -0.103618 -0.085898 0.0789638 -0.00400015 0.0187006 0.0799113 -0.0355944 -0.0309552 -0.00579881 0.0968438 0.113862 -9.07489e-05 -0.00753498 0.10098 0.104569 0.0489046 0.0922781 -0.0968942 -0.222923 -0.0520268 0.0585073 0.0775168 0.134894 -0.00203833 0.0193462 0.0857051 0.154176 0.0223839 0.0745318 -0.0257443 -0.0963322 0.0642118 -0.000594535 0.038134 0.0051364 -0.134434 0.160779 0.234924 0.000300998 -0.111897 0.0179456 -0.0234836 -0.078572 0.159149 -0.0136608 0.207282 0.0381713 0.0195836 0.154677 0.0352525 -0.113728 -0.0742323 0.126315 0.114326 -0.155164 0.159345 0.0396 0.0333285 0.00617285 -0.0744179 0.130286 -0.0212247 0.0670992 -0.0759647 0.0256202 0.0690143 0.0199871 -0.100617 -0.0169558 0.0503861 0.0410007 -0.0155161 0.150069 -0.0788885 -0.0849625 -0.0125711 -0.0780373 0.00301224 0.0152347 -0.0904436 0.0741609 0.122251 0.00903347 0.0459476 -0.0433534 -0.0297093 0.00951682 0.0593376 0.170871 0.0957811 -0.0680917 -0.0262734 0.0220731 0.00511772 -0.00573007 -0.175579 0.0783013 -0.0772834 -0.0013328 -0.00894067 0.0488438 0.054846 0.0973161 -0.0573239 -0.139055 0.0266812 0.03097 -0.0839951 -0.221071 -0.00270123 0.124421 0.131613 0.0147346 0.047442 -0.00534483 -0.0901158 0.0993044 0.0718411 0.00116305 
7.80103e-05 0.00115569 -0.0262137 0.0493453 0.0875271 0.128494 -0.0627542 -0.200006 -0.114191 -0.0978399 -0.0834901 0.0808418 0.000801918 0.0207355 0.0717661 -0.0311261 -0.0320485 -0.00349989 0.101674 0.117488 -0.00170654 -0.0145375 0.102986 0.10756 0.0459616 0.0968641 -0.0930476 -0.226307 -0.0517112 0.0621618 0.0728498 0.134108 -0.00316349 0.014788 0.081306 0.152782 0.0145456 0.0778807 -0.0239283 -0.091791 0.0528375 -0.000273048 0.0351205 0.00669062 -0.130521 0.156407 0.237877 0.000418044 -0.115286 0.0195751 -0.0213806 -0.0833917 0.16005 -0.0148522 0.2025 0.0397365 0.0216696 0.162891 0.0378604 -0.114486 -0.071805 0.12985 0.125094 -0.15699 0.158908 0.0425605 0.0308288 0.00718917 -0.0782177 0.124133 -0.0232695 0.0682014 -0.0767739 0.0283966 0.0670622 0.0185382 -0.0965971 -0.0215727 0.0516863 0.0398147 -0.0154901 0.144443 -0.0852887 -0.090109 -0.0193872 -0.0775714 -0.00128581 0.0101222 -0.0846955 0.0680798 0.117615 0.00937101 0.0502864 -0.0387903 -0.022985 0.0129831 0.0583992 0.173731 0.0983674 -0.0652111 -0.0256291 0.0197779 0.00106921 -0.00336611 -0.177295 0.0806676 -0.0780242 -0.00344302 -0.0137207 0.0474341 0.05605 0.101955 -0.0478609 -0.1395 0.0233728 0.0349751 -0.0857904 -0.213388 -0.00197443 0.122873 0.124907 0.00651593 0.047833 -0.00984656 -0.0977152 0.104706 0.0621749 -0.0011849 
0.0261368 0.0283952 -0.0279401 0.0341285 0.116606 0.168377 -0.0267028 -0.194048 -0.12659 -0.0780619 -0.0764531 0.0761376 -0.00741475 -0.0313935 0.0448897 -0.0138203 -0.0560124 0.0609854 0.0632676 0.121854 0.0359974 0.00810757 0.118583 0.0891858 0.0192541 0.0738302 -0.117283 -0.213596 0.00732513 0.0711444 0.0436982 0.121173 -0.0374331 0.0131569 0.128324 0.112276 0.00222219 0.0850542 0.00586818 -0.112784 0.0335333 0.00966482 0.031252 0.0175316 -0.169701 0.117351 0.23285 0.0308866 -0.13029 0.0636242 -0.01635 -0.0390675 0.110002 -0.00175223 0.181554 0.0024502 0.0725121 0.149604 -0.00756224 -0.123736 -0.0740676 0.126831 0.1861 -0.154722 0.156403 0.00854319 0.00267395 -0.00761009 -0.108472 0.156139 -0.00927373 0.087324 -0.0622048 0.0655227 0.0194433 -0.00461523 -0.0955508 -0.0182059 0.0704938 0.00805728 0.0168252 0.164344 -0.0659568 -0.0691606 -0.0023496 -0.0888897 -0.023547 0.0498687 -0.0465764 0.0974207 0.153934 0.00808056 0.0127896 -0.0335934 -0.00838882 -0.0363332 0.0598789 0.213589 0.0646901 -0.0586191 0.0131723 0.037581 -0.0134854 0.00780086 -0.150092 0.0794998 -0.0333359 0.00501448 0.0501886 0.065595 0.0599811 0.117534 -0.0281773 -0.0861824 0.0439212 0.0407401 -0.0643757 -0.175856 -0.00509902 0.12539 0.111827 -0.0191516 0.0760501 -0.0325157 -0.109569 0.100916 0.0825301 -0.0107815 
0.0654928 -0.00154899 -0.0281648 0.00772341 0.0984384 0.195511 0.00576358 -0.144366 -0.114575 -0.120977 -0.0953514 0.0878126 0.00249997 -0.0858039 0.0373117 -0.0327077 -0.118163 -0.00600718 0.00816894 0.11141 0.0541419 0.0149597 0.0891276 0.10701 0.0110448 0.0651758 -0.10037 -0.246112 -0.0432235 0.0621981 0.0204669 0.101137 -0.0802874 0.07268 0.0832842 0.0696183 -0.00436725 0.0757587 -0.00496779 -0.0848898 0.0672879 -0.042094 0.0312662 0.0339179 -0.136511 0.0978155 0.217832 0.0180808 -0.148308 0.0976106 0.00640093 -0.0860128 0.107307 0.0236811 0.207924 -0.00663738 0.0371151 0.174521 -0.0110122 -0.145596 -0.0416529 0.126195 0.179543 -0.133599 0.11682 0.000511478 0.0100516 0.0172508 -0.0833165 0.112084 -0.0418913 0.0858562 -0.070779 0.0721782 0.0325457 0.00647607 -0.0884839 -0.0501964 0.0778372 0.0839798 0.0296922 0.12546 -0.0463399 -0.0896398 -0.0344607 -0.0771498 0.0272249 0.0371373 -0.0509565 0.103436 0.156459 -0.0535374 -0.00929656 -0.0239148 -0.0777926 0.0105439 0.0627778 0.145516 0.0898663 -0.0486606 0.0186367 0.0199861 -0.0314435 0.0492765 -0.169645 0.0393083 -0.111041 0.0632026 -0.0489291 0.0329705 0.112926 0.145556 -0.066454 -0.0984346 0.0462217 0.0705739 -0.0964373 -0.146903 -0.009582 0.132898 0.121968 0.00313062 0.0929014 -0.0173245 -0.0835316 0.0689264 0.0578729 -0.0398967 
0.0368061 -0.00182044 -0.0229731 0.0212658 0.1054 0.163003 -0.027516 -0.17282 -0.0998043 -0.115357 -0.0868141 0.0878561 0.003864 -0.0298925 0.0693889 -0.0331574 -0.0744742 -0.00920425 0.0433183 0.111946 0.031923 0.0134182 0.102357 0.111297 0.0315758 0.0750259 -0.0874303 -0.240127 -0.0471053 0.0708707 0.0553516 0.119346 -0.0309569 0.0595683 0.0873752 0.116488 0.0187035 0.0815018 -0.019495 -0.0952124 0.067529 -0.0291684 0.0361118 0.0296358 -0.145459 0.134382 0.220694 0.0157234 -0.128803 0.0578486 -0.00693832 -0.0824964 0.132371 0.00266798 0.216805 0.0223793 0.0148908 0.170836 0.00327339 -0.125802 -0.06785 0.107658 0.149678 -0.14991 0.147228 0.010519 0.0140595 0.0192531 -0.0842669 0.13321 -0.0346261 0.0728 -0.0857082 0.0328389 0.0495259 0.0145706 -0.0912108 -0.0288081 0.0617765 0.0675953 0.00613594 0.135774 -0.0627852 -0.086556 -0.0288576 -0.0902237 0.0202933 0.0257462 -0.0719063 0.106165 0.142301 -0.0362312 0.00629032 -0.033044 -0.0582117 0.0137319 0.0531568 0.152036 0.101267 -0.0636392 0.00338467 0.0223369 -0.017384 0.0208526 -0.172093 0.0507236 -0.104552 0.0264388 -0.0231031 0.0359765 0.0828124 0.125761 -0.0738934 -0.111791 0.0447568 0.0539453 -0.0885963 -0.193709 -0.00430438 0.145178 0.141982 0.0148884 0.0667619 0.00320494 -0.078526 0.0795043 0.0735739 -0.0221119 
0.0390411 0.0210674 0.0117924 0.051645 0.118355 0.200329 -0.0193002 -0.195797 -0.111509 -0.10852 -0.0708891 0.07079 -0.0221996 -0.0521547 0.0591479 -0.0241791 -0.081028 0.0690847 0.037502 0.0978405 0.0558234 0.0243902 0.106847 0.109746 0.0415996 0.0356652 -0.133918 -0.214623 -0.0106256 0.0700676 0.0581918 0.105601 -0.0627366 0.0281038 0.141404 0.110343 -0.0137342 0.0440692 0.00779337 -0.112942 0.0509665 -0.00363832 0.0245931 0.00493119 -0.157854 0.100627 0.212756 0.0276795 -0.133001 0.0694205 -0.00473982 -0.0427002 0.127295 -0.00681189 0.174035 0.00280135 0.0580224 0.147784 -0.0146913 -0.120089 -0.07082 0.146939 0.169856 -0.158773 0.147192 0.0184791 0.0127536 -0.018176 -0.125236 0.17016 -0.00439378 0.094265 -0.0591073 0.0523443 0.0121643 -0.00305212 -0.0985886 -0.0467863 0.0698545 0.0431359 0.0291618 0.159046 -0.0510435 -0.0760389 -0.00735887 -0.0780673 -0.0179926 0.0368424 -0.0775562 0.116597 0.167824 -0.00219571 0.00930712 -0.0197919 -0.0423555 -0.0244512 0.0436381 0.188513 0.0658013 -0.0484739 0.0334582 0.0383328 -0.0254774 -0.00398375 -0.130751 0.0788082 -0.0240874 0.00487216 0.0325379 0.0715428 0.0685723 0.108871 -0.0308154 -0.0931827 0.0535912 0.0527036 -0.0814801 -0.138319 -0.00542818 0.131255 0.119612 -0.0279409 0.0640886 -0.0379425 -0.0847724 0.113595 0.0990732 -0.0158254 
0.0463829 0.00356064 -0.00250342 0.0484785 0.126527 0.189487 -0.0182763 -0.186322 -0.117006 -0.120503 -0.0781196 0.0776399 -0.0137553 -0.042509 0.0427985 -0.0142345 -0.0717372 0.0652722 0.0254538 0.114759 0.0666586 0.0132315 0.120005 0.106167 0.0315701 0.0451907 -0.133187 -0.228516 -0.0181392 0.064971 0.0529288 0.117795 -0.0651488 0.0372306 0.126848 0.107981 -0.0161031 0.0772663 0.000158316 -0.110569 0.0441486 0.0156554 0.0184654 0.00601494 -0.153049 0.0992835 0.216257 0.0193301 -0.127333 0.0754314 -0.0121589 -0.0575057 0.116686 0.001584 0.177865 -0.0053743 0.070979 0.156622 -0.00609126 -0.12783 -0.0622101 0.144374 0.171055 -0.158373 0.148304 0.00423046 0.0106251 -0.000112782 -0.109626 0.165972 -0.00344323 0.0954672 -0.0536819 0.0564144 0.0035852 -0.00456745 -0.0958957 -0.0411994 0.0656326 0.0368557 0.0200753 0.161172 -0.0601279 -0.0866821 -0.0177443 -0.0796365 -0.00960383 0.0472532 -0.0724929 0.096049 0.169027 -0.0061631 0.00977523 -0.0282382 -0.0308731 -0.0150636 0.0481823 0.193462 0.0619277 -0.0407258 0.0215548 0.028846 -0.0304244 0.0204885 -0.133749 0.0681928 -0.0431911 0.00993971 0.0304122 0.0581031 0.0590708 0.124281 -0.0370796 -0.0832939 0.0556304 0.0597856 -0.084393 -0.154279 -0.0110282 0.128948 0.104602 -0.00280427 0.0700572 -0.0311613 -0.0919325 0.100605 0.08089 -0.0241257 
0.013087 0.0151946 -0.0087843 0.0644448 0.0982461 0.149896 -0.0479571 -0.214069 -0.109933 -0.107764 -0.0872065 0.0812746 -0.00681837 -0.00771638 0.063184 -0.0206671 -0.0501361 0.0104727 0.0768525 0.109337 0.0198228 -0.00506481 0.0947171 0.0991632 0.0506748 0.073542 -0.124246 -0.220942 -0.0442665 0.080925 0.0636005 0.157894 -0.020757 0.0264359 0.0995238 0.135043 0.0153867 0.0526688 0.000806294 -0.108872 0.0610937 -0.021191 0.0525053 -0.0199036 -0.124777 0.152917 0.231836 0.00646533 -0.1262 0.0270645 -0.00638563 -0.0605727 0.170265 -0.00606869 0.203159 0.0240253 0.0397912 0.132065 0.0148328 -0.110396 -0.0680033 0.14414 0.116634 -0.159528 0.14844 0.0518703 0.0216484 -0.000911161 -0.100191 0.126515 -0.0272562 0.0684897 -0.0826042 0.0329438 0.0604074 0.027765 -0.0902996 -0.0476943 0.0533976 0.0587397 0.00834637 0.147814 -0.067294 -0.07462 -0.0127959 -0.0633032 -0.0102568 0.011409 -0.096778 0.0976198 0.129671 0.00335798 0.0350607 -0.0131311 -0.0551095 0.0110052 0.0523964 0.17776 0.096874 -0.064861 0.0125476 0.022512 -0.00842658 0.00737334 -0.153943 0.0787346 -0.0600831 0.0210464 -0.00631103 0.0620187 0.0509436 0.0911643 -0.0578618 -0.136338 0.0297554 0.0393795 -0.0969334 -0.175963 -0.003065 0.133581 0.131989 -0.0016648 0.0601291 -0.026965 -0.0854122 0.115023 0.0840667 -0.00877894 
0.0163663 0.0200455 -0.0177376 0.0469852 0.0937124 0.146751 -0.0588407 -0.199031 -0.116101 -0.111648 -0.0948756 0.0753141 -0.00160624 -0.00871657 0.0606896 -0.0200384 -0.0526674 -0.00393554 0.0732957 0.119597 0.0197857 -0.00552778 0.107049 0.0920992 0.0397899 0.0788888 -0.111663 -0.223702 -0.0498796 0.0732435 0.0572724 0.148827 -0.0141967 0.0397375 0.0915548 0.134392 0.0278294 0.072962 -0.00138953 -0.103521 0.0508775 -0.0244777 0.0549589 -0.0164386 -0.123046 0.158309 0.239783 0.00921981 -0.132381 0.0504223 -0.00915907 -0.0630478 0.159197 0.00775784 0.208545 0.0185082 0.0472041 0.129025 0.0158748 -0.124155 -0.0634062 0.139475 0.120532 -0.160205 0.143832 0.0383027 0.0183056 0.0110326 -0.0910447 0.126026 -0.0327004 0.0598944 -0.0878583 0.0370363 0.0665725 0.0227134 -0.0866039 -0.0409023 0.0602497 0.0603857 0.0027817 0.142381 -0.0691528 -0.0732078 -0.018415 -0.0632216 -0.0115546 0.0177225 -0.0791711 0.0991819 0.12969 -0.010054 0.0349228 -0.0183863 -0.0503244 0.0131231 0.0562191 0.186103 0.0912487 -0.0683439 0.00359566 0.0242935 -0.0156226 0.0218214 -0.156637 0.0730467 -0.078766 0.0253324 -0.0133883 0.0508003 0.0541212 0.102065 -0.0625598 -0.122925 0.0274488 0.0412615 -0.0884777 -0.190503 -8.98874e-05 0.136644 0.133405 0.0081648 0.0728286 -0.0198824 -0.085066 0.0964197 0.0863561 -0.0120302 
0.0164901 0.0232378 -0.0215548 0.0621763 0.0938587 0.149172 -0.0552082 -0.212872 -0.106163 -0.111484 -0.088352 0.0750695 -0.0049759 -0.00619122 0.0549137 -0.0146308 -0.0456917 0.00721247 0.0714971 0.112475 0.0215909 -0.00830306 0.104543 0.0919797 0.0459837 0.0725288 -0.119886 -0.221706 -0.046407 0.0790586 0.0654742 0.165093 -0.0153963 0.0320078 0.095419 0.135087 0.0223744 0.0667917 0.00134462 -0.107951 0.0507726 -0.0204194 0.0513092 -0.0213062 -0.120342 0.154476 0.234477 0.00757451 -0.128683 0.0383465 -0.0084972 -0.0534106 0.167584 0.000452736 0.199684 0.0204183 0.0497094 0.127144 0.0175956 -0.12015 -0.0694885 0.142506 0.121042 -0.165579 0.144206 0.0476319 0.0213195 0.00598908 -0.0990781 0.133039 -0.0298208 0.0600081 -0.0870672 0.0364705 0.0599561 0.0213568 -0.0862896 -0.048171 0.0484145 0.0558028 0.003911 0.147822 -0.0728768 -0.0784051 -0.0137198 -0.0591707 -0.0188949 0.00926958 -0.0901489 0.0964136 0.130018 -0.00499219 0.0326972 -0.0181547 -0.0423127 0.0131303 0.0534317 0.186135 0.0916331 -0.0633766 0.00971663 0.0224669 -0.012537 0.0201229 -0.152023 0.0763753 -0.0648886 0.022195 -0.00527923 0.055862 0.0461505 0.0966211 -0.0581658 -0.128313 0.0320735 0.0366176 -0.0915421 -0.184303 0.00785393 0.135959 0.133151 0.00460983 0.0696636 -0.0233066 -0.0814558 0.102731 0.0890567 -0.00908654 
0.0144255 0.024276 -0.00928677 0.0543917 0.0918594 0.138251 -0.0588748 -0.206373 -0.108116 -0.115352 -0.093995 0.0761224 -0.00851827 0.00680204 0.0688182 -0.0254523 -0.0337371 -0.00887958 0.0783944 0.112613 0.00470415 -0.00152385 0.101467 0.107106 0.0479459 0.0699602 -0.103992 -0.205968 -0.0488748 0.0726414 0.0657849 0.153214 -0.00507274 0.0384003 0.0826812 0.138974 0.0299573 0.061328 -0.0110288 -0.0994276 0.0542876 -0.0227826 0.055505 -0.0269032 -0.114859 0.170049 0.232425 0.00624801 -0.130132 0.0420466 -0.00800463 -0.0561105 0.171397 -0.00516441 0.205067 0.0289338 0.0324645 0.138628 0.0205744 -0.11182 -0.0688073 0.147189 0.107195 -0.166713 0.141636 0.0521107 0.0227072 0.00401411 -0.106721 0.132988 -0.0343099 0.0511059 -0.0928485 0.0370443 0.0737586 0.0290732 -0.0749767 -0.0422144 0.0534745 0.0519357 -0.00135919 0.143019 -0.0750761 -0.0797899 -0.00715951 -0.0679894 -0.0194068 0.00427119 -0.0954171 0.10627 0.128295 -0.00734114 0.0412893 -0.0138181 -0.0354922 0.0248108 0.0553253 0.173958 0.0991743 -0.0686991 -0.00131044 0.0236134 -0.0154659 0.0186943 -0.165684 0.0783062 -0.0755837 0.0109168 -0.0158144 0.0457139 0.0577776 0.0991781 -0.0534286 -0.126971 0.0246481 0.0323049 -0.0870622 -0.190714 0.00759661 0.14357 0.136988 0.00900348 0.0592693 -0.0168933 -0.0816057 0.103924 0.08638 -0.0212193 
0.0533181 0.00777681 -0.0156196 0.0344265 0.118139 0.198927 -0.00665784 -0.162695 -0.127757 -0.126505 -0.0625901 0.0829887 0.000549714 -0.0549731 0.00592427 -0.0089783 -0.0776795 0.0641483 0.00419745 0.123865 0.0887384 -0.00657545 0.115429 0.101264 0.018541 0.0623989 -0.125165 -0.230187 0.0101937 0.0512288 0.0455939 0.120993 -0.0856547 0.0478101 0.101273 0.08639 -0.0318692 0.114716 0.0134036 -0.0946408 0.0474303 0.0129103 -0.000529401 0.0137498 -0.146723 0.0639759 0.216336 0.00383827 -0.144276 0.0697515 -0.0278279 -0.0488693 0.0853656 0.0122234 0.155897 -0.00702267 0.0784311 0.183493 -0.0199747 -0.142545 -0.0597366 0.133461 0.210938 -0.160061 0.141888 0.00847299 0.0196558 -0.00160239 -0.102365 0.162531 -0.0137192 0.0949622 -0.0516186 0.088512 0.00626912 -0.0255064 -0.0855916 -0.0354879 0.0613447 0.0313382 -0.0055199 0.156786 -0.0450108 -0.0961517 -0.0292865 -0.0797381 0.0111013 0.0594085 -0.0545775 0.0658858 0.181335 -0.0308586 0.0112753 -0.0250377 -0.0102532 -0.032316 0.0562208 0.19717 0.0532745 -0.0261488 -0.00357814 0.0231969 -0.0485491 0.0742763 -0.124671 0.0750736 -0.0412227 0.0372955 0.0299023 0.0164356 0.0461569 0.144437 -0.052051 -0.0536462 0.071267 0.0570101 -0.08973 -0.158268 0.0118743 0.126588 0.0820671 0.00210911 0.068431 -0.0320233 -0.097002 0.095736 0.0571138 -0.0274492 
0.0598015 0.0142632 -0.0180672 0.03464 0.126953 0.195994 -0.00313802 -0.175915 -0.123529 -0.121919 -0.0721109 0.0852767 -0.00173379 -0.0508396 0.0129612 -0.00951934 -0.0682493 0.0685648 4.71364e-05 0.121412 0.0798663 0.0101951 0.114862 0.112226 0.0163411 0.0501853 -0.126016 -0.223532 0.0016499 0.0668733 0.0350696 0.120069 -0.0838514 0.0468848 0.110715 0.0842944 -0.021728 0.10307 0.00484256 -0.097306 0.0408529 0.0188628 0.0136805 0.0148509 -0.150684 0.0827124 0.216436 0.0156805 -0.137879 0.0813842 -0.00451112 -0.0491644 0.0885306 0.0106175 0.17107 -0.0126323 0.0774134 0.179221 -0.00872063 -0.140088 -0.0579707 0.13597 0.196012 -0.15921 0.138301 -0.00844283 0.0122332 0.00418177 -0.110333 0.163104 -0.00476703 0.0945363 -0.0484473 0.077834 0.000748552 -0.0103045 -0.0886615 -0.0327592 0.0646809 0.0278601 0.0175282 0.163918 -0.048242 -0.0909514 -0.0226824 -0.0835916 0.00215182 0.0520316 -0.0606885 0.0857388 0.167334 -0.031525 0.00554797 -0.0292627 -0.0194925 -0.0258401 0.0573916 0.192685 0.0583087 -0.0340271 0.0139656 0.0350511 -0.0395089 0.0687683 -0.139217 0.0606095 -0.0540315 0.0302942 0.0264623 0.0344632 0.0634968 0.140561 -0.0447366 -0.0536752 0.056191 0.0607752 -0.0933409 -0.153714 -0.00733062 0.125832 0.0883665 0.00443613 0.0726105 -0.0332344 -0.0956221 0.0936893 0.057255 -0.0377595 
0.0481273 0.0202069 -0.00413849 0.0372629 0.134029 0.191952 -0.00921629 -0.164812 -0.13822 -0.111298 -0.0691887 0.0729655 -0.00491227 -0.0508143 0.0199454 0.00578271 -0.0511303 0.0792638 0.0057078 0.118297 0.0793835 0.00871119 0.12071 0.0904251 0.0162915 0.0633371 -0.140714 -0.219385 0.0284178 0.0418882 0.0476577 0.143181 -0.0821421 0.0437966 0.109379 0.092831 -0.0183863 0.108786 0.0186935 -0.0980645 0.0543167 0.0238449 0.00954681 -0.00329542 -0.149566 0.0847192 0.215324 0.00913844 -0.147238 0.055538 -0.0289618 -0.038376 0.0817653 0.00754539 0.142536 -0.00909917 0.0966785 0.164941 -0.0119787 -0.127087 -0.0657639 0.139633 0.189946 -0.165665 0.153321 0.0083364 0.0136944 -0.00298691 -0.100199 0.173881 -0.0119053 0.0945853 -0.0478403 0.0903386 0.0041574 -0.0237327 -0.0888589 -0.0119659 0.05362 -0.00337502 -0.000270031 0.174823 -0.0465782 -0.0845464 -0.017253 -0.0712817 0.00358095 0.0623562 -0.0703721 0.0749739 0.185625 -0.011368 0.00369215 -0.0282314 0.00387686 -0.0256394 0.0575012 0.212067 0.0429096 -0.0248569 -0.00279477 0.0233238 -0.0420868 0.0758605 -0.117505 0.0719715 -0.0273477 0.0301713 0.0545999 0.0248692 0.0313871 0.137545 -0.0441657 -0.0538421 0.0761283 0.0384214 -0.0886281 -0.170964 0.0064197 0.116451 0.0892066 0.00820867 0.0760061 -0.0278533 -0.0998692 0.093935 0.0567691 -0.0300926 
0.0506838 0.0143167 0.0189318 0.0659546 0.128126 0.208931 -0.0137878 -0.194099 -0.114019 -0.126874 -0.0710057 0.078575 -0.0122213 -0.0544168 0.0256411 -0.00103848 -0.0610613 0.095242 -0.00165913 0.0982125 0.0898666 0.0138803 0.110439 0.12506 0.0388956 0.0292804 -0.149013 -0.220502 -0.00335489 0.0661532 0.0589582 0.134197 -0.0882757 0.0420905 0.130352 0.0918615 -0.0228716 0.0663894 0.0141017 -0.107774 0.0557926 0.0148396 0.0226064 -0.010859 -0.140311 0.0672775 0.209961 0.0106107 -0.133508 0.0587268 0.00666783 -0.0582632 0.114541 0.000119682 0.153958 -0.000797698 0.082532 0.157029 0.000350431 -0.133868 -0.0627016 0.155154 0.162063 -0.171207 0.147921 0.0149795 0.0168612 -0.0188477 -0.126477 0.177822 -0.00866747 0.0951602 -0.0494426 0.0595508 -0.003421 -0.0103387 -0.0906679 -0.0380068 0.0550233 0.0278286 0.021658 0.173279 -0.0405294 -0.0868842 -0.0155533 -0.0675519 -0.00417161 0.0408963 -0.0954191 0.0932471 0.167025 -0.0144163 0.0129807 -0.0230823 -0.0301719 -0.0116882 0.0402763 0.20116 0.0510463 -0.022587 0.029206 0.0285274 -0.038458 0.0543012 -0.104356 0.0626801 -0.0242312 0.0138621 0.02873 0.0493104 0.0339705 0.118106 -0.0345643 -0.0698211 0.0613857 0.0528293 -0.104075 -0.132866 -0.0139058 0.121162 0.0980244 -0.00337538 0.0580281 -0.0460654 -0.0855022 0.112298 0.0655505 -0.0280685 
0.0469889 0.0145873 -0.00360971 0.0406826 0.116385 0.193682 -0.0162151 -0.181452 -0.129649 -0.100748 -0.0725041 0.0744632 0.00102846 -0.0440365 0.0401808 -0.0184321 -0.0583494 0.0800793 0.0256415 0.116106 0.0611522 0.0120379 0.120146 0.126702 0.0205594 0.0483479 -0.129094 -0.22238 0.0059186 0.065726 0.048516 0.115911 -0.0710352 0.0313947 0.123603 0.0959427 -0.0217442 0.0914801 -0.00172778 -0.100658 0.0360818 0.0135824 0.00597769 0.0159632 -0.160913 0.0865506 0.217252 0.0285923 -0.131384 0.0735759 0.000731351 -0.0479371 0.110509 -0.00429511 0.162163 -0.00296237 0.0771925 0.166737 0.0067845 -0.140211 -0.0695225 0.145544 0.176883 -0.159694 0.139796 0.000969367 0.0220506 -0.0140708 -0.123779 0.159276 -0.0107355 0.0896499 -0.0524147 0.0700435 0.00281452 -0.01665 -0.0974874 -0.03381 0.0781826 0.0360803 0.0218945 0.156938 -0.0583356 -0.0928111 -0.00296664 -0.0919637 -0.00978366 0.0422399 -0.0617745 0.0905117 0.160503 -0.00320049 0.0216203 -0.031553 -0.0221357 -0.0305751 0.0539033 0.205713 0.0561331 -0.0436896 0.0236278 0.0440225 -0.0283849 0.0424124 -0.136796 0.0641235 -0.03825 0.00670016 0.0469252 0.0525256 0.063211 0.136052 -0.0330443 -0.0731115 0.0421109 0.0585036 -0.0859912 -0.15889 -0.0119442 0.126543 0.0942795 -0.0204191 0.0560447 -0.0359875 -0.104508 0.100655 0.0622904 -0.0267026 
0.0598481 0.0011546 -0.0444901 0.0286789 0.123804 0.180703 -0.00717342 -0.159793 -0.12546 -0.110979 -0.0729894 0.0870316 0.00950783 -0.0562807 0.00240246 -0.0119656 -0.0626609 0.0674729 0.00948522 0.140541 0.0830426 -0.00594802 0.121944 0.11796 0.00859527 0.0557809 -0.11029 -0.241088 -0.00091894 0.0706744 0.0277279 0.111249 -0.0704777 0.0433684 0.104911 0.0796188 -0.0245577 0.116523 -0.0128948 -0.109167 0.0266216 0.0177094 0.00778564 0.0427241 -0.15562 0.0834915 0.223244 0.0222682 -0.134018 0.0874102 -0.00546377 -0.0601675 0.0881963 0.00442894 0.179087 -0.015251 0.0758854 0.173523 0.00400363 -0.155237 -0.0516218 0.120481 0.202147 -0.143625 0.132968 -0.0295014 0.0035291 0.00824359 -0.0980649 0.143659 -0.0125419 0.087069 -0.0529069 0.0647105 -0.00818937 -0.0154353 -0.0884694 -0.015727 0.0710409 0.0361984 0.00676243 0.152571 -0.0647002 -0.0978329 -0.0178696 -0.0870666 0.000892728 0.0575103 -0.0356673 0.0751508 0.159364 -0.0251411 -0.00361012 -0.0400879 -0.0159392 -0.0269675 0.0571847 0.19618 0.0548619 -0.0469765 0.0177261 0.0350729 -0.0297544 0.0610063 -0.151722 0.0525583 -0.0652344 0.0306342 0.0310957 0.0345815 0.0683665 0.149597 -0.0475714 -0.0629928 0.0501898 0.0679535 -0.0878961 -0.172807 -0.00722876 0.127245 0.0759143 0.0098152 0.0717911 -0.0254412 -0.107069 0.0827277 0.0530639 -0.0405933 
0.0528969 0.0284912 -0.00663739 0.0488423 0.12876 0.192919 -0.0117901 -0.166318 -0.132184 -0.111812 -0.074069 0.0594817 -0.00800904 -0.0633809 0.0219627 0.0142462 -0.0567686 0.0806697 -0.00593029 0.117235 0.0801136 -0.00247119 0.128988 0.0905506 0.0254162 0.0469642 -0.148866 -0.223764 0.0167392 0.0370796 0.0547063 0.152865 -0.0876695 0.0472058 0.10698 0.0886655 -0.0188447 0.103987 0.0180624 -0.0991795 0.0523068 0.0122643 0.0171659 -0.00340066 -0.140913 0.0808358 0.218211 0.0130057 -0.1466 0.0698751 -0.016981 -0.0416921 0.0818362 0.00733999 0.14019 -0.0165011 0.103299 0.149953 0.00674266 -0.139379 -0.0648184 0.142126 0.176921 -0.167333 0.139474 0.00920929 0.0142148 -0.00416017 -0.101935 0.174882 -0.0181266 0.100874 -0.0472852 0.0967061 0.00150575 -0.0339623 -0.08856 -0.0132833 0.0475094 0.00862324 0.0049885 0.171247 -0.0544051 -0.0914089 -0.0177289 -0.0570463 -0.00977048 0.055629 -0.0686558 0.0738415 0.17975 -0.0111295 -0.00279281 -0.0419886 0.00165176 -0.0178178 0.0541668 0.218342 0.0366069 -0.0283446 -0.000725482 0.0163713 -0.0342401 0.0817375 -0.112738 0.064723 -0.0329622 0.0416659 0.0573856 0.0296919 0.0277372 0.145126 -0.0427958 -0.0578547 0.0742903 0.0333554 -0.0868643 -0.167121 0.0130449 0.117988 0.0943616 0.0184555 0.0830822 -0.0211713 -0.0982337 0.0773067 0.0625979 -0.0289308 
0.0630963 0.00942957 -0.0482745 0.0299408 0.130246 0.191024 -0.00632947 -0.169563 -0.13101 -0.0946655 -0.0774856 0.0807213 0.0149667 -0.0651563 0.00984637 -0.00151201 -0.0646907 0.0853992 0.00668558 0.130975 0.0860059 0.000733648 0.118033 0.11877 0.0119919 0.042557 -0.124758 -0.244912 -0.00617188 0.0883358 0.021792 0.118679 -0.0791868 0.0382997 0.118061 0.0757324 -0.0254886 0.0862721 -0.00162823 -0.111045 0.0219795 0.0094597 0.0239939 0.0439181 -0.154623 0.0867612 0.22876 0.0376609 -0.138032 0.0856513 0.0189271 -0.0697508 0.0913026 -0.000401637 0.173805 -0.0167232 0.0804284 0.161845 0.0144903 -0.152583 -0.0451059 0.131119 0.18801 -0.142857 0.12822 -0.0356133 -0.00622061 0.00932429 -0.101751 0.134911 -0.0127026 0.0953411 -0.0532698 0.0487446 -0.0206662 -0.00692466 -0.0937521 -0.0178094 0.0731202 0.0403476 0.0311727 0.1543 -0.0671656 -0.0870553 -0.0224651 -0.0728755 -0.00660531 0.043843 -0.0420467 0.0853086 0.146645 -0.0206118 -0.0136482 -0.0381694 -0.0343519 -0.018189 0.0491079 0.20185 0.0477052 -0.0480719 0.039826 0.0392792 -0.0222402 0.054802 -0.146412 0.0446553 -0.0711801 0.0352023 0.0237446 0.0573232 0.0711374 0.133859 -0.0430562 -0.070501 0.0354277 0.0718288 -0.0959257 -0.154894 -0.024713 0.123015 0.0826556 -0.00041653 0.0754042 -0.0306078 -0.11193 0.0811858 0.043628 -0.0421723 
0.0508118 0.0195806 -0.0625895 0.0164577 0.134776 0.175153 -0.0197792 -0.170627 -0.128337 -0.0800607 -0.0822542 0.079523 0.0213689 -0.0625195 0.00490839 -0.00288383 -0.059754 0.0863885 0.0151588 0.139274 0.084484 -0.00248438 0.124128 0.114285 0.0124993 0.047731 -0.115823 -0.245736 -0.00180607 0.0954118 0.0220577 0.10098 -0.0623359 0.0222871 0.12394 0.073529 -0.0218808 0.0929858 -0.00928948 -0.115154 0.0109189 0.01691 0.0267639 0.0695642 -0.163426 0.101384 0.238013 0.0444794 -0.130589 0.0827419 0.01986 -0.0668299 0.0851516 -0.00770301 0.174921 -0.0170092 0.0790907 0.157907 0.0246431 -0.163148 -0.04203 0.115182 0.189195 -0.125294 0.130482 -0.0640628 -0.0157267 0.0179286 -0.0895273 0.126076 -0.00260255 0.0938079 -0.0515293 0.0270004 -0.0225987 0.000144932 -0.109155 0.00365253 0.0758944 0.0416402 0.0257452 0.156873 -0.0706015 -0.0682325 -0.0183723 -0.0795758 -0.00861314 0.0503859 -0.0271551 0.0754464 0.124925 -0.0137842 -0.0152839 -0.0497134 -0.0314445 -0.0321361 0.0483097 0.212783 0.039524 -0.064107 0.0391046 0.0476568 -0.00982315 0.0460497 -0.161043 0.0389763 -0.07829 0.0365451 0.0359433 0.0630545 0.0784496 0.125816 -0.050267 -0.0649387 0.0215982 0.0740989 -0.100168 -0.167316 -0.0363548 0.120544 0.0757141 0.0077594 0.0648647 -0.0299256 -0.121091 0.0753387 0.0356222 -0.0360512 
0.0590629 -0.00208418 -0.0441728 0.0185291 0.122737 0.181048 -0.0276104 -0.145577 -0.134702 -0.103436 -0.0871374 0.0907419 0.0176035 -0.0834133 -0.00782079 -0.00529304 -0.0738322 0.0780442 0.0127525 0.142431 0.109485 -0.00924524 0.12563 0.109966 0.0126223 0.0633773 -0.112536 -0.264821 -0.0168965 0.0787832 0.0191879 0.093014 -0.0692158 0.0398639 0.117616 0.0579889 -0.0293947 0.111135 0.00285447 -0.114379 0.011612 0.013093 0.0208668 0.0658335 -0.152807 0.0711595 0.237594 0.0145795 -0.135605 0.0936007 0.0276245 -0.0808 0.0801372 0.012321 0.178329 -0.0267431 0.0909114 0.154321 0.0125625 -0.177312 -0.0239626 0.105224 0.189374 -0.122431 0.138039 -0.0734544 -0.0116866 0.0146008 -0.0814268 0.122388 -0.0133632 0.0907873 -0.0529556 0.0331536 -0.0293802 -0.0146694 -0.106159 -0.00774935 0.0809692 0.0693083 0.00708915 0.144477 -0.0505629 -0.0720296 -0.0226926 -0.0941685 0.0125801 0.0652157 -0.015101 0.0612161 0.121839 -0.0246629 -0.0133423 -0.0341443 -0.0407122 -0.0265642 0.0552771 0.210174 0.0292121 -0.0485104 0.0263246 0.0451399 -0.0304516 0.0689652 -0.138465 0.0305588 -0.0745144 0.0432624 0.0214896 0.0397484 0.0654945 0.13233 -0.0624458 -0.0603485 0.0415427 0.0777928 -0.10102 -0.169979 -0.0304171 0.117833 0.0695994 0.0208551 0.0712104 -0.0475264 -0.0958473 0.0693323 0.0509816 -0.0383959 
0.0193993 0.0416591 -0.0468651 0.0292183 0.110879 0.193035 -0.0551664 -0.185003 -0.113466 -0.0825794 -0.0578287 0.0663908 0.0155384 -0.0756928 0.00513394 -0.010959 -0.0589125 0.0926867 0.0420197 0.114322 0.100206 -0.0120042 0.103873 0.104564 0.030542 0.0628687 -0.130981 -0.264233 0.0120566 0.0853952 0.0725532 0.0978488 -0.0492262 -0.00287884 0.14899 0.096588 -0.0284564 0.0738734 0.0161778 -0.107068 0.0222454 0.0116067 0.00282765 0.0676527 -0.144239 0.0917565 0.24783 0.0228666 -0.148384 0.0230324 -0.00762896 -0.0531617 0.114493 -0.0257755 0.131008 0.0147895 0.0785927 0.145382 0.017225 -0.164257 -0.0575376 0.121521 0.191544 -0.139757 0.149898 -0.0471512 0.0174131 -0.00509625 -0.0824603 0.127045 -0.00266698 0.0759948 -0.0635094 -0.00318148 -0.00652007 -0.0136813 -0.145473 0.00564048 0.0607349 0.0644001 -0.0156061 0.167549 -0.0628409 -0.0560277 -0.0194839 -0.0596662 -0.00130245 0.0260269 -0.0551315 0.0467778 0.121581 0.00161424 0.00620419 -0.0374839 -0.0267276 -0.0501007 0.0424694 0.224649 0.0170747 -0.0547802 0.027175 0.046177 -0.0178969 0.0299899 -0.133902 0.0655702 -0.0263975 0.0298005 0.0359987 0.0676891 0.0473634 0.0845239 -0.0655561 -0.0942417 0.0300945 0.065704 -0.138181 -0.186831 -0.0136587 0.108325 0.0850703 -0.0154464 0.0352367 -0.0436433 -0.105534 0.0963841 0.0428193 -0.00309515 
0.0843598 -0.00180755 -0.0603256 0.00715167 0.147794 0.213728 -0.00950109 -0.126819 -0.108067 -0.136623 -0.0803718 0.09191 0.00851314 -0.125262 -0.0358161 -0.0138355 -0.0876987 0.0588156 -0.0399324 0.142534 0.124382 0.0112826 0.101219 0.0635145 -0.00163522 0.0581753 -0.127158 -0.270553 -0.0219619 0.0554266 0.0297916 0.098888 -0.100097 0.0568191 0.119478 0.0454361 -0.0318629 0.113725 0.00741586 -0.111982 0.0504467 0.0104373 -0.0181704 0.0658291 -0.153709 0.074554 0.19985 0.0188409 -0.135496 0.087299 0.00609552 -0.061651 0.0545703 0.0141846 0.154009 -0.0483763 0.0750112 0.150445 -0.0121641 -0.168352 -0.0213405 0.0976219 0.204101 -0.12335 0.141562 -0.110358 0.000300559 0.035388 -0.0512098 0.12758 0.00448054 0.0844896 -0.0313639 0.0305652 -0.0465849 -0.0123852 -0.122362 -0.00333352 0.0555074 0.0825807 0.0019963 0.142523 -0.0202212 -0.0549605 -0.0233769 -0.0882295 0.0496713 0.0772173 -0.034726 0.0558482 0.144423 -0.0570588 -0.0350686 -0.0293121 -0.0586028 -0.0425572 0.0706358 0.159602 0.0064742 -0.0321731 0.0290244 0.0575175 -0.0499432 0.0877652 -0.124033 0.0210164 -0.0671827 0.0821203 2.13575e-05 0.0525733 0.0786022 0.117263 -0.0945635 -0.0320888 0.0499273 0.0671568 -0.145923 -0.160177 -0.0237135 0.104341 0.0591823 0.0503553 0.0808107 -0.032152 -0.0416577 0.0444313 0.0417653 -0.049698 
