{
  "descriptor": [
    -0.09560209512710571,
    0.15028931200504303,
    0.08430781215429306,
    -0.058132536709308624,
    -0.1462973654270172,
    0.11704987287521362,
    -0.06719090044498444,
    -0.06559812277555466,
    0.12808378040790558,
    -0.11052379757165909,
    0.1641789823770523,
    0.00007588906737510115,
    -0.26851820945739746,
    -0.030991453677415848,
    -0.03264562040567398,
    0.0849568322300911,
    -0.07607771456241608,
    -0.1512489765882492,
    -0.11356097459793091,
    -0.0822582021355629,
    -0.010189050808548927,
    0.10408565402030945,
    0.012627114541828632,
    -0.05971340835094452,
    -0.05381832644343376,
    -0.31360507011413574,
    -0.058090291917324066,
    -0.0686551183462143,
    0.1431189328432083,
    -0.12038947641849518,
    0.05404392629861832,
    0.04601215943694115,
    -0.14393621683120728,
    -0.02579679526388645,
    -0.012070750817656517,
    0.03295883536338806,
    -0.09124886989593506,
    -0.0684601441025734,
    0.251687616109848,
    -0.04860249161720276,
    -0.12132338434457779,
    -0.01728375442326069,
    0.04281581938266754,
    0.2567109763622284,
    0.11436959356069565,
    -0.03522629663348198,
    0.03751501813530922,
    -0.03159097209572792,
    0.08120586723089218,
    -0.30149996280670166,
    0.13775207102298737,
    0.17741011083126068,
    0.15495017170906067,
    0.16663742065429688,
    0.06684575229883194,
    -0.11484986543655396,
    0.05238700658082962,
    0.20108871161937714,
    -0.17163053154945374,
    0.17863504588603973,
    0.09981117397546768,
    -0.07148870080709457,
    -0.10030847787857056,
    -0.029141463339328766,
    0.2006082385778427,
    0.10472752898931503,
    -0.0915200486779213,
    -0.20600156486034393,
    0.13046316802501678,
    -0.12583784759044647,
    -0.05998199060559273,
    0.14821207523345947,
    -0.09954729676246643,
    -0.10727224498987198,
    -0.17305593192577362,
    0.10843396186828613,
    0.35770508646965027,
    0.1408023238182068,
    -0.16429199278354645,
    -0.024371610954403877,
    -0.03826754540205002,
    -0.048975665122270584,
    0.019993945956230164,
    0.031453266739845276,
    -0.09776798635721207,
    -0.15560808777809143,
    -0.003958981484174728,
    0.025817137211561203,
    0.19312143325805664,
    0.014460709877312183,
    -0.059790223836898804,
    0.24172228574752808,
    0.09832236170768738,
    -0.0023557241074740887,
    0.0097117330878973,
    0.07012274116277695,
    0.01779516227543354,
    -0.053471703082323074,
    -0.03680530935525894,
    0.05167768523097038,
    0.04777756705880165,
    -0.15922297537326813,
    -0.04360326752066612,
    0.09404859691858292,
    -0.16587214171886444,
    0.25435295701026917,
    -0.03003128618001938,
    0.05025674030184746,
    0.10141176730394363,
    -0.013807179406285286,
    -0.056147124618291855,
    -0.009898310527205467,
    0.23168358206748962,
    -0.2743748724460602,
    0.2126486748456955,
    0.16547556221485138,
    0.036029595881700516,
    0.11748494952917099,
    0.047610875219106674,
    0.12547804415225983,
    0.07402291893959045,
    -0.029792610555887222,
    -0.16430222988128662,
    -0.13238494098186493,
    0.05080808699131012,
    -0.08386807888746262,
    -0.09770175814628601,
    0.07200119644403458
  ]
}