{
  "descriptor": [
    -0.019087737426161766,
    0.08986958861351013,
    0.09525637328624725,
    -0.07120273262262344,
    -0.16253255307674408,
    0.036959391087293625,
    -0.08602914959192276,
    -0.013640773482620716,
    0.15627256035804749,
    -0.13312232494354248,
    0.16462448239326477,
    0.012566063553094864,
    -0.20632946491241455,
    0.09303348511457443,
    -0.014329596422612667,
    0.14518055319786072,
    -0.16314877569675446,
    -0.19742870330810547,
    -0.04961872100830078,
    -0.06590587645769119,
    -0.033502306789159775,
    0.08862597495317459,
    -0.00962450634688139,
    0.040016353130340576,
    -0.15005464851856232,
    -0.3572084903717041,
    -0.10594459623098373,
    -0.06752335280179977,
    0.10423661023378372,
    -0.10766192525625229,
    -0.053623732179403305,
    0.054496992379426956,
    -0.11785842478275299,
    0.01461986918002367,
    0.10842432826757431,
    0.013609439134597778,
    -0.10182570666074753,
    -0.15957191586494446,
    0.2749026119709015,
    0.10622851550579071,
    -0.2386193722486496,
    -0.0036878385581076145,
    0.08290142565965652,
    0.2709294259548187,
    0.19641219079494476,
    -0.014418134465813637,
    0.09324866533279419,
    -0.07252459228038788,
    0.17232604324817657,
    -0.26257026195526123,
    0.05316067487001419,
    0.1976071447134018,
    0.07572382688522339,
    0.0793701633810997,
    0.08320573717355728,
    -0.12122363597154617,
    -0.04392677918076515,
    0.13074755668640137,
    -0.15838998556137085,
    0.0855506882071495,
    0.06277642399072647,
    -0.05127072334289551,
    -0.0640067607164383,
    -0.08505841344594955,
    0.18059766292572021,
    0.1010340228676796,
    -0.13323955237865448,
    -0.17490266263484955,
    0.253736287355423,
    -0.1503104418516159,
    -0.11399004608392715,
    0.08291454613208771,
    -0.11031787097454071,
    -0.14980448782444,
    -0.19105024635791779,
    0.021264441311359406,
    0.4191298186779022,
    0.11121296882629395,
    -0.1065564900636673,
    0.07233858853578568,
    0.01745438575744629,
    -0.07710153609514236,
    -0.026763146743178368,
    0.1640181541442871,
    -0.12764614820480347,
    0.011451562866568565,
    0.005657688714563847,
    0.051730427891016006,
    0.2840237617492676,
    0.015130641870200634,
    -0.01488523744046688,
    0.15953393280506134,
    0.014386117458343506,
    0.04754800349473953,
    0.0971560925245285,
    0.11834443360567093,
    -0.11559198796749115,
    -0.09867992997169495,
    -0.1932397335767746,
    -0.038034528493881226,
    -0.013083577156066895,
    -0.06689641624689102,
    -0.04331647977232933,
    0.16166481375694275,
    -0.16596847772598267,
    0.19750893115997314,
    -0.03357312083244324,
    -0.09835641086101532,
    -0.05215148627758026,
    0.039819225668907166,
    -0.08179324120283127,
    -0.01577598974108696,
    0.1373845487833023,
    -0.22510333359241486,
    0.11535622924566269,
    0.14037764072418213,
    0.06209464371204376,
    0.10760883241891861,
    0.09465174376964569,
    0.012702563777565956,
    0.038702499121427536,
    -0.06287984549999237,
    -0.167526513338089,
    -0.16324187815189362,
    0.02912048064172268,
    -0.022636348381638527,
    -0.003798463148996234,
    -0.008873950690031052
  ]
}