{
  "descriptor": [
    -0.10884247720241547,
    0.02197607047855854,
    0.08678209036588669,
    0.01475096307694912,
    -0.13141293823719025,
    -0.06049652025103569,
    -0.03970186039805412,
    -0.056782640516757965,
    0.06421738862991333,
    0.015716923400759697,
    0.17244377732276917,
    -0.10936767607927322,
    -0.23103085160255432,
    0.058884281665086746,
    -0.059817180037498474,
    0.08084509521722794,
    -0.16869746148586273,
    -0.10714572668075562,
    -0.07335611432790756,
    -0.071554996073246,
    0.02567148394882679,
    0.020716998726129532,
    -0.03633419796824455,
    0.07276808470487595,
    -0.06294812262058258,
    -0.31874534487724304,
    -0.12305700033903122,
    -0.11157339811325073,
    0.06247516721487045,
    -0.08383798599243164,
    0.026249410584568977,
    0.00847712717950344,
    -0.13556264340877533,
    -0.0823741927742958,
    0.050880033522844315,
    0.007526475470513105,
    -0.0829111859202385,
    -0.15265566110610962,
    0.2744816243648529,
    -0.021311769261956215,
    -0.10320247709751129,
    -0.01237413752824068,
    0.06454493850469589,
    0.2787345349788666,
    0.14242222905158997,
    0.1215563416481018,
    -0.009225555695593357,
    -0.058196377009153366,
    0.14073465764522552,
    -0.3152223527431488,
    0.08421427011489868,
    0.22737914323806763,
    0.0815579816699028,
    0.07838605344295502,
    0.09578432887792587,
    -0.1388808637857437,
    0.06002795323729515,
    0.12168396264314651,
    -0.19194884598255157,
    0.10425932705402374,
    0.03352843597531319,
    -0.03894713893532753,
    0.03044520877301693,
    -0.1314401775598526,
    0.16031067073345184,
    0.11175999045372009,
    -0.049137458205223083,
    -0.06661581248044968,
    0.14294366538524628,
    -0.17610441148281097,
    -0.08410811424255371,
    0.008889550343155861,
    -0.11899443715810776,
    -0.19393612444400787,
    -0.28500476479530334,
    0.0465427003800869,
    0.41089123487472534,
    0.13176372647285461,
    -0.14565609395503998,
    -0.00507750129327178,
    0.04131482541561127,
    -0.050361890345811844,
    0.09636690467596054,
    0.02196982316672802,
    -0.15510457754135132,
    -0.09948964416980743,
    -0.07387412339448929,
    0.021684426814317703,
    0.21561546623706818,
    -0.011970262974500656,
    -0.008003429509699345,
    0.16011717915534973,
    -0.013555679470300674,
    -0.009217046201229095,
    0.08778394758701324,
    0.042847905308008194,
    -0.053239841014146805,
    -0.012470658868551254,
    -0.10778714716434479,
    0.08164174109697342,
    0.09524672478437424,
    -0.08709193021059036,
    0.017537541687488556,
    0.10593323409557343,
    -0.18045398592948914,
    0.058171819895505905,
    -0.03661377355456352,
    -0.0945311188697815,
    -0.04777643457055092,
    -0.05590782314538956,
    -0.18248990178108215,
    0.01567032001912594,
    0.23413211107254028,
    -0.1956527829170227,
    0.196104034781456,
    0.16532738506793976,
    -0.013409490697085857,
    0.12513498961925507,
    0.026136217638850212,
    0.05602063611149788,
    -0.04794580489397049,
    -0.01925574615597725,
    -0.15875443816184998,
    -0.09463980793952942,
    0.07765190303325653,
    0.01647244393825531,
    -0.014916322194039822,
    0.020827217027544975
  ]
}