{
  "descriptor": [
    -0.0783601850271225,
    0.08968274295330048,
    0.04233404994010925,
    -0.11559730768203735,
    -0.18468940258026123,
    0.038882412016391754,
    -0.09736012667417526,
    -0.053112857043743134,
    0.21791177988052368,
    -0.1742647886276245,
    0.17131586372852325,
    -0.05369086563587189,
    -0.2190166562795639,
    0.11744780093431473,
    -0.10014832019805908,
    0.14637792110443115,
    -0.1463744193315506,
    -0.1806309074163437,
    0.01124753337353468,
    -0.048232343047857285,
    -0.022125523537397385,
    0.0913412943482399,
    0.04331640899181366,
    0.10685759782791138,
    -0.1340009570121765,
    -0.3787367641925812,
    -0.055873479694128036,
    -0.09096485376358032,
    0.02396261692047119,
    -0.11781921237707138,
    -0.07235758006572723,
    0.09800015389919281,
    -0.14470693469047546,
    0.04736579954624176,
    0.05018876492977142,
    0.0780082643032074,
    -0.05582980439066887,
    -0.13257268071174622,
    0.26677170395851135,
    0.09741992503404617,
    -0.2662222385406494,
    -0.024747997522354126,
    0.05354912951588631,
    0.263943612575531,
    0.1847010999917984,
    -0.04303333908319473,
    0.02522379532456398,
    -0.1124996617436409,
    0.18479931354522705,
    -0.2518143653869629,
    0.03304076939821243,
    0.20025455951690674,
    0.0517246276140213,
    0.049977876245975494,
    0.04455713927745819,
    -0.09938794374465942,
    0.0063048601150512695,
    0.11327282339334488,
    -0.14873012900352478,
    0.01371544785797596,
    0.09790100157260895,
    -0.027033738791942596,
    0.010817358270287514,
    -0.0950702503323555,
    0.22739677131175995,
    0.13944116234779358,
    -0.09544713795185089,
    -0.12068144977092743,
    0.22966375946998596,
    -0.16438207030296326,
    -0.09221432358026505,
    0.08037121593952179,
    -0.12014704942703247,
    -0.17897769808769226,
    -0.15735942125320435,
    0.020427774637937546,
    0.34322690963745117,
    0.18111425638198853,
    -0.02984415553510189,
    0.08584493398666382,
    0.0036936867982149124,
    -0.049410708248615265,
    -0.027077334001660347,
    0.1626662015914917,
    -0.13950443267822266,
    0.033411335200071335,
    0.020366176962852478,
    0.08451469242572784,
    0.2552627921104431,
    0.031218819320201874,
    0.0042800940573215485,
    0.2210659682750702,
    -0.010154243558645248,
    0.07594108581542969,
    0.08057936280965805,
    0.08685106784105301,
    -0.12435412406921387,
    -0.02432049810886383,
    -0.15686793625354767,
    0.031919606029987335,
    -0.0346234031021595,
    -0.05851434916257858,
    0.02146705612540245,
    0.16841499507427216,
    -0.22357140481472015,
    0.13376347720623016,
    -0.102149099111557,
    -0.08431815356016159,
    -0.013488959521055222,
    0.05113233998417854,
    0.001026008278131485,
    -0.02721291035413742,
    0.10858594626188278,
    -0.2160988599061966,
    0.12253958731889725,
    0.0911320149898529,
    0.09560950100421906,
    0.1509166955947876,
    0.07146962732076645,
    0.02488602325320244,
    0.036116600036621094,
    -0.07471416890621185,
    -0.17793740332126617,
    -0.08632908016443253,
    0.06944021582603455,
    -0.043467238545417786,
    0.015981236472725868,
    0.01710309088230133
  ]
}