0.0378115 -0.0118859 -0.085955 0.033116 0.0476361 0.138232 0.0700129 -0.0678288 -0.00216422 -0.0923899 0.0706323 0.101304 0.106946 -0.0425258 -0.151174 -0.0433675 -0.147872 0.0791986 -0.12916 0.0860455 0.22942 -0.148159 0.0163304 0.206152 0.0235681 -0.092881 -0.0605015 -0.200174 0.0154056 0.179665 -0.00785557 0.00757483 -0.0728823 0.0424893 -0.0453938 0.0204899 -0.174046 0.00277321 -0.0905236 -0.0267673 0.0164527 -0.0752958 -0.0539074 0.137757 -0.0708179 -0.0635161 0.117556 -0.00471311 -0.0991018 -0.00340211 -0.0114136 -0.0386682 0.00682345 -0.0268526 0.101619 0.0866863 -0.032516 0.202704 -0.00301906 -0.0891283 -0.0168534 0.0570454 0.219166 -0.0212411 0.00708395 -0.0627353 -0.00379719 -0.00988151 -0.0700912 0.0765861 -0.0157878 0.0568174 -0.0629131 -0.0668383 -0.000917962 0.0450066 -0.0225123 0.00779428 -0.0257923 0.103529 -0.0729013 0.00795086 -0.0339404 -0.0512571 -0.155973 0.112479 0.0828952 -0.0460646 -0.0516348 0.0032827 0.0772519 -0.158998 -0.0323292 -0.0320556 -0.0937154 -0.0499297 -0.114172 0.0452659 0.123652 -0.00417219 0.0956286 0.0142857 -0.00957115 0.0930292 -0.0621697 0.0624989 -0.112207 0.147802 -0.0674558 -0.0851314 0.00779051 0.0796528 -0.101054 -0.0724504 0.024043 0.190707 -0.0739081 -0.0176323 0.0581196 0.176875 -0.0174855 -0.0545336 -0.112193 0.02274 -0.142545 0.15516 -0.0659547 0.02072 
0.044877 -0.00718992 -0.0892694 0.0444635 0.0497953 0.140172 0.0726364 -0.0661008 0.000455114 -0.0903497 0.0768984 0.104595 0.105323 -0.039036 -0.157587 -0.0397911 -0.123301 0.0767853 -0.128778 0.0861874 0.234105 -0.153511 0.00756138 0.223348 0.0343939 -0.0985621 -0.0613866 -0.189501 0.0275622 0.183436 -0.0037387 0.013968 -0.0747009 0.0442349 -0.0589913 0.0151978 -0.174063 0.00112991 -0.0844156 -0.0267589 0.0147863 -0.0665703 -0.0504029 0.122628 -0.0591038 -0.0800674 0.114904 -0.010133 -0.093103 -0.0118591 -0.000936686 -0.026785 0.0100315 -0.0321612 0.100998 0.0895064 -0.0341599 0.209104 -0.00116609 -0.0931458 -0.0236662 0.0568549 0.217391 -0.0364776 -0.00254705 -0.0478664 0.000581463 -0.0145197 -0.0818524 0.0735049 -0.0161118 0.0606661 -0.0702765 -0.0608601 0.00462 0.0460005 -0.00565479 0.011432 -0.0283349 0.104688 -0.0786988 0.0133595 -0.0213624 -0.0550229 -0.139166 0.111671 0.0804057 -0.0448514 -0.0484246 -0.00540222 0.0706443 -0.160406 -0.0326283 -0.0190648 -0.0819571 -0.0519894 -0.107805 0.0409771 0.11577 -0.00258542 0.0942605 0.0134778 -0.0106132 0.108285 -0.0735315 0.0725669 -0.105918 0.137284 -0.0630127 -0.09567 0.00536815 0.081915 -0.0975591 -0.0653131 0.0329126 0.185582 -0.0796257 -0.012825 0.0583733 0.179048 -0.0266152 -0.0549168 -0.112662 0.0136394 -0.142183 0.165917 -0.0665947 0.0158033 
0.0394508 -0.0136476 -0.0462776 0.0656151 0.0638053 0.13838 0.120551 -0.0686535 0.00882473 -0.0783692 0.0447239 0.0890098 0.105142 -0.039548 -0.102895 -0.0551073 -0.0978538 0.115708 -0.112995 0.0472988 0.236045 -0.13421 -0.0270816 0.255794 0.043552 -0.144951 -0.12737 -0.204642 0.0137185 0.21509 0.015718 0.0444946 -0.0954785 0.0562398 -0.0127465 0.00306242 -0.137677 -0.0530824 -0.0744022 -0.0356216 0.0455969 -0.0622377 -0.0126922 0.0935592 -0.049024 -0.081381 0.100238 -0.0137938 -0.0682072 -0.0430634 0.022602 -0.0791944 0.0422589 -0.0432152 0.0956116 0.118238 -0.0355058 0.200559 0.0125605 -0.0581246 -0.0030619 0.0831373 0.132373 -0.0790686 0.014723 -0.0498986 0.00801871 -0.0685233 -0.110306 0.0403128 -0.0245312 0.0687224 -0.0755808 -0.0821924 -0.0339475 0.0692823 0.00625516 0.012034 -0.00939508 0.0875045 -0.0674488 0.0213588 -0.0300987 -0.0325563 -0.114908 0.109816 0.080339 -0.0807907 -0.0908697 0.00640352 0.0621983 -0.144453 -0.0109552 -0.0418633 -0.106969 -0.0201982 -0.118864 0.0271246 0.113002 0.0390575 0.112533 0.0199176 -0.00651836 0.114344 -0.0535574 0.0372441 -0.0899987 0.111665 -0.0902053 -0.0344057 -0.0167674 0.0272633 -0.103167 -0.103463 -0.00161689 0.188748 -0.0592442 -0.0074838 0.00307868 0.17079 -0.00998215 -0.0531752 -0.140906 0.024361 -0.150771 0.16009 -0.107328 -0.00891599 
0.0648024 -0.0321659 -0.127258 0.0510036 0.113329 0.122322 0.0382038 -0.0848677 -0.0425697 -0.0795931 0.0310038 0.143961 0.0982071 -0.0587351 -0.163141 -0.000318417 -0.0376558 0.147365 -0.0904942 0.119153 0.230714 -0.100451 0.0434451 0.24289 0.0148293 -0.0754458 -0.03228 -0.239951 0.00702441 0.219029 -0.0413765 0.0600213 -0.0421484 0.037436 -0.0121438 -0.0109067 -0.118511 -0.0135598 -0.0757563 -0.0626547 -0.00775862 -0.0208229 -0.00340881 0.140602 -0.0986586 -0.0298055 0.180397 -0.0189596 -0.105892 -0.00620477 0.0722826 -0.0827881 0.039646 -0.0375736 0.114166 0.0740867 0.0259514 0.172263 0.037402 -0.101364 0.00667684 0.0478495 0.176915 -0.0558463 0.0318006 -0.137629 -0.0410729 -0.0149741 -0.0699151 0.061212 -0.026874 0.0417018 -0.0784839 -0.11889 -0.0540798 0.073333 -0.0152625 0.0645207 -0.0259783 0.065836 -0.0615288 0.0865043 -0.0537248 -0.0461667 -0.0923202 0.0884691 0.0551885 -0.037668 -0.0731047 0.0059234 0.0348301 -0.111045 -0.0843474 -0.0198995 -0.0582636 -0.0082947 -0.084467 0.0968154 0.0772363 -0.0256292 0.103351 0.0115038 0.00923894 0.13397 -0.0887513 0.00893717 -0.119508 0.100023 -0.0809506 -0.0445412 0.00232877 0.0662213 -0.0712814 -0.0725185 -0.014041 0.153594 -0.116269 -0.0886318 -0.0117403 0.149037 -0.0260323 -0.00225924 -0.0828557 -0.0202754 -0.135806 0.136227 -0.0904981 -0.0388356 
0.0755509 -0.0191688 -0.119785 0.0591952 0.116934 0.132373 0.0417857 -0.0551961 -0.0112502 -0.0599269 0.076948 0.151291 0.0885915 -0.0930084 -0.15557 -0.0103742 -0.0328251 0.153715 -0.107056 0.137737 0.244751 -0.114956 0.0547262 0.254513 0.0336188 -0.0885212 -0.0205256 -0.230221 0.0439406 0.197503 -0.0164446 0.0424718 -0.0226037 0.0586231 -0.035394 -0.0214612 -0.132725 0.0112123 -0.0762607 -0.0692391 0.0013921 -0.0372019 -0.0434307 0.144988 -0.118785 -0.0947235 0.146115 -0.012263 -0.0854396 0.00964923 0.0659813 -0.0332991 -0.00205983 -0.0516294 0.0933582 0.07367 0.00558545 0.158647 0.0051246 -0.100783 -0.0282896 -0.00740233 0.207205 -0.0649968 0.0194525 -0.139304 -0.0338205 -0.0252231 -0.0908952 0.0941596 -0.0335689 0.0527121 -0.0977191 -0.0863523 -0.0531086 0.0266149 -0.000209365 0.0808767 -0.031497 0.0853091 -0.107515 0.0763006 -0.0197094 -0.0464369 -0.0557966 0.0645735 0.0653663 -0.0113647 -0.0292213 0.00221125 0.0451922 -0.129123 -0.0962264 -0.000318179 -0.0348793 -0.0641301 -0.0980091 0.0743868 0.0556017 -0.0417419 0.0969487 0.00922212 -0.00301199 0.133687 -0.0700806 0.0325991 -0.0822492 0.0862173 -0.0133217 -0.0725061 -0.0167238 0.0923739 -0.0797406 -0.0360081 0.0378314 0.133098 -0.0912217 -0.0954777 0.0322944 0.187201 -0.0185148 0.0033834 -0.105355 0.0058724 -0.11749 0.130093 -0.0343014 -0.0130095 
0.0440195 -0.0245362 -0.10385 0.0232353 0.120052 0.138409 0.0290402 -0.0724354 -0.0695546 -0.0613177 0.0344933 0.181432 0.0748843 -0.0722648 -0.13371 -0.0188486 -0.0607533 0.11976 -0.0477353 0.104913 0.216754 -0.084015 0.0279562 0.204192 0.0448135 -0.00609637 -0.00267433 -0.231368 0.0307999 0.201097 -0.0156212 0.0355293 -0.0341369 0.0276405 -0.0148509 -0.0121097 -0.155996 -0.00289873 -0.0409728 -0.0459804 0.0149731 -0.0270821 -0.0208304 0.178642 -0.116617 -0.0375761 0.181723 -0.0553991 -0.129698 -0.0368022 0.0753687 -0.0586083 0.00230487 -0.0639802 0.113503 0.0848097 -0.0304061 0.229703 -0.0111424 -0.0805071 -0.0122131 -0.00976415 0.229492 -0.0411068 0.0862841 -0.141769 -0.0472677 -0.0100626 -0.08454 0.0905779 -0.00677041 0.0736613 -0.0866645 -0.107464 -0.0477671 0.0551707 -0.0336391 0.0527971 -0.0251704 0.091046 -0.102536 0.0739186 -0.00132148 -0.0275154 -0.104192 -0.00573726 0.105608 -0.0139668 -0.0389696 -0.00799601 0.00635955 -0.112445 -0.103738 0.0227844 -0.0395374 -0.0313644 -0.0498597 0.069395 0.0632301 -0.0285753 0.0351236 0.0249036 -0.0202675 0.12204 -0.123323 0.0453547 -0.110169 0.0986049 -0.0508331 -0.0899733 0.0272223 0.069077 -0.107639 -0.0501482 0.0459616 0.12381 -0.119165 -0.100914 0.0325759 0.172501 0.00443956 -0.0154835 -0.0870413 -0.0418521 -0.0867197 0.147251 -0.0400737 -0.0215166 
0.0728501 -0.0566467 -0.0813241 0.00902246 0.0972355 0.168703 0.045942 -0.01245 -0.0368535 -0.0843225 0.0298323 0.166545 0.0691388 -0.135395 -0.131701 -0.0208404 -0.102669 0.0579763 -0.0815868 0.107036 0.236083 -0.0885147 0.0186463 0.205442 0.0280483 -0.00117191 -0.013326 -0.260583 0.0143898 0.157261 0.00667264 0.0177042 -0.0602094 0.0708155 -0.0326757 -0.0302162 -0.160806 0.0248071 -0.0382574 -0.0430709 0.019115 -0.0607095 -0.05765 0.155855 -0.0653412 -0.0841852 0.135312 -0.0455313 -0.116774 0.000190356 0.0515878 -0.0559658 0.0159239 -0.0486205 0.112045 0.0647778 -0.0248885 0.219752 -0.0484952 -0.104889 -0.00848597 -0.0109204 0.238194 -0.0438788 0.054352 -0.134197 -0.0278412 0.00274296 -0.0698332 0.0637012 -0.0385424 0.0700889 -0.113423 -0.0707743 -0.0488437 0.0258098 -0.0149898 0.0303846 -0.00177511 0.157739 -0.100404 0.0359689 0.0148135 -0.0414423 -0.0930222 -0.0059787 0.123702 0.0130673 -0.00821585 -0.00874142 0.0438431 -0.120555 -0.100511 0.0601912 -0.0576131 -0.0157661 -0.039046 0.031129 0.0567216 -0.0139535 0.0618549 0.0037503 -0.0675332 0.117597 -0.10039 0.0295417 -0.10894 0.0895981 -0.0540178 -0.0968859 0.0259637 0.103497 -0.119491 -0.0595666 0.0910219 0.155625 -0.119505 -0.0739112 0.038558 0.181878 0.00527126 -0.00226445 -0.0541411 -0.0258304 -0.0762982 0.131522 -0.0170484 -0.0287488 
0.0588978 -0.0638373 -0.0785376 -0.00265579 0.114925 0.15772 0.00355517 -0.029432 -0.0553738 -0.100641 0.012097 0.17927 0.0473942 -0.0866337 -0.0950836 0.0111499 -0.11298 0.0466572 -0.0359754 0.114743 0.234154 -0.069612 0.0723246 0.145656 0.0346623 0.0156537 0.00253402 -0.264988 -0.0174802 0.161191 -0.00265762 0.00431733 -0.00780162 0.0579474 -0.0119421 0.013778 -0.122326 0.0502063 -0.0268125 -0.0479985 0.00219299 -0.0217622 -0.0130596 0.129717 -0.10211 -0.0386939 0.17753 -0.0874499 -0.129408 0.0348724 0.0327951 -0.0768705 0.00971737 0.00173827 0.162909 0.0598204 0.011238 0.206565 -0.0785506 -0.0944271 -0.0176416 -0.0186276 0.246355 -0.0773411 0.116745 -0.122839 -0.064099 0.0455737 -0.0633604 0.115092 0.0016567 0.0946398 -0.123115 -0.0842806 -0.0239262 0.0548235 -0.0231324 0.0177487 -0.0103628 0.105237 -0.108334 0.0634299 0.0131942 -0.0179539 -0.122903 -0.00178468 0.102538 0.0405197 -0.00398248 0.0149108 0.048039 -0.132433 -0.115271 0.0601522 -0.0327545 -0.0107339 -0.0422848 0.0877535 0.0563595 -0.010667 0.028843 -0.0209454 -0.0685041 0.075086 -0.111222 0.0567683 -0.118727 0.0603189 -0.0589298 -0.112448 -0.0026243 0.0862402 -0.0925446 -0.0575623 0.11371 0.151731 -0.0814779 -0.10225 0.0335603 0.199704 0.0370805 0.0153297 -0.00860453 -0.0299689 -0.063838 0.139561 0.0467012 0.00265037 
0.0798116 -0.0599404 -0.0807103 0.0044573 0.0960341 0.149952 0.0115464 -0.0481783 -0.025594 -0.115752 0.0677346 0.187359 0.064332 -0.0627757 -0.132134 -0.0109631 -0.099474 0.0732029 -0.0872453 0.090465 0.230079 -0.0254574 0.0456507 0.18684 0.0209327 0.00745791 0.048169 -0.220744 -0.00544785 0.174373 -0.0245504 -0.00227628 -0.0131556 0.0529009 -0.0409266 -0.00756482 -0.14959 0.0481365 -0.0441009 -0.000878906 -1.66244e-05 -0.0054074 -0.0603277 0.149804 -0.111924 -0.067386 0.136819 -0.0806628 -0.105602 0.0118766 0.0600184 -0.0343027 0.0028999 -0.00452816 0.130669 0.0611014 -0.00255729 0.221488 -0.0629801 -0.0873396 -0.0372928 -0.038686 0.253502 -0.0308327 0.0530523 -0.133513 -0.0252575 0.0499974 -0.0564361 0.116479 0.0206301 0.064164 -0.0864549 -0.0963918 -0.011615 0.0526949 -0.0568253 -0.00534318 -0.0468746 0.124658 -0.0736704 0.0743704 0.0343176 -0.0406246 -0.121617 0.0113926 0.125096 0.00126599 -0.0446086 0.00587102 0.0276345 -0.15423 -0.110419 0.0553546 -0.0504448 -0.034514 -0.0700291 0.0390686 0.0887013 -0.0281469 0.0446288 0.0113943 -0.0379499 0.108105 -0.112808 0.0327064 -0.125778 0.0693593 -0.0620026 -0.133304 0.0392057 0.0976228 -0.0961818 -0.031582 0.0809651 0.161021 -0.118418 -0.0836935 0.032802 0.17751 0.0321453 -0.00403776 -0.0518083 -0.0401 -0.0507693 0.149894 0.0170422 0.0130499 
0.076804 -0.0257753 -0.0926014 0.00857747 0.0252692 0.15989 0.0244019 -0.042015 -0.0440593 -0.122349 0.0773005 0.152451 0.0993044 -0.0837028 -0.142069 -0.0332357 -0.129603 0.027521 -0.10637 0.112778 0.198607 -0.0626628 0.0178908 0.172947 -0.0151915 0.00170417 0.0282766 -0.218874 -0.031376 0.169057 -0.0527079 0.00778683 -0.0178391 0.0785382 -0.0580837 -0.00702098 -0.117344 0.0586881 -0.0671135 -0.0005571 0.00927667 -0.0819485 -0.0384872 0.141055 -0.0949075 -0.0539765 0.157613 -0.0688454 -0.155471 0.0436509 0.0459462 -0.0542806 0.00789202 0.0366612 0.137439 0.063427 -0.0304231 0.183463 -0.0331606 -0.112688 -0.0395904 -0.00537755 0.247347 -0.0494043 0.0372589 -0.090153 0.00858429 0.00921729 -0.0706304 0.0581283 -0.0234641 0.00481182 -0.0777052 -0.0600683 0.037429 0.0510067 -0.0402487 -0.0226595 -0.0272189 0.1447 -0.0624728 0.00968638 0.00516753 -0.0586369 -0.141289 0.0750112 0.10816 -0.0494521 -0.0353504 0.0376028 0.041669 -0.20421 -0.0773389 0.0346509 -0.106648 -0.0231645 -0.0567436 0.0320937 0.115622 -0.0263074 0.0474212 0.0365885 -0.0333901 0.126425 -0.103159 0.0416233 -0.128245 0.140969 -0.126013 -0.131788 0.0332162 0.0929158 -0.0999895 -0.0587264 0.0390194 0.151988 -0.111781 -0.0678575 0.0575082 0.158832 0.0242164 -0.0463228 -0.0321626 -0.0112497 -0.0303535 0.131531 0.00884531 0.00305636 
0.0837691 -0.0295201 -0.0520515 0.0654531 0.0380244 0.152415 0.0700576 -0.0712325 -0.0131989 -0.115503 0.0833481 0.162533 0.0859959 -0.0802836 -0.150466 -0.0575193 -0.133647 0.12052 -0.129548 0.119335 0.214682 -0.0820897 0.0153203 0.228073 -0.00628505 -0.0818655 -0.0392444 -0.191442 -0.0379859 0.210721 -0.0695952 0.0395133 -0.0277681 0.109154 -0.0375137 -0.0182575 -0.103461 0.00449362 -0.0718617 -0.0428957 0.0121257 -0.0852727 0.0101549 0.0977244 -0.109603 -0.148164 0.135653 -0.0463721 -0.105755 0.0950366 0.0622214 -0.0819049 0.00670266 0.0528058 0.147544 0.0749224 -0.0219831 0.151222 -0.0435674 -0.0933468 -0.0265501 0.0334292 0.209501 -0.076566 0.00635653 -0.0568613 1.66296e-05 -0.0714589 -0.134877 0.0763152 -0.0376607 0.0131789 -0.0634716 -0.0101582 -0.00902004 0.0262479 0.0246523 -0.0507515 -0.0133538 0.084166 -0.0487025 0.0360034 -0.00398925 -0.0543515 -0.0990191 0.101006 0.0617531 -0.051224 -0.0190494 0.0812779 0.0817272 -0.211075 -0.0536646 0.0152232 -0.108028 -0.0269449 -0.128514 0.0505021 0.114495 0.00766574 0.101421 0.0346104 -0.0191393 0.115314 -0.0311284 0.0534131 -0.0816479 0.105854 -0.122051 -0.0728541 -0.00398299 0.0796977 -0.0582793 -0.046738 0.0138714 0.134664 -0.0091673 -0.0280331 0.0515446 0.166556 0.030706 -0.0546982 -0.05222 -0.0156427 -0.0669292 0.13745 0.02435 0.00201704 
0.096513 -0.06636 -0.110965 0.0547533 0.0918932 0.156019 0.0573424 -0.0671762 -0.0122317 -0.10356 0.0713962 0.15028 0.102522 -0.0707813 -0.143132 -0.0476278 -0.0878028 0.148677 -0.105859 0.15368 0.230074 -0.0962617 0.0312588 0.239655 0.00306815 -0.0955135 -0.0477621 -0.242446 -0.0362259 0.215582 -0.0314077 0.0343087 -0.0475691 0.0762071 -0.00156585 0.00915873 -0.110651 -0.0141046 -0.0732479 -0.0812581 -0.0060884 -0.0504012 -0.0257938 0.136084 -0.119603 -0.109647 0.135602 -0.00727006 -0.0826465 0.0744827 0.0305606 -0.104931 0.023167 0.007483 0.122237 0.0662805 -0.0266968 0.163664 -0.0156773 -0.103699 -0.00357828 0.0394906 0.216892 -0.089343 0.00834757 -0.115681 -0.00352249 -0.0414745 -0.0959839 0.0513901 -0.0252894 0.0415372 -0.0714008 -0.0828476 -0.0758367 0.0271894 0.00760929 0.00183833 -0.00226839 0.0944725 -0.058906 0.0659566 -0.0587466 -0.0624822 -0.080183 0.0897943 0.0533911 -0.035867 -0.0184736 0.0440958 0.0967745 -0.159816 -0.0631166 0.00231905 -0.0816195 -0.0389935 -0.120829 0.0573524 0.0820655 -0.0144205 0.111088 0.0118413 -0.0189988 0.0872923 -0.0565272 0.0407486 -0.0887925 0.0781563 -0.097999 -0.0101974 -0.00256864 0.0640914 -0.0623784 -0.0553916 -0.0052196 0.145668 -0.0461688 -0.0728466 0.00587051 0.156008 -0.00352064 -0.026236 -0.0667477 0.0191772 -0.111257 0.11149 -0.0309285 -0.0207787 
0.0397449 -0.0460309 -0.149535 0.0195667 0.0268193 0.101702 0.00868515 -0.00760278 -0.031957 -0.0588559 0.0704008 0.113108 0.114637 -0.0798934 -0.154154 -0.048458 -0.107109 0.0604586 -0.0749575 0.188093 0.179809 -0.155338 0.0721598 0.21459 -0.0142213 -0.019766 0.0245685 -0.239038 0.0166605 0.125692 -0.0266993 -0.00211905 -0.00437198 0.0411216 -0.0923846 0.0135289 -0.137128 0.0799986 -0.135348 -0.0401734 -0.00735393 -0.0867539 -0.0807912 0.197163 -0.128474 -0.0844514 0.171641 -0.0035656 -0.0924053 0.0572645 -0.00476609 -0.061913 -0.00543781 -0.00579455 0.117381 0.0515637 -0.0102787 0.149177 0.0460332 -0.163613 -0.0307976 0.000149082 0.237359 -0.00647341 -0.0145829 -0.106694 0.0216195 -0.027407 -0.0154482 0.0420309 -0.0605384 0.0322775 -0.0592128 -0.0252223 0.0222225 -0.0215304 -0.0318158 0.0780824 -0.00823011 0.108116 -0.0980828 0.032852 -0.0632773 -0.0861664 -0.0703922 0.0907348 0.0611751 0.00670331 0.0307551 -0.0271122 0.0719241 -0.11957 -0.060443 -0.0464183 -0.0568187 -0.0739281 -0.0767542 0.0927271 0.0977377 -0.0783366 0.0522881 -0.00528995 0.0242127 0.0929975 -0.105891 0.0523501 -0.11484 0.125367 -0.0378882 -0.0891929 0.0108179 0.150907 -0.0652336 -0.0749598 -0.00202975 0.125681 -0.0557909 -0.137913 0.0576443 0.149009 -0.0262225 -0.0159395 -0.0641624 0.0312066 -0.157834 0.101075 -0.048255 0.0269343 
0.0404077 -0.0685975 -0.129782 0.0132121 0.0711544 0.122357 -0.00933626 -0.0170956 -0.029054 -0.0662767 0.0640955 0.132138 0.095598 -0.0852028 -0.143428 -0.0343908 -0.107543 0.0834998 -0.0724152 0.192664 0.189785 -0.137539 0.0629562 0.244183 0.00373361 -0.0155216 0.0374955 -0.222434 0.0222594 0.111888 -0.0112514 -0.0163714 -0.0216161 0.0536446 -0.0754545 0.0380839 -0.132724 0.0246299 -0.121926 -0.0608833 0.0243771 -0.0781568 -0.0489554 0.196184 -0.126478 -0.110041 0.174335 0.0258175 -0.0754934 0.0695874 -0.00641079 -0.0949375 -0.0161944 -0.0194515 0.140461 0.0562637 -0.0350415 0.16257 0.0252579 -0.160683 -0.0285013 0.0119212 0.243608 -0.000167042 -0.00932129 -0.0966691 -0.00531981 -0.0301848 -0.0207351 0.064681 -0.06686 0.0528772 -0.059576 -0.0367431 0.0154013 -0.0247681 -0.0194745 0.103787 0.00559071 0.0831715 -0.0676869 0.0699627 -0.0435997 -0.0734421 -0.0667045 0.0803346 0.0682304 0.0504263 0.0318271 0.000467321 0.0993958 -0.106129 -0.0751581 -0.0244385 -0.052122 -0.0587336 -0.0981093 0.0912858 0.0785386 -0.0834274 0.0591544 -0.0253903 0.00877442 0.0585112 -0.0915342 0.0732589 -0.121921 0.0888899 -0.0484623 -0.0698916 0.0146769 0.152179 -0.0471528 -0.0503741 0.00541724 0.11229 -0.0523161 -0.123632 0.0316029 0.152635 -0.00460202 -0.0107089 -0.0528022 0.016681 -0.188846 0.114932 -0.045472 0.0216445 
0.0626175 -0.0805641 -0.108806 0.00693973 0.079023 0.106759 -0.0128958 -0.0142773 -0.0181147 -0.11344 0.0514294 0.140125 0.0929235 -0.0867897 -0.143225 -0.0253849 -0.0993714 0.0822096 -0.134469 0.197699 0.193605 -0.103706 0.0964029 0.231526 -0.0297018 -0.0246259 0.0337797 -0.225482 -0.0159967 0.0901016 -0.0272483 0.00933616 -0.00626516 0.0894701 -0.0782979 0.0238681 -0.118386 0.0877063 -0.144304 -0.0439185 0.0187804 -0.0490563 -0.0702202 0.164918 -0.125427 -0.0839183 0.156447 0.0196394 -0.0882747 0.107941 -0.00560558 -0.108534 -0.0152136 0.00078386 0.137132 0.028815 -0.00488581 0.151117 0.0145784 -0.157407 -0.0277975 0.0218977 0.218812 0.0012579 -0.00799875 -0.119618 -0.00898792 0.0168319 -0.0275106 0.077968 -0.0502541 0.0213496 -0.0456881 -0.0257033 0.00685488 -0.0156602 -0.0378012 0.063025 -0.00271694 0.0814257 -0.0619224 0.0786061 -0.0561247 -0.10113 -0.0902227 0.0784702 0.0735704 0.0442914 -0.000467639 0.017031 0.10866 -0.132179 -0.07327 -0.0334188 -0.0516274 -0.026022 -0.0980626 0.0818032 0.072625 -0.079255 0.0645088 -0.0331686 -0.00808394 0.095132 -0.0774718 0.0311722 -0.149348 0.0906963 -0.0485736 -0.0899683 0.0212607 0.179421 -0.05501 -0.0275292 0.00959618 0.11925 -0.078331 -0.134329 0.0299583 0.159842 -0.00384178 0.0339145 -0.0454655 0.0328092 -0.144139 0.0844144 -0.0376903 -0.0124493 
0.0426818 -0.0658982 -0.10342 0.00131888 0.0717184 0.124178 -0.00209615 -0.00950522 -0.046672 -0.0654436 0.0466021 0.102715 0.112016 -0.0626962 -0.105426 -0.0468572 -0.110341 0.094642 -0.0935186 0.196462 0.180607 -0.13207 0.0908072 0.239379 -0.0216289 -0.0293717 -0.0069097 -0.230141 0.011483 0.0822021 -0.0114708 -0.00210918 -0.0329878 0.0643243 -0.0644133 0.0534716 -0.120781 0.0676303 -0.137824 -0.0481647 0.0323699 -0.0624638 -0.0755956 0.170986 -0.14529 -0.0909302 0.170699 0.0406776 -0.0877059 0.0850848 -0.0246855 -0.109337 -0.0237764 -0.00048783 0.138456 0.047646 -0.00857764 0.161324 0.0424725 -0.169728 -0.0269635 0.0482459 0.217416 -0.0158195 -0.00201801 -0.0875761 0.013328 -0.00810267 -0.017201 0.0759755 -0.0557616 0.0563495 -0.0406254 -0.0099547 0.0118531 -0.0347843 -0.0453162 0.0916778 0.0305112 0.0570337 -0.0686127 0.0785624 -0.0655481 -0.0956441 -0.0782821 0.0857865 0.0719524 0.0473282 0.0240275 0.00280549 0.124353 -0.106875 -0.0419226 -0.0686013 -0.0629669 -0.0632448 -0.0914164 0.114153 0.0713161 -0.0735001 0.0609592 -0.021278 0.0157595 0.0670387 -0.0854821 0.0682508 -0.136688 0.0846945 -0.0337747 -0.0594532 0.0132888 0.169308 -0.0503198 -0.0562299 0.000186824 0.113427 -0.0473159 -0.15437 0.0197985 0.144446 0.000538071 -0.00768397 -0.0470956 0.0425684 -0.196167 0.095509 -0.0561777 0.0220513 
0.0662672 -0.0625902 -0.12123 0.037244 0.0781261 0.102242 0.00993264 -0.020527 -0.0445304 -0.074839 0.0779855 0.143876 0.103124 -0.0713203 -0.172994 -0.0176466 -0.0595218 0.132431 -0.100868 0.194697 0.225845 -0.132935 0.0637505 0.25824 -0.0130907 -0.0394594 0.00304829 -0.222037 0.0255896 0.140568 -0.0485135 0.0209214 -0.0317511 0.060229 -0.0879328 0.00638884 -0.151737 0.0463873 -0.11174 -0.0417536 -0.00988975 -0.0416765 -0.067282 0.156534 -0.109636 -0.108912 0.167097 -0.00628737 -0.0899806 0.063688 0.0314365 -0.0737925 -0.0366966 -0.0137706 0.114348 0.052136 0.00668449 0.164147 0.0323529 -0.124714 -0.00440942 0.0232383 0.222482 -0.0179743 -0.0143305 -0.132675 -0.00876464 -0.03073 -0.0391456 0.0762813 -0.042313 0.0444991 -0.0546184 -0.023631 -0.0281985 -0.0175173 -0.0011814 0.0925365 -0.0131634 0.060973 -0.0876756 0.0816793 -0.0497246 -0.0864334 -0.0746089 0.0906663 0.0677363 0.019106 0.00833069 -0.0178705 0.0790133 -0.114261 -0.0744828 -0.0210698 -0.0280037 -0.0499282 -0.0913478 0.0884118 0.0628563 -0.0580484 0.0656468 -0.00940342 -0.0023144 0.120434 -0.0694829 0.0533155 -0.109669 0.0861812 -0.0393643 -0.0875133 -0.0101175 0.139617 -0.0514625 -0.0393509 0.00778131 0.118585 -0.0520489 -0.130213 0.0250615 0.148576 -0.0453804 0.00986379 -0.0703436 0.0123086 -0.167474 0.119993 -0.0561891 -0.00705797 
0.0545318 -0.0539134 -0.109101 0.0315513 0.0676088 0.116457 0.0155181 -0.0201144 -0.0508854 -0.0500719 0.0726826 0.129084 0.112394 -0.0710655 -0.155531 -0.0376768 -0.0923696 0.152243 -0.0973858 0.170264 0.223211 -0.148885 0.062058 0.254847 0.000518082 -0.0636284 -0.016249 -0.217887 0.0142308 0.147655 -0.0488992 0.0135175 -0.0377065 0.0643513 -0.0742095 0.00792106 -0.16004 0.00440644 -0.113308 -0.0573876 -0.00147846 -0.076732 -0.047211 0.16462 -0.125698 -0.126618 0.158003 0.0104548 -0.0931262 0.0664391 0.0391324 -0.0852697 -0.0294649 -0.0118115 0.107904 0.0625017 0.00551896 0.142684 0.0424255 -0.13067 0.00360881 0.037614 0.204803 -0.00619657 -0.0214382 -0.115153 -0.0172194 -0.0394036 -0.0493697 0.0851329 -0.0556405 0.0490569 -0.0567776 -0.0419984 -0.0302749 -0.0135704 -0.00512735 0.0755914 -0.00371075 0.063338 -0.0869696 0.0598712 -0.0444354 -0.0679614 -0.0860356 0.105177 0.0672987 0.00673634 0.0179829 0.0049925 0.0773897 -0.11384 -0.065869 -0.0366341 -0.0648208 -0.0547043 -0.120447 0.104675 0.0697801 -0.0569427 0.0929041 0.00295863 0.0128591 0.0975873 -0.0432344 0.0502499 -0.111479 0.102525 -0.0506394 -0.0715226 -0.0143425 0.126608 -0.0499291 -0.0601805 0.000462292 0.124837 -0.0285171 -0.107396 0.0354809 0.156265 -0.0241045 -0.0274128 -0.080555 0.0107818 -0.178448 0.116776 -0.0494847 0.0179212 
0.036593 -0.0608806 -0.125234 0.0132285 0.0502723 0.0974485 -0.0075024 -0.0118485 -0.0552592 -0.0196924 0.0717445 0.131975 0.110235 -0.06293 -0.148922 -0.0318226 -0.0941182 0.11153 -0.0487262 0.185244 0.201032 -0.160895 0.0786973 0.223967 -0.00818986 0.00953927 0.0300764 -0.238261 0.029372 0.120873 -0.0416864 0.00488378 -0.00893404 0.0305119 -0.080506 0.0175499 -0.15823 0.0738912 -0.111928 -0.0530618 -0.00994705 -0.0780189 -0.0878289 0.186739 -0.137782 -0.0973424 0.169228 -0.00284418 -0.092 0.0377707 0.0268473 -0.056544 -0.0344811 -0.0151655 0.126807 0.0589098 0.015933 0.146588 0.040421 -0.146249 -0.00440381 -0.0186612 0.233513 0.00918367 0.0179333 -0.124951 -0.0120815 -0.0104979 -0.00656376 0.0913238 -0.0574045 0.0564937 -0.0675584 -0.0398882 -0.00610031 -0.0286626 -0.0297537 0.112815 0.00185212 0.0688681 -0.115037 0.0576034 -0.0422393 -0.0717015 -0.0786522 0.0538396 0.0865746 0.0428456 0.0517719 -0.0325464 0.0530293 -0.0879929 -0.058398 -0.0360664 -0.0490753 -0.0817397 -0.074431 0.109313 0.0873354 -0.0799374 0.0671878 0.000509372 0.0122589 0.0806262 -0.0631675 0.0525863 -0.109695 0.0881393 -0.0140896 -0.0955733 -0.0183605 0.150343 -0.0568355 -0.0703564 0.0285444 0.117363 -0.0443589 -0.156501 0.0412694 0.14772 -0.0204757 -0.0149625 -0.0631237 0.00804102 -0.168292 0.123402 -0.0308552 0.0441336 
0.0582062 -0.0571997 -0.124087 0.0186008 0.0497353 0.102736 4.1748e-05 -0.0200345 -0.0387812 -0.0525877 0.0854981 0.134925 0.108042 -0.0692917 -0.181165 -0.0199145 -0.105 0.114665 -0.0950773 0.166162 0.222845 -0.132247 0.0649224 0.228878 -0.0140792 -0.00521277 0.0267291 -0.221651 0.0307507 0.137568 -0.0582712 0.0145372 -0.0397992 0.0386284 -0.0894153 -0.00377469 -0.179931 0.066093 -0.0915126 -0.0225142 -0.0251081 -0.0615749 -0.09852 0.177115 -0.105077 -0.11346 0.151281 -0.0045695 -0.0868986 0.0453489 0.0384831 -0.0304748 -0.0371455 -0.00991878 0.105247 0.0461944 0.0215427 0.159413 0.0296244 -0.139643 -0.000622683 -0.00827052 0.245851 0.0253647 -0.0250939 -0.136662 -0.000391746 -0.00133536 -0.0035551 0.0886384 -0.0447932 0.049965 -0.0543058 -0.0281421 -0.02423 -0.0308687 -0.0313032 0.0722578 -0.0207191 0.0937607 -0.0773603 0.0629614 -0.0306865 -0.0837379 -0.0921373 0.0728387 0.0875007 0.0210486 0.0295005 -0.0375818 0.057176 -0.108829 -0.0724157 -0.0138628 -0.0496254 -0.0708916 -0.0859338 0.086556 0.0886927 -0.0693777 0.0766634 0.00295643 -9.30838e-05 0.117515 -0.0594383 0.0410259 -0.112857 0.103645 -0.0230871 -0.102124 0.000871079 0.15217 -0.0715041 -0.0445852 0.0244541 0.13435 -0.060804 -0.118863 0.0464117 0.134803 -0.0352372 -0.0058697 -0.0596024 -0.00504818 -0.157826 0.120983 -0.0414504 0.0290439 
0.0447274 -0.05599 -0.11498 0.01972 0.0644804 0.0803448 -0.013887 -0.03532 -0.0228362 -0.0570091 0.0711703 0.138793 0.0977872 -0.0861137 -0.184857 -0.00436565 -0.111172 0.122188 -0.111813 0.17594 0.22022 -0.121242 0.0713405 0.235386 -0.0220128 -0.00251938 0.0252445 -0.230554 0.023855 0.138254 -0.0585094 0.0150115 -0.0359113 0.0345946 -0.0773486 -0.00214275 -0.176554 0.0676809 -0.105232 -0.0186185 -0.0241763 -0.0519841 -0.0964013 0.180867 -0.0969237 -0.0883756 0.158294 0.00583402 -0.0802967 0.0455629 0.0394497 -0.0474821 -0.0352856 -0.0223912 0.110559 0.0396055 0.0211511 0.148114 0.0353947 -0.134553 0.0100861 -0.0115221 0.228954 0.047735 -0.0182755 -0.166614 -0.00892681 0.00604763 0.00654686 0.080859 -0.0394621 0.048159 -0.0412067 -0.0391132 -0.030598 -0.0203943 -0.0485503 0.0925202 -0.0232952 0.0880055 -0.0587069 0.0849574 -0.048697 -0.0769737 -0.0963176 0.0712474 0.0826811 0.0319056 0.012665 -0.03358 0.0471752 -0.0931306 -0.0740696 -0.0203833 -0.0551592 -0.0552871 -0.0941766 0.0757843 0.0915977 -0.0783945 0.0799406 -0.0127849 -0.0044687 0.108272 -0.0566871 0.0209424 -0.120285 0.100434 -0.0219322 -0.0802746 0.00751023 0.156761 -0.070309 -0.0427757 0.00581976 0.137496 -0.085771 -0.121303 0.018085 0.123919 -0.0407489 0.0281159 -0.0653338 -0.000832742 -0.161437 0.120929 -0.0644213 0.00749637 
0.0693226 -0.0459358 -0.148503 0.0352139 0.0658008 0.124752 0.0258892 -0.0248379 -0.0482391 -0.0308624 0.0853074 0.135653 0.106798 -0.0991777 -0.170469 -0.0178002 -0.0873805 0.144323 -0.0848321 0.156852 0.21406 -0.127747 0.0560284 0.244003 -0.00933614 -0.0376213 0.00385584 -0.238592 0.029848 0.158579 -0.0582937 0.0308191 -0.0548531 0.0441682 -0.0755368 -0.0102491 -0.167667 0.00469183 -0.082549 -0.0266415 -0.012471 -0.076685 -0.0728525 0.177513 -0.117958 -0.117673 0.159135 0.00786656 -0.0880011 0.0454465 0.06365 -0.0469286 -0.0375531 -0.0220603 0.0894631 0.0544831 0.0251151 0.147241 0.0411662 -0.106874 -0.0020075 0.00877634 0.230813 -0.00919055 -0.0208698 -0.154637 -0.0106558 -0.0339407 -0.0277778 0.0778916 -0.0599913 0.0613965 -0.0634215 -0.0301299 -0.0459539 -0.0245567 -0.0152486 0.0921273 -0.0282959 0.0806903 -0.0719628 0.0612145 -0.039769 -0.0660257 -0.0881309 0.101286 0.0750981 -0.0104125 0.0109188 -0.027049 0.0557655 -0.100702 -0.09114 -0.0248158 -0.0491102 -0.0589082 -0.0940162 0.085294 0.0737726 -0.0564267 0.0875257 0.00635896 0.010106 0.120576 -0.0467936 0.0326051 -0.102022 0.110009 -0.0452027 -0.0579984 -0.00749046 0.127535 -0.0468859 -0.0661174 0.000927754 0.126923 -0.0400041 -0.110622 0.0401768 0.141558 -0.0264334 -0.0249131 -0.0609979 0.00392408 -0.169614 0.114105 -0.0625663 0.0185822 
0.107032 -0.0326553 -0.144034 0.048321 0.0723045 0.152211 0.0576114 -0.02678 -0.0877646 -0.0512134 0.0663928 0.13706 0.100754 -0.135758 -0.140988 -0.0170536 -0.0485612 0.129023 -0.098803 0.161588 0.174985 -0.088443 0.0540141 0.257802 -0.0355748 -0.0585651 -0.0236764 -0.245722 0.00538355 0.144348 -0.0743338 0.0480752 -0.0845502 0.079707 -0.0749577 -0.0247121 -0.135796 -0.00878027 -0.0982296 -0.00214389 0.00262905 -0.0717605 -0.0539804 0.150022 -0.122385 -0.0737948 0.170152 0.00792806 -0.114668 0.091237 0.101508 -0.0848725 -0.0430293 -0.0181912 0.0784405 0.0345659 0.0221455 0.157358 0.0632648 -0.06757 -0.00433904 0.0546914 0.196309 -0.067414 -0.00573137 -0.177805 -0.00239175 -0.0616876 -0.0757053 0.0588431 -0.0691563 0.0544997 -0.0503864 0.0123004 -0.0494504 -0.0112591 -0.000773654 0.0817153 -0.0154276 0.0854864 -0.0468742 0.0392619 -0.0577636 -0.0813988 -0.0825699 0.1019 0.0615871 -0.0607663 -0.0439089 0.00110589 0.0636773 -0.107303 -0.0948597 -0.0333354 -0.0470565 -0.0172567 -0.0550999 0.0631091 0.0573546 -0.0370304 0.0670127 0.0290206 0.00130122 0.157088 -0.0654104 0.00239824 -0.110333 0.128897 -0.0841818 -0.0340715 0.0220395 0.12864 -0.0142203 -0.0715934 -0.0312003 0.113782 -0.046502 -0.0996515 0.0126152 0.15048 -0.0330666 -0.0250724 -0.0503499 0.0228393 -0.139954 0.0877989 -0.0883553 -0.0430323 
0.101225 -0.0566381 -0.170945 0.0419634 0.079323 0.124221 0.0381188 -0.0186429 -0.0748977 -0.0755115 0.031671 0.129103 0.0930189 -0.142246 -0.140035 -0.000775292 -0.0644529 0.103694 -0.0996431 0.190807 0.160676 -0.0946459 0.0912585 0.209758 -0.0550266 -0.0469121 -0.0155103 -0.271662 -0.0345943 0.123855 -0.0804546 0.0695322 -0.0528613 0.0858128 -0.0680466 -0.0129396 -0.0949935 0.0270344 -0.122314 -0.0278033 0.00654809 -0.0732478 -0.0369329 0.152729 -0.139727 -0.0360641 0.188247 0.0103147 -0.1064 0.12147 0.069242 -0.121895 -0.0252781 0.00903887 0.105839 0.00684083 0.0435562 0.108185 0.0678078 -0.092543 0.00182437 0.0491091 0.178793 -0.0588796 0.005152 -0.185248 -0.0132483 -0.035055 -0.034693 0.0414864 -0.0755322 0.0376988 -0.0456909 0.00704838 -0.0426207 -0.00455133 -0.016296 0.0848116 -0.0220648 0.0756049 -0.0341427 0.0519787 -0.0909614 -0.086353 -0.0815994 0.122466 0.0438296 -0.0322551 -0.0401953 0.00759673 0.0852768 -0.101746 -0.112522 -0.0645688 -0.0520231 0.00257783 -0.0511629 0.0855682 0.0614824 -0.0531012 0.06093 -0.00608508 0.0151376 0.139138 -0.0679772 -0.0194867 -0.131643 0.144763 -0.0943443 -0.0145894 0.0103647 0.139281 -0.0110065 -0.0848702 -0.0419828 0.103781 -0.0430164 -0.134988 0.00792223 0.139212 -0.0229447 0.020414 -0.0118911 0.0448477 -0.133591 0.0470203 -0.0839675 -0.0450366 
0.0945508 -0.051254 -0.149865 0.043716 0.0736046 0.088063 -0.00862017 -0.00624538 -0.0621269 -0.144571 -0.00482627 0.149625 0.0319357 -0.150976 -0.181769 0.0201248 -0.0396705 0.0561211 -0.113902 0.198854 0.163174 -0.0706067 0.0856948 0.144449 -0.03919 0.00823665 0.0269571 -0.249557 -0.0619911 0.0887862 -0.0777004 0.0793312 -0.0157958 0.0978632 -0.0738125 -0.0346754 -0.0808624 0.105484 -0.130796 -0.0478419 0.0016556 -0.0263607 -0.0110162 0.157888 -0.089967 0.00918241 0.208591 -0.0554322 -0.140767 0.127067 0.0689242 -0.108139 -0.0191389 0.0195877 0.135515 -0.0192629 0.0260374 0.0941188 0.0566234 -0.142302 0.0150057 0.00590221 0.175202 -0.0365148 0.0323492 -0.199379 -0.0258598 -0.0108389 -0.0191344 0.0671285 -0.0474758 0.00115462 -0.0252873 0.00424743 -0.0451322 -0.0118833 -0.0203538 0.0748145 -0.0470455 0.0734941 -0.0625543 0.0892264 -0.083124 -0.112175 -0.0715837 0.0548417 0.0407502 0.0106872 -0.0182271 0.0104377 0.0552034 -0.116372 -0.146374 -0.0472792 0.00181671 0.0470997 0.014158 0.0672787 0.03068 -0.0589998 -0.00776475 -0.00904346 -0.012009 0.166507 -0.111611 -0.0357762 -0.144386 0.135364 -0.0919103 -0.0742577 0.0356801 0.159167 -0.0671638 -0.0400802 0.00357897 0.0483482 -0.0875082 -0.183252 0.0340883 0.109575 -0.0320956 0.118432 0.0349405 0.0195792 -0.0289985 0.0033686 -0.0102829 -0.0943862 
0.0748212 -0.0172178 -0.114404 -0.0173764 0.112858 0.0800102 0.00364836 0.0316453 -0.0322018 -0.0743102 0.00927873 0.138232 0.0614865 -0.139528 -0.171617 0.03503 -0.0522151 0.0642332 -0.167907 0.195903 0.208554 -0.0806658 0.0482754 0.106827 -0.019333 0.0257143 -0.0169189 -0.197343 0.0142109 0.0810059 -0.0427141 0.0725839 -0.0597728 0.065414 -0.0803912 -0.0436815 -0.117662 0.148039 -0.0663492 -0.0471016 -0.00770738 0.00131197 -0.0321391 0.162116 -0.0602309 -0.0627775 0.158847 -0.0294074 -0.117038 0.084816 0.0497757 -0.05079 -0.108517 -0.00603754 0.111161 -0.0420759 -0.0219425 0.130777 -0.000787146 -0.175831 0.0247311 -0.0544126 0.204547 0.0127764 0.00510253 -0.197514 -0.0402293 0.06253 0.0068871 0.0619583 0.0210814 0.0733049 -0.00479716 0.00210857 -0.0787404 -0.0264238 -0.0373835 0.0932786 -0.0199728 0.0632473 -0.0633338 0.127288 -0.0259304 -0.0626627 -0.0573004 -0.00134633 0.0818458 0.0991815 0.0871817 -0.0334522 0.0245802 -0.122468 -0.151578 -0.000621969 0.0113936 -0.0192934 0.00622168 0.0419512 -0.0298589 -0.0641397 -0.0159926 -0.027964 -0.0448842 0.174805 -0.128099 0.00543415 -0.15674 0.122176 0.00802851 -0.103562 0.0297207 0.173625 -0.142397 0.0531868 0.0649854 0.0355955 -0.120455 -0.155538 0.011191 0.0968584 -0.0522649 0.162047 0.0408201 0.0333521 -0.0477143 -0.0102997 -0.0186181 -0.079915 
0.0708999 -0.0818776 -0.066638 0.0338026 0.109973 0.0485654 -0.0217551 0.00538742 -0.105042 -0.0568183 0.010279 0.178602 0.0299591 -0.104068 -0.151489 0.0224687 -0.00310495 0.106187 -0.0500097 0.195117 0.193361 -0.0738718 0.0749237 0.121483 0.0117743 0.102606 0.0288186 -0.225741 -0.0108488 0.0711852 -0.0711034 0.0552804 -0.0257308 0.0631285 -0.0550323 -0.0591819 -0.107077 0.171087 -0.0270452 -0.0688636 -0.0107142 0.0390074 -0.031231 0.141687 -0.116738 -0.0820245 0.181911 -0.0976736 -0.0863224 0.0543011 0.104267 -0.0693976 -0.0798009 0.0239536 0.146369 -0.0374452 0.0456892 0.117156 0.00791148 -0.153129 0.0502005 -0.0960328 0.174983 0.00443642 0.0761859 -0.19177 -0.0415012 0.0318596 0.0260974 0.095899 0.00243411 0.0873288 -0.00981528 0.00963681 -0.0895212 -0.053153 -0.0320531 0.107122 -0.0104902 0.049881 -0.119448 0.145949 0.0157456 -0.0774046 -0.0339425 -0.089801 0.110485 0.124623 0.0754182 -0.0737082 -0.00313259 -0.0609243 -0.107913 0.00659303 0.0100328 -0.045141 0.0365813 0.0775893 -0.0169956 -0.0672272 -0.045173 0.00252636 -0.0268278 0.173253 -0.0727411 -0.0239409 -0.0973135 0.0678072 0.025879 -0.115514 -0.00115106 0.165048 -0.106607 0.0374082 0.0824155 0.0136927 -0.0905759 -0.210693 -0.0182284 0.0702533 -0.0516807 0.161764 0.01397 -0.0318865 -0.0262381 0.0290236 0.0286879 -0.0479004 
0.0313052 -0.0501661 -0.0481875 0.0223336 0.0704683 0.0184507 -0.0826666 -0.0300356 -0.14055 -0.056424 -0.017089 0.11815 0.00592984 -0.0374626 -0.119849 0.0564532 -0.0151463 0.0573372 0.0941221 0.143892 0.211742 -0.0732323 0.110205 0.0805742 0.0573633 0.143642 0.0554098 -0.232615 0.0140195 0.0919453 -0.0739068 -0.0103985 0.00637814 -0.00455383 0.0060494 -0.0394686 -0.067386 0.18063 0.0513821 -0.059644 -0.0801244 0.0525296 -0.00312267 0.0951319 -0.0872149 0.00330134 0.219271 -0.141728 -0.0788496 0.0108659 0.0901958 -0.0189315 -0.00975917 0.0620273 0.159977 -0.0407038 0.167346 0.0757059 0.00867006 -0.164698 0.103526 -0.101369 0.156602 0.00233858 0.109383 -0.179153 -0.0355759 0.0430717 0.097127 0.103456 -0.0137227 0.110578 -0.0654367 -0.036199 -0.0349876 -0.0390651 -0.0530461 0.128743 0.0131428 0.0828591 -0.115038 0.148184 0.0423363 -0.0278059 -0.0183575 -0.093725 0.0595328 0.133268 0.0639744 -0.111334 -0.0265205 0.000138737 -0.0638599 0.0219358 -0.00530758 -0.0828586 0.0573337 0.175549 0.0269044 -0.0789876 -0.0380732 0.0133407 -0.028599 0.135993 -0.0616834 -0.0224825 -0.0447118 0.0489633 0.0403505 -0.104129 -0.0339072 0.101301 -0.0895888 -0.0102413 0.0866713 0.0746961 -0.0852328 -0.210324 -0.0704082 0.0476305 -0.0566009 0.151972 0.0267573 -0.0921306 -0.0674803 0.0794882 0.0517728 0.0276433 
0.0863693 0.0478691 -0.0687434 -0.0838398 0.112886 0.145713 -0.0310622 0.0163927 -0.184501 0.0188823 0.0424933 0.0468034 0.0736957 -0.031154 -0.0598418 -0.0251256 0.0188196 0.0680109 0.0311798 0.147098 0.151619 -0.0331364 0.0592172 0.063497 0.0257884 0.0990232 0.0359624 -0.136443 0.150304 0.0270507 -0.0328244 -0.0278387 -0.0800427 0.0157972 -0.0220329 -0.00493306 -0.068739 0.145414 0.0638577 -0.0334417 -0.0143724 0.00641104 -0.0696092 0.122659 -0.148129 0.00451562 0.167363 -0.0019845 -0.148581 0.00231847 0.0232664 0.103998 -0.11576 0.0285119 0.0634178 -0.0390585 0.0756739 0.151303 -0.0285585 -0.149036 0.0160311 -0.0424817 0.255493 -0.0385544 0.056203 -0.128093 0.0131161 0.0633674 0.051372 0.141787 0.0105756 0.125273 -0.0483172 0.0319854 -0.00556788 -0.0755294 -0.0609144 0.17053 0.052751 0.0284443 -0.102875 0.137263 0.070445 -0.0192713 0.00664701 -0.0869384 0.0940595 0.136135 0.104925 -0.0526809 0.0911462 -0.052571 -0.0554188 0.0360258 0.0211023 -0.197707 0.0731346 0.138928 -0.0188918 -0.0946141 -0.0397201 0.087488 -0.0394396 0.163636 -0.118145 0.0780644 -0.0515929 0.0884654 0.11304 -0.115436 0.0552883 0.130046 -0.116188 0.0907924 0.0904725 0.0175778 -0.108829 -0.208049 -0.0172282 0.0713595 -0.0336156 0.0359001 0.0110032 -0.0194711 -0.0847996 0.0434119 0.0113169 0.0141495 
0.0297506 0.0707546 -0.115622 -0.041281 0.0820106 0.122763 -0.0196925 -0.00741771 -0.0929721 0.0839035 0.0925354 -0.0197603 0.089105 -0.0726786 -0.00239889 -0.0624469 -0.0230532 0.0528636 0.0663717 0.134227 0.100362 -0.0942309 0.0487063 0.00604506 0.0342821 0.0713088 -0.0487314 -0.174874 0.177703 0.00617531 0.0655864 -5.50009e-05 -0.0531138 -0.0588217 0.0342214 0.038138 -0.0364001 0.120818 0.09527 -0.0601333 0.0454832 -0.0307908 -0.139984 0.125655 -0.185699 -0.0262054 0.130237 0.0644711 -0.0720882 -0.0936824 -0.0956023 0.13641 -0.0585315 -0.0138707 -0.00882072 -0.0224186 0.0553601 0.066819 -0.0440839 -0.147252 -0.051117 -0.0467132 0.245621 -0.0305703 0.029413 -0.0421939 0.086115 0.0274547 0.0970702 0.045359 0.00015499 0.124796 -0.0346426 0.0281765 0.0248689 -0.114548 -0.137879 0.156432 0.0531025 0.073541 -0.118446 0.122499 0.0202401 0.00785339 0.0660677 -0.0102961 0.071521 0.128747 0.0994054 -0.118877 0.129123 0.0195637 -0.00621307 -0.00435301 -0.0232186 -0.309625 0.0328112 0.127093 -0.0256018 -0.1171 -0.0101686 0.0343883 0.0305136 0.0540098 -0.0773371 0.124986 0.0552832 0.106546 0.191462 0.00211513 0.0184335 0.0814012 -0.118611 0.0150952 0.05726 0.000163458 -0.122929 -0.2038 0.0208525 0.0263383 -0.0105425 -0.0171287 -0.0359733 0.0404049 -0.120339 0.0336978 -0.00702307 0.0906178 
0.0854899 -0.0745824 -0.160011 -0.022469 0.149809 0.127666 -0.000618627 -0.0271948 -0.0699486 -0.0192641 0.0471889 0.0948756 0.0838822 -0.0479419 -0.0389085 0.0104952 -0.0384735 0.0395848 0.0116583 0.216307 0.154779 -0.0697305 0.0866632 0.133926 0.019073 0.0603561 -0.00950577 -0.236475 0.0685696 0.0724166 0.0320624 1.08177e-05 -0.0772351 -0.0124658 0.00131227 0.0718337 -0.101337 0.10926 -0.00229652 -0.075634 0.00496603 0.0359641 -0.0922388 0.179893 -0.159603 -0.0465484 0.154405 0.0582287 -0.0433904 0.025715 -0.051936 -0.0583301 -0.0577529 -0.0326543 0.119853 -0.0160619 -0.0420834 0.215898 -0.0275987 -0.125798 -0.046455 -0.0344778 0.288875 -0.0564997 0.0588997 -0.10194 0.0117455 0.0553958 0.04091 0.0374095 0.0167602 0.17732 -0.0288789 -0.0099415 -0.0574457 -0.0681789 -0.0615661 0.119272 0.0425364 0.0826082 -0.0223106 0.11345 -0.0546449 -0.0918421 -0.0283397 -0.043017 0.0739492 0.119694 0.0692238 -0.075807 0.137734 -0.0285898 -0.0942696 0.009222 0.0120663 -0.131586 0.00520862 0.0817262 0.00713575 -0.0868223 -0.015021 -0.0428089 -0.00756425 0.0199903 -0.176312 0.109004 -0.0743306 0.0345428 0.0929281 -0.00875418 0.0494895 0.161473 -0.0761616 0.0140582 0.0710824 0.0685931 -0.0948462 -0.161993 -0.0410506 0.093914 -0.0353143 0.0415045 0.0180596 0.0653592 -0.174421 0.0660393 -0.031209 0.00350334 
0.122289 -0.147698 -0.14197 0.0509803 0.156948 0.0527634 0.0565157 0.0561041 0.000747973 -0.0257102 0.00652705 0.171713 0.0611708 -0.190568 -0.0995036 0.0259635 -0.0136471 0.0572678 -0.135702 0.240342 0.13297 -0.0749241 0.070557 0.173697 -0.0377634 -0.000666843 -0.00250824 -0.253587 -0.0401265 0.0574891 -0.0423025 0.0938435 -0.0410905 0.0834039 -0.0597837 -0.0287324 -0.11035 0.0793898 -0.122829 -0.113809 0.0424256 -0.0276559 -0.1011 0.158217 -0.112446 -0.046453 0.0628665 0.0563916 -0.0278864 0.0899298 0.058325 -0.107021 -0.0401021 -0.0811705 0.127526 -0.0486338 -0.0651382 0.0762394 0.00312769 -0.0689146 -0.00517251 -0.0836523 0.139979 0.0150074 0.0192931 -0.220221 -0.0615707 0.0662518 -0.00237248 -0.0138652 -0.0355773 0.0668043 -0.0302941 -0.0527198 -0.124896 0.00927144 0.00487823 0.123113 0.000801216 0.127822 -0.0379556 0.0337813 -0.0795495 -0.0884147 -0.00657276 -0.0312502 0.0993884 0.0968137 0.0346114 -0.0119997 0.0446425 -0.0323344 -0.170155 0.0330146 -0.0581153 0.0183217 0.00321674 -0.0765154 0.00650149 -0.108261 0.080017 -0.061751 -0.0405116 0.051041 -0.0911706 -0.0553644 -0.121022 0.0674283 0.0290305 -0.000707723 0.0371326 0.193377 -0.0651736 -0.0239979 0.0530579 0.0506145 -0.128666 -0.123889 -0.0403357 0.12344 -0.0553183 0.132011 0.00269703 0.100356 -0.041707 -0.000181971 -0.0280353 -0.108111 
0.103425 -0.0712193 -0.1333 -0.00747935 0.14697 0.0968736 0.0758914 -0.00108457 -0.0486226 -0.0650524 0.01714 0.104629 0.107138 -0.114626 -0.0600279 0.0120275 -0.109185 0.0541715 -0.169701 0.231655 0.139364 -0.0729129 0.0977006 0.158985 -0.0562095 -0.0481131 -0.0476073 -0.213619 -0.0174575 0.0832291 -0.0618269 0.0620587 -0.0875095 0.117002 -0.0287034 0.0190541 -0.0596567 0.0747651 -0.109475 -0.0761225 0.0537008 -0.0529122 -0.0101035 0.151991 -0.161918 -0.0433874 0.129578 0.106533 -0.0673731 0.156544 -0.00783519 -0.179012 -0.0883615 0.0079161 0.153445 -0.0307739 -0.0754081 0.148133 0.000882384 -0.0933177 -0.0272424 0.0111184 0.199517 -0.0265419 0.0181274 -0.112538 -0.0509004 0.0253219 -0.0328313 -0.00305929 -0.049696 0.092152 0.00828659 0.0189144 -0.0390131 -0.0146512 0.000223613 0.0700574 0.0359257 0.0510235 0.0474566 0.0316157 -0.0989995 -0.0868945 -0.0885772 0.0658355 0.0561365 0.060728 0.0311224 0.0548445 0.159444 -0.127252 -0.123337 -0.0646348 -0.0807419 -0.0133629 -0.0722006 0.0351031 0.0474828 -0.0616839 0.0516158 -0.0526852 0.00446299 0.0659678 -0.0945229 0.0225537 -0.162016 0.143201 -0.0192444 -0.00743327 0.0548146 0.187961 -0.0540562 0.00743491 -0.00528741 0.0772801 -0.043765 -0.0661749 -0.0356319 0.127807 -0.00714829 0.0635793 0.0262791 0.12953 -0.136515 0.0063464 -0.0738047 -0.0781132 
0.0865721 -0.0299213 -0.133443 -0.0232122 0.0913119 0.139606 0.0910546 -0.014556 -0.0629841 0.0250362 0.0497526 0.0706204 0.136502 -0.108609 -0.103719 -0.0451948 -0.121681 0.123961 -0.127908 0.169986 0.169612 -0.125947 0.0712014 0.177583 -0.0581633 -0.0266426 -0.0726366 -0.241096 0.048002 0.0930959 -0.0630652 0.0402059 -0.114645 0.0658214 -0.00596479 -0.0126634 -0.117676 0.0980399 -0.0819386 -0.0964592 0.00971552 -0.0836359 -0.109753 0.174257 -0.166903 -0.063744 0.109329 0.107089 -0.11473 0.0563571 -0.0113029 -0.0731648 -0.0628899 -0.0169273 0.0969668 0.00990702 -0.0147966 0.157845 0.0189936 -0.138192 0.00770759 0.0194603 0.252359 -0.00851233 0.0240273 -0.104827 -0.0155467 0.0301246 -0.0167394 0.0483088 -0.0545638 0.0758722 -0.0223111 0.003608 -0.0720107 -0.0436648 -0.0372023 0.0816958 0.0605938 0.0360689 -0.0381782 0.0331322 -0.0898772 -0.0918753 -0.0745846 0.0229037 0.0845276 0.0422536 0.0668471 0.0202916 0.150294 -0.106429 -0.0538732 -0.0661909 -0.0854883 -0.0923612 -0.0513815 0.0660555 0.0721542 -0.048956 0.127703 0.0161563 -0.0043004 0.0695973 -0.0623449 0.0225951 -0.108921 0.125806 0.0157196 -0.0138241 0.0590226 0.182942 -0.0573981 -0.0440549 0.0350398 0.104811 -0.0777463 -0.101035 0.00888728 0.0961098 -0.0277755 -0.0222705 -0.0200244 0.082356 -0.154073 0.0618788 -0.0879148 -0.0399377 
0.124898 -0.0983207 -0.114891 0.0161221 0.132167 0.105644 0.0728315 0.0282442 -0.040611 -0.0211242 0.0323483 0.111898 0.0943955 -0.180041 -0.112743 0.0222881 -0.083487 0.136713 -0.16855 0.19389 0.183149 -0.06907 0.0945028 0.212256 -0.0894778 -0.0618452 -0.0532112 -0.269338 0.00933922 0.0786153 -0.0934701 0.0625611 -0.101695 0.0928801 -0.0300707 -0.0358389 -0.117483 0.05127 -0.114381 -0.0674642 0.00875329 -0.0460666 -0.117114 0.133174 -0.130398 -0.0584003 0.0861134 0.0862036 -0.0872322 0.101528 0.0407066 -0.126067 -0.0612845 -0.0325193 0.0764439 -0.0204725 0.022217 0.101912 0.00972886 -0.0637922 0.0316676 0.0187904 0.179368 0.00657911 0.0164427 -0.200787 -0.04811 0.013632 -0.0133047 0.0230838 -0.0695854 0.0590269 -0.0155836 -0.0100898 -0.115921 -0.0172007 -0.008112 0.105934 0.0191001 0.0533087 0.00321321 0.0411231 -0.113472 -0.0937465 -0.0575165 0.0682577 0.0735514 0.0384075 -0.0121836 0.0255437 0.132097 -0.0717834 -0.132517 -0.0188442 -0.0670582 -0.00132073 -0.0679528 0.00296624 0.0411481 -0.0316353 0.136965 -0.0415518 -0.0367351 0.0772354 -0.0157458 -0.0427444 -0.10382 0.0929966 -0.00462671 0.0043726 0.030267 0.178336 -0.0103398 -0.0465739 0.0166891 0.114461 -0.0908438 -0.0759479 -0.0433733 0.0971204 -0.0638697 0.050351 -0.0216578 0.0807259 -0.120437 0.049868 -0.10959 -0.0962534 
0.111819 -0.099653 -0.119597 0.00943783 0.136137 0.114041 0.0785809 0.011094 -0.0590393 -0.0443716 -0.00785064 0.111259 0.0869424 -0.175428 -0.114384 0.0150952 -0.100122 0.119974 -0.143134 0.184184 0.181007 -0.0722903 0.0968109 0.185765 -0.0844896 -0.0454144 -0.0704553 -0.288527 -0.00152288 0.0862231 -0.0855261 0.0694396 -0.110454 0.0807806 -0.00849679 -0.0341939 -0.104946 0.0638802 -0.106876 -0.0780028 0.0181433 -0.0358404 -0.0868073 0.13581 -0.136568 -0.0322199 0.11809 0.0687845 -0.0943152 0.0930716 0.0287451 -0.142021 -0.0339779 -0.0194268 0.103704 -0.0239719 0.0407431 0.117421 0.0124513 -0.0872247 0.0412383 0.037283 0.184611 -0.003518 0.0439297 -0.189736 -0.0439898 0.013125 -0.00356754 0.0224209 -0.0661176 0.0716082 -0.0180464 -0.00221795 -0.111353 -0.00221349 -0.024942 0.0903648 0.0254426 0.0477513 0.00336686 0.0540717 -0.114672 -0.0889139 -0.0652969 0.0517778 0.0737878 0.048808 -0.0170537 0.0196226 0.137053 -0.0655982 -0.123106 -0.0412348 -0.0693927 0.00391992 -0.0438006 0.0350788 0.0480863 -0.0199295 0.116388 -0.0385872 -0.0302568 0.0843943 -0.041733 -0.0473634 -0.117 0.109137 -0.0212777 0.0135969 0.0396667 0.167272 -0.0295009 -0.0658366 0.0142763 0.126258 -0.0937044 -0.087962 -0.0469182 0.0935418 -0.0545549 0.0586041 -0.00222699 0.0611288 -0.128945 0.0467636 -0.114675 -0.0970448 
0.0950395 -0.111742 -0.117123 0.0281725 0.129023 0.0896456 0.0518757 0.0044926 -0.100329 0.015238 0.0220496 0.144807 0.104165 -0.149146 -0.138196 0.033045 -0.0629476 0.159543 -0.111992 0.204504 0.192018 -0.125684 0.108352 0.178205 -0.070715 0.00815078 -0.0643885 -0.28125 0.0019 0.0755369 -0.0976358 0.0886228 -0.0894036 0.0715065 -0.0404181 -0.0403573 -0.13588 0.0913655 -0.0690891 -0.0825724 0.000460622 -0.0303454 -0.0907995 0.125439 -0.145099 -0.0887322 0.127006 0.0323367 -0.0840163 0.0675295 0.0704228 -0.132878 -0.0787842 -0.00725727 0.0969377 -0.0223552 0.0680474 0.109559 0.0248515 -0.0779319 0.0548929 -0.00225823 0.180006 0.00698945 0.0682964 -0.189456 -0.0667455 0.0226803 -0.000543329 0.0429246 -0.0607455 0.0951831 -0.0164425 0.0061376 -0.122237 -0.0229517 -0.00927604 0.113634 0.0178572 0.0245311 -0.0558392 0.0495155 -0.0748657 -0.07781 -0.0833107 0.0293693 0.102359 0.0745677 0.0276537 -0.0364359 0.0786772 -0.0533364 -0.0995023 -0.0226419 -0.0584247 -0.0240864 -0.0433809 0.0647779 0.024179 -0.0226898 0.0967799 -0.0254511 -0.0320105 0.118576 0.0177453 -0.0301138 -0.0989215 0.103785 0.00832487 -0.0249467 -0.0285787 0.171126 -0.0190977 -0.0390701 0.039247 0.0943939 -0.0713246 -0.106752 -0.0380161 0.0952401 -0.0717198 0.0566644 -0.0122615 0.0293536 -0.129642 0.0664246 -0.103471 -0.0576236 
0.0846822 -0.0818741 -0.14452 0.0172406 0.152403 0.0962611 0.0197105 -0.0183802 -0.0897162 0.0135319 0.0356431 0.1294 0.0963644 -0.120401 -0.13543 0.0542739 -0.0480496 0.170602 -0.0968191 0.194746 0.207101 -0.116719 0.104687 0.180007 -0.0246079 0.00803975 -0.0277656 -0.260683 0.0265368 0.0909315 -0.0670461 0.0618877 -0.0728371 0.0546474 -0.0261471 -0.0151597 -0.13273 0.0654738 -0.0545065 -0.0907714 -0.00359153 -0.0125514 -0.0511486 0.168431 -0.144588 -0.0804573 0.157255 0.0497489 -0.0851727 0.048599 0.0613572 -0.11634 -0.0834747 -0.0287306 0.106136 -0.0123901 0.0506449 0.126362 0.036137 -0.114232 0.0296929 -0.0154586 0.209957 0.0107676 0.0534912 -0.171066 -0.0849466 0.045512 0.0139201 0.0666145 -0.0398619 0.113382 -0.0265893 -0.0355071 -0.104748 -0.03128 -0.0278963 0.145427 0.00191741 0.0145357 -0.0427405 0.0957316 -0.0639245 -0.0717804 -0.0921693 0.0368638 0.084614 0.0846828 0.0402454 -0.0316373 0.0743313 -0.0495388 -0.123532 -0.0347966 -0.0316929 -0.0377088 -0.0610353 0.0997839 0.00973836 -0.0573768 0.0814914 -0.0335605 -0.00198067 0.0981627 -0.0278172 -0.00162287 -0.113025 0.0950588 0.0263154 -0.0328006 -0.012433 0.163434 -0.0285119 -0.0114511 0.0470917 0.0795641 -0.0828593 -0.124105 -0.0332948 0.0980339 -0.0436727 0.0603093 -0.00446334 0.0265807 -0.158455 0.0664376 -0.0838554 -0.0356328 
