0.0349873 -0.0363057 -0.0952638 -0.0832336 0.0237959 0.0762211 -0.0179959 0.0144209 -0.067376 -0.0911538 -0.0306155 0.0929108 0.137354 -0.0737217 -0.161554 -0.0367359 -0.158092 -0.0258838 -0.170684 0.170026 0.123474 -0.117287 0.118829 0.0371735 -0.0884477 0.0461762 0.019655 -0.174877 -0.0831987 0.0232146 -0.0661029 -0.027786 -0.0461149 0.0713283 -0.0749586 -0.0343481 -0.132951 0.221526 -0.126621 -0.0207187 -0.0370222 -0.070702 -0.075092 0.170054 -0.108322 -0.0213482 0.100301 0.0206121 -0.103798 0.14935 0.0174529 -0.110196 -0.0542837 0.0463396 0.101827 -0.0531369 -0.0134332 0.127731 0.0351143 -0.185707 0.018308 -0.00308155 0.193437 0.0583253 0.0391627 -0.158901 -0.0279866 0.111861 -0.00306816 0.0219723 -0.0104888 0.0114627 0.0233819 -0.029025 -0.017207 0.0300571 -0.0718032 -0.0355044 0.034722 0.142049 -0.0409187 -0.0690276 -0.0258414 -0.0452386 -0.165901 -0.0398791 0.113122 0.0790804 0.088673 -0.0162607 0.00972042 -0.15371 -0.0169218 -0.0301671 -0.106971 -0.0284963 -0.00400636 0.0635137 0.0399884 -0.0581232 0.0317801 0.044486 -0.0606042 0.127362 -0.065653 -0.0355945 -0.193028 0.170309 -0.0499637 -0.106917 0.0692469 0.184986 -0.108534 0.0480327 -0.0106533 0.122788 -0.119055 -0.0336759 0.00539148 0.111059 -0.0772909 0.0401392 -0.00351192 0.0114575 -0.0276517 0.00307598 -0.059454 -0.0335232 
0.0262769 -0.0358364 -0.0857009 -0.0931146 0.0338335 0.0849082 -0.0366977 0.0191142 -0.0883951 -0.121547 -0.0705572 0.0814292 0.118728 -0.0549351 -0.131301 -0.0467668 -0.154871 -0.0522632 -0.141482 0.152497 0.115114 -0.103392 0.119309 0.0399611 -0.0553553 0.041131 0.0273807 -0.167082 -0.0994224 0.0125805 -0.0404359 -0.0517694 -0.0561869 0.0642423 -0.0660474 -0.0170607 -0.135715 0.190229 -0.136071 -0.0172193 -0.025068 -0.0498444 -0.0497072 0.179963 -0.0953763 0.0122086 0.120199 0.0156796 -0.107452 0.149026 0.0188018 -0.129726 -0.0297682 0.0305132 0.113193 -0.0484337 -0.0264238 0.156209 0.0622646 -0.204973 0.0219173 0.029077 0.169361 0.0531856 0.0431579 -0.149452 -0.0263435 0.111905 -0.000490442 0.0239252 -0.00326015 0.0252284 0.0286331 -0.0504892 -0.0114083 0.0448759 -0.0819879 -0.0434693 0.044971 0.158502 -0.0329267 -0.065535 -0.0226929 -0.0475748 -0.163531 -0.0575379 0.108128 0.0779364 0.0716019 -0.0159582 0.00401822 -0.135755 -0.01556 -0.0427238 -0.103604 -0.00567916 0.0152975 0.0781346 0.0277498 -0.062579 0.003647 0.0471876 -0.0540755 0.117774 -0.11277 -0.0322927 -0.219703 0.162713 -0.0731328 -0.102757 0.101349 0.176716 -0.121662 0.0423978 -0.0237239 0.12222 -0.128212 -0.0377727 -0.00240982 0.110763 -0.0685864 0.0478279 -0.00397811 -0.00192604 -0.032323 -0.00678973 -0.0627341 -0.0432293 
0.00157765 -0.0159489 -0.0714239 -0.11978 0.0503803 0.113539 -0.0125382 0.0128606 -0.0986441 -0.0990058 -0.076688 0.0621887 0.109712 -0.074263 -0.107944 -0.0671903 -0.203683 -0.0583369 -0.138537 0.137085 0.0992186 -0.0984184 0.0869639 0.0317129 -0.0512224 0.0345667 -0.0112297 -0.151815 -0.052891 -0.00987631 -0.00777219 -0.076168 -0.120756 0.0415494 -0.0444854 0.00744347 -0.15917 0.132962 -0.112593 -0.0031884 0.0155876 -0.0622309 -0.0575608 0.204001 -0.101433 0.0182945 0.117279 0.0599929 -0.116559 0.123396 -0.0293174 -0.122504 -0.0583147 -0.00118664 0.0907276 -0.0440492 -0.0674961 0.203081 0.0468299 -0.183954 0.0167198 0.0688086 0.201138 0.0686175 0.0420419 -0.13184 -0.0109905 0.0908995 0.0102766 0.0280557 0.00400335 0.0697781 0.0497936 -0.0137862 -0.0107496 0.0254475 -0.102354 -0.0234173 0.0643921 0.142927 -0.00605212 -0.0582629 -0.0200395 -0.0287377 -0.169354 -0.0554243 0.11764 0.0895424 0.069453 -0.0179957 0.0552662 -0.11105 -0.0033613 -0.0538178 -0.107174 -0.0348245 0.0118353 0.0697255 0.0207457 -0.055026 -0.00840257 0.0423638 -0.0546888 0.0803227 -0.123812 0.00970845 -0.20645 0.185826 -0.0577969 -0.0646527 0.130384 0.167141 -0.128762 0.0449273 -0.0303355 0.118168 -0.121503 -0.013479 0.00202064 0.0986101 -0.055678 0.0166648 -0.0113151 0.0112603 -0.0895552 0.000256346 -0.104014 -0.0362325 
-0.00761301 0.112761 -0.0934079 -0.0509001 -0.00152212 0.153594 0.0181298 -0.0711196 -0.120236 -0.0500105 -0.0414713 0.0287103 0.0565816 -0.0575721 0.0126055 -0.102498 -0.140365 -0.0808463 0.0643777 0.0701248 0.0485562 -0.0741836 0.0364515 0.01579 0.0191183 0.0864758 -0.0486199 -0.219304 0.0204989 0.0800207 0.0254275 0.0100347 -0.0382303 0.0083154 0.0542598 0.042254 -0.0230647 0.12992 -0.0127777 -0.0477976 0.0421161 -0.109425 -0.00385536 0.156572 -0.150089 0.129692 0.220648 -0.0252958 -0.203964 0.00182926 -0.0450569 -0.00160963 0.0452656 0.0120454 0.145098 0.0551658 -0.0425814 0.187582 -0.00492234 -0.163533 -0.065203 0.0144461 0.241247 -0.107851 0.142815 -0.0173127 0.0457241 -0.0193878 -0.0491573 0.0667821 -0.0311901 0.0446506 -0.0822107 0.0213127 0.0811093 0.00259606 -0.103941 -0.00847624 0.0615017 0.129054 -0.0950746 0.000992033 -0.028686 -0.0339435 -0.0653533 -0.0824805 0.0621018 -0.0227134 0.0403101 0.0257646 0.0814093 -0.113099 0.0143414 -0.0835307 -0.0613293 -0.0907782 0.0941882 0.137323 0.0952146 -0.0626014 -0.0597751 0.0995691 0.001584 0.055952 -0.209592 0.0773452 -0.0829493 0.170466 -0.0266029 -0.0575013 0.107339 0.0781338 -0.162745 -0.0967129 0.0456767 0.0562049 -0.0701332 -0.190027 0.0974063 0.132965 0.0869516 -0.050982 0.0132442 0.0331459 -0.0282544 0.0460031 0.0648936 0.0210713 
0.000759653 0.105861 -0.0831055 -0.0331787 0.017832 0.149474 0.0344915 -0.0928149 -0.117008 -0.0581217 -0.0649524 0.0255855 0.0414552 -0.050282 0.02802 -0.110386 -0.156521 -0.0764493 0.0533656 0.0713271 0.0354934 -0.0735307 0.0358917 0.0165712 0.0340321 0.053319 -0.0748802 -0.206826 -0.0084754 0.0902387 0.0176609 0.00992253 -0.0511427 0.00797205 0.0720794 0.050732 -0.0304971 0.0964053 -0.0328264 -0.0762466 0.0458298 -0.109805 0.0226733 0.150801 -0.154182 0.157337 0.215738 -0.00104105 -0.19118 0.0281358 -0.0390646 -0.0111787 0.0602655 0.00396563 0.175191 0.0390628 -0.0586332 0.180182 0.00703321 -0.159328 -0.058936 0.0396293 0.218864 -0.0976631 0.131179 -0.00268321 0.0283198 -0.0121387 -0.0653094 0.0673307 -0.0156957 0.0622536 -0.0672267 0.0166263 0.0716262 0.0245952 -0.101212 -0.0331859 0.0760528 0.131413 -0.0618275 -0.00300838 -0.0463587 -0.0396422 -0.0654314 -0.0789012 0.0399106 -0.0195113 0.0348403 0.0593546 0.0893917 -0.100351 0.00974219 -0.0992479 -0.08982 -0.0777082 0.0903372 0.128528 0.110689 -0.0763435 -0.0361537 0.103406 0.022356 0.0183505 -0.228298 0.0776212 -0.0990913 0.17457 -0.0256749 -0.02146 0.134806 0.0791206 -0.156346 -0.107576 0.0355741 0.0628469 -0.058258 -0.158372 0.0858844 0.140049 0.094983 -0.052574 0.0234195 0.0379987 -0.0331672 0.0449175 0.0822555 0.00849411 
0.011768 0.057673 -0.0571204 -0.0488678 -0.0102163 0.174431 0.000963827 -0.0518359 -0.0983296 -0.109313 -0.0574663 0.0476951 0.0347757 -0.100259 -0.0212678 -0.116089 -0.194358 -0.0858264 0.00208798 0.0903342 0.0534981 -0.0567785 0.0582935 0.0486503 -0.00361416 0.077069 -0.0196611 -0.218807 -0.0362535 0.0210576 0.0251283 -0.0437812 -0.0669489 0.0479478 0.0409989 0.0358767 -0.0473316 0.12882 -0.0663232 -0.0438728 0.0527359 -0.111333 -0.021642 0.177894 -0.141649 0.0759917 0.200656 -0.00457191 -0.183536 0.0940399 -0.032728 -0.0520107 0.0336278 0.0286143 0.165384 0.0176905 -0.0491248 0.183256 0.0179588 -0.201869 -0.0484215 0.0422357 0.238965 -0.0657853 0.109793 -0.0512564 0.0520582 -0.0180971 -0.0432052 0.100354 -0.0444011 0.0394537 -0.037026 0.0504085 0.0622119 -0.0264292 -0.114855 -0.0216464 0.070622 0.153273 -0.0600937 -0.00505703 -0.0231792 -0.0673768 -0.0778478 -0.0949677 0.0732124 0.0143732 0.0414287 0.0491953 0.109457 -0.12126 0.0113854 -0.0920651 -0.0896507 -0.0620399 0.0797186 0.117146 0.0874563 -0.0652649 -0.0443861 0.0944372 -0.0163038 0.0401524 -0.173655 0.045645 -0.109763 0.156083 -0.0649587 -0.049883 0.131983 0.134193 -0.133685 -0.073838 0.0343134 0.0662774 -0.061877 -0.158086 0.0832445 0.123905 0.0787617 -0.0290988 0.0320095 0.0175125 -0.0256006 0.0222879 0.0711358 0.0112015 
0.0137475 0.0480086 -0.116521 -0.0875376 0.00635789 0.156822 -0.0113997 -0.00621432 -0.0686279 -0.121101 -0.0926906 0.0249317 0.0470672 -0.127967 -0.0704134 -0.0872964 -0.18872 -0.120839 -0.0649306 0.121439 0.0328112 -0.0606156 0.0840998 -0.00605481 -0.0468299 0.0667366 0.00473872 -0.190961 -0.0613247 -0.0382976 0.0254869 -0.0558066 -0.0730575 0.0633835 0.00263333 0.0262577 -0.0374317 0.155546 -0.115409 -0.0419224 0.0507166 -0.0975395 -0.010659 0.200875 -0.119367 0.0709607 0.17561 0.0482232 -0.1473 0.148053 -0.0485677 -0.0856853 -0.00832161 0.0281852 0.144888 -0.0326597 -0.0556895 0.149757 0.0586738 -0.233877 -0.0405807 0.0496381 0.224695 -0.0305222 0.0779992 -0.0980967 0.0283258 0.0321687 0.00160709 0.0630122 -0.0448565 0.0312517 0.00803997 0.0596992 0.0416212 -0.0254831 -0.104115 0.00883103 0.0566704 0.129948 -0.0224169 -0.0237759 -0.0346186 -0.0536306 -0.089364 -0.0756421 0.0656342 0.065055 0.0757483 0.0316155 0.103044 -0.12353 -0.0167509 -0.117946 -0.061687 -0.0276188 0.0902285 0.105458 0.0309569 -0.0692871 -0.0502567 0.0722225 -0.0174574 0.0526094 -0.179817 0.00464958 -0.165328 0.170751 -0.0833642 -0.0255415 0.149149 0.169136 -0.118624 -0.01119 -0.00437242 0.046468 -0.0704438 -0.128344 0.0628474 0.090676 0.0373581 0.0273471 0.0756051 0.0338465 -0.0389983 -0.052702 0.0049453 -0.0251686 
0.0220992 0.0172008 -0.113295 -0.104615 0.0207852 0.162633 0.00256708 0.00261882 -0.0685417 -0.0914996 -0.0786539 0.0483857 0.0768082 -0.0904821 -0.0731752 -0.106456 -0.175468 -0.0814097 -0.0703405 0.123437 0.0412724 -0.056426 0.0948763 0.0601673 -0.0679067 0.0389555 0.0331976 -0.176419 -0.0498526 -0.0122569 -0.00197014 -0.101454 -0.0749214 0.0528266 -0.00274847 0.0232043 -0.0633719 0.148008 -0.154085 -0.0348212 0.0275309 -0.0763256 -0.0452867 0.214761 -0.153156 0.0399058 0.148075 0.0748377 -0.12481 0.156992 -0.0293977 -0.0975956 -0.0118894 0.0172345 0.154213 -0.0141675 -0.0608876 0.186885 0.0651433 -0.228727 -0.042918 0.0565276 0.24115 -0.0207261 0.0670631 -0.108551 0.0176222 0.0447935 -0.0138157 0.0769113 -0.0348834 0.0377555 0.0124378 0.0268483 0.0215177 0.00263861 -0.100865 0.0115179 0.082045 0.103219 -0.0141649 -0.0262958 -0.0316071 -0.0595197 -0.0881075 -0.0921596 0.0783472 0.0737595 0.0876495 0.0475762 0.0990344 -0.128242 -0.000846834 -0.100505 -0.0649983 -0.0521095 0.0554237 0.0943237 0.051483 -0.0738917 0.0031604 0.0826994 -0.0172274 0.0270738 -0.185585 0.00555305 -0.179269 0.112653 -0.0832137 -0.0260003 0.169457 0.183811 -0.0770382 -0.00031194 -0.0191598 0.0837547 -0.0716101 -0.100881 0.0282394 0.0983469 0.0144259 -0.0129539 0.0351502 0.0239177 -0.0771912 -0.00651453 -0.0265211 -0.023031 
0.0413467 -0.0362006 -0.116067 -0.064347 0.0439008 0.100448 -0.0142272 0.00236435 -0.0109593 -0.155095 -0.0621612 0.114462 0.0559186 -0.10014 -0.155022 -0.0943642 -0.150648 -0.0438512 -0.138358 0.163299 0.0736521 -0.046034 0.0987174 0.0787251 -0.0875411 0.0222606 0.0693007 -0.164482 -0.10356 0.0101393 -0.0484304 -0.0779569 -0.0288206 0.0733497 -0.0385774 -0.0109712 -0.0783015 0.163834 -0.203425 -0.0362981 0.0196806 -0.0421649 -0.0608364 0.211856 -0.143384 0.0286525 0.122417 0.0329661 -0.0895509 0.182613 -0.00672469 -0.10238 -0.0225523 0.0280944 0.163813 -0.0359574 -0.0543724 0.138316 0.0456141 -0.199863 -0.01257 0.0188735 0.212179 0.0335073 0.0437834 -0.186883 -0.00367127 0.0626924 -0.00225052 0.0838955 -0.00604618 -0.0123556 0.0380908 -0.0104974 -0.00798848 0.0367028 -0.0909122 0.00824414 0.02361 0.0943254 -0.0287357 0.00652182 -0.0370027 -0.0650453 -0.0943213 -0.0628317 0.0896944 0.0832268 0.0495627 0.0458443 0.059183 -0.14863 -0.0414496 -0.0854677 -0.0628727 -0.0281271 0.0256741 0.038515 0.0582494 -0.0855161 0.0155649 0.0577639 -0.019542 0.0551116 -0.146761 -0.0403987 -0.18911 0.117337 -0.10598 -0.0431859 0.153155 0.177835 -0.0804815 0.0237818 -0.0372193 0.0862955 -0.0974225 -0.102402 0.0194836 0.0998061 -0.0268842 0.0659536 0.00928437 0.0154064 -0.0244717 -0.0110402 -0.0171126 -0.0513497 
0.0418669 -0.0403011 -0.115633 -0.0638912 0.0429029 0.100624 -0.0101124 0.00997302 -0.0178011 -0.153713 -0.0620476 0.121038 0.0579211 -0.0888931 -0.156222 -0.0976906 -0.132855 -0.0476257 -0.139367 0.169936 0.0631433 -0.0452973 0.0943276 0.0801379 -0.094243 0.0280914 0.0703512 -0.152005 -0.103365 0.00096424 -0.053709 -0.0709857 -0.0262047 0.0818483 -0.0522174 -0.00976344 -0.072437 0.174398 -0.210122 -0.0332218 0.0270997 -0.0349495 -0.0557001 0.199218 -0.144324 0.0209585 0.121941 0.0271726 -0.0882951 0.185184 -0.00476608 -0.103888 -0.0285296 0.0361751 0.172009 -0.0331588 -0.0564058 0.145625 0.0490639 -0.202072 -0.0172449 0.0234839 0.210721 0.0210755 0.0428287 -0.17336 -0.00120524 0.0633731 -0.00846294 0.0828015 -0.00464569 -0.0143514 0.0434683 0.00463348 -0.00143548 0.0381757 -0.0805489 0.00964361 0.0247515 0.0758718 -0.0363386 0.0111609 -0.029312 -0.0711709 -0.0909524 -0.0658649 0.0944348 0.0897919 0.0575334 0.0443123 0.0581094 -0.155066 -0.0332827 -0.0854199 -0.0528292 -0.0269088 0.0345994 0.0353891 0.0505649 -0.0812662 0.00695478 0.0615189 -0.0207368 0.0675373 -0.153725 -0.0329215 -0.194084 0.107585 -0.11275 -0.052391 0.151604 0.184722 -0.0764103 0.0332267 -0.0381556 0.0746666 -0.0908908 -0.109783 0.0203868 0.0965303 -0.0298081 0.0653057 0.0151591 0.013021 -0.0239242 -0.0102999 -0.0217223 -0.0549048 
0.0435458 -0.0477726 -0.0958354 -0.0804023 0.0432938 0.123746 -0.000808616 0.0226213 -0.0371371 -0.136291 -0.0715899 0.100447 0.056782 -0.0682859 -0.099528 -0.114994 -0.134147 -0.069308 -0.110896 0.155422 0.0375573 -0.0278806 0.0865463 0.089641 -0.0825025 0.041293 0.0626906 -0.147385 -0.0899004 -0.0278086 -0.0287029 -0.0870954 -0.0547063 0.0835005 -0.0437874 0.0173174 -0.0674848 0.164907 -0.198289 -0.0250381 0.0450001 -0.0250948 -0.0644637 0.194489 -0.149809 0.0171432 0.117043 0.0466343 -0.0860719 0.177654 -0.0200647 -0.115281 -0.0249625 0.0319813 0.180231 -0.0244532 -0.0758389 0.185134 0.0586251 -0.211257 -0.0308003 0.0425091 0.214028 0.00309194 0.0393265 -0.131074 0.0234231 0.065702 -0.000752768 0.0860153 -0.00584368 0.0178322 0.0486078 0.0289059 0.00439735 0.0160145 -0.0894251 0.00784598 0.054629 0.0705777 -0.022439 0.0179296 -0.0245908 -0.0898561 -0.0807861 -0.0966284 0.105214 0.0981173 0.0694513 0.0439229 0.0905444 -0.139147 -0.0103973 -0.0903113 -0.0519817 -0.0309202 0.0494893 0.0319324 0.0475376 -0.0787803 -0.0105671 0.0631686 -0.0185844 0.0416813 -0.187144 -0.0104152 -0.202021 0.0736222 -0.108202 -0.0426334 0.177889 0.2021 -0.0740698 0.0280753 -0.0264506 0.0653309 -0.0792046 -0.12239 0.0109702 0.0809774 -0.00659037 0.045056 0.0287405 0.0236345 -0.0462995 -0.0144657 -0.0256687 -0.0493189 
0.0447204 -0.0492014 -0.116274 -0.0676195 0.0468484 0.103024 -0.0085104 0.0268752 -0.0353531 -0.145828 -0.0711057 0.119789 0.0556761 -0.0744502 -0.139957 -0.102563 -0.107222 -0.0522502 -0.12259 0.17045 0.0443106 -0.027656 0.0870311 0.0760145 -0.0942958 0.0392876 0.0750223 -0.141808 -0.108133 -0.0143442 -0.0561093 -0.0708146 -0.02965 0.0864363 -0.057229 -0.00458755 -0.0622911 0.174706 -0.213106 -0.0298734 0.0360047 -0.0164848 -0.0491417 0.19392 -0.149298 0.0227906 0.122766 0.0231006 -0.0838602 0.185529 0.00457952 -0.112153 -0.0333971 0.0421657 0.180953 -0.0344505 -0.0594531 0.150277 0.0647048 -0.206636 -0.017859 0.027395 0.198788 0.0076068 0.0400412 -0.168243 0.00801581 0.0681768 0.000536872 0.0796096 0.00325063 -0.00485462 0.0548847 0.0118893 -0.00501678 0.0370886 -0.0800029 0.0159835 0.0298039 0.0585805 -0.0356073 0.023497 -0.0213123 -0.077357 -0.0804844 -0.0811917 0.10087 0.096552 0.066839 0.0402545 0.0542099 -0.148106 -0.0311176 -0.0900275 -0.043828 -0.0222721 0.0550613 0.0311876 0.0351502 -0.082433 -0.00988896 0.0705462 -0.0127292 0.0686819 -0.176014 -0.0325093 -0.204314 0.0866257 -0.122951 -0.049094 0.162979 0.186884 -0.0733179 0.0376879 -0.0417148 0.0551301 -0.0840018 -0.130051 0.00851748 0.0786137 -0.027279 0.0692206 0.0312913 0.0106189 -0.0209234 -0.021418 -0.024549 -0.0607709 
0.0391088 -0.0345826 -0.105677 -0.0779414 0.0547051 0.106863 -0.0203866 0.0187518 -0.0225624 -0.156254 -0.0682215 0.109716 0.0425546 -0.0904709 -0.12641 -0.0894999 -0.128691 -0.057615 -0.138319 0.159445 0.0487609 -0.01392 0.0758574 0.0767785 -0.0800151 0.0415649 0.0719492 -0.142234 -0.102126 -0.0201679 -0.0356889 -0.0707434 -0.043913 0.0851187 -0.0514873 0.00908756 -0.0716029 0.152953 -0.197998 -0.0128565 0.0471447 -0.0203034 -0.0461395 0.205119 -0.128583 0.0325809 0.127925 0.0320597 -0.093865 0.175474 -0.00469028 -0.117249 -0.0386622 0.0258289 0.170015 -0.032162 -0.0792123 0.16082 0.0556962 -0.201789 -0.0226593 0.0293211 0.200963 0.0215001 0.0319104 -0.167169 0.0115823 0.0735663 0.00837623 0.0807025 0.0107914 0.00568062 0.0568789 0.00655389 0.00146416 0.0297618 -0.0988019 0.0180028 0.0204597 0.07048 -0.0143711 0.0423223 -0.0248224 -0.0739435 -0.0968731 -0.0682661 0.104117 0.0915005 0.0503084 0.0430829 0.0611725 -0.143988 -0.0452536 -0.0885112 -0.0461633 -0.00589878 0.0438361 0.0192332 0.0299513 -0.0855994 -0.0237476 0.0473987 -0.0205731 0.0612715 -0.182587 -0.0255827 -0.214581 0.0959746 -0.122381 -0.047138 0.175835 0.188059 -0.0890288 0.0404376 -0.0371588 0.0546717 -0.105506 -0.125284 0.00871429 0.0747858 -0.0101697 0.0803649 0.0349251 0.0222845 -0.0237558 -0.0284901 -0.0306387 -0.0654476 
0.0287291 -0.0252405 -0.139636 -0.0674251 0.0609536 0.103794 -0.0109176 -0.019118 -0.0280655 -0.140718 -0.0724671 0.105336 0.0471899 -0.0865417 -0.133049 -0.0853749 -0.144639 -0.049968 -0.116826 0.15152 0.0491279 -0.0555577 0.0892605 0.0611579 -0.0602655 0.0481725 0.057142 -0.169373 -0.0962968 -0.00326738 -0.0273217 -0.0450517 -0.0572827 0.0554617 -0.0414964 0.0108308 -0.0862373 0.150223 -0.174328 -0.0276966 0.0480891 -0.0303361 -0.049294 0.217487 -0.143337 0.0525788 0.142881 0.0401048 -0.0916241 0.144652 -0.0150651 -0.110929 -0.023582 0.00664795 0.155939 -0.0294305 -0.0614974 0.175619 0.0647204 -0.197249 -0.0149881 0.0311696 0.220281 0.0261223 0.0458493 -0.157601 0.00468152 0.075671 0.0196831 0.077834 -0.00242523 0.0287366 0.0495604 0.00444207 -0.00444182 0.0275858 -0.10867 0.0162875 0.0115311 0.0784455 -0.0261479 0.0366294 -0.045894 -0.0706865 -0.108052 -0.0645146 0.0958586 0.0793017 0.0434779 0.00969059 0.0604015 -0.12702 -0.0319686 -0.115423 -0.0463906 -0.0229666 0.0458379 0.0420377 0.0553314 -0.0912095 -0.0248213 0.0359264 -0.00298773 0.064264 -0.179243 -0.0269864 -0.209908 0.132269 -0.112623 -0.0331486 0.17056 0.18188 -0.0915674 0.0207189 -0.0413968 0.0616791 -0.114569 -0.120148 0.0256536 0.0780333 -0.00866864 0.0720816 0.0229566 0.0255132 -0.051512 -0.025698 -0.0598907 -0.0529074 
0.0244773 -0.0394601 -0.129334 -0.0710527 0.0614864 0.10454 -0.0141152 -0.0126229 -0.0311391 -0.140773 -0.0786993 0.106706 0.0479438 -0.0816452 -0.124511 -0.0845859 -0.151459 -0.0578478 -0.113417 0.154596 0.050332 -0.0619523 0.0937349 0.0584504 -0.058782 0.0561852 0.0523627 -0.172929 -0.100327 -0.015364 -0.0175598 -0.0447896 -0.0597047 0.058824 -0.0444633 0.0179828 -0.0906864 0.158495 -0.172364 -0.0291567 0.0515514 -0.0293106 -0.0534262 0.210164 -0.140499 0.0437079 0.138739 0.0377903 -0.0850255 0.145228 -0.0240482 -0.121546 -0.0222129 0.00942717 0.159972 -0.027364 -0.0624671 0.184225 0.0591233 -0.198313 -0.014638 0.033861 0.219101 0.0240615 0.052897 -0.146098 0.00287544 0.0804104 0.0210855 0.0795145 -0.00599261 0.0365828 0.0482666 0.00961202 -0.00373967 0.0236892 -0.104802 0.0112397 0.0185418 0.0782977 -0.0312337 0.0303889 -0.0424146 -0.0728221 -0.11184 -0.0742556 0.103961 0.0919103 0.0498898 0.00529821 0.067052 -0.124824 -0.0233995 -0.11091 -0.0455895 -0.0187812 0.0445648 0.0432318 0.0530078 -0.0831349 -0.0290767 0.0285464 -0.0129785 0.0592757 -0.172499 -0.0217436 -0.211792 0.121525 -0.10991 -0.0390676 0.160582 0.187921 -0.0924052 0.0218143 -0.0303351 0.0637406 -0.107612 -0.1193 0.0250639 0.0808166 -0.00583777 0.0729873 0.0246666 0.0246104 -0.0573647 -0.0226773 -0.0594831 -0.0485184 
0.0273006 -0.0271512 -0.145061 -0.0737387 0.0624194 0.112834 -0.00957971 -0.0175515 -0.0419449 -0.122865 -0.0740403 0.09623 0.0543579 -0.0903962 -0.123511 -0.0788127 -0.152359 -0.0500514 -0.100378 0.157771 0.0511816 -0.0643785 0.101403 0.056694 -0.0614948 0.0576545 0.0490629 -0.183598 -0.0790114 -0.00950493 -0.0168821 -0.0426687 -0.0646412 0.0508489 -0.035178 0.0153439 -0.0848953 0.15884 -0.159843 -0.0362248 0.0450551 -0.0364804 -0.0517234 0.218444 -0.153129 0.0435801 0.149501 0.0502077 -0.088031 0.142019 -0.0255409 -0.111563 -0.0237667 0.00917499 0.155209 -0.0297865 -0.0453075 0.180702 0.0643363 -0.202972 -0.0189922 0.0317306 0.23425 0.0171657 0.054281 -0.147656 0.00289808 0.0715416 0.0263619 0.0784538 -0.0162103 0.0454076 0.0392856 0.0201994 -0.00467403 0.00971994 -0.105363 0.0271218 0.0228216 0.0754704 -0.024946 0.032368 -0.0455868 -0.0697688 -0.101068 -0.0703175 0.094385 0.0930263 0.0578196 0.00159187 0.0793764 -0.115788 -0.0288275 -0.117314 -0.0407572 -0.0336079 0.0463309 0.0659792 0.0537756 -0.0885849 -0.0222854 0.0330858 -0.00454939 0.0605099 -0.172806 -0.0190955 -0.200028 0.128083 -0.0914517 -0.0275771 0.15596 0.190988 -0.0867587 0.0182675 -0.029423 0.0634902 -0.0979751 -0.125462 0.0251415 0.0802642 -0.00388478 0.0641411 0.0326543 0.0254738 -0.0796978 -0.0223478 -0.0631264 -0.0400565 
0.029229 -0.0349791 -0.129486 -0.0922259 0.0504083 0.132052 0.00121532 0.00272523 -0.0602789 -0.122323 -0.0878842 0.0886273 0.0553584 -0.07036 -0.100792 -0.0959301 -0.150243 -0.0660669 -0.0782825 0.13402 0.0402118 -0.0397602 0.076418 0.0447054 -0.0701363 0.0706133 0.0513676 -0.17425 -0.0880722 -0.0160824 -0.0241441 -0.0579467 -0.0790479 0.0547285 -0.0235693 0.0258368 -0.0727083 0.143371 -0.157845 -0.0322103 0.0497446 -0.0324243 -0.0404236 0.21478 -0.146159 0.0532161 0.144928 0.0430959 -0.106355 0.134752 -0.0302609 -0.124607 -0.0184654 0.0228812 0.169345 -0.0170227 -0.0657823 0.203321 0.0582977 -0.203493 -0.0142315 0.0447005 0.235063 -0.00183911 0.0646867 -0.124575 0.00921464 0.0740361 0.0253185 0.0770403 -0.01238 0.0442951 0.0397086 0.0131507 -0.00513172 0.018714 -0.101622 0.013289 0.0409505 0.0601436 -0.0204977 0.024979 -0.0382871 -0.0762785 -0.110409 -0.0888715 0.106918 0.085287 0.0647296 0.0218591 0.0890934 -0.124831 -0.0209618 -0.109467 -0.0448921 -0.0162101 0.0640972 0.0573301 0.0549893 -0.0707925 -0.0287858 0.0547542 -0.0135294 0.0427428 -0.193087 -0.0098292 -0.208345 0.103729 -0.127775 -0.0318738 0.174451 0.176258 -0.0899625 0.00588377 -0.0194686 0.0609671 -0.0871392 -0.133544 0.0209117 0.0668264 0.00911869 0.0398711 0.0502713 0.0235042 -0.0635603 -0.0192766 -0.050946 -0.0450884 
0.027016 -0.024111 -0.125644 -0.0929345 0.0545879 0.116912 -0.0126871 -0.00036971 -0.0604841 -0.111504 -0.0707225 0.100102 0.056578 -0.0696578 -0.112319 -0.0825628 -0.136827 -0.0522498 -0.0942077 0.148865 0.0387035 -0.0264798 0.0759964 0.0550703 -0.0740974 0.0783548 0.0711291 -0.1573 -0.077763 -0.0121861 -0.0381979 -0.0579383 -0.0654308 0.059758 -0.038654 0.0191297 -0.0734976 0.156549 -0.161534 -0.0155485 0.0420839 -0.0273038 -0.0397976 0.217169 -0.1489 0.0476252 0.149753 0.0402226 -0.106479 0.13847 -0.00538909 -0.112956 -0.0434468 0.0254942 0.17087 -0.0223796 -0.0641591 0.190755 0.0643841 -0.200379 -0.0186873 0.0225771 0.230404 0.0120123 0.0557478 -0.14689 0.00707102 0.080912 0.0271107 0.0849368 0.000540615 0.0412705 0.0494015 0.0142781 0.00186158 0.0185083 -0.105651 0.034916 0.028807 0.0528571 -0.012797 0.04201 -0.0242922 -0.0694327 -0.110118 -0.0853191 0.111614 0.0936721 0.068263 0.0212727 0.0644034 -0.126904 -0.0304356 -0.100205 -0.0439194 -0.0236568 0.0571256 0.0532488 0.0492806 -0.0879964 -0.0327955 0.0559894 -0.0116935 0.0603306 -0.190077 -0.0153148 -0.21417 0.104765 -0.112774 -0.0446306 0.172037 0.186749 -0.0894088 0.0305748 -0.0282395 0.0507242 -0.0991754 -0.138185 0.00671538 0.0616436 0.00288375 0.0556499 0.0467228 0.0190899 -0.0593393 -0.0169025 -0.0523891 -0.0462233 
0.0262928 -0.0130127 -0.126047 -0.10205 0.0468804 0.121985 -0.012161 0.0106652 -0.0708693 -0.10591 -0.0697612 0.0914086 0.0664121 -0.0703541 -0.107389 -0.0873938 -0.134837 -0.0648274 -0.0929343 0.144118 0.0370789 -0.0330661 0.0757221 0.0466844 -0.0720854 0.0764134 0.0697666 -0.153267 -0.070991 -0.0181203 -0.0332242 -0.065266 -0.0665764 0.0597791 -0.0464616 0.0158011 -0.0762643 0.158605 -0.158316 -0.0101253 0.0414882 -0.0358385 -0.0406913 0.218985 -0.148473 0.0480185 0.146721 0.0403576 -0.113996 0.136506 -0.00653924 -0.107068 -0.0468385 0.023422 0.158013 -0.0214653 -0.067408 0.192735 0.0678974 -0.203504 -0.0232209 0.0250612 0.228488 0.00956211 0.0530847 -0.141129 0.0102796 0.082237 0.024597 0.0775961 -0.00222255 0.0399535 0.0456163 0.0141097 0.00852014 0.0191812 -0.105867 0.0314414 0.0332799 0.0645517 -0.0213271 0.0237672 -0.017079 -0.0637784 -0.11169 -0.0847762 0.114524 0.0884398 0.0744832 0.0163102 0.0605798 -0.131604 -0.0263082 -0.0967222 -0.0464521 -0.0304279 0.061912 0.0554281 0.0413629 -0.0879423 -0.0374838 0.0631521 -0.0128908 0.0679048 -0.19473 -0.0114441 -0.214519 0.116154 -0.109549 -0.0548076 0.172592 0.185354 -0.095618 0.033936 -0.0277564 0.0502578 -0.10169 -0.132589 0.0142871 0.0676307 -0.00139722 0.0449467 0.0405178 0.0212472 -0.0557717 -0.0214169 -0.0550942 -0.0432878 
0.0248444 -0.0342313 -0.101199 -0.0978755 0.061937 0.11708 -0.0343136 0.00884392 -0.0482298 -0.137283 -0.0641841 0.100665 0.0561996 -0.0592883 -0.105385 -0.0933534 -0.135347 -0.0517413 -0.121486 0.145774 0.0404267 -0.0131358 0.0817229 0.052193 -0.0646239 0.0635439 0.0683632 -0.13712 -0.0976328 -0.0362716 -0.0127525 -0.0794386 -0.0634353 0.0667108 -0.0449139 0.0325587 -0.09014 0.148615 -0.167512 0.00138265 0.0522984 -0.00516622 -0.0561841 0.216879 -0.14834 0.0291364 0.124538 0.0406594 -0.0856623 0.14883 -0.0109313 -0.115958 -0.0543832 0.0218837 0.149708 -0.0324809 -0.0772973 0.187094 0.0651635 -0.198026 -0.0262395 0.0312814 0.207985 0.0293662 0.0371505 -0.159858 0.0202954 0.10054 0.0344457 0.0932933 0.031917 0.0441572 0.0729819 0.000144652 -0.0018121 0.020391 -0.127438 0.0167152 0.0214567 0.0718514 -0.0154739 0.043796 -0.00594817 -0.0600917 -0.120204 -0.081877 0.126599 0.100127 0.0536842 0.00944945 0.0562221 -0.128868 -0.0207014 -0.0959131 -0.0532689 -0.0325574 0.0406216 0.0367937 0.018705 -0.0899186 -0.0459893 0.0548625 -0.0157633 0.0582475 -0.177835 -0.0137172 -0.222253 0.100145 -0.106988 -0.045259 0.174136 0.181115 -0.100238 0.0588853 -0.0392324 0.0491637 -0.11219 -0.125744 0.00132551 0.0618742 -0.00251732 0.0656629 0.0259061 0.0162947 -0.0448395 -0.0314423 -0.0527437 -0.0344595 
0.0307117 -0.0437873 -0.108126 -0.0885416 0.0722648 0.10646 -0.0337837 0.0183292 -0.0300348 -0.142592 -0.0679518 0.11734 0.0520307 -0.0653413 -0.124282 -0.0869439 -0.110244 -0.0348987 -0.134709 0.154048 0.0496881 -0.00914332 0.0821378 0.068997 -0.075414 0.0472091 0.0764973 -0.136642 -0.114151 -0.0251234 -0.027614 -0.0737162 -0.0418791 0.0758222 -0.0483415 0.0203316 -0.0742898 0.144978 -0.191396 -0.00972108 0.0495846 0.0056028 -0.0478485 0.209767 -0.143159 0.0312459 0.124404 0.0321974 -0.0823145 0.159501 0.00186083 -0.12846 -0.0521228 0.0245664 0.161644 -0.0289213 -0.0722242 0.165565 0.0661009 -0.197114 -0.0152386 0.0275472 0.18957 0.0220824 0.0381555 -0.182454 0.00747681 0.103155 0.027738 0.0936062 0.0329278 0.0229591 0.0691456 -0.0229979 -0.0134688 0.0419086 -0.112507 0.0321959 0.0144962 0.0484787 -0.024955 0.0601866 -0.016189 -0.0586023 -0.110707 -0.0720655 0.119939 0.10137 0.0486581 0.0266656 0.0427858 -0.136706 -0.0371938 -0.0937139 -0.0441392 -0.0155773 0.0351973 0.0265828 0.0131056 -0.0887784 -0.0293248 0.0482249 -0.0148773 0.0602945 -0.172051 -0.0308908 -0.227207 0.0804008 -0.126544 -0.0416433 0.16624 0.175122 -0.0856789 0.0564033 -0.0459455 0.0467227 -0.117993 -0.136255 -0.0101924 0.0639502 -0.0102651 0.0874704 0.0252152 0.0167806 -0.0319368 -0.0310966 -0.0530648 -0.0548295 
0.0293465 -0.0277864 -0.121045 -0.0893222 0.0617913 0.107355 -0.0385847 0.0249331 -0.0491338 -0.12493 -0.0620181 0.117705 0.0523275 -0.0697347 -0.130561 -0.072909 -0.102855 -0.0318522 -0.111244 0.148676 0.0578787 -0.0038765 0.0722291 0.0755948 -0.0728992 0.0591859 0.0960222 -0.141569 -0.0950294 -0.00555409 -0.047703 -0.077924 -0.0365716 0.06541 -0.053689 0.0102921 -0.0764256 0.135513 -0.186001 -0.000139141 0.03319 -0.000957691 -0.0343805 0.224272 -0.13947 0.0403412 0.147673 0.0173484 -0.102106 0.148068 0.028562 -0.114322 -0.0577317 0.02344 0.166979 -0.0205318 -0.0618485 0.163784 0.0761586 -0.199452 -0.013571 0.0126024 0.199063 0.0221129 0.0395277 -0.192873 0.000453155 0.0894056 0.0316916 0.0931723 0.0281985 0.022112 0.0558125 -0.0327882 -0.00495698 0.0444921 -0.109496 0.0528943 0.00803066 0.049888 -0.021431 0.0615607 -0.00883825 -0.0548231 -0.108053 -0.0642164 0.117596 0.0886724 0.0552584 0.0274188 0.0213378 -0.134501 -0.0592795 -0.0873115 -0.0376142 -0.0143858 0.0454291 0.0409025 0.0185075 -0.0945651 -0.0293414 0.0583409 -0.00628722 0.0664599 -0.187015 -0.0295471 -0.226545 0.0838875 -0.130966 -0.0577666 0.166834 0.168515 -0.0862264 0.0418605 -0.0418454 0.0477735 -0.115104 -0.146834 -0.00915781 0.0615968 -0.0112995 0.0757225 0.0329372 0.00397819 -0.0334398 -0.0170498 -0.043993 -0.0487269 
0.0225677 -0.0329261 -0.119364 -0.0885636 0.0706985 0.104077 -0.0412988 0.0148958 -0.0338633 -0.13712 -0.0597333 0.121746 0.0503168 -0.0587695 -0.13247 -0.0759411 -0.107499 -0.025844 -0.117423 0.149273 0.0630395 -0.00970991 0.0744546 0.0781199 -0.0674011 0.0541449 0.0920609 -0.139035 -0.0979606 -0.00594822 -0.0359832 -0.0754638 -0.031352 0.0640283 -0.0500517 0.0216257 -0.0743769 0.13262 -0.187495 -0.00507134 0.044226 0.00702178 -0.0336409 0.222431 -0.143041 0.0372537 0.146487 0.0186468 -0.0937783 0.14184 0.0073755 -0.122052 -0.0545222 0.0225133 0.169 -0.0128234 -0.067165 0.170035 0.0666959 -0.198301 -0.0171572 0.0181274 0.202796 0.0221955 0.040382 -0.182548 -0.000184802 0.0933619 0.0340869 0.100153 0.0314962 0.0234021 0.0570033 -0.0370691 -0.00244765 0.0464451 -0.113552 0.051052 0.00343087 0.0373341 -0.0274972 0.0754527 -0.0138743 -0.0535524 -0.112907 -0.0554038 0.117982 0.0944223 0.0468189 0.0259423 0.0347218 -0.137898 -0.0525413 -0.0951106 -0.0320543 -0.0176161 0.0300185 0.0442243 0.0219648 -0.0932403 -0.0328159 0.0434819 -0.00351205 0.0602514 -0.183405 -0.0206084 -0.227332 0.081798 -0.132283 -0.0557557 0.161446 0.164084 -0.0870202 0.0446703 -0.0421209 0.0482571 -0.11443 -0.150433 -0.00460088 0.065086 -0.00410484 0.0814194 0.0237069 0.00974235 -0.0464237 -0.0147906 -0.0500428 -0.0434038 
0.0192892 -0.0403211 -0.102605 -0.100297 0.0697715 0.114572 -0.0408748 0.0292036 -0.0408852 -0.13938 -0.0644145 0.11395 0.0553695 -0.0651407 -0.11628 -0.0824702 -0.120059 -0.0322248 -0.125567 0.143653 0.0591011 -0.00355279 0.0721086 0.0769135 -0.0677785 0.0486143 0.0845665 -0.134714 -0.101319 -0.0248317 -0.0224728 -0.0898553 -0.0459551 0.0672083 -0.0484373 0.0277652 -0.0843489 0.11642 -0.187376 0.00223718 0.055079 0.00248624 -0.0395784 0.226945 -0.143031 0.0274201 0.135811 0.0285745 -0.0937478 0.147151 0.0029772 -0.137954 -0.0578724 0.0174853 0.156268 -0.0167308 -0.080519 0.1769 0.0667535 -0.197258 -0.0173278 0.0309563 0.192914 0.031081 0.0351629 -0.179554 0.00326323 0.0937721 0.0330647 0.0922902 0.0334764 0.0286492 0.0659149 -0.0386593 -0.00428504 0.044486 -0.120756 0.0420638 0.0140596 0.0510404 -0.0180348 0.0596297 -0.00726595 -0.0507621 -0.120048 -0.0556292 0.127409 0.0963542 0.0416343 0.0258786 0.0404493 -0.133956 -0.0500548 -0.0905266 -0.0461339 -0.0121501 0.0247226 0.0368556 0.00666299 -0.087406 -0.0349689 0.0420469 -0.0117079 0.0525423 -0.1765 -0.0173269 -0.23087 0.0843769 -0.135525 -0.0515742 0.16563 0.164089 -0.0886138 0.0481488 -0.0466381 0.0499658 -0.117412 -0.133854 -0.00966061 0.0663224 -0.00472412 0.0696249 0.0198805 0.010982 -0.0453803 -0.0217002 -0.0580784 -0.0431669 
0.023355 -0.0318801 -0.120686 -0.0884694 0.0763418 0.10402 -0.0244406 -0.00852 -0.0222402 -0.154628 -0.0679323 0.11404 0.0469548 -0.0531238 -0.128362 -0.0961623 -0.125113 -0.047663 -0.127924 0.145171 0.0421514 -0.0104008 0.0585423 0.0613937 -0.0622914 0.0396268 0.0784236 -0.115771 -0.108775 -0.00522775 -0.023703 -0.0829495 -0.0540054 0.0550846 -0.0365307 0.034833 -0.0816207 0.109301 -0.187483 -0.0166092 0.0584672 0.00178053 -0.032187 0.227387 -0.140081 0.0555193 0.12758 0.0455457 -0.0829262 0.141952 -0.0139476 -0.12241 -0.0438815 0.00818383 0.166186 -0.0241174 -0.11167 0.183714 0.0572915 -0.186421 -0.0177704 0.0365022 0.204254 0.0336865 0.0327476 -0.166877 0.00428316 0.0940921 0.02384 0.0859798 0.0403651 0.0246575 0.0728802 -0.036758 -0.00968641 0.0562114 -0.110404 0.023034 0.0104608 0.0550555 -0.00233159 0.0529108 -0.023992 -0.0550221 -0.117454 -0.0678117 0.10895 0.0894379 0.0354329 0.0354448 0.0501768 -0.135828 -0.0401339 -0.0962068 -0.0515374 -0.0181468 0.032962 0.0160235 0.0321477 -0.0941736 -0.0321981 0.0489388 -0.00663864 0.0370616 -0.196161 -0.0094892 -0.227576 0.102524 -0.137917 -0.0266988 0.190365 0.153334 -0.0956432 0.0570461 -0.0597428 0.0487773 -0.120621 -0.111581 -0.00302296 0.0641944 -0.00978746 0.0706049 0.0177211 0.0186693 -0.0385055 -0.0229491 -0.0585507 -0.0584307 
0.0153229 -0.0304905 -0.104407 -0.0975352 0.0605591 0.107767 -0.033569 0.00700426 -0.0564772 -0.127614 -0.0697424 0.112051 0.0618584 -0.0684046 -0.124448 -0.0891639 -0.139888 -0.0418621 -0.115344 0.142421 0.0531511 -0.0266395 0.069286 0.0659589 -0.0608382 0.0569536 0.0738253 -0.137781 -0.0992407 -0.0111848 -0.0258197 -0.0956264 -0.065768 0.0501315 -0.0407512 0.0185688 -0.108663 0.11686 -0.171123 -0.00269312 0.039035 -0.0156498 -0.0417707 0.23986 -0.138191 0.0364223 0.134226 0.0362696 -0.0945512 0.141457 0.0122888 -0.125592 -0.0557135 0.00457855 0.147129 -0.027317 -0.0902725 0.186188 0.0731143 -0.189143 -0.00647786 0.0293832 0.200204 0.0492536 0.0409391 -0.187849 0.000804481 0.0869449 0.0255056 0.0811222 0.0315289 0.0380146 0.0684114 -0.0348485 -0.0138371 0.0435482 -0.119811 0.027017 0.0236255 0.0876688 -0.0124163 0.0234757 -0.00829017 -0.0435327 -0.130012 -0.07987 0.124475 0.0868772 0.0508743 0.0118913 0.0235671 -0.121687 -0.0346858 -0.0870345 -0.065877 -0.0237464 0.037412 0.0366449 0.0203598 -0.0911513 -0.0330993 0.0623738 -0.0145384 0.053413 -0.174644 -0.020182 -0.223044 0.11486 -0.120019 -0.0445879 0.173887 0.160443 -0.0991101 0.0480888 -0.0536422 0.0616296 -0.119753 -0.102527 -0.00766138 0.0708656 -0.0209906 0.0543622 0.00770321 0.000948136 -0.0450594 -0.0170277 -0.0624764 -0.0423456 
0.00372182 -0.0411399 -0.112836 -0.0777837 0.0668836 0.07534 -0.0375944 -0.0295448 -0.0500999 -0.113598 -0.0695274 0.122313 0.0691238 -0.0366754 -0.137094 -0.0736685 -0.146857 -0.0337612 -0.107783 0.165884 0.0610226 -0.0733925 0.0901707 0.0745345 -0.052046 0.0599171 0.0593736 -0.145244 -0.101768 0.0120823 -0.0363542 -0.0728061 -0.0597609 0.0289974 -0.0496804 0.0324933 -0.131806 0.143808 -0.172818 -0.0158554 0.0115508 -0.00785346 -0.0529487 0.218572 -0.132545 0.0474594 0.138972 0.0388114 -0.0776524 0.134004 0.00287634 -0.117304 -0.0482687 -0.00232308 0.163724 -0.0291332 -0.0759756 0.1942 0.0724629 -0.177346 0.00616017 0.0296061 0.207137 0.0603856 0.0496457 -0.173522 -0.014068 0.105543 0.0241017 0.0849556 0.0345003 0.05911 0.0626466 -0.0306149 -0.0172393 0.0532354 -0.107839 0.0229138 0.0242765 0.0799803 -0.019666 0.0226932 -0.035605 -0.0528917 -0.144276 -0.0783195 0.109403 0.0971741 0.0597185 -0.00786983 0.0143297 -0.105498 -0.0087848 -0.0870251 -0.0629805 -0.0309521 0.0222706 0.0448109 0.0563607 -0.0990575 -0.0224098 0.0400304 -0.0164155 0.0465425 -0.166801 -0.00988072 -0.225847 0.113849 -0.0923177 -0.0451162 0.149832 0.174497 -0.0893396 0.0407459 -0.0470145 0.0824555 -0.115543 -0.0914075 -0.00798529 0.0828783 -0.0384912 0.0656895 -0.00406277 0.0051443 -0.0776844 0.0108857 -0.0738853 -0.0374732 
0.0303535 -0.00153206 -0.155794 -0.058563 0.0640619 0.0954965 -0.000876591 -0.0522096 -0.0910086 -0.108366 -0.0506912 0.123381 0.0802173 -0.0209765 -0.143663 -0.0700208 -0.116401 -0.0298234 -0.0779984 0.15315 0.0721397 -0.0726475 0.0785446 0.0676518 -0.0398509 0.0571035 0.0500116 -0.154362 -0.0598261 0.0714132 -0.0666332 -0.0255298 -0.0656851 0.0199655 -0.0539376 0.0121039 -0.122131 0.136019 -0.140612 -0.0201747 -1.07669e-05 -0.0138691 -0.0302525 0.212905 -0.155895 0.0793201 0.173843 0.0112562 -0.119362 0.103512 0.0240191 -0.0708047 -0.0365348 0.00264015 0.159272 -0.0163193 -0.0554588 0.215315 0.070262 -0.165861 -0.0089259 0.0275981 0.237062 0.0119092 0.0507095 -0.146794 -0.00788635 0.0797228 -0.0041321 0.0801612 0.0256263 0.0589622 0.0341504 -0.0205442 -0.00802694 0.0609076 -0.0902093 0.00421644 0.00917826 0.0816818 -0.0262062 0.0220466 -0.0369194 -0.0618197 -0.12675 -0.0595486 0.0893492 0.0441929 0.0441242 -0.00351055 0.0198101 -0.124817 -0.0353244 -0.084025 -0.0487651 -0.0472988 0.0477313 0.0729135 0.0773414 -0.0974431 -0.0268131 0.0661132 0.00895193 0.0954501 -0.213303 0.0102204 -0.209378 0.157327 -0.0872899 -0.0646888 0.159544 0.157831 -0.105858 0.0194894 -0.0388505 0.0827058 -0.108725 -0.109605 0.0242139 0.100767 -0.0351063 0.0354435 0.00416204 0.00660206 -0.0695774 0.0253517 -0.0593864 -0.0420335 
0.0259007 -0.00182779 -0.166012 -0.0449946 0.0889766 0.084917 -0.0173692 -0.074949 -0.0950989 -0.101158 -0.0381144 0.126097 0.0807387 -0.0228172 -0.152136 -0.0352945 -0.115699 -0.0115133 -0.0622824 0.160731 0.10928 -0.108225 0.106085 0.0576696 -0.00701387 0.0635773 0.0396341 -0.177184 -0.0416872 0.0845226 -0.0510714 -0.0153573 -0.0563126 0.00682167 -0.0500736 0.0114195 -0.138059 0.147426 -0.0990836 -0.0331334 -0.0114583 -0.00535035 -0.0270951 0.204197 -0.154803 0.0647231 0.185875 -0.0024452 -0.109539 0.0774334 0.0139757 -0.0636684 -0.037519 -0.00443661 0.147392 -0.0188776 -0.0230597 0.215799 0.0530049 -0.158842 -0.00465139 0.0102728 0.252448 0.0125227 0.0724853 -0.142243 -0.0348864 0.0923605 0.00813709 0.0848923 0.0261571 0.0872733 0.0134314 -0.0328776 -0.0105749 0.0528232 -0.088121 0.0165812 -0.00444497 0.0882619 -0.0527302 0.0310461 -0.0288955 -0.0448865 -0.13978 -0.0525164 0.0874281 0.0634389 0.0438431 -0.0399002 0.0142331 -0.108827 -0.0424536 -0.0717839 -0.0324663 -0.0676593 0.030573 0.105669 0.0694836 -0.0959455 -0.0325886 0.0371296 0.00572262 0.106415 -0.186152 0.0227884 -0.188944 0.167058 -0.0453802 -0.0784702 0.120611 0.152968 -0.108299 0.0273736 -0.0112177 0.0931603 -0.121092 -0.101581 0.0253372 0.113935 -0.0434433 0.0524623 -0.00879337 -0.00153507 -0.0883485 0.0424123 -0.0595253 -0.0213598 
0.0174384 0.0166874 -0.126273 -0.0463045 0.0421602 0.0967062 -0.019863 -0.074973 -0.0764559 -0.127555 -0.0520136 0.11219 0.0444189 -0.0134923 -0.0961657 -0.0604028 -0.103206 -0.0486977 -0.0276983 0.136459 0.0721388 -0.0448306 0.0768507 0.0557972 -0.025679 0.105965 0.0461907 -0.194925 -0.0606458 0.0727648 -0.0385523 0.00678204 -0.0216252 0.0419177 -0.0058984 0.0402708 -0.0424754 0.193438 -0.102307 -0.0347625 0.00880866 -0.0101059 -0.010868 0.173564 -0.142363 0.11156 0.214136 -0.0393478 -0.149071 0.078216 -0.000488377 -0.0680571 -0.00535578 0.0416445 0.204058 0.00986878 -0.0369826 0.204338 0.0266829 -0.177562 -0.0234309 -0.00610999 0.240165 -0.0572271 0.116078 -0.114489 0.00764112 0.0649204 -0.00609468 0.114697 0.0129986 0.0390045 -0.0111205 -0.00497071 0.0295586 0.0293916 -0.0948354 0.020433 0.0114317 0.0565825 -0.0602107 0.0696229 -0.0439513 -0.0783555 -0.111188 -0.0898553 0.0834635 0.039067 0.0312955 0.0143315 0.0430481 -0.142095 -0.0156079 -0.0930997 -0.0215061 -0.0330493 0.0761142 0.097113 0.0979322 -0.0782377 -0.0687735 0.0604046 -0.0141943 0.0948385 -0.211152 0.0178278 -0.183794 0.117199 -0.0903928 -0.0850641 0.121235 0.143948 -0.125131 -0.0109496 0.0149623 0.0639657 -0.0940022 -0.200507 0.0342315 0.100943 0.0305032 0.0656019 0.0401955 0.0206587 -0.0265935 0.0269568 0.0134997 -0.0344962 
-0.0245936 0.0961477 -0.127144 -0.0712577 0.0211191 0.104549 -0.00651695 -0.109519 -0.10197 -0.0683029 -0.0303965 0.0622857 0.0615521 0.0164875 -0.0433074 -0.0719406 -0.109205 -0.0556081 0.0563019 0.0778742 0.0549012 -0.0434578 0.0290639 0.00583151 -0.00802272 0.126898 0.00425378 -0.193521 0.00978542 0.112891 -0.0102246 0.00667774 -0.011766 -0.0187313 0.0529388 0.0664961 -0.0134405 0.159015 -0.0288959 -0.0290564 0.0112151 -0.0334954 0.0141665 0.182795 -0.153217 0.163252 0.238915 -0.0392911 -0.184161 -0.0177955 -0.045612 -0.0192475 0.0113631 0.0275538 0.171392 0.0533816 -0.0440218 0.209493 -0.00629388 -0.146887 -0.048394 -0.0142938 0.260581 -0.0763193 0.150384 -0.0693801 0.0282476 0.0318833 -0.00140521 0.0860021 0.0219408 0.041631 -0.0479772 -0.018535 0.06626 0.0338696 -0.125951 0.0315549 0.0222561 0.0462268 -0.0683752 0.0652428 -0.0447221 -0.0301437 -0.107492 -0.0779985 0.0709812 -0.0105675 0.0244889 0.00765813 0.0515636 -0.123498 0.00556978 -0.102754 -0.0214367 -0.0825517 0.0797191 0.138064 0.107225 -0.0658536 -0.0868588 0.0905992 0.0128152 0.0572267 -0.232618 0.0667364 -0.124442 0.144183 -0.0492573 -0.0657558 0.108808 0.0587626 -0.156425 -0.0578993 0.0211301 0.0649571 -0.0786208 -0.218859 0.0562205 0.0968958 0.0663507 -0.00489403 0.0210483 0.0280501 -0.0525444 0.0501027 0.0243304 0.0179357 
-0.0137471 0.0920075 -0.118107 -0.0707656 0.0201825 0.107247 -0.00930746 -0.103251 -0.106255 -0.0810725 -0.0531815 0.0563923 0.0545151 0.00807638 -0.0335478 -0.0872494 -0.11577 -0.0627663 0.0433263 0.0961911 0.0384605 -0.0364598 0.0424631 0.00516961 -0.0162917 0.106505 -0.00240797 -0.19128 -0.0253538 0.0985577 -0.0200664 -0.00640959 -0.0120251 -0.00335973 0.0578326 0.0661298 -0.00817995 0.156376 -0.0556675 -0.0398692 0.00754039 -0.0419305 0.0170281 0.176854 -0.157382 0.18715 0.236347 -0.0256759 -0.188648 0.0286522 -0.0331559 -0.0254894 0.0160801 0.0365197 0.187486 0.0328404 -0.047577 0.190497 0.00979581 -0.154407 -0.0409484 0.00578769 0.237656 -0.0761847 0.14343 -0.0852151 0.022176 0.0377776 -0.0150788 0.0899725 0.0271702 0.0318653 -0.0394904 -0.0167968 0.0621685 0.0433055 -0.12394 0.0168242 0.040289 0.0628435 -0.058464 0.0476178 -0.0550823 -0.0356477 -0.101642 -0.080721 0.057468 -0.0110198 0.0289809 0.0363771 0.0492361 -0.128587 0.0117974 -0.11076 -0.04239 -0.0712811 0.0882992 0.131667 0.104605 -0.0777199 -0.0736484 0.108239 0.0119844 0.0479066 -0.235681 0.0554798 -0.138565 0.148035 -0.060919 -0.0490127 0.127305 0.0683268 -0.150347 -0.0571065 0.00471635 0.0638921 -0.0732385 -0.213372 0.0506204 0.105047 0.0673158 -0.00200315 0.0311702 0.033279 -0.0308249 0.0327558 0.0437511 0.00156371 
-0.0161495 0.128021 -0.135416 -0.0699427 0.0195169 0.134558 0.0069904 -0.133382 -0.108366 -0.0392091 -0.0485105 0.0389751 0.0671442 -0.00571202 -0.0195708 -0.0939752 -0.131058 -0.0458365 0.0574724 0.0750243 0.0189213 -0.03223 0.0232823 -0.00317164 -0.0199656 0.0922592 -0.0430035 -0.189249 -0.00372134 0.124002 -0.018555 0.0175172 -0.0310705 -0.0304442 0.0841806 0.0678059 -0.00557401 0.107045 -0.0262849 -0.0431883 0.0175006 -0.0692399 0.0249352 0.174198 -0.167417 0.192381 0.235146 0.0099801 -0.191808 0.0115452 -0.0321115 0.000535102 0.0316488 0.0241148 0.167165 0.0380515 -0.037791 0.174785 0.0131569 -0.143734 -0.0548868 0.0323295 0.244131 -0.0829722 0.128135 -0.0611125 0.0326547 0.0214822 -0.0259136 0.0680161 0.0240907 0.0391721 -0.0440369 -0.00729611 0.0656959 0.0491991 -0.139318 0.000707927 0.0489711 0.0658221 -0.0258231 0.049271 -0.0573692 -0.0123644 -0.0869204 -0.0529184 0.0410912 -0.0365986 0.025602 0.0486642 0.0576205 -0.113205 0.0163555 -0.111502 -0.064705 -0.0957202 0.0811501 0.145774 0.109274 -0.0792801 -0.0360853 0.123784 0.0343898 0.0281996 -0.237695 0.0672113 -0.115414 0.165875 -0.0553812 0.00441888 0.137731 0.0425687 -0.139389 -0.0827823 -0.0174078 0.0638315 -0.0738325 -0.18891 0.0550136 0.0984044 0.0887119 -0.0548201 0.0370043 0.0261333 -0.0589617 0.0439227 0.0307618 0.0210321 
-0.0207168 0.141501 -0.133045 -0.0649105 0.0248281 0.135257 -0.00657476 -0.151753 -0.139394 -0.0178384 -0.0448905 0.0263303 0.071627 0.0203979 0.00511882 -0.0746178 -0.107268 -0.0310835 0.0944242 0.0583976 0.024114 -0.0314752 0.0225807 -0.02194 0.0037778 0.0935393 -0.0610752 -0.187369 0.0134603 0.146629 -0.0163338 0.0337909 -0.0227764 -0.05023 0.0949756 0.0789949 -0.0124621 0.0803944 0.0100785 -0.0457056 -0.00414203 -0.0628963 0.0394409 0.155228 -0.158844 0.211157 0.246192 0.000888144 -0.206583 -0.0228236 -0.0235688 0.0141567 0.04729 0.0130499 0.144389 0.047239 -0.0220501 0.170246 0.00983066 -0.120714 -0.0533893 0.043716 0.230557 -0.0946025 0.140916 -0.0371613 0.0229736 0.0248636 -0.0339464 0.0617238 0.0318847 0.0492788 -0.0600012 -0.0315112 0.0640066 0.0595345 -0.13752 -0.0152478 0.0470053 0.0675762 -0.0236554 0.0477084 -0.0584481 -0.000829745 -0.090229 -0.0444026 0.0246915 -0.0572702 0.0112108 0.0449534 0.0441135 -0.0908889 0.0127098 -0.085334 -0.0612829 -0.0922169 0.0788297 0.167425 0.0989442 -0.0723682 -0.0338937 0.127624 0.0373823 0.0194268 -0.240806 0.0866923 -0.0977563 0.159102 -0.0360476 0.00514927 0.124327 0.0123461 -0.139161 -0.0970865 -0.010046 0.0647696 -0.080874 -0.178649 0.0517682 0.101105 0.0884309 -0.0792024 0.0331561 0.0109539 -0.0556761 0.0640867 0.0407559 0.0266867 
-0.018804 0.12141 -0.130548 -0.0675444 0.0056399 0.124171 0.0128764 -0.112672 -0.134201 -0.0152364 -0.0392017 0.0369561 0.0671424 0.00877771 -0.00251061 -0.0866019 -0.114938 -0.0576159 0.0903281 0.0698801 0.0155182 -0.0549667 0.0264544 -0.0163876 -0.0069217 0.111616 -0.0274765 -0.1922 0.00814052 0.114724 -0.0254822 0.0188824 -0.0182345 -0.0304748 0.0678274 0.0656683 -0.00273932 0.126323 -0.0125134 -0.0478287 0.0080215 -0.0785834 0.0243787 0.160126 -0.167327 0.190701 0.236335 -0.0154914 -0.20674 -0.0104672 -0.0328674 0.00622734 0.0268078 0.0269368 0.168621 0.0500961 -0.0381951 0.182827 -0.0018342 -0.133748 -0.0531065 0.00836109 0.246205 -0.0980885 0.15326 -0.0297043 0.0225122 0.0228191 -0.0291422 0.0706989 0.0108088 0.0481092 -0.0632466 -0.00445743 0.0773625 0.043896 -0.113982 0.0103863 0.0549242 0.0540385 -0.0615547 0.0277886 -0.0544682 -0.0214221 -0.0932945 -0.0696861 0.044024 -0.0302718 0.0433933 0.0389549 0.0520949 -0.109965 0.0190533 -0.0952141 -0.0503375 -0.0914739 0.0963205 0.145208 0.115077 -0.073592 -0.0562583 0.117596 0.0246144 0.0279512 -0.232271 0.0820066 -0.10609 0.155309 -0.0427651 -0.0346428 0.115411 0.0498693 -0.132957 -0.0912433 0.0183355 0.0535614 -0.0617242 -0.197659 0.0699878 0.105409 0.0861318 -0.0639951 0.0380107 0.0281392 -0.0410008 0.0579081 0.0502405 0.0213974 
-0.010438 0.102947 -0.130743 -0.0544675 0.0200761 0.100008 -0.00485703 -0.116689 -0.128236 -0.035949 -0.0255687 0.0694413 0.0625144 0.0160567 -0.0239914 -0.0644774 -0.0787389 -0.0496405 0.0837025 0.0813422 0.0398069 -0.0410989 0.0366075 0.0172548 -0.000426258 0.135241 0.00643681 -0.20136 0.0138613 0.129406 -0.0247396 0.0333124 -0.00596597 -0.0146536 0.0432967 0.0566422 -0.00631063 0.162046 -0.0114246 -0.0215885 -0.000730662 -0.0425675 0.00730418 0.162445 -0.161561 0.17717 0.244035 -0.0479098 -0.184119 -0.0253094 0.000197539 0.00883695 0.0115482 0.0236009 0.173003 0.053685 -0.0212897 0.197287 0.0043964 -0.125872 -0.0474618 -0.0300428 0.239892 -0.0965342 0.156413 -0.0814966 0.0291012 0.0304319 -0.0123005 0.0943401 0.0143603 0.0510091 -0.0679013 -0.0119059 0.0667183 0.0348352 -0.112697 0.0415745 0.023561 0.0589652 -0.0769738 0.0610434 -0.0340956 -0.0275422 -0.0889844 -0.0937051 0.0684991 -0.0237086 0.0217948 0.00299935 0.0232319 -0.110859 0.00991105 -0.0851349 -0.0265057 -0.0894853 0.0981292 0.134884 0.117408 -0.0776259 -0.0803083 0.108621 0.0135195 0.0809605 -0.228635 0.0547991 -0.118076 0.139047 -0.0351211 -0.0653068 0.0980434 0.064021 -0.150367 -0.0656356 0.0240253 0.057324 -0.0785016 -0.234723 0.0491665 0.107725 0.0710132 -0.00702077 0.0197746 0.0245007 -0.0351578 0.0582251 0.0341239 0.0175451 
0.0127 0.0233796 -0.13451 -0.0767788 0.0368425 0.132281 -0.0162611 -0.0275375 -0.127295 -0.0618197 -0.0505245 0.105321 0.0838769 -0.0483302 -0.0874778 -0.0778421 -0.120757 -0.0297769 -0.0228116 0.141098 0.0578705 -0.0654398 0.0906287 0.0784692 -0.0380318 0.0827723 0.0537755 -0.191087 -0.0360039 0.0461472 -0.0409697 -0.0424528 -0.0512778 0.0269019 -0.0302442 0.0213311 -0.0899018 0.140126 -0.118234 -0.0182247 0.0110487 -0.0551986 -0.0291301 0.224274 -0.180745 0.065361 0.204061 0.00594044 -0.157568 0.101291 0.0303088 -0.0805343 -0.0354809 0.00822759 0.157399 0.008176 -0.0420636 0.213694 0.0699754 -0.181109 -0.0331709 0.0191496 0.244411 -0.028544 0.0934661 -0.134659 -0.00285716 0.0446125 -0.0216195 0.0949616 -0.00844167 0.0610741 -0.00259337 -0.00633753 0.0199 0.0273302 -0.100037 0.0361391 0.0436344 0.086158 -0.0532499 0.00742707 -0.0199208 -0.0497085 -0.11155 -0.0794381 0.0964432 0.0420321 0.063492 0.0065908 0.0281919 -0.118682 -0.0246982 -0.081674 -0.0469337 -0.0572058 0.060695 0.114737 0.0575722 -0.0926652 -0.0409557 0.0824319 -0.00322353 0.0859744 -0.198624 0.023602 -0.184996 0.135765 -0.0775169 -0.0760876 0.134442 0.160943 -0.0927418 -0.00717758 -0.0163871 0.0639879 -0.083688 -0.15438 0.0369114 0.119138 0.010938 -0.00789271 0.00892808 0.0029602 -0.0690531 0.030876 -0.0266212 -0.0147678 
0.0360118 0.0167831 -0.161765 -0.0497283 0.0672383 0.148235 -0.0090881 -0.0689236 -0.108651 -0.0915049 -0.0313697 0.106827 0.085078 -0.0113219 -0.0950294 -0.0537956 -0.101988 -0.00756605 -0.0104384 0.13296 0.108744 -0.0884398 0.113408 0.070674 -0.00166406 0.0519068 0.0321891 -0.205413 -0.0333062 0.0970216 -0.0234446 -0.0140139 -0.0320209 0.0228295 -0.0090237 0.0351557 -0.0879921 0.134922 -0.0806912 -0.0555344 -0.0108259 -0.0330717 -0.00934764 0.200093 -0.18195 0.0598945 0.209663 -0.00748404 -0.152279 0.0811131 0.00765148 -0.0658793 -0.00284563 0.0138536 0.161495 0.0165444 -0.0173623 0.222577 0.0332636 -0.173526 -0.0409763 0.0198626 0.27414 -0.074961 0.105424 -0.101279 -0.0258998 0.0635161 -0.0388711 0.117843 0.00366574 0.0707086 -0.0462603 -0.0392267 0.00651253 0.0356667 -0.0759443 0.00600067 0.0225295 0.083183 -0.0740554 0.0234671 -0.0320754 -0.0542773 -0.117699 -0.0571806 0.0698785 0.0267106 0.0468468 0.00980935 0.0535159 -0.135865 -0.0407879 -0.0719635 -0.0170932 -0.0647605 0.0328565 0.150111 0.0650008 -0.0758421 -0.0253476 0.0625699 -0.00222819 0.0840293 -0.19202 0.0514496 -0.165366 0.129634 -0.0553265 -0.084691 0.0986772 0.132422 -0.0938908 -0.0121614 0.0230805 0.0893234 -0.0763763 -0.145254 0.0570996 0.152368 0.021381 -0.00994447 0.00914308 0.00769805 -0.0756439 0.0491394 0.00770222 0.00411609 
