0.0377367 0.0693404 -0.106467 -0.00482202 0.0569257 0.188617 0.00566703 -0.0672864 -0.0646917 0.0322319 0.0793015 0.0778943 0.0723938 -0.176969 -0.134748 0.0702321 -0.142848 0.130745 -0.0505877 0.0442042 0.24834 -0.0626933 0.00927691 0.0904414 0.0275879 0.0163349 -0.0144128 -0.253215 0.0795394 0.201202 -0.0515449 0.0276613 -0.0366565 0.0233072 0.0726517 -0.0445507 -0.0980321 -0.0180252 0.0649899 -0.0761712 -0.0406495 -0.132091 0.013195 0.167218 -0.0568106 -0.0371139 0.191748 -0.00880507 -0.217251 -0.0528298 0.0843586 -0.00419791 -0.0107531 -0.0150652 0.065856 0.0674743 0.0409499 0.0733854 -0.0448036 -0.121578 0.0157047 -0.0594704 0.253137 -0.0287664 0.0918954 -0.122516 -0.0741466 0.00063619 -0.0342529 0.072209 -0.0496875 0.0448903 -0.129073 -0.139678 -0.0445409 0.00483022 -0.0454275 0.0864271 -0.0212755 0.108311 -0.0321396 0.059973 -0.00398432 0.0229897 -0.111225 0.0652103 0.0485316 -0.0162393 0.0181318 0.0541356 0.0197964 -0.107145 -0.163775 0.0644222 -0.099949 -0.0306139 -0.0585652 0.116963 0.0619914 -0.0278582 0.132702 0.0247588 -0.0461814 0.0686062 -0.0158428 0.0274233 -0.0316611 0.138549 -0.0359459 -0.0491532 -0.0220942 0.040631 -0.089531 -0.0755445 0.0978401 0.114041 -0.14375 -0.0529512 0.0215977 0.103889 0.0415487 -0.055515 0.0210459 -0.0432597 -0.0386827 0.1336 0.0336895 0.00299908 
0.0471449 0.0494532 -0.0617264 0.0234596 0.0285371 0.184078 0.0268797 -0.0439404 -0.0270795 -0.00537765 0.083266 0.0519561 0.101583 -0.18211 -0.123309 0.065316 -0.178455 0.118072 -0.128561 0.0549423 0.279109 -0.101371 0.0584509 0.123375 0.0184658 -0.0605686 -0.0703273 -0.275306 0.0548849 0.179443 -0.0139568 0.0299779 -0.0529938 0.065084 0.0427456 -0.0547936 -0.111812 0.0337209 0.0347423 -0.0498965 -0.0490525 -0.134921 -0.0291721 0.123025 -0.0467939 -0.10774 0.146151 -0.00104881 -0.163136 0.00627023 0.0694999 -0.0327674 -0.00615701 0.00249496 0.0420695 0.0534213 0.0713365 0.0651912 -0.0257902 -0.132956 -0.00443569 -0.0313065 0.209222 -0.0494475 0.0608465 -0.103104 -0.0425957 -0.0110827 -0.0586181 0.0531992 -0.0622459 0.0581767 -0.116628 -0.0930899 -0.037823 -0.0253767 -0.033179 0.0320823 -0.0137614 0.170119 -0.023473 -0.00506229 -0.00823302 -0.0032248 -0.117915 0.101202 0.049427 -0.0294953 0.000376603 0.0234547 0.0409357 -0.131058 -0.119566 0.0410424 -0.125131 -0.0324769 -0.106496 0.121877 0.0570881 0.00748953 0.149385 0.00034518 -0.0567805 0.10853 0.0417768 0.0100852 -0.0301482 0.148776 -0.00367232 -0.0594395 -0.070783 0.0811117 -0.0891914 -0.0694758 0.0926753 0.164874 -0.112666 0.00906099 0.0217347 0.13951 0.016245 -0.0419569 -0.0148801 -0.00911166 -0.0568731 0.11855 0.0146851 0.0204257 
0.0491221 0.0536594 -0.020874 0.0389496 0.014957 0.230427 0.0502567 -0.041894 -0.049788 0.00226694 0.0705075 0.0533493 0.0898229 -0.180211 -0.0593087 0.039717 -0.181077 0.135083 -0.102322 0.00775557 0.250518 -0.076418 0.0527427 0.129223 0.0343764 -0.0860143 -0.0984175 -0.287876 0.0170092 0.181367 0.00155857 0.0388879 -0.0639423 0.0826611 0.0555287 -0.0537658 -0.0914754 -0.00505095 0.0476069 -0.0225521 -0.0241835 -0.142091 -0.0124772 0.087717 -0.0697381 -0.121638 0.146824 -0.0343936 -0.169339 0.0159583 0.112401 -0.066709 0.00598524 0.0180077 0.0330469 0.0788414 0.0791184 0.0745519 -0.0173605 -0.103996 -0.017691 -0.0069598 0.16645 -0.11818 0.0907392 -0.0772287 -0.0231798 -0.0429566 -0.101467 0.0717153 -0.0578884 0.0837657 -0.116375 -0.0777613 -0.0334154 -0.0177984 -0.0382784 -0.00564517 -0.00861582 0.157447 -0.0348946 -0.00845476 0.00759344 0.00114995 -0.120413 0.101127 0.0561805 -0.0710679 -0.0351857 0.0378564 0.0290281 -0.142685 -0.0949227 0.0290069 -0.141615 -0.0160991 -0.102712 0.120446 0.0602229 0.0493682 0.129504 0.0104773 -0.0555098 0.116726 0.0503811 0.00440398 -0.0278548 0.124555 -0.0518489 -0.0442974 -0.0821829 0.0571034 -0.0630077 -0.103908 0.0837016 0.152235 -0.0877223 0.0196157 0.0161216 0.144411 0.0592964 -0.0754155 -0.019334 -0.0136364 -0.022732 0.117857 0.0215422 0.0300731 
0.040669 0.101747 -0.022222 0.00516314 0.00234768 0.211527 0.0080303 -0.027482 -0.0548249 0.0255375 0.112353 0.0526921 0.0791704 -0.19807 -0.0904263 0.0507617 -0.17099 0.0955283 -0.0991749 0.026347 0.253814 -0.0635853 0.0195559 0.121695 0.0427379 -0.0184244 -0.0261446 -0.220665 0.101673 0.162312 -0.0131785 -0.00668415 -0.0399345 0.0648357 0.030509 -0.0617425 -0.112384 0.0199547 0.0561343 -0.0295067 -0.0380324 -0.159674 -0.0196103 0.133768 -0.0441174 -0.116702 0.153655 -0.0195223 -0.204981 -0.0101996 0.105232 0.0305294 -0.0366111 -0.0028791 0.0420371 0.0668687 0.0298053 0.0732625 -0.0481959 -0.139437 -0.0324863 -0.0660077 0.231301 -0.045135 0.0626316 -0.0762608 -0.0321556 -0.0317758 -0.0889776 0.0849726 -0.0592308 0.0504007 -0.12538 -0.0753402 0.00750804 -0.0426453 -0.0351737 0.0397227 -0.00285323 0.177786 -0.033052 -0.00491858 0.0475689 0.00932627 -0.0893799 0.0537492 0.0569394 -0.0262082 0.0260107 0.0554857 0.0176414 -0.140537 -0.134418 0.086008 -0.12022 -0.055361 -0.0721199 0.104458 0.0547783 -0.0117372 0.117222 0.0385624 -0.0648908 0.104358 0.00839445 0.0444888 -0.0118087 0.139312 0.0142092 -0.10646 -0.0351453 0.087578 -0.097115 -0.0502839 0.127327 0.117113 -0.115334 -0.00359864 0.0525424 0.145105 0.0486337 -0.0760543 -0.00551319 -0.0363676 -0.00649568 0.136961 0.0826637 0.0320914 
0.00886835 0.141012 0.00264075 0.0130097 0.000999558 0.182705 0.0415399 -0.00374679 -0.0351411 0.0746167 0.118458 0.053049 0.0388546 -0.264569 -0.0769607 0.00307259 -0.1898 0.101425 -0.0977077 0.0356716 0.190093 -0.0846234 -0.0186955 0.0983888 0.0332718 0.0234761 -0.0441271 -0.201756 0.146246 0.0940913 0.00444688 0.0196251 -0.0608173 0.0673535 0.0309633 -0.0737773 -0.0832777 0.0459485 0.062637 -0.0329882 0.0451611 -0.187167 -0.047585 0.143479 -0.0759288 -0.132834 0.152352 -0.0100083 -0.197 -0.0388057 0.0632923 0.0781503 -0.0915292 -0.0148771 0.0431373 0.0578865 2.1076e-05 0.0410573 -0.0769862 -0.137241 -0.0475382 -0.111069 0.237723 -0.0193816 0.0718262 -0.0637747 -0.00281115 -0.08468 -0.0638106 0.103012 -0.080626 0.0650754 -0.0898976 0.0327016 0.0220395 -0.109767 -0.0577483 0.110773 0.00660002 0.12164 -0.0825487 0.0469069 0.0601156 0.0136969 -0.0346652 0.0148792 0.082771 0.0375738 0.0771143 0.0305966 0.0500411 -0.105878 -0.114193 0.0399445 -0.100934 -0.117811 -0.0353859 0.0707923 0.042877 -0.032945 0.0522003 0.0274236 -0.050218 0.106906 0.0316935 0.0612519 0.0317036 0.166928 0.0745716 -0.0783498 -0.0295303 0.118556 -0.125363 -0.0378093 0.142272 0.028249 -0.0869581 -0.0823876 0.0985156 0.10714 0.070956 -0.0292708 -0.00788066 0.00221639 -0.0063029 0.0920698 0.0937956 0.033363 
0.0206984 0.10961 -0.0455638 0.00982955 -0.0116354 0.165796 -0.00641323 -0.00142571 -0.0526876 0.0340105 0.121636 0.0592095 0.0744493 -0.227134 -0.131369 0.0401604 -0.187312 0.106492 -0.104822 0.085371 0.235806 -0.0969452 0.0311954 0.100168 0.0133021 -0.0123124 -0.0180611 -0.21901 0.101022 0.139971 -0.0482719 -0.014985 -0.0148385 0.0617725 0.00398642 -0.0690292 -0.10948 0.0432488 0.0234963 -0.0251354 -0.0353389 -0.178397 -0.0230654 0.159253 -0.0706559 -0.124608 0.182672 -0.0304692 -0.207028 0.0278028 0.0808082 0.0297474 -0.082212 0.0195879 0.0391252 0.0492531 0.0346184 0.0189437 -0.0396298 -0.145689 -0.0211683 -0.0837617 0.23752 -0.00877501 0.049978 -0.109981 -0.0343233 -0.0657506 -0.0611859 0.0727875 -0.064775 0.0348356 -0.0960958 -0.0279839 0.0156978 -0.0651499 -0.0394069 0.073984 -0.0122286 0.147497 -0.0623951 0.00232791 0.0298258 0.0203074 -0.0826823 0.0944654 0.0445203 -0.000863294 0.0687275 0.0337379 0.0180481 -0.134291 -0.142867 0.0551549 -0.104221 -0.0829164 -0.0806727 0.120481 0.0428885 -0.0353234 0.0795288 0.0252095 -0.0391195 0.10918 0.027165 0.0552257 -0.00138797 0.181043 0.0219029 -0.101314 -0.0531488 0.0979349 -0.0946971 -0.0439955 0.0914644 0.081704 -0.0771707 -0.0414302 0.0754494 0.12604 0.0225223 -0.0424641 -0.00499912 -0.0128632 -0.017514 0.105535 0.0897081 0.0438151 
0.00976675 0.116958 -0.0463745 -0.00558603 -0.0187682 0.199303 -8.04725e-05 0.00141822 -0.0218959 0.0309712 0.125124 0.0526549 0.0805373 -0.209799 -0.109946 0.0391283 -0.200216 0.102157 -0.11473 0.033191 0.23561 -0.0831067 0.0252131 0.0915703 0.016592 -0.0342678 -0.0154682 -0.221996 0.0805956 0.147266 -0.0171815 -0.00930526 -0.0132294 0.0616404 0.00212163 -0.0546109 -0.108566 0.0199224 0.0236943 0.0087421 -0.0297258 -0.180796 -0.0319362 0.153217 -0.0553315 -0.130004 0.158867 -0.0379276 -0.20908 0.00882586 0.0828812 0.0142514 -0.0755271 0.0109797 0.010645 0.0835336 0.0180937 0.0412536 -0.04655 -0.12407 -0.0400601 -0.0800313 0.231262 -0.0438287 0.0635152 -0.10196 -0.0229057 -0.0463619 -0.0682462 0.0883012 -0.0527308 0.0363718 -0.109783 -0.0643375 0.0164733 -0.0461656 -0.0472006 0.0523907 -0.0397483 0.139591 -0.0655753 -0.00232495 0.0303083 0.0294189 -0.114969 0.115743 0.0607846 -0.0411333 0.0369657 0.0415524 0.00762693 -0.166798 -0.142908 0.0544966 -0.101379 -0.0587077 -0.0993515 0.0988469 0.0502698 0.00069104 0.0836467 0.00808722 -0.0539715 0.105813 0.0302903 0.0505422 -0.0221541 0.160376 -0.0255177 -0.108737 -0.0698735 0.0769739 -0.0897032 -0.0599811 0.0976396 0.0966537 -0.0883289 -0.0211209 0.0925793 0.136615 0.0544048 -0.0643904 -0.012126 0.00030263 0.00171601 0.106125 0.0703896 0.0518394 
0.0329555 0.127416 -0.0598285 -0.0209639 0.0161674 0.184422 -0.00599327 -0.0162918 -0.0459166 0.0227344 0.109334 0.0788711 0.0777973 -0.193141 -0.115509 0.0546111 -0.159221 0.0928391 -0.120599 0.06027 0.225623 -0.0467599 0.0277639 0.104311 0.00761363 -0.00781491 0.0133164 -0.210484 0.08808 0.167879 -0.053125 0.00562317 -0.00769417 0.0684029 -0.00899619 -0.0558356 -0.0894794 0.0435655 0.0225394 0.0166472 -0.0399081 -0.149576 -0.00940546 0.15253 -0.0624816 -0.0710892 0.191542 -0.0482708 -0.226769 0.0205253 0.11204 0.022518 -0.0969752 0.016314 0.0450661 0.0648652 0.0127095 0.0686452 -0.0446018 -0.118687 -0.0353284 -0.093138 0.237985 -0.0468826 0.0680052 -0.142064 -0.0381686 -0.0160055 -0.0707869 0.0977708 -0.0366728 0.0375948 -0.109698 -0.0635639 0.0227393 -0.0197913 -0.0454102 0.0801973 -0.0398865 0.120033 -0.048638 0.0329811 0.0312634 0.0296414 -0.108237 0.0871092 0.0600011 -0.0343835 0.0306183 0.0562168 -0.00858167 -0.178963 -0.163344 0.0671847 -0.0841168 -0.0429794 -0.0709749 0.0934217 0.0547527 -0.0205689 0.0567177 0.0216598 -0.0565475 0.142019 -0.0288825 0.0427262 -0.0637511 0.16259 -0.0258952 -0.125851 -0.030909 0.0928699 -0.101096 -0.0266871 0.0868706 0.0856842 -0.114341 -0.0577852 0.0627772 0.141402 0.0539222 -0.0237081 0.00808104 -0.0028469 0.0112454 0.100243 0.0655994 0.0126789 
0.0357274 0.107963 -0.0588567 -0.0300682 0.0150109 0.191923 0.0193045 0.00325817 -0.0218969 -0.00535957 0.101751 0.0625295 0.0703935 -0.188202 -0.0920874 0.0211494 -0.182459 0.0676223 -0.128223 0.0345631 0.227706 -0.0565512 0.0506311 0.0926969 0.0118295 -0.0302636 0.00417736 -0.236933 0.0780216 0.133956 -0.0230114 -0.0049838 -0.0161998 0.0739362 -0.00187685 -0.0644087 -0.0904342 0.0769707 0.000991591 0.0203451 -0.00504629 -0.145568 -0.0620197 0.156414 -0.0892163 -0.0553765 0.156185 -0.0447114 -0.209238 0.00854323 0.0634351 0.030221 -0.0751946 0.0127961 0.0328385 0.0659224 0.0318649 0.0835419 -0.0557711 -0.122393 -0.0428824 -0.0844994 0.237565 -0.0485904 0.077655 -0.134094 -0.0170985 0.00358465 -0.043781 0.116351 -0.0396462 0.042231 -0.113907 -0.0595483 0.0304097 -0.0297542 -0.0748843 0.0618875 -0.040181 0.141541 -0.0831471 0.0202108 0.025339 0.00918521 -0.107299 0.0769638 0.0840903 -0.0316702 -0.000479486 0.0350774 0.0281111 -0.180231 -0.141442 0.0232207 -0.0907263 -0.0740926 -0.0661687 0.0839471 0.0738896 -0.0145414 0.0623301 0.0110662 -0.0479791 0.139765 -0.023174 0.0184046 -0.0640964 0.180509 -0.0176446 -0.130961 -0.0191299 0.102235 -0.114961 -0.0464804 0.105364 0.111398 -0.126626 -0.0719133 0.0880508 0.158683 0.0596379 -0.0134833 -0.0251344 0.0300266 0.0117168 0.0808405 0.0539115 0.0300695 
0.049431 0.100262 -0.0556418 -0.0127109 0.0301597 0.198384 0.0334987 0.0142499 0.00792451 0.00580331 0.130252 0.064678 0.0732277 -0.212811 -0.0939644 0.010871 -0.167609 0.111921 -0.154882 0.0357753 0.238618 -0.0554482 0.0333426 0.12406 0.0220718 -0.0750915 -0.00172455 -0.227474 0.0769028 0.139983 -0.0014029 -0.0153912 -0.0257414 0.0917767 -0.00083559 -0.0667627 -0.094019 0.0225606 -0.00309618 0.0102116 0.00533381 -0.144829 -0.0582628 0.175412 -0.0905509 -0.120687 0.126773 -0.01904 -0.177659 0.0208413 0.0726294 0.00913225 -0.0960193 -0.00508375 0.00709599 0.0711238 -0.00235243 0.0752147 -0.053576 -0.108838 -0.0473378 -0.0938525 0.226687 -0.0498459 0.046496 -0.14555 -0.0142402 -0.0233839 -0.0564155 0.112389 -0.0430989 0.0508627 -0.102505 -0.0719876 -0.00895685 -0.0530511 -0.060074 0.0793355 -0.0494903 0.133638 -0.0741163 0.0282754 0.026084 0.00863077 -0.0906967 0.0987427 0.083089 -0.037637 0.00563173 0.0414736 0.0392132 -0.185835 -0.158334 0.0181384 -0.0889335 -0.0776054 -0.108251 0.0573109 0.0454466 -0.00623804 0.071584 0.000560804 -0.0369635 0.126108 0.00625954 0.019843 -0.0491874 0.162937 -0.0172732 -0.103609 -0.0319373 0.093356 -0.103533 -0.0276862 0.097922 0.0930573 -0.101989 -0.0547603 0.0836504 0.152107 0.0599204 -0.013487 -0.0435493 0.0541881 0.00358996 0.0583686 0.043984 0.0292932 
-0.000636067 0.120962 -0.0590331 0.00516052 0.00982044 0.16832 -0.0159384 -0.0270626 0.0234586 0.0310157 0.105662 0.0304164 0.0436915 -0.188214 -0.103872 0.0550781 -0.157731 0.120291 -0.0724547 0.00555119 0.25082 -0.0869549 0.0599857 0.0792717 0.0541245 -0.0197727 0.0138313 -0.236131 0.113597 0.144769 0.0275873 0.0104419 0.0320047 0.0387025 0.054734 -0.054082 -0.0696675 0.0669478 0.0300136 -0.059076 -0.0264067 -0.150511 -0.0323313 0.159601 -0.0656145 -0.0949918 0.152796 -0.0355609 -0.187125 -0.0529153 0.043411 0.0541429 -0.0160166 -0.0154028 0.0256783 0.0968773 0.0685217 0.0261891 -0.0551636 -0.156394 -0.0507429 -0.120463 0.235075 -0.0493877 0.0994378 -0.0881458 -0.0474367 -0.0283492 -0.0446907 0.136773 -0.0734177 0.0260646 -0.146824 -0.106496 0.00186941 -0.0606377 -0.0558671 0.0977046 -0.0533793 0.103512 -0.108269 0.053149 0.0133128 0.0173954 -0.0662127 0.0552483 0.0365062 0.00403271 0.0371662 0.0358591 0.0286357 -0.125885 -0.149681 0.0195316 -0.0396936 -0.0681143 -0.0837137 0.142182 0.0581345 -0.0179252 0.0999477 -0.00933936 -0.0407309 0.0847517 0.0314036 0.0246644 0.010922 0.108644 0.046936 -0.110937 -0.0823151 0.0817628 -0.0956876 -0.0656954 0.154868 0.0850678 -0.0997073 -0.0917334 0.107385 0.138216 0.0791865 -0.0250522 -0.0190159 -0.0047794 -0.00891072 0.100455 0.0994325 0.0555083 
0.0626301 0.039797 -0.0268322 -0.0386249 0.0256056 0.176945 0.0417482 0.00363121 -0.0639839 -0.0751747 0.0502392 0.0717353 0.1023 -0.161068 -0.0996587 0.013815 -0.197848 0.0200742 -0.135695 0.0837808 0.258512 -0.0479361 0.0257998 0.0971951 -0.021573 -0.0180526 -0.0589125 -0.238619 0.0580986 0.165456 -0.0662967 0.00172815 -0.0501973 0.0893835 0.0137536 -0.0590276 -0.0920458 0.0850272 0.000312867 -0.0225795 -0.011679 -0.132024 -0.0236652 0.112616 -0.0612076 -0.0393705 0.153619 -0.0335553 -0.200892 0.0420686 0.0290252 -0.0228364 -0.0245583 0.04787 0.0943839 0.0299991 0.0152997 0.105082 -0.086055 -0.13349 -0.00697608 -0.0198414 0.224555 -0.0310425 0.0611801 -0.0986685 -0.0205418 -0.00450053 -0.057765 0.0188118 -0.0469708 0.0201176 -0.108288 -0.0517495 0.0238385 0.0134213 -0.0427127 -0.0154255 0.028221 0.192351 -0.0150447 -0.0208309 0.0181203 -0.00440414 -0.108903 0.0669041 0.0810233 -0.00952851 -0.00132216 0.0636156 0.0717182 -0.177651 -0.118925 0.0689237 -0.155842 -0.0404066 -0.0498363 0.083237 0.0852554 -0.00654222 0.101914 0.0265958 -0.0714021 0.124479 -0.057852 0.0330413 -0.0764684 0.197976 -0.0382534 -0.104933 0.0112379 0.0788309 -0.149317 -0.0609908 0.0823031 0.168882 -0.120814 -0.0147216 0.0261422 0.157468 0.0157883 -0.0303226 0.00420641 0.000209176 -0.0155392 0.108842 0.042523 -0.0103091 
0.0685557 0.0171644 -0.05197 0.00693616 0.0554111 0.193682 0.0605047 -0.0196022 -0.0174942 -0.0475527 0.093131 0.126155 0.0769207 -0.210547 -0.154474 -0.048571 -0.162188 0.114805 -0.157527 0.115959 0.222351 -0.0837563 0.0275376 0.164315 -0.0358429 -0.0357964 -0.0371791 -0.236711 0.046191 0.123297 -0.0561261 -0.0112071 -0.0633977 0.0989852 0.0126074 -0.0742905 -0.0969427 0.0699919 -0.0286544 -0.053258 0.0310994 -0.114544 -0.0792096 0.12796 -0.133269 -0.137178 0.121462 0.00324767 -0.154298 0.0636922 0.0337607 -0.02342 -0.0568706 0.0221611 0.0804653 0.027019 -9.81426e-05 0.109603 -0.0998513 -0.124306 -0.00757054 -0.0334085 0.269771 -0.0392604 0.0594485 -0.124719 -0.012289 -0.0318535 -0.0789619 0.0861857 -0.0535211 0.0267358 -0.0688071 0.000566367 -0.0265886 -0.0356622 -0.037525 0.039673 0.0199511 0.107493 -0.0822444 0.0451791 0.0167556 -0.0342355 -0.0720425 0.0482127 0.102273 0.0330298 0.027069 0.0481955 0.0942161 -0.183777 -0.0799387 0.0321792 -0.106202 -0.110313 -0.0740438 0.0331057 0.0615389 -0.016909 0.104957 0.0283647 -0.064253 0.117117 0.0161377 0.0297214 -0.0240745 0.150007 -0.0392598 -0.0568618 0.0113827 0.113304 -0.0719102 -0.0178402 0.0716121 0.113903 -0.114246 -0.0418202 0.0497236 0.139832 0.0013019 -0.0223236 -0.0443788 0.00862981 -0.0269193 0.105084 0.0132927 -0.0166722 
0.0959735 -0.0205713 -0.0565019 0.00470423 0.0725592 0.168211 0.0720667 0.0152562 0.0216348 -0.101846 0.0552889 0.114101 0.0680359 -0.192364 -0.0960097 -0.0618367 -0.140416 0.0653239 -0.184375 0.137673 0.199522 -0.0577244 0.0784903 0.133432 -0.0519166 -0.0563174 -0.0444827 -0.262667 -0.00528644 0.0836696 -0.0311428 0.0157162 -0.028212 0.127978 0.0178406 -0.0615493 -0.0457083 0.160242 -0.0861372 -0.0809135 0.0472975 -0.0851626 -0.106239 0.123452 -0.162418 -0.080533 0.0900292 0.00558502 -0.131518 0.104143 -0.00435001 -0.0469282 -0.0269068 0.0318853 0.112166 -0.00301843 -0.00343525 0.0918179 -0.0946247 -0.150475 -0.0330886 -0.0508213 0.2275 -0.0594619 0.071174 -0.135066 -0.00147879 0.0202242 -0.0630521 0.0840885 -0.0337115 -0.000941503 -0.0663462 -0.00666438 -0.0343503 -0.0318488 -0.0629413 0.011767 0.0286555 0.126783 -0.0898015 0.0455337 -0.0218967 -0.0780044 -0.0388927 0.0196012 0.100605 0.0469306 0.0129626 0.0646034 0.129632 -0.199546 -0.0898967 -0.0128586 -0.101804 -0.091625 -0.0473882 0.0152231 0.0510072 -0.0339592 0.0972568 0.00972753 -0.0528996 0.101178 -0.023393 -0.0138369 -0.0585313 0.131269 -0.0105447 -0.0570332 0.0253552 0.14284 -0.103042 -0.0180549 0.0861876 0.10943 -0.118372 -0.10427 0.0546318 0.152678 0.0204069 0.0459208 -0.0276289 0.0776839 0.026707 0.0294365 0.0549408 -0.0347423 
0.068528 0.0559422 -0.0131906 0.0121084 0.0525956 0.194764 0.0457012 0.00295192 -0.0188074 -0.0591742 0.103173 0.114399 0.0548007 -0.216246 -0.0889106 -0.0418012 -0.153998 0.10352 -0.166025 0.0952536 0.213583 -0.040168 0.0353148 0.137945 0.0056429 -0.0526874 -0.0226265 -0.218354 0.0464217 0.110509 -0.00960087 -0.013941 -0.0356938 0.11767 0.0229619 -0.0659403 -0.0830004 0.0765487 -0.0347489 -0.0389961 0.0443556 -0.117342 -0.065531 0.16005 -0.139764 -0.119068 0.128304 -0.02321 -0.180131 0.0690622 0.0512726 -0.00923723 -0.0757622 0.00608226 0.0658655 0.0329897 -0.0400908 0.0967313 -0.0862518 -0.134302 -0.0539858 -0.0771887 0.241521 -0.0546562 0.0734157 -0.126881 -0.00753105 -0.0373012 -0.108662 0.114351 -0.0268895 0.023104 -0.0685901 -0.0204076 -0.0179906 -0.0540313 -0.0660457 0.0291017 0.00103687 0.143775 -0.0893185 0.0353914 0.0307214 -0.032203 -0.0611451 0.0256947 0.0956849 0.00586875 0.0149671 0.0726922 0.0806144 -0.198176 -0.126654 0.0210211 -0.0972221 -0.0950683 -0.0677725 0.0327365 0.030264 -0.0316352 0.0536496 0.0352528 -0.0534967 0.112916 -0.0185361 0.0317814 -0.0307727 0.152709 0.00565362 -0.0920955 0.00902418 0.112163 -0.118603 -8.23951e-05 0.0998836 0.0727856 -0.103572 -0.0720249 0.0812894 0.162357 0.0486863 0.000322826 -0.0472502 0.0444268 0.0429722 0.0565258 0.0993276 -0.00542523 
0.0651478 0.0368482 -0.0082484 0.00276572 0.0641553 0.175387 0.0371335 0.0167186 -0.00665777 -0.0458001 0.073618 0.117058 0.036826 -0.233532 -0.0726803 -0.0214277 -0.174168 0.0769119 -0.156635 0.107855 0.204079 -0.0315868 0.0664701 0.129189 -0.0124981 -0.0293474 -0.0116531 -0.249087 0.0400035 0.0925606 -0.0305699 -0.0190584 -0.0153242 0.118292 0.0289423 -0.0649669 -0.0662957 0.114719 -0.058522 -0.0499845 0.038432 -0.115933 -0.0776921 0.151801 -0.149451 -0.0779939 0.129798 -0.0218437 -0.173242 0.0859645 0.0503226 -0.0136467 -0.0688586 0.0104259 0.105214 0.0221928 -0.0102975 0.072735 -0.0910232 -0.13328 -0.0428804 -0.0992098 0.229165 -0.0385588 0.102372 -0.153147 -0.0293669 -0.0050383 -0.0789666 0.123715 -0.0364864 0.0311505 -0.0789471 -0.0203225 -0.0144744 -0.0385452 -0.0744545 0.0558756 0.0134848 0.134992 -0.0779033 0.0413774 0.0156141 -0.0265149 -0.0466067 -0.000576873 0.0980213 0.0453923 0.0272773 0.0880034 0.0787539 -0.175643 -0.13697 0.0224679 -0.104823 -0.0814714 -0.0529952 0.0289981 0.0525988 -0.0409729 0.0722559 0.0177193 -0.0627371 0.0775971 -0.0225792 -0.000864478 -0.0419279 0.130044 0.0186418 -0.0822848 0.0168599 0.142578 -0.102035 -0.0197504 0.118631 0.0871799 -0.109958 -0.094206 0.0540537 0.160621 0.0574113 0.0352409 -0.020462 0.0492299 0.048519 0.0595261 0.112899 -0.0111107 
0.0222443 0.0612782 0.0393138 0.0103663 0.0666074 0.222356 0.0421851 -0.0156114 -0.000611998 -0.0576742 0.0639099 0.0813479 0.0289851 -0.202206 -0.024256 -0.0401248 -0.223502 0.0817813 -0.134552 0.0507968 0.214551 -0.0445201 0.0448673 0.116665 0.0473745 -0.0622366 -0.0670636 -0.226527 0.0570437 0.0906817 0.0450258 -0.0349721 -0.0444447 0.0913953 0.0750509 -0.0222466 -0.0835648 0.0422799 -0.0278798 -0.0622566 0.0863081 -0.124395 -0.046997 0.141941 -0.149643 -0.097968 0.127183 -0.012401 -0.168622 0.0333334 0.00614516 -0.0223281 -0.0327013 -0.00874999 0.0928288 0.0609292 -0.0370099 0.106213 -0.103008 -0.140775 -0.0743274 -0.0451823 0.227616 -0.0607286 0.123791 -0.0561656 -0.0143102 -0.0424951 -0.105727 0.141614 -0.0196007 0.0710065 -0.073708 -0.0410521 0.0125879 -0.031971 -0.0944987 0.0131473 0.0231573 0.138966 -0.068629 0.0410009 0.0412988 -0.0031858 -0.0665678 0.0162117 0.0980318 0.0442123 -0.00485263 0.0954985 0.113096 -0.165977 -0.109127 0.00564903 -0.125149 -0.100198 -0.0797526 0.064296 0.0489501 -0.0116228 0.0745795 0.00902403 -0.0486521 0.0304832 -0.0167544 0.0622526 -0.00948679 0.128298 0.0265353 -0.0618685 0.00418734 0.0962404 -0.118091 -0.0412068 0.132146 0.0922772 -0.104524 -0.0404276 0.073056 0.172077 0.0955107 -0.0279819 -0.0468237 0.0271724 0.0184224 0.100287 0.116585 0.0334022 
0.0455651 0.0233233 -0.00699415 -0.0124113 0.0987991 0.218746 0.0549967 0.00881781 -0.00414121 -0.0488424 0.0652253 0.0985638 0.0453091 -0.176677 -0.0408701 -0.020143 -0.168892 0.0856808 -0.136416 0.0660813 0.232807 -0.0475287 0.0474723 0.139035 0.0319021 -0.0515781 -0.04339 -0.234081 0.0756306 0.0892456 0.0350388 -0.0301175 -0.0472139 0.0872192 0.0483726 -0.0192125 -0.0977626 0.0605885 -0.0386909 -0.0639064 0.0675655 -0.0800491 -0.0629534 0.157215 -0.142184 -0.096522 0.122039 -0.0084573 -0.16399 0.0183498 -0.00311954 -0.0338862 -0.0529286 -0.0249028 0.0902576 0.0634987 -0.045263 0.158364 -0.106184 -0.129855 -0.0699575 -0.052922 0.259505 -0.0674662 0.121622 -0.0784226 -0.0338383 -0.00593229 -0.0919453 0.137617 -0.0119638 0.080492 -0.084919 -0.0580133 -0.01356 -0.025219 -0.0704337 0.0481792 0.0151659 0.10141 -0.084627 0.0559757 0.0239952 -0.0253823 -0.0738126 0.0034709 0.110663 0.053668 0.00110977 0.0729178 0.117382 -0.164422 -0.135174 0.0139473 -0.0705506 -0.0831641 -0.065714 0.0522732 0.0346941 -0.00408918 0.0638296 -0.0100004 -0.060164 0.0450143 -0.0568814 0.062184 -0.0405597 0.0982933 0.0297711 -0.090568 0.012677 0.115058 -0.107063 -0.0258249 0.155343 0.100027 -0.114447 -0.06643 0.0616606 0.180273 0.0673286 -0.017398 -0.0398546 0.0371765 -0.0106282 0.100837 0.0789777 0.00520198 
0.00262167 0.137874 0.024687 0.00789773 0.102027 0.216067 0.0457142 -0.096138 0.0124381 0.00748391 0.0776052 0.0810365 0.004168 -0.162965 -0.0222207 -0.0334975 -0.173773 0.127308 -0.0833284 0.0243482 0.191293 -0.019064 0.000679226 0.103118 0.0737956 -0.0588638 -0.0742612 -0.163521 0.140803 0.154349 0.0416882 -0.0101416 -0.0372127 0.0439683 0.117126 0.000191735 -0.0632808 -0.00766809 0.033827 -0.0738263 0.0671209 -0.105277 -0.0124459 0.117193 -0.141037 -0.0553043 0.13248 0.0107388 -0.162626 -0.0318816 0.00582114 0.0665388 -0.0498292 -0.0479097 0.0771192 0.0880334 -0.0536439 0.111599 -0.154238 -0.084365 -0.0869641 -0.0612093 0.258561 -0.0783359 0.142206 -0.0430536 -0.0275516 -0.0546269 -0.132692 0.186734 0.00870628 0.0895059 -0.0923354 -0.0472588 0.00811349 -0.0170672 -0.0716318 0.0476241 0.0109594 0.0550363 -0.0602921 0.114966 0.0415465 0.0452662 -0.0368614 -0.0154879 0.0561663 0.0490149 0.00432113 0.121777 0.104602 -0.138582 -0.107145 0.0396554 -0.0694379 -0.144037 -0.0785436 0.066094 0.0639767 -0.0145049 0.0803171 0.0212233 -0.0515895 0.00359855 -0.0398702 0.108328 0.0388055 0.0905113 0.0759778 -0.0232268 0.00933794 0.0482186 -0.10984 -0.0121419 0.135651 0.0641193 -0.0961934 -0.0350153 0.0740204 0.162895 0.104503 -0.0478126 -0.048086 0.00969567 -0.00539646 0.141772 0.122837 0.017945 
-0.0037765 0.150719 -0.0577437 -0.00733102 0.0641109 0.1733 0.0263221 -0.0961233 -0.0279265 0.00162309 0.0684333 0.0739548 0.0540183 -0.0896474 -0.108555 0.0259653 -0.128491 0.116162 -0.0388498 0.0224869 0.241754 -0.0649374 -0.0134685 0.0570395 0.0615701 -0.0330476 -0.0734354 -0.154815 0.140919 0.246897 -0.0321951 0.034125 0.0123977 0.00138999 0.070999 -0.0272594 -0.0796556 0.0051096 0.0688495 -0.0805537 -0.0236426 -0.100654 0.0550598 0.0936771 -0.0651058 -0.0208944 0.172229 -0.0504498 -0.211798 -0.0788091 0.0172342 0.0776391 0.00277607 -0.00768524 0.0730484 0.102607 0.00227251 0.0960862 -0.12247 -0.102705 -0.0472533 -0.0368505 0.256184 -0.0782816 0.101828 -0.0173113 -0.0633807 -0.031583 -0.121541 0.089736 0.00978836 0.029512 -0.141852 -0.113159 0.0265185 0.0578085 -0.0231037 -0.000734995 -0.0175957 0.0597903 -0.0724926 0.0796505 0.0376839 0.070981 -0.0726018 0.0559545 0.0145541 -0.015193 0.0263479 0.0877323 0.0326851 -0.156755 -0.126799 0.0821564 -0.057518 -0.0892391 -0.068506 0.1319 0.0708202 -0.00396526 0.107326 0.032677 -0.043107 0.0697741 -0.0828586 0.124012 0.00983495 0.13037 0.0153978 -0.0907058 -0.0202578 -0.0150635 -0.127797 -0.0464395 0.112198 0.106083 -0.113676 -0.0197032 0.0833916 0.153362 0.0529509 -0.0831549 -0.0258122 -0.055348 -0.0238324 0.182064 0.0964726 0.0185149 
0.030348 0.144694 -0.0556378 -0.0102482 0.0386592 0.1851 0.0150979 -0.0439666 -0.0546609 0.0530057 0.10426 0.0589574 0.0630301 -0.144139 -0.0877858 0.0390883 -0.126625 0.117873 -0.053259 0.0249122 0.240327 -0.0682044 0.029239 0.102553 0.0619672 -0.0407477 -0.0112295 -0.190169 0.129538 0.209156 -0.0431218 -0.0201343 0.00441538 0.0330055 0.0375722 -0.0558385 -0.0962983 0.0223832 0.0475701 -0.0378016 -0.0598158 -0.131882 0.00536889 0.12936 -0.0725854 -0.0496504 0.171714 -0.0396533 -0.21694 -0.0320004 0.0936866 0.0785828 -0.0516391 -0.0131421 0.0499283 0.0857082 0.0289732 0.0820292 -0.0760051 -0.103303 -0.0377073 -0.0847222 0.247546 -0.0707178 0.0960815 -0.0889122 -0.0684943 -0.0182209 -0.103968 0.118906 -0.0203704 0.0590024 -0.150004 -0.103834 0.0136015 0.00846065 -0.0163748 0.0647358 -0.0161806 0.101785 -0.0830434 0.0302166 0.0379267 0.0465503 -0.0795178 0.0473381 0.0251474 -0.0280999 0.0446789 0.0696397 -0.00281474 -0.153098 -0.142113 0.0753961 -0.0633708 -0.0834992 -0.0685024 0.117168 0.0692622 -0.0171766 0.101514 0.0464937 -0.0479377 0.0909901 -0.0418455 0.0738933 -0.0130353 0.127512 0.0301272 -0.118292 -0.0271119 0.052227 -0.0899725 -0.0371691 0.125507 0.111473 -0.101393 -0.0303177 0.07098 0.16818 0.0442442 -0.0727605 -0.0251132 -0.0264219 -0.00121617 0.152591 0.0977828 0.0235303 
0.0359909 0.0868648 -0.0559229 0.0260662 0.0184346 0.183324 -0.0184467 -0.0457888 -0.017661 -0.0172284 0.10035 0.0857778 0.0399523 -0.180262 -0.116286 0.0349676 -0.163332 0.108176 -0.0624743 0.0460535 0.239138 -0.0541241 0.075323 0.114066 0.041402 -0.0256579 0.0213932 -0.245887 0.064703 0.174956 -0.0220235 -0.0222225 0.0288021 0.0493797 0.039337 -0.0567701 -0.0810252 0.0494918 0.0157424 -0.0297057 -0.0382634 -0.131322 -0.0248872 0.146147 -0.106261 -0.0849691 0.180172 -0.0635686 -0.169918 0.0239265 0.0937301 0.0498267 -0.0117128 0.0228797 0.0702402 0.069392 0.087361 0.0406444 -0.0502481 -0.132972 -0.0441067 -0.0960301 0.236962 -0.06031 0.0844485 -0.133653 -0.0363396 -0.0349766 -0.0663558 0.140894 -0.0471267 0.0367632 -0.135449 -0.0808449 0.013892 -0.0208864 -0.0567231 0.0576735 -0.0416785 0.148575 -0.084725 0.0414549 0.0376557 0.0236787 -0.0686172 0.0608822 0.0371963 -0.013234 0.0104487 0.0447721 0.0076505 -0.142351 -0.138625 0.0370254 -0.077388 -0.0847 -0.0772784 0.138094 0.0769204 -0.0302962 0.0981903 0.0334477 -0.0297952 0.0967022 0.00748714 0.0198568 -0.00772249 0.122679 0.00228356 -0.0970818 -0.050695 0.0742868 -0.0773582 -0.0608491 0.105976 0.118708 -0.082804 -0.06641 0.07487 0.163705 0.0662475 -0.0368604 -0.0193302 -0.0380362 0.00243813 0.12503 0.124013 0.0698833 
0.03639 0.095021 -0.082732 0.0136691 0.0183254 0.171015 -0.0237145 -0.0376308 -0.0335681 -0.00910397 0.100128 0.0789261 0.054856 -0.159317 -0.126498 0.0410972 -0.148351 0.09959 -0.0586947 0.0554395 0.243149 -0.0790862 0.0817428 0.106308 0.0474322 -0.0324207 0.026627 -0.237434 0.0668927 0.184597 -0.033274 -0.0210777 0.0293864 0.0405361 0.00752311 -0.0565013 -0.0976675 0.0509039 0.0167529 -0.0196258 -0.0593296 -0.129222 -0.0209649 0.14672 -0.0927016 -0.0711811 0.18449 -0.0699427 -0.181883 0.0194671 0.0911111 0.0509855 -0.0229422 0.0160212 0.054933 0.0705823 0.0826899 0.0555427 -0.0352803 -0.1292 -0.0342234 -0.0872828 0.239616 -0.0592064 0.072822 -0.13188 -0.0455748 -0.0164528 -0.0620168 0.125507 -0.0397354 0.0423609 -0.140627 -0.0918541 0.0173403 -0.0090724 -0.0433218 0.056098 -0.0505923 0.148525 -0.10037 0.0280232 0.0308311 0.0257979 -0.0840505 0.0794397 0.03003 -0.0267368 0.0211335 0.0248244 -0.00794097 -0.146676 -0.143676 0.0427705 -0.0615178 -0.0791582 -0.0776726 0.141835 0.0706435 -0.0318109 0.0824456 0.0278145 -0.0289045 0.11603 -0.0144759 0.033465 -0.0260667 0.138543 -0.00248427 -0.120007 -0.0495341 0.0747647 -0.0800192 -0.0528224 0.0983113 0.120584 -0.0905026 -0.0638758 0.0816382 0.168105 0.0442944 -0.0363053 -0.0252706 -0.0312421 -0.00672164 0.122717 0.100827 0.0621213 
0.0342911 0.0765435 -0.0952568 0.0240177 0.0265524 0.158417 -0.0169139 -0.0415831 -0.00814243 -0.0130343 0.100509 0.0966201 0.0534896 -0.175161 -0.148247 0.0556435 -0.151261 0.103348 -0.0742816 0.074561 0.245033 -0.0846573 0.0835185 0.103288 0.0268799 -0.0161519 0.0238101 -0.250962 0.056304 0.180384 -0.0418775 0.000344899 0.0378046 0.0531124 0.0138837 -0.058601 -0.0749437 0.0735689 0.00959002 -0.037184 -0.0466801 -0.125059 -0.0135722 0.140572 -0.0997276 -0.0887058 0.18529 -0.0660792 -0.16116 0.0299957 0.0799322 0.025662 -0.0291191 0.0309222 0.0783761 0.0654323 0.0856021 0.037083 -0.0470089 -0.130647 -0.0349585 -0.10714 0.245968 -0.0612761 0.0835866 -0.136844 -0.0525258 -0.0170172 -0.0495041 0.119163 -0.0521925 0.0348249 -0.135637 -0.0775769 0.0101645 -0.0140288 -0.0367836 0.0734157 -0.0554983 0.122553 -0.0941025 0.0431851 0.0235806 0.0201126 -0.0829256 0.0820696 0.0392552 -0.000593339 0.0322513 0.0277418 0.00351435 -0.153558 -0.146088 0.0324358 -0.0592827 -0.0771103 -0.0821105 0.137303 0.0753649 -0.0305051 0.0874878 0.00620717 -0.0300463 0.111713 0.00826873 0.0202052 -0.0226943 0.133543 -0.00948249 -0.104803 -0.0690015 0.0818678 -0.0707244 -0.0513367 0.102448 0.112781 -0.0824415 -0.070646 0.0731644 0.157996 0.0458479 -0.00942179 -0.0059118 -0.0206807 -0.0123754 0.117181 0.0981367 0.0567231 
0.0378762 0.0959882 -0.0407007 0.0111203 0.0104861 0.175154 -0.0315119 -0.0537147 -0.0347243 -0.0300339 0.0947062 0.0791221 0.023172 -0.177346 -0.0993739 0.0395877 -0.164016 0.0654361 -0.0308396 0.0400354 0.226062 -0.0297588 0.0577493 0.0868181 0.047517 0.018405 0.0381039 -0.243858 0.0696978 0.173096 -0.025305 -0.0299487 0.0296416 0.0387858 0.0490423 -0.04564 -0.0705906 0.0592842 0.0466696 -0.0182995 -0.0452424 -0.133276 -0.0267043 0.137174 -0.0808821 -0.0254277 0.189085 -0.0824663 -0.194026 0.00174617 0.0796071 0.0806422 -0.00390672 0.0246872 0.0778503 0.0596609 0.0825613 0.0460745 -0.0729646 -0.11568 -0.0342841 -0.106183 0.242358 -0.0550542 0.0983634 -0.142385 -0.0287593 -0.0209449 -0.0480501 0.138809 -0.0393107 0.0306676 -0.151626 -0.0880549 0.0333159 -0.016543 -0.065546 0.0644844 -0.0392198 0.176583 -0.0818682 0.0456522 0.0446466 0.0306035 -0.069735 0.0368801 0.0378451 -0.0154451 -0.00332036 0.0469334 0.0074596 -0.129358 -0.141337 0.066898 -0.0833705 -0.0796264 -0.042694 0.124973 0.0915952 -0.0407754 0.0742624 0.0435575 -0.0520372 0.0890504 -0.0137875 0.0255961 -0.000116669 0.13022 0.00676578 -0.106225 -0.0318108 0.0589957 -0.10223 -0.0636922 0.119304 0.122584 -0.107086 -0.0848013 0.0660491 0.15723 0.0709897 -0.0252942 -0.00431119 -0.0409898 0.0300997 0.130197 0.14633 0.0619929 
0.0486629 0.0817654 -0.092663 0.0141737 0.0116886 0.174574 -0.0242625 -0.0424912 -0.0192408 -0.010447 0.103718 0.0579568 0.063425 -0.156528 -0.126372 0.052452 -0.14295 0.0927299 -0.0612522 0.0605227 0.250077 -0.0794356 0.0802702 0.0978779 0.0375445 -0.00914025 0.0165259 -0.245358 0.0821895 0.172577 -0.0167207 0.0109838 0.0206315 0.0431888 0.0225 -0.0462611 -0.0893034 0.0845403 0.0329079 -0.0489249 -0.061814 -0.133404 -0.0383866 0.146035 -0.0837499 -0.0826779 0.168774 -0.0400821 -0.173855 0.00871718 0.0655283 0.0679885 -0.00364875 0.0198518 0.0598629 0.0549644 0.0938461 0.0468381 -0.0367603 -0.158621 -0.0446137 -0.0928783 0.254883 -0.0537401 0.0590959 -0.106348 -0.0349229 -0.00634565 -0.0463152 0.116233 -0.0571461 0.0275282 -0.147485 -0.0797129 0.00806759 -0.0453689 -0.0422384 0.0499482 -0.0388563 0.161823 -0.0795222 0.0323084 0.0217706 -0.00694051 -0.0682425 0.0621758 0.0263268 -0.00855923 0.0385161 0.0283497 0.0255836 -0.132142 -0.141925 0.0463416 -0.0605367 -0.0834881 -0.0660366 0.152144 0.066672 -0.04409 0.108737 0.0254057 -0.033255 0.109366 -0.00701807 0.0321403 -0.0146351 0.127362 0.037945 -0.110257 -0.0514568 0.0934375 -0.0968778 -0.0521769 0.124351 0.116939 -0.0902651 -0.0812331 0.087395 0.154187 0.0504968 -0.0383304 0.00386381 -0.026187 -0.0193693 0.11109 0.116461 0.0647865 
0.0425722 0.0781821 -0.0676149 0.0194473 0.0261522 0.185575 -0.0160577 -0.0410843 -0.031909 -0.0107081 0.10744 0.100794 0.0387292 -0.178186 -0.118211 0.037541 -0.146768 0.0922804 -0.0428508 0.052076 0.231732 -0.0518328 0.0500965 0.121022 0.0468056 -0.00542697 0.0437603 -0.234655 0.0650389 0.180588 -0.0343117 -0.0359765 0.0250698 0.0487051 0.0285146 -0.0460066 -0.0877498 0.0222679 0.0183228 -0.0306831 -0.0355856 -0.133748 -0.009562 0.156509 -0.0940996 -0.0726822 0.185174 -0.0651403 -0.183815 0.0088448 0.0967015 0.0416744 -0.0232826 0.0103138 0.0836562 0.0760893 0.0468384 0.0641582 -0.0605483 -0.11065 -0.0385168 -0.102998 0.253301 -0.0623114 0.0940791 -0.136393 -0.0511873 -0.0299221 -0.0702025 0.132375 -0.0466095 0.0399786 -0.143575 -0.0985748 0.0153826 -0.00366331 -0.0375999 0.0786884 -0.0424352 0.14383 -0.0862221 0.0349017 0.0436173 0.0257733 -0.0825515 0.0521035 0.0468304 -0.0178238 0.0130413 0.0537848 0.00072524 -0.145428 -0.152693 0.0601777 -0.0718889 -0.0704383 -0.0641427 0.108596 0.0802736 -0.0345348 0.0835218 0.0369711 -0.0414091 0.0807242 -0.0141336 0.0357025 -0.0157085 0.120754 -0.0207147 -0.107574 -0.0355263 0.0634417 -0.0711963 -0.0591825 0.113927 0.112543 -0.0912629 -0.0632292 0.0663472 0.166404 0.0604691 -0.0467927 -0.0134466 -0.0367481 0.00903107 0.140252 0.120704 0.0540427 
0.0438499 0.089588 -0.0649341 0.0121027 0.0356503 0.180207 -0.0260274 -0.0492933 -0.00968597 -0.0238428 0.101093 0.0832838 0.034834 -0.178695 -0.117834 0.0469855 -0.153254 0.0943507 -0.0627994 0.0582138 0.243418 -0.038813 0.0581439 0.107824 0.0400987 -0.0153696 0.039322 -0.233871 0.0713018 0.183201 -0.034495 -0.0318776 0.0338821 0.0511188 0.0486843 -0.0420582 -0.0652273 0.0374247 0.0139412 -0.0491759 -0.0410033 -0.130671 -0.0050902 0.157674 -0.0914445 -0.0513313 0.187218 -0.0496946 -0.189045 0.0178197 0.0776607 0.0440638 -0.0201287 0.0154806 0.0884436 0.0657686 0.049433 0.042747 -0.063454 -0.130988 -0.0349193 -0.105653 0.25061 -0.0523969 0.090473 -0.139636 -0.0515909 -0.0191712 -0.0584009 0.137735 -0.0436023 0.0244201 -0.139866 -0.111974 0.0113029 -0.00988888 -0.0459153 0.0837671 -0.0398852 0.137911 -0.0646062 0.0568601 0.0252522 0.022014 -0.0678641 0.0570021 0.030277 -0.00395909 0.0152181 0.0778385 0.0224434 -0.150288 -0.165812 0.0533617 -0.0759614 -0.0724533 -0.0724215 0.119572 0.080925 -0.0438316 0.0995007 0.0288491 -0.0389428 0.0687592 -0.0184801 0.0308842 -0.0145529 0.119911 -0.00548685 -0.096216 -0.0302534 0.065748 -0.0832169 -0.0494691 0.113371 0.108592 -0.103297 -0.072244 0.0576513 0.155196 0.0648004 -0.0223876 -0.000214804 -0.0208724 0.0144355 0.123642 0.133977 0.0424954 
0.0337351 0.101244 -0.0451041 -0.000127666 0.0190946 0.188548 -0.0237795 -0.0445076 -0.0271626 -0.0217024 0.10652 0.0729885 0.0365385 -0.17173 -0.115999 0.039002 -0.167391 0.0833109 -0.0457197 0.0306441 0.249497 -0.0362502 0.0328567 0.0892563 0.0538197 -0.00670631 0.0278588 -0.213638 0.0901021 0.18579 -0.0260596 -0.0542057 0.0186106 0.0308071 0.0543653 -0.0483881 -0.0894657 0.0171574 0.0468373 -0.0344618 -0.0473908 -0.130836 -0.0059644 0.154568 -0.0693524 -0.0676796 0.174481 -0.0608563 -0.194514 -0.00735879 0.0690864 0.066763 -0.0132648 0.0132638 0.0643737 0.0691899 0.0455569 0.0578367 -0.0837444 -0.124095 -0.0352511 -0.0966378 0.259555 -0.0393907 0.0816417 -0.11748 -0.0438296 -0.0279303 -0.0617343 0.116836 -0.0312843 0.0284184 -0.142281 -0.116846 0.019297 -0.00676559 -0.0508041 0.0512838 -0.0341676 0.164107 -0.0627446 0.0349007 0.0542499 0.0416682 -0.0770367 0.0546234 0.0351832 -0.0147331 0.0175809 0.0617776 0.0117115 -0.143043 -0.157029 0.0801528 -0.084808 -0.0836688 -0.068941 0.118852 0.0696972 -0.0309308 0.095634 0.0436864 -0.0488259 0.0633902 -0.0171659 0.0543387 0.00669136 0.128777 -0.00114436 -0.105566 -0.0240922 0.0381609 -0.0999262 -0.0479446 0.120177 0.125722 -0.103657 -0.0374658 0.0668965 0.149639 0.054726 -0.0583214 -0.00842744 -0.0494814 0.0166601 0.143234 0.137591 0.0611244 
0.0612236 0.0560974 -0.0593313 0.0152059 0.0491248 0.199462 -0.00232199 -0.0391853 -0.00868495 -0.0468166 0.10161 0.105675 0.041721 -0.173359 -0.118852 0.0185665 -0.1428 0.105296 -0.0824956 0.052584 0.250681 -0.0335786 0.0427085 0.138107 0.0410868 -0.0370988 0.0304767 -0.234515 0.0512674 0.184739 -0.024193 -0.0370912 0.0129412 0.0672153 0.0437067 -0.0454554 -0.0849831 0.0122517 0.00208542 -0.0496121 -0.0222479 -0.11782 -0.0142318 0.160725 -0.0990193 -0.0837325 0.161094 -0.0458525 -0.175219 0.0208473 0.080578 0.0177344 -0.0118827 0.00565004 0.0841655 0.0725213 0.0212621 0.0820712 -0.0726672 -0.120145 -0.0385718 -0.086232 0.252007 -0.0628188 0.081682 -0.136909 -0.0472977 -0.0219384 -0.0819175 0.132738 -0.0378166 0.0252658 -0.134741 -0.120745 -0.0093472 0.000803813 -0.0378623 0.0550003 -0.0356996 0.145547 -0.070979 0.0480098 0.0341536 0.00650775 -0.0758117 0.0502662 0.0527116 -0.0157339 -0.00310347 0.0810526 0.0331633 -0.166476 -0.158217 0.055892 -0.0822083 -0.064304 -0.0831996 0.0879588 0.0713456 -0.0273821 0.105699 0.0347071 -0.04506 0.0720163 -0.019788 0.0288802 -0.0252622 0.109962 -0.0326896 -0.0958555 -0.0158644 0.0602053 -0.0839027 -0.0456507 0.109454 0.120592 -0.104785 -0.0530763 0.0590793 0.168315 0.0600526 -0.0398712 -0.0224702 -0.0228047 0.0178985 0.12529 0.115113 0.030715 
0.054032 0.0615947 -0.0871935 0.0157061 0.0396239 0.171698 -0.0174583 -0.0377358 -0.00553347 -0.0541912 0.0958098 0.094955 0.0512725 -0.170908 -0.15012 0.0458965 -0.148463 0.0926318 -0.0966378 0.0822761 0.259266 -0.0662334 0.0658101 0.11248 0.0264622 -0.0328701 0.03061 -0.240172 0.0434106 0.181928 -0.0439246 -0.0202321 0.0277996 0.0654466 0.0226012 -0.0468797 -0.0791555 0.0516048 -0.00757949 -0.0537486 -0.0466599 -0.119125 -0.00457787 0.155293 -0.0831896 -0.0693163 0.179162 -0.0534565 -0.182637 0.0399161 0.0648728 0.00503025 -0.0220282 0.0239774 0.0873108 0.0576088 0.0376225 0.0581248 -0.0578409 -0.136761 -0.0256478 -0.0859148 0.252829 -0.0543631 0.0773095 -0.138617 -0.0598721 -0.00979941 -0.0636637 0.115635 -0.0435636 0.0141164 -0.129473 -0.109928 -0.0034245 -0.00327463 -0.0283144 0.0586947 -0.0459475 0.13561 -0.0735586 0.0400802 0.00696842 0.00190981 -0.0903027 0.0788632 0.0323405 -0.00998597 0.0165162 0.0655803 0.0296216 -0.172707 -0.1627 0.0443881 -0.0672488 -0.051736 -0.0834562 0.112613 0.0712284 -0.0306211 0.0945383 0.0133914 -0.0426316 0.088734 -0.0166593 0.0289548 -0.0360588 0.13295 -0.0311558 -0.109446 -0.0363912 0.0750001 -0.081775 -0.0392018 0.101691 0.117841 -0.101916 -0.058092 0.0649985 0.159979 0.0387206 -0.0102111 -0.00394061 -0.0123771 0.00977334 0.110889 0.107506 0.0217611 
0.0488463 0.104951 -0.0768913 0.0231563 0.0257767 0.169489 -0.0185538 -0.0471155 -0.012443 -0.0319082 0.0999271 0.0707549 0.050849 -0.178087 -0.136732 0.0723563 -0.151253 0.0873321 -0.0937428 0.0722959 0.256393 -0.0700639 0.0700688 0.0854569 0.0335268 -0.0390983 0.00564412 -0.228235 0.0656299 0.188133 -0.0462121 0.00288719 0.0285742 0.064491 0.0256462 -0.0533434 -0.0630318 0.0606555 0.0204579 -0.0457737 -0.0618889 -0.133689 0.0133026 0.123603 -0.0681613 -0.0630337 0.188277 -0.0594151 -0.194652 0.0412985 0.076682 0.0355897 -0.0320288 0.0354065 0.0752095 0.0506615 0.0617824 0.0263053 -0.0564771 -0.13573 -0.0306462 -0.0896095 0.238451 -0.0720198 0.0766824 -0.118544 -0.0585064 -0.015311 -0.0695817 0.112711 -0.0451913 0.0247368 -0.138159 -0.085374 0.0115177 -0.0120953 -0.020291 0.0567247 -0.050201 0.13808 -0.0610808 0.0336957 0.0125674 0.0159755 -0.0827553 0.0960857 0.00748134 -0.0177358 0.0258716 0.0670392 0.0209333 -0.168608 -0.167643 0.0537285 -0.0677694 -0.0551501 -0.0770931 0.134748 0.0689045 -0.0276493 0.0931331 0.0118015 -0.0434875 0.10811 -0.0076013 0.0367577 -0.0191901 0.150343 -0.00596022 -0.109545 -0.0605764 0.0735724 -0.0842849 -0.0390491 0.111568 0.107841 -0.0941159 -0.0455708 0.0704446 0.158229 0.043298 -0.00826794 0.0162838 -0.00694357 0.0158764 0.108144 0.125904 0.0278497 
0.0428315 0.0882237 -0.0618814 0.0214163 0.0198275 0.189141 -0.010167 -0.04237 -0.013437 -0.031599 0.0998111 0.0747608 0.0504086 -0.18635 -0.124084 0.05814 -0.172112 0.0918853 -0.0949459 0.0544503 0.253491 -0.0712221 0.0706514 0.0940532 0.0361678 -0.0424557 -0.000284269 -0.239712 0.0528462 0.172494 -0.0219437 -0.0107052 0.0135955 0.0705535 0.0330346 -0.049172 -0.0809435 0.0461505 0.0224091 -0.0381559 -0.0471272 -0.141328 0.000249697 0.130139 -0.0744912 -0.0927831 0.171517 -0.0522457 -0.187163 0.0416667 0.0767257 0.0150725 -0.0264626 0.0271268 0.065743 0.0598734 0.0562037 0.0488938 -0.0624245 -0.128172 -0.039647 -0.0786866 0.243257 -0.0750533 0.0882869 -0.11218 -0.0560687 -0.0241799 -0.0821742 0.120458 -0.0490308 0.036287 -0.135093 -0.0816911 0.00363049 -0.0222473 -0.0252226 0.0389025 -0.0438341 0.147901 -0.0647866 0.0129403 0.0232841 0.0136124 -0.100878 0.0848325 0.0274757 -0.0208407 0.0193913 0.0622857 0.0262934 -0.169073 -0.151501 0.0506585 -0.0757804 -0.0525362 -0.0866874 0.127256 0.0627987 -0.0107891 0.0957707 0.012989 -0.0560653 0.0966182 0.0167593 0.0352791 -0.0160542 0.139367 -0.0134128 -0.105247 -0.0642476 0.0754522 -0.0766298 -0.0444021 0.116532 0.118632 -0.0831163 -0.0236559 0.0769443 0.167319 0.0545142 -0.0329236 0.00372233 -0.0134976 0.0102515 0.112527 0.117395 0.0409653 
0.0427066 0.0805731 -0.105947 0.00228883 0.0372843 0.163685 -0.015203 -0.0450972 -0.0133532 -0.0205647 0.103309 0.0795007 0.0626951 -0.170518 -0.160302 0.0693484 -0.166491 0.1058 -0.0981374 0.0740008 0.258274 -0.0809593 0.0645541 0.079469 0.0197167 -0.0291989 0.0193061 -0.230443 0.0590662 0.188002 -0.0591964 -0.00360459 0.0181211 0.0499493 0.0209814 -0.0491916 -0.0945853 0.0371535 0.0164526 -0.0463721 -0.0659255 -0.131356 0.00138291 0.156282 -0.0703406 -0.0653953 0.178448 -0.0418873 -0.193885 0.0309906 0.0595476 0.0106281 -0.0431615 0.0214459 0.0593535 0.0565761 0.0458687 0.0473814 -0.0591379 -0.119845 -0.0144736 -0.0837605 0.264591 -0.0376102 0.0707197 -0.133748 -0.0758864 -0.00250084 -0.0495898 0.105162 -0.0421399 0.0242818 -0.125372 -0.105195 -0.0147532 -0.00939755 -0.0239958 0.0545276 -0.0587498 0.113564 -0.05635 0.0326158 -0.00551742 0.0170424 -0.114158 0.1055 0.0214777 -0.0212864 0.0340136 0.0574736 0.025589 -0.163041 -0.174052 0.0468829 -0.0597718 -0.04612 -0.0971377 0.125879 0.0708463 -0.023514 0.09966 -0.00143326 -0.0426038 0.0861523 0.000201494 0.0395688 -0.0331723 0.151863 -0.0239591 -0.102126 -0.0516062 0.0673666 -0.0755531 -0.0385727 0.100547 0.117425 -0.0901222 -0.0360273 0.0756689 0.145706 0.0336935 -0.0225419 0.0103025 -0.00719584 -0.0117156 0.107473 0.0891082 0.0276379 
0.0590321 0.0712207 -0.0931042 0.028735 0.0390764 0.13356 -0.00487588 -0.0318791 0.0250205 -0.0494166 0.0944571 0.0936283 0.0660423 -0.202478 -0.172304 0.0834752 -0.131963 0.10868 -0.155418 0.0990504 0.265532 -0.0720006 0.0839146 0.0874872 -0.0117914 -0.0667596 -0.00353491 -0.243025 0.0276398 0.18588 -0.0588965 0.029742 0.0381429 0.0863257 0.0158933 -0.0763387 -0.0536131 0.084367 -0.00584061 -0.0401738 -0.0744981 -0.114308 -0.00205753 0.1099 -0.0576487 -0.0848745 0.153304 -0.052226 -0.158383 0.0737671 0.0779965 -0.00955492 -0.0425533 0.0371728 0.0521107 0.0339281 0.0657751 0.00358164 -0.0683687 -0.106529 -0.0154015 -0.097837 0.210162 -0.0695835 0.0690816 -0.172601 -0.0730299 -0.00545762 -0.0701843 0.0787436 -0.0463044 -0.00239243 -0.12614 -0.0884932 -0.0356194 -0.00349577 -0.00350287 0.0535208 -0.0695974 0.125893 -0.0580238 0.0204104 -0.0159091 0.0160888 -0.0927209 0.117826 0.0125382 -0.0249971 0.0181259 0.0581277 0.0092728 -0.188167 -0.171695 0.0535659 -0.0572542 -0.0226011 -0.104649 0.097349 0.0466954 -0.00518498 0.103264 -0.0142825 -0.0634171 0.135242 0.0391677 -0.00770004 -0.0253318 0.146653 -0.0228596 -0.0912044 -0.0923664 0.0753732 -0.0721907 -0.0164696 0.0836648 0.118984 -0.09176 -0.0269494 0.0531803 0.15475 0.0131609 0.037898 0.00460163 0.0201626 0.0295229 0.0716423 0.082443 -0.0113319 
0.0456598 0.0847909 -0.0797925 0.0262627 0.0299179 0.147485 0.00100594 -0.0428108 0.0198205 -0.0361889 0.105763 0.083668 0.0688877 -0.191245 -0.161299 0.0723399 -0.15526 0.109835 -0.147209 0.0854149 0.266193 -0.0864765 0.0703959 0.092005 0.00611948 -0.060266 -0.0114051 -0.23326 0.0472691 0.187716 -0.0432172 0.022571 0.0251032 0.0803413 0.0196613 -0.0653191 -0.0722238 0.0772883 0.00401954 -0.0439598 -0.0629741 -0.12957 -0.00405775 0.120955 -0.057797 -0.0959667 0.156446 -0.0457906 -0.171437 0.050331 0.0670155 0.000317042 -0.043601 0.0276027 0.054868 0.0512237 0.0451121 0.0260529 -0.0675848 -0.116739 -0.0260442 -0.0927943 0.229915 -0.063931 0.0729859 -0.136512 -0.0648843 -0.0153915 -0.0800866 0.0915828 -0.0463973 0.00979424 -0.125423 -0.0824375 -0.021813 -0.0153503 -0.00765202 0.0450735 -0.0599943 0.126197 -0.061919 0.0158809 -0.0078952 0.0105695 -0.101849 0.107075 0.0198854 -0.0244854 0.0270121 0.0597423 0.0199344 -0.187158 -0.157126 0.0482148 -0.065216 -0.0375719 -0.108106 0.104599 0.0606189 -0.00554326 0.10257 -0.0086901 -0.0606399 0.122281 0.0329029 0.0186561 -0.0214138 0.149572 -0.00928602 -0.101208 -0.0859461 0.0801443 -0.0844953 -0.0213322 0.099199 0.11684 -0.0898094 -0.0214445 0.0701797 0.158226 0.0257351 0.0100766 -0.00479009 0.0150799 0.0147261 0.0907502 0.0876707 0.00511786 
0.0359324 0.102925 -0.0740218 0.00428327 0.022872 0.166926 -0.0132394 -0.0352916 -0.0145662 -0.00937292 0.107485 0.0688346 0.0613606 -0.179898 -0.141281 0.0714363 -0.162734 0.10641 -0.108878 0.0650398 0.259078 -0.0762939 0.0640588 0.0809623 0.0220857 -0.0308255 0.00724545 -0.224037 0.0741416 0.176559 -0.0459939 0.00202555 0.0212873 0.0632731 0.0219477 -0.0575005 -0.0826901 0.0625486 0.0228153 -0.0392019 -0.065062 -0.139522 0.00159 0.138325 -0.0628229 -0.0824275 0.176241 -0.0483039 -0.202242 0.0308937 0.0729223 0.0237985 -0.0508345 0.0264072 0.0550815 0.059021 0.0538065 0.0363181 -0.0598381 -0.133735 -0.0264281 -0.0947767 0.247373 -0.0499901 0.0754104 -0.119058 -0.0668361 -0.0124289 -0.0663905 0.110518 -0.0460373 0.0232504 -0.12961 -0.0852927 -0.00214219 -0.0264483 -0.0250035 0.0560729 -0.0496526 0.119244 -0.0625625 0.0284594 0.00881797 0.0157788 -0.0994048 0.0925141 0.021881 -0.0156577 0.0425949 0.0611544 0.0198287 -0.166611 -0.167289 0.0529876 -0.0625577 -0.0473615 -0.0916948 0.131623 0.0610001 -0.0184498 0.0946319 0.00466821 -0.0511223 0.106246 0.0115208 0.0374866 -0.0251071 0.147056 0.000813863 -0.117294 -0.0665015 0.0824914 -0.0875063 -0.0322679 0.116397 0.106497 -0.0891241 -0.0404158 0.0790693 0.15082 0.0424999 -0.0168041 0.011833 -0.0044686 0.00423985 0.102309 0.106917 0.0282619 
0.0478643 0.101391 -0.0858009 0.00724072 0.0259193 0.160741 -0.00997602 -0.0562344 -0.000579341 -0.0154541 0.103468 0.0638705 0.063641 -0.183356 -0.145741 0.0724266 -0.157591 0.100593 -0.115177 0.0642152 0.255493 -0.0665697 0.0687278 0.0828026 0.0175454 -0.0230541 0.0117976 -0.233146 0.0770105 0.183917 -0.0368323 0.0168218 0.0145635 0.0628219 0.0387984 -0.0637653 -0.0742834 0.0812035 0.0284892 -0.0496366 -0.0695053 -0.139706 -0.013677 0.14922 -0.0616265 -0.0671817 0.165892 -0.0278134 -0.189793 0.0233654 0.0702297 0.0378242 -0.0329206 0.0146866 0.0539941 0.0483252 0.0574135 0.0399486 -0.056209 -0.138656 -0.0262418 -0.104177 0.253669 -0.044468 0.0721732 -0.132015 -0.0605427 -0.00376276 -0.0581467 0.111052 -0.0555183 0.0142921 -0.131453 -0.0881648 -0.0191115 -0.0389102 -0.0286539 0.0558891 -0.0500108 0.139417 -0.048381 0.0308069 -0.00370751 0.002859 -0.0881032 0.0640305 0.0188755 -0.0186858 0.0360653 0.061746 0.027091 -0.159437 -0.161507 0.0470404 -0.0637873 -0.051525 -0.0837492 0.125859 0.0727062 -0.0307829 0.109007 0.0130633 -0.0535119 0.111507 0.00934081 0.0138761 -0.0217325 0.147473 0.0189528 -0.10208 -0.0531582 0.0919052 -0.0980974 -0.0251048 0.114819 0.112112 -0.102539 -0.0482082 0.0724146 0.145634 0.0433365 -0.00539288 0.0101106 0.00093701 0.003568 0.0912101 0.101703 0.0166521 
