{
  "descriptor": [
    -0.11579371243715286,
    0.08526327461004257,
    0.010122716426849365,
    -0.06082170829176903,
    -0.14532466232776642,
    -0.02197657898068428,
    -0.006555231288075447,
    -0.12053356319665909,
    0.13059058785438538,
    -0.027230728417634964,
    0.15370576083660126,
    -0.0006869165226817131,
    -0.21000222861766815,
    0.019398337230086327,
    -0.03371686115860939,
    0.06749742478132248,
    -0.1414082944393158,
    -0.12489096075296402,
    -0.22415894269943237,
    -0.16105329990386963,
    -0.03953462839126587,
    0.03681432455778122,
    0.012918708845973015,
    0.005303259938955307,
    -0.16414298117160797,
    -0.21811139583587646,
    -0.06780596822500229,
    -0.11202837526798248,
    0.1629123091697693,
    -0.09831178188323975,
    0.015776056796312332,
    -0.027172377333045006,
    -0.18178808689117432,
    -0.07253897190093994,
    0.030522461980581284,
    0.012284656055271626,
    -0.10557076334953308,
    -0.10241574794054031,
    0.24407793581485748,
    -0.05208904668688774,
    -0.18103154003620148,
    0.022300472483038902,
    0.08395256847143173,
    0.2406066209077835,
    0.20401130616664886,
    -0.012739160098135471,
    0.03882916644215584,
    -0.08569148182868958,
    0.134196937084198,
    -0.2430788278579712,
    0.1168818548321724,
    0.14378759264945984,
    0.1451079398393631,
    0.07646399736404419,
    0.13237406313419342,
    -0.1769290417432785,
    0.02630593255162239,
    0.17540478706359863,
    -0.1651400327682495,
    0.09344173222780228,
    0.11395291984081268,
    -0.013043784536421299,
    -0.08263285458087921,
    -0.054224636405706406,
    0.14451265335083008,
    0.11188583821058273,
    -0.0868033915758133,
    -0.1729779839515686,
    0.17134514451026917,
    -0.1727665811777115,
    0.00797850638628006,
    0.13438726961612701,
    -0.037050217390060425,
    -0.16739404201507568,
    -0.20956078171730042,
    0.05460315942764282,
    0.4035601317882538,
    0.1476447433233261,
    -0.17646044492721558,
    -0.008358228020370007,
    -0.06658294796943665,
    -0.039687640964984894,
    0.07061640918254852,
    -0.031454093754291534,
    -0.17309394478797913,
    -0.04818848520517349,
    -0.09564929455518723,
    0.02385217323899269,
    0.21214337646961212,
    -0.00680955033749342,
    0.005585057660937309,
    0.19775687158107758,
    0.07797921448945999,
    -0.09579578787088394,
    0.055356528609991074,
    0.08671838045120239,
    -0.17250999808311462,
    -0.02602408640086651,
    -0.0698196068406105,
    0.00737781310454011,
    0.12935771048069,
    -0.12588031589984894,
    0.019560692831873894,
    0.0867413654923439,
    -0.15181666612625122,
    0.21306662261486053,
    -0.024055926129221916,
    -0.014354176819324493,
    -0.02112458646297455,
    -0.05513300374150276,
    -0.05886192247271538,
    -0.011361339129507542,
    0.21239039301872253,
    -0.2371990829706192,
    0.17462047934532166,
    0.13166190683841705,
    -0.030427049845457077,
    0.11840492486953735,
    0.06224457547068596,
    0.05495930463075638,
    -0.004177161492407322,
    0.03927192464470863,
    -0.14942504465579987,
    -0.09699928760528564,
    0.01915023848414421,
    -0.1006643995642662,
    0.01637943647801876,
    0.05727439746260643
  ]
}