0.144702 0.0070029 -0.124073 -0.00704294 0.11941 0.186141 0.140994 -0.014804 -0.0991573 -0.0259761 0.031892 0.0600618 0.159409 -0.0664782 -0.0289584 -0.0942784 -0.0472438 0.0351804 -0.119039 0.169873 0.129098 -0.107161 0.0255806 0.15417 0.00202171 -0.0887457 -0.146724 -0.1643 0.0613219 0.114057 0.00529718 0.0819995 -0.166904 0.0836403 -0.0398472 0.00452686 -0.112974 0.0516144 -0.0226168 -0.0684332 0.0503949 -0.0785918 -0.0703956 0.110819 -0.159679 -0.068548 0.0797432 0.115229 -0.0731627 0.0795752 -0.00265014 -3.04361e-06 -0.0563775 -0.0242464 0.074893 -0.0380321 -0.0722022 0.203904 0.007724 -0.103701 -0.0610417 0.0604009 0.208922 -0.09761 -0.0323312 -0.045726 0.0402393 0.00133137 -0.10287 -0.00322563 -0.00994351 0.120018 -0.0438289 0.0719978 -0.0455913 -0.0326225 0.000456446 -0.0150616 0.0802735 0.160536 -0.0220213 -0.0214919 -0.0104987 -0.0685982 -0.00993337 0.00425492 0.0777182 0.00750539 0.0459942 -0.00132373 0.147884 -0.107906 -0.0329386 -0.0170564 -0.0977332 -0.139392 -0.00211843 0.0448331 0.0174817 -0.0602856 0.0638358 0.0782371 0.00018851 0.146686 -0.151335 0.0832909 -0.104599 0.175097 0.073872 0.000375341 0.0759917 0.132125 -0.134667 0.0111903 0.0134055 0.0998821 -0.039978 -0.0483446 0.0226713 0.176014 -0.0285686 -0.0539701 -0.028296 0.0929708 -0.136946 0.0187164 -0.0493027 -0.0220507 
0.159142 -0.0184418 -0.115014 0.00749612 0.144065 0.198666 0.143325 -0.0449204 -0.0964567 -0.0390929 0.0258729 0.079987 0.155861 -0.0392433 -0.00797753 -0.0998708 -0.0384683 0.059981 -0.108294 0.145137 0.138349 -0.0827634 0.0416801 0.175405 0.0132879 -0.109363 -0.141498 -0.183792 0.0307221 0.149653 -0.00189268 0.0842744 -0.166251 0.07655 -0.0179578 0.00644817 -0.109741 0.0300511 -0.0222797 -0.0622915 0.0480951 -0.0519751 -0.0770259 0.0978406 -0.182933 -0.056613 0.0705858 0.103767 -0.0559855 0.0646324 0.0299455 -0.0198301 -0.0275593 -0.0229933 0.0803949 -0.025693 -0.055122 0.219434 0.00696114 -0.078775 -0.0556565 0.0666592 0.187186 -0.118209 -0.00823536 -0.0634327 0.0417883 0.0187822 -0.1101 0.0170587 0.00718235 0.130933 -0.0444675 0.0191934 -0.0630475 0.00421253 -0.0114452 -0.0394718 0.0728957 0.165711 -0.0128887 -0.0069759 -0.00816822 -0.0640977 -0.016588 -0.00113893 0.087406 -0.0111573 -0.00564103 0.00634849 0.132984 -0.113337 -0.0239794 -0.00984481 -0.122558 -0.136226 -0.0169735 0.0372153 0.0381795 -0.0453028 0.0907553 0.0822987 0.00573289 0.138397 -0.145923 0.0607653 -0.112399 0.147189 0.0456916 0.0163649 0.0812037 0.109734 -0.119371 -0.00186146 -0.000498957 0.131818 -0.0640928 -0.0330927 -0.0143748 0.181646 -0.0202782 -0.0657326 -0.0500791 0.0747511 -0.115474 0.0457915 -0.0660086 -0.0206395 
0.177176 -0.0335483 -0.141289 0.000477808 0.166997 0.175837 0.134483 -0.0365566 -0.119785 -0.0428969 0.0153469 0.0847122 0.164901 0.00180572 -0.0260042 -0.0803078 0.00207813 0.0531439 -0.0935326 0.142836 0.155501 -0.0803465 0.0535024 0.137954 0.025744 -0.0962856 -0.125262 -0.170707 0.0334177 0.170032 -0.0209584 0.0960813 -0.154279 0.0557787 -0.0331577 -0.0114642 -0.121267 0.0506043 -0.00704051 -0.076084 0.0183615 -0.0141816 -0.0684875 0.100458 -0.180724 -0.0335985 0.0627699 0.0875489 -0.0404252 0.0418328 0.0476872 0.00390848 -0.0240002 -0.0218587 0.0802089 -0.0490493 -0.0309102 0.216552 0.0168488 -0.0844925 -0.0407108 0.0471593 0.177307 -0.0971059 -0.0183461 -0.077128 0.0275177 0.0683276 -0.0773116 0.0015499 0.0314634 0.136272 -0.0433176 -0.024608 -0.0823965 0.0324297 -0.00824107 -0.0511893 0.0589502 0.177254 -0.00921927 -0.0101593 0.00507457 -0.0559013 -0.0100943 -0.0189866 0.0911262 0.00415351 0.0044757 -0.0196109 0.099916 -0.104357 -0.0455679 0.00941352 -0.115792 -0.142236 0.0039881 0.0457667 0.0259055 -0.0564772 0.0925798 0.0932682 0.0222618 0.156846 -0.176176 0.0478172 -0.132339 0.153301 0.0645121 -0.00825498 0.0914865 0.098356 -0.144356 0.019517 0.00829761 0.140103 -0.0851306 -0.0297125 -0.0252982 0.172638 -0.0503019 -0.0467693 -0.0450447 0.0524311 -0.0999372 0.0398233 -0.0676634 -0.0198831 
0.173341 -0.0512912 -0.147124 0.00304189 0.160519 0.157217 0.124221 -0.0281213 -0.121147 -0.0417781 0.000961971 0.0807923 0.171893 -0.0172362 -0.0424756 -0.0504872 -0.00156497 0.05552 -0.110677 0.16295 0.162721 -0.091713 0.0673956 0.135494 0.00179983 -0.0866547 -0.139283 -0.198562 0.0215789 0.160839 -0.0313346 0.117671 -0.155736 0.0523625 -0.0401958 -0.00985201 -0.129325 0.074296 -0.0227208 -0.0750339 0.000890632 -0.00969275 -0.0779849 0.0943815 -0.156347 -0.0252719 0.0709666 0.0883041 -0.0444341 0.0483995 0.0495253 -0.0218516 -0.0198914 -0.0235628 0.0782014 -0.0607555 -0.00848936 0.197914 0.0342447 -0.0908971 -0.022909 0.0548411 0.163173 -0.0820169 -0.0152459 -0.0989765 0.0190984 0.077114 -0.062954 -0.0230678 0.0242685 0.130768 -0.0350086 -0.0255629 -0.0941959 0.0341069 -0.0088502 -0.0409814 0.0562013 0.175668 0.00389678 -0.016217 -0.0267229 -0.0683494 -0.0267681 -3.90376e-05 0.083429 0.008658 0.000346038 -0.0339499 0.0905283 -0.0887493 -0.0524085 0.00920639 -0.117883 -0.106879 0.00887681 0.047973 0.0228069 -0.0507098 0.102069 0.0693586 0.00708119 0.162865 -0.164579 0.0273801 -0.146641 0.155131 0.0629785 -0.00248769 0.0740351 0.115089 -0.136401 0.00495615 0.00321144 0.149924 -0.104297 -0.0277494 -0.0437608 0.158715 -0.07224 -0.0249828 -0.0276497 0.0533815 -0.105175 0.0372482 -0.0953343 -0.0414215 
0.176927 0.0271005 -0.150631 -0.0159627 0.185533 0.172009 0.126466 -0.0434286 -0.0818925 -0.0259585 0.0367105 0.1266 0.141374 -0.0169774 -0.0342232 -0.0842964 0.0537938 0.0559544 -0.102432 0.174511 0.101371 0.00124133 0.000601346 0.155124 0.00119629 -0.0822268 -0.0660946 -0.0950949 0.0566551 0.189022 -0.0480781 0.0678839 -0.101946 0.0679188 -0.0254795 -0.010153 -0.0564017 0.0309139 -0.0345276 -0.073506 0.0300566 -0.00839684 -0.015626 0.119515 -0.199436 -0.00944248 0.0777778 0.0968634 -0.044006 0.0788816 0.0891808 0.0355931 -0.0686102 -0.0301212 0.126325 -0.0399464 -0.111706 0.189065 2.03148e-05 -0.0767481 -0.0838329 -0.00769174 0.186378 -0.11879 -0.0234625 -0.124536 0.0198189 0.0455691 -0.118127 0.00963033 0.062529 0.097903 -0.0336849 -0.0320777 -0.0617847 0.0650843 0.00806469 0.0147966 0.0588092 0.132074 0.0245178 0.0411199 0.0396875 -0.00976126 0.0497299 -0.0566652 0.0790624 0.0158082 0.0373241 0.0610019 0.0544848 -0.13804 -0.0865454 0.0370635 -0.0899273 -0.151222 0.0231451 0.0011353 0.0110791 -0.104572 0.0808436 0.131112 0.0263231 0.143571 -0.239889 0.0570004 -0.124866 0.109742 0.0495601 0.014118 0.133706 0.0828013 -0.12668 0.0780484 -0.0178133 0.0700551 -0.0873349 -0.0641114 -0.0510109 0.165512 -0.0196117 -0.0296457 -0.0211785 0.0514367 -0.0544758 0.0364214 -0.0191901 -0.058728 
0.123162 0.0571919 -0.160626 -0.0271725 0.154654 0.124733 0.113416 -0.0612675 -0.0618688 0.0283264 0.0563804 0.0943934 0.129367 -0.0635417 -0.0617031 -0.0451673 -0.00932536 0.0704964 -0.0790809 0.169569 0.147304 -0.0836885 -0.000276085 0.0712123 0.0270507 0.00435718 -0.0848503 -0.14369 0.117833 0.177821 -0.0242444 0.133226 -0.0701872 0.0536784 0.00542246 -0.0298923 -0.0464387 0.114454 0.0518813 -0.134502 0.0342935 -0.0767386 -0.000861764 0.139838 -0.16976 -0.018228 0.114413 0.0833362 -0.0879703 0.00139988 0.00776258 0.0830924 -0.0759272 -0.018229 0.124227 -0.0308873 -0.0752329 0.139889 -0.0636548 -0.124759 -0.0584363 -0.0859164 0.248051 -0.0656201 0.0173039 -0.0634965 -0.0171524 0.0404206 -0.0650473 0.0227761 0.00363311 0.0810194 -0.0873583 0.00479797 -0.0411918 -0.022701 -0.0057006 0.0525955 0.0441474 0.10158 -0.044335 0.0753137 0.0199201 -0.011915 0.0366362 -0.0628965 0.0703045 0.0647666 0.115753 0.0298908 0.0943306 -0.111403 -0.10041 0.00835833 -0.0626018 -0.180338 0.0199537 0.0702657 0.0345969 -0.117678 0.0583535 0.0722416 0.0233466 0.145792 -0.162868 0.0727148 -0.0668466 0.177563 0.133793 -0.0285473 0.050778 0.0993147 -0.193575 0.0553346 0.0802546 0.027179 -0.0707386 -0.138582 0.0404879 0.154531 0.023009 0.0122273 0.0125324 0.0795863 -0.0776782 0.0119344 0.0439992 -0.0157884 
0.113345 0.00209393 -0.160946 0.00851574 0.119437 0.0942216 0.109078 -0.0241517 -0.00897935 -0.00764955 0.0710674 0.151447 0.138107 -0.132428 -0.11848 -0.0678806 -0.0294145 0.0600217 -0.155567 0.247509 0.121139 -0.112349 0.0282743 0.132782 -0.053174 -0.0265901 -0.0664619 -0.178878 0.0447007 0.139181 -0.0620399 0.123831 -0.0341437 0.095253 -0.0669082 -0.0397885 -0.0643786 0.143942 -0.0695934 -0.0975447 0.0428482 -0.104977 -0.0648802 0.127857 -0.185761 -0.0667384 0.0889433 0.0688534 -0.0650239 0.0941719 0.0144492 0.0231523 -0.088872 -0.00678508 0.123343 -0.0377628 -0.0855477 0.0966174 -0.0544616 -0.085157 -0.0622531 -0.076395 0.21887 -0.0511687 0.0044807 -0.140842 -0.00587812 0.013075 -0.0844682 -0.00475315 -0.0173009 0.0297483 -0.0579455 0.0484566 -0.0341768 -0.00701815 0.00715333 0.0648811 0.0248917 0.111504 -0.0759712 0.029045 -0.0188571 -0.0312643 0.0144096 0.00442664 0.0865631 0.0519448 0.0862374 0.0235138 0.0704952 -0.149954 -0.0827708 0.00653269 -0.0794155 -0.148259 -0.0177576 -0.00444624 0.0468824 -0.11561 0.0666708 0.038301 -0.00346489 0.160722 -0.103263 0.0341651 -0.0828677 0.182575 0.0676351 -0.0266563 0.0241155 0.144089 -0.131565 0.0333584 0.0197903 0.0353234 -0.0699433 -0.12268 0.0459114 0.175589 -0.0193887 0.0387723 -0.025987 0.107484 -0.053264 0.013939 0.00244515 -0.0435286 
