{
  "descriptor": [
    -0.13179023563861847,
    0.09816673398017883,
    0.02708590030670166,
    -0.09488223493099213,
    -0.1358904242515564,
    -0.07965113967657089,
    -0.049278419464826584,
    -0.10818009078502655,
    0.1031217947602272,
    -0.05133170634508133,
    0.17158660292625427,
    -0.016533035784959793,
    -0.2560335099697113,
    -0.008230797946453094,
    -0.07998830825090408,
    0.10522256791591644,
    -0.07119528204202652,
    -0.08630918711423874,
    -0.24372950196266174,
    -0.11760439723730087,
    -0.051147233694791794,
    -0.011603937484323978,
    0.045011211186647415,
    0.008291115052998066,
    -0.11845146119594574,
    -0.21000373363494873,
    -0.0889248177409172,
    -0.12279853969812393,
    0.0925026535987854,
    -0.09529601037502289,
    -0.04731755331158638,
    -0.007239401340484619,
    -0.14642387628555298,
    -0.111153744161129,
    0.0301797054708004,
    0.06353893131017685,
    -0.15040795505046844,
    -0.09526295959949493,
    0.32356464862823486,
    -0.02154446393251419,
    -0.12173816561698914,
    0.034935951232910156,
    0.10230827331542969,
    0.22136954963207245,
    0.21379020810127258,
    -0.006937018595635891,
    0.040500763803720474,
    -0.07862243801355362,
    0.1750226616859436,
    -0.2800208628177643,
    0.06365706026554108,
    0.1368521749973297,
    0.19858421385288239,
    0.10652045905590057,
    0.15951476991176605,
    -0.1768142282962799,
    0.09105846285820007,
    0.14599816501140594,
    -0.2408962994813919,
    0.09850504994392395,
    0.0314609557390213,
    -0.069818414747715,
    -0.1408533900976181,
    -0.06173665076494217,
    0.1814260631799698,
    0.1788153201341629,
    -0.10316174477338791,
    -0.10748779773712158,
    0.23527388274669647,
    -0.168986976146698,
    0.05124307796359062,
    0.11808295547962189,
    -0.08169100433588028,
    -0.16780970990657806,
    -0.21579942107200623,
    0.02843247726559639,
    0.36987602710723877,
    0.20209570229053497,
    -0.1473609209060669,
    -0.011814601719379425,
    -0.031752943992614746,
    -0.10274985432624817,
    0.00645636348053813,
    -0.028827562928199768,
    -0.20054665207862854,
    -0.05240290239453316,
    -0.028739171102643013,
    0.0517459437251091,
    0.17066223919391632,
    -0.044190872460603714,
    0.011840255931019783,
    0.19781744480133057,
    0.09513046592473984,
    0.03931114822626114,
    0.0333949476480484,
    0.003093465929850936,
    -0.1375502645969391,
    -0.08999385684728622,
    -0.09645890444517136,
    0.0749933198094368,
    0.08328719437122345,
    -0.19238777458667755,
    0.05054717883467674,
    0.030102021992206573,
    -0.10269326716661453,
    0.08828919380903244,
    -0.018569577485322952,
    -0.040432099252939224,
    -0.0778098776936531,
    -0.023950153961777687,
    -0.11260920763015747,
    -0.02011946402490139,
    0.21110601723194122,
    -0.20597684383392334,
    0.22897176444530487,
    0.1657414734363556,
    -0.045954469591379166,
    0.05732119828462601,
    0.12183494865894318,
    0.019130021333694458,
    0.03688107803463936,
    0.034541137516498566,
    -0.10399799793958664,
    -0.09902313351631165,
    0.03954977169632912,
    -0.08325991034507751,
    0.05180355906486511,
    0.0580279640853405
  ]
}