0.15182 -0.00260553 -0.196348 0.00737735 0.11512 0.148887 0.0448936 -0.00624041 -0.0400742 -0.096117 0.081425 0.112507 0.097885 -0.162337 -0.164921 -0.0125839 -0.033879 0.0532822 -0.185644 0.18154 0.149091 -0.0674457 0.073505 0.12057 -0.0342256 -0.0733268 0.00659501 -0.18678 -0.000540953 0.0763517 -0.0431817 0.043894 -0.0809759 0.0911494 -0.0971827 -0.0352588 -0.12205 0.0341095 -0.0898613 -0.0138116 0.0274876 -0.0647306 -0.0811202 0.186992 -0.146747 -0.0277092 0.0974128 0.05367 -0.107821 0.113593 0.0439091 -0.0147599 -0.100175 -0.0273355 0.017052 -0.0511167 -0.0268756 0.11442 0.035137 -0.0731567 -0.0373616 0.000114167 0.220808 -0.0294125 -0.0373029 -0.212204 -0.00680903 0.0486106 -0.0223624 0.0565489 -0.00862313 0.0397837 -0.0175726 -0.0147101 -0.0563035 -0.00762531 -0.0353765 0.0680935 -0.0669014 0.139501 -0.0407542 0.0139024 -0.0300098 -0.0556091 -0.0827743 0.10523 0.0797059 -0.0206816 -0.0376123 -0.00860675 0.0789143 -0.140686 -0.154634 -0.021181 -0.0394653 -0.0740908 -0.0335117 0.00686379 -0.00300602 -0.0894652 0.0348055 0.023867 0.00222439 0.168727 -0.0864269 -0.0112059 -0.121866 0.223257 -0.024181 -0.050062 0.0692707 0.139795 -0.0692759 0.0376731 -0.0161337 0.06444 -0.132197 -0.0710967 0.0487771 0.142567 -0.0550674 0.0425463 -0.0330258 0.0926562 -0.0449976 -0.0197742 -0.0609372 -0.0498504 
0.147926 -0.00536484 -0.194637 0.0114991 0.117708 0.146873 0.0422635 -0.00746398 -0.040802 -0.0979776 0.0807554 0.117656 0.0944666 -0.166856 -0.167399 -0.00651945 -0.0361687 0.0548817 -0.183984 0.18103 0.155156 -0.0693179 0.076262 0.111292 -0.0319386 -0.0670542 0.00459384 -0.193269 -0.00320364 0.0752508 -0.0442468 0.0486053 -0.0765906 0.0897696 -0.09375 -0.0372522 -0.119254 0.0377606 -0.0850391 -0.0169376 0.0323689 -0.0607824 -0.0776937 0.186346 -0.150989 -0.0286814 0.102331 0.0434401 -0.108242 0.107237 0.0442828 -0.0185072 -0.10255 -0.0229604 0.0191304 -0.0526097 -0.0219995 0.10814 0.02929 -0.0724844 -0.0350025 -0.00734417 0.220223 -0.0282691 -0.0266248 -0.215047 -0.0106924 0.0509944 -0.0169213 0.05886 -0.00679369 0.0425966 -0.0157811 -0.0193183 -0.0567174 -0.005027 -0.0405402 0.0707728 -0.0724898 0.136882 -0.0464959 0.0193924 -0.0270793 -0.0507673 -0.0871804 0.106307 0.0845877 -0.0148217 -0.0421342 -0.0136762 0.0750492 -0.140824 -0.159717 -0.0222769 -0.0426975 -0.0764652 -0.0327753 0.00994458 -0.00425739 -0.087087 0.0301658 0.0189585 0.00306957 0.169084 -0.0794097 -0.0129982 -0.117803 0.228041 -0.0255096 -0.0525228 0.0605401 0.135706 -0.072147 0.0364675 -0.0108585 0.0610637 -0.1367 -0.0745112 0.0476442 0.140763 -0.0543329 0.0508234 -0.0312666 0.0910425 -0.0370167 -0.0186542 -0.0570113 -0.046342 
0.14026 -0.010519 -0.175611 0.0102364 0.10762 0.153005 0.0379917 -0.00622361 -0.0410389 -0.0937521 0.0765236 0.111706 0.0960078 -0.18181 -0.157544 -0.0209459 -0.0578398 0.0675016 -0.184228 0.179709 0.151286 -0.0609276 0.0761333 0.128559 -0.0420992 -0.0736796 -0.00202542 -0.206233 -0.0107365 0.0702011 -0.0418832 0.0270709 -0.0845668 0.0876086 -0.0765867 -0.0321563 -0.124494 0.0235649 -0.097318 -0.0126778 0.0326258 -0.0708151 -0.0920603 0.198569 -0.157925 -0.0315341 0.102311 0.0558344 -0.105841 0.118723 0.0477574 -0.0308692 -0.0980908 -0.0266361 0.0169732 -0.0509792 -0.0197727 0.101751 0.0372438 -0.0744503 -0.0272844 0.0022991 0.21276 -0.0144783 -0.0264042 -0.234162 -0.000185364 0.035472 -0.0172257 0.062027 -0.00991249 0.0398871 -0.00717586 -0.0219539 -0.0648617 -0.0100189 -0.0578731 0.0729352 -0.0574529 0.146599 -0.0357438 0.0148375 -0.0342917 -0.0473403 -0.0865636 0.105739 0.0864781 -0.0181539 -0.0474242 -0.00549259 0.0771203 -0.132134 -0.148325 -0.0298804 -0.0641305 -0.077997 -0.0429944 0.00795899 -0.000903697 -0.0876432 0.0432526 0.029995 0.00310588 0.149609 -0.0632508 -0.0206768 -0.112447 0.22033 -0.0304566 -0.0299464 0.0662333 0.132974 -0.0665468 0.0237686 -0.0279217 0.0743758 -0.130018 -0.0720585 0.033409 0.135797 -0.0525629 0.0377817 -0.0412611 0.0880539 -0.0439249 -0.0158 -0.0611298 -0.0410042 
0.151997 -0.0257049 -0.193806 0.00890772 0.124512 0.153524 0.035694 -0.0181406 -0.070439 -0.0931963 0.056989 0.107094 0.105587 -0.152082 -0.158854 -0.0150283 -0.0435504 0.069498 -0.159146 0.175814 0.160689 -0.0720407 0.0944326 0.110701 -0.025532 -0.070905 -0.00774662 -0.211259 -0.0180166 0.0831647 -0.0452811 0.0334328 -0.0979473 0.0733133 -0.0705689 -0.0343787 -0.136845 0.0259536 -0.074062 -0.0306757 0.0103572 -0.0524605 -0.0852901 0.195451 -0.160707 -0.0199755 0.102921 0.0574233 -0.0960427 0.112994 0.0565184 -0.0291042 -0.0816496 -0.0254279 0.0165983 -0.067181 0.00846277 0.113857 0.0519706 -0.0812144 -0.00877183 0.014542 0.211611 -0.0159952 -0.0224606 -0.233532 -0.0102904 0.0601999 -0.0044717 0.058965 -0.00247921 0.0607793 -0.0120891 -0.0382621 -0.0876479 -0.00131103 -0.051532 0.0556993 -0.0513953 0.15763 -0.0347352 0.00740833 -0.0320181 -0.0472438 -0.0888401 0.0870216 0.0800071 -0.0111891 -0.0404394 -0.0252194 0.0714846 -0.114886 -0.142896 -0.0256742 -0.0642287 -0.0818145 -0.0309513 0.034139 -0.0058981 -0.088346 0.0496382 0.0403267 0.00661295 0.160321 -0.0704153 -0.0258623 -0.121862 0.220835 -0.0197215 -0.024853 0.0668641 0.127251 -0.0689632 0.0311689 -0.0267477 0.0885116 -0.128918 -0.0633704 0.0215655 0.133206 -0.0690696 0.0354688 -0.0337254 0.0663347 -0.0559498 -0.0181147 -0.0701569 -0.0375725 
0.157526 -0.0140669 -0.192383 0.00713475 0.11947 0.169801 0.0546134 -0.011204 -0.0590986 -0.0900435 0.0689752 0.103782 0.100691 -0.153861 -0.142049 -0.0215779 -0.0402014 0.0646212 -0.158581 0.156061 0.158191 -0.0681192 0.0781963 0.136967 -0.0201938 -0.0853394 -0.00290454 -0.211374 -0.00772888 0.0872172 -0.0375311 0.0314351 -0.0991564 0.0829301 -0.0752652 -0.0332179 -0.130686 0.00902906 -0.0805462 -0.019763 0.0255661 -0.0645458 -0.0822913 0.192264 -0.154501 -0.0177006 0.100576 0.0566824 -0.110539 0.100856 0.055231 -0.0285774 -0.0803032 -0.035257 0.0156867 -0.0419195 -0.00998143 0.133314 0.0472746 -0.069528 -0.0222213 0.0185596 0.214324 -0.0389381 -0.0252524 -0.213246 -0.00636877 0.0469898 -0.0209743 0.0664427 -0.0130306 0.0586802 -0.0304466 -0.0369762 -0.0682614 0.000582414 -0.0450013 0.0620924 -0.0532329 0.151764 -0.0427489 0.00944354 -0.0317274 -0.0576465 -0.0890317 0.0963093 0.0831899 -0.0368102 -0.0564601 -0.0103261 0.083683 -0.127831 -0.145613 -0.0321505 -0.0555755 -0.0737724 -0.0320583 0.0195228 0.00685637 -0.0816376 0.0495892 0.0352312 0.00856206 0.15808 -0.0853394 -0.0194061 -0.12493 0.216026 -0.0373176 -0.0373744 0.0750243 0.125304 -0.0619221 0.00985741 -0.0147905 0.0902307 -0.1298 -0.0688537 0.0350882 0.149417 -0.0473931 0.0198705 -0.0450851 0.0822588 -0.059702 -0.00962241 -0.0721319 -0.0418381 
0.142608 -0.0320412 -0.180096 0.00959633 0.121268 0.154834 0.038776 -0.0153313 -0.0594066 -0.0925638 0.0627995 0.113541 0.10266 -0.152644 -0.149851 -0.0272897 -0.0587066 0.0671064 -0.157026 0.175409 0.161364 -0.0768106 0.0864389 0.137002 -0.0212254 -0.0737305 -0.00483461 -0.212748 -0.0145612 0.0825236 -0.0372857 0.018496 -0.0973436 0.074732 -0.0730159 -0.0242971 -0.14385 0.0151218 -0.0872549 -0.0278568 0.0248086 -0.0604802 -0.0921572 0.199364 -0.162873 -0.0280821 0.102807 0.0599306 -0.0923956 0.108078 0.0470907 -0.0333156 -0.0796291 -0.0331056 0.0295406 -0.0510111 -0.00972743 0.127689 0.0444924 -0.0782673 -0.0150781 0.0157814 0.216335 -0.0105298 -0.0235084 -0.222935 -0.00539355 0.0495441 -0.0103929 0.0653697 -0.00655153 0.0643923 -0.0172326 -0.0376623 -0.0737695 0.000940402 -0.0548665 0.0623475 -0.0434647 0.159086 -0.0407363 0.00894577 -0.0305814 -0.0501805 -0.0904763 0.0879465 0.0894828 -0.00798377 -0.0449299 -0.0199827 0.0801646 -0.115671 -0.13314 -0.0276868 -0.0710549 -0.0871383 -0.0416743 0.023955 0.00962735 -0.0917787 0.0516803 0.0343725 0.00730391 0.142745 -0.0731541 -0.0141229 -0.122537 0.212145 -0.0239807 -0.0278958 0.0701908 0.129964 -0.0684105 0.0182234 -0.0227968 0.0968138 -0.124712 -0.0652979 0.0244727 0.14447 -0.0587148 0.0268207 -0.0497882 0.0706439 -0.0708988 0.000468747 -0.0699424 -0.0300954 
0.138652 -0.0189281 -0.176589 0.00627457 0.112989 0.15313 0.0382454 -0.00833415 -0.0634855 -0.0874606 0.0638479 0.105159 0.103 -0.163744 -0.151462 -0.0152343 -0.0638206 0.0619142 -0.163361 0.172172 0.163946 -0.0779469 0.0808713 0.129992 -0.023661 -0.0693635 -0.00791974 -0.212873 -0.00348578 0.0791742 -0.0410009 0.0233943 -0.0988349 0.075678 -0.0760159 -0.0308611 -0.144122 0.0177577 -0.083793 -0.0212932 0.0227346 -0.0698327 -0.086416 0.200821 -0.150731 -0.0235709 0.10896 0.0557999 -0.107481 0.103401 0.0488206 -0.0318516 -0.0872094 -0.0322865 0.0218095 -0.0520318 -0.00937022 0.120337 0.0467064 -0.0800443 -0.0136413 0.0128409 0.213301 -0.00583232 -0.0244433 -0.221158 -0.00735105 0.0441384 -0.00897987 0.0567169 -0.0123316 0.0601271 -0.0171411 -0.0338289 -0.0660603 -0.00379673 -0.0555836 0.066946 -0.0463912 0.160883 -0.0348172 0.00431146 -0.0317426 -0.0494903 -0.0951263 0.0966054 0.0871984 -0.0137252 -0.0450496 -0.0201278 0.0761095 -0.116473 -0.14355 -0.0266701 -0.0721238 -0.0784105 -0.0367984 0.0254772 0.00671181 -0.0887616 0.0473205 0.0296654 0.00498187 0.150335 -0.0736099 -0.015079 -0.122317 0.226875 -0.0228373 -0.0377255 0.0663668 0.131784 -0.072799 0.0133889 -0.0189158 0.0933322 -0.131222 -0.0628302 0.0285067 0.141108 -0.0601508 0.0278955 -0.0431879 0.0732887 -0.06617 -0.00273635 -0.0703478 -0.0347245 
0.137951 -0.0203469 -0.177673 0.00670096 0.118393 0.152692 0.0395207 -0.00935838 -0.0539374 -0.0868517 0.0664151 0.109553 0.0996557 -0.169292 -0.154129 -0.0156188 -0.0637241 0.0670127 -0.169978 0.174795 0.163317 -0.0775951 0.0835167 0.127407 -0.027217 -0.0717664 -0.00908337 -0.21375 -0.00643619 0.0750696 -0.0371293 0.0246581 -0.0958013 0.0776411 -0.0737612 -0.0306047 -0.140265 0.0212945 -0.0833054 -0.0230279 0.0271274 -0.0668805 -0.0903624 0.198174 -0.155339 -0.029302 0.103193 0.0576604 -0.102738 0.105995 0.0434287 -0.0322529 -0.0907757 -0.0322779 0.0198821 -0.0524498 -0.00934889 0.117551 0.0382021 -0.0763092 -0.0162088 0.00927772 0.216931 -0.0085829 -0.0205344 -0.225056 -0.00908364 0.0473476 -0.00929344 0.0618059 -0.0092101 0.0600286 -0.0158204 -0.0318108 -0.0697582 -0.00518855 -0.0558228 0.06961 -0.0497701 0.152684 -0.0400231 0.0100291 -0.0319273 -0.0457837 -0.0945192 0.0971469 0.089301 -0.00805232 -0.0430345 -0.0195852 0.0792353 -0.120195 -0.143212 -0.0269844 -0.0668176 -0.082211 -0.0420722 0.0211505 0.00203265 -0.0858382 0.0473397 0.0248078 0.00173137 0.148145 -0.0640106 -0.0154484 -0.117665 0.221904 -0.0206376 -0.0337079 0.0621976 0.132332 -0.069303 0.0201098 -0.0171823 0.0898824 -0.131423 -0.0632927 0.0305165 0.140994 -0.0583151 0.0335024 -0.0449004 0.0775934 -0.0631636 -0.00545163 -0.0700606 -0.0347656 
0.135269 -0.0171653 -0.172051 0.0057464 0.114471 0.152677 0.0355004 -0.00298097 -0.0519773 -0.0867882 0.0731742 0.111041 0.1006 -0.166106 -0.154238 -0.0194846 -0.0575458 0.0661219 -0.174568 0.176814 0.161168 -0.0749613 0.0771751 0.137368 -0.0265169 -0.0704822 -0.00305871 -0.203437 -0.000120442 0.0697147 -0.0348615 0.0196092 -0.0931907 0.07952 -0.0830888 -0.0281342 -0.142874 0.0207777 -0.0910399 -0.0163426 0.0313803 -0.0657848 -0.0936777 0.20075 -0.153562 -0.0366809 0.103038 0.0559952 -0.103848 0.10463 0.0441633 -0.0285121 -0.0970648 -0.0348226 0.0197228 -0.047104 -0.019465 0.121543 0.0408828 -0.0802955 -0.0234153 0.007895 0.216725 -0.0070914 -0.0280796 -0.220593 -0.00407215 0.0436867 -0.0128244 0.0630426 -0.00729678 0.0568032 -0.0123654 -0.0282275 -0.0619409 -0.00779517 -0.0560698 0.0750544 -0.0495285 0.150761 -0.0425339 0.0130657 -0.0262142 -0.0495331 -0.0917486 0.0980111 0.0930488 -0.00748057 -0.0419897 -0.0195257 0.0768266 -0.122822 -0.14204 -0.025131 -0.0626882 -0.083364 -0.0428273 0.0159347 -0.00052968 -0.0900372 0.0416279 0.0262605 0.00277583 0.150393 -0.0717501 -0.00897832 -0.120114 0.217 -0.0195266 -0.0427052 0.0657708 0.137407 -0.0707803 0.0247812 -0.017428 0.0833465 -0.132986 -0.0681018 0.0330793 0.141424 -0.0584291 0.031824 -0.0495065 0.0785976 -0.0637954 -0.00198443 -0.0694424 -0.034545 
0.135078 -0.0234794 -0.175089 0.00532771 0.112028 0.150403 0.0311293 -0.00546216 -0.0510116 -0.0913076 0.0692009 0.110648 0.100726 -0.165259 -0.156311 -0.021508 -0.0635018 0.0677369 -0.172536 0.175526 0.159511 -0.0727621 0.0822489 0.131754 -0.0303902 -0.070316 0.000430976 -0.207802 -0.0115979 0.0705211 -0.0374818 0.0187022 -0.0912696 0.0775896 -0.0798005 -0.0270837 -0.143386 0.0183728 -0.0929493 -0.0163589 0.0276024 -0.0666954 -0.0966856 0.203884 -0.155522 -0.0327102 0.101901 0.0571487 -0.100597 0.109081 0.044379 -0.0322815 -0.0908056 -0.0324605 0.0178758 -0.0496148 -0.0136705 0.115737 0.0431883 -0.0796205 -0.0186093 0.00979208 0.21428 -0.00112219 -0.0289285 -0.227791 -0.00354299 0.0471137 -0.00713689 0.0634544 -0.00757262 0.0522823 -0.0102161 -0.0346514 -0.0679237 -0.00564832 -0.060804 0.0680281 -0.0517412 0.15419 -0.0400707 0.0108567 -0.0316412 -0.0487264 -0.0961958 0.0999565 0.0914512 -0.0100612 -0.0441596 -0.0190787 0.0754787 -0.120267 -0.141271 -0.0275856 -0.0676165 -0.0801794 -0.0458475 0.0169199 0.00235883 -0.0907232 0.0457514 0.0270016 0.00420929 0.145599 -0.0652172 -0.0157064 -0.122197 0.216811 -0.0265714 -0.0361073 0.0670746 0.134004 -0.0690461 0.0212344 -0.0237292 0.0871979 -0.131068 -0.0680001 0.0319994 0.138123 -0.0578837 0.0309722 -0.0479761 0.0763469 -0.0610704 -0.00651849 -0.0696409 -0.0320731 
0.129768 -0.0226164 -0.169938 -0.00958424 0.118573 0.160375 0.0285532 -0.00769477 -0.0564513 -0.0986636 0.0631195 0.1113 0.0988837 -0.158315 -0.150582 -0.0288155 -0.0739978 0.0621514 -0.172327 0.167708 0.155195 -0.0595058 0.0772154 0.12469 -0.0278557 -0.0640622 0.00445925 -0.197916 -0.0126442 0.0646625 -0.0305038 0.00416415 -0.100633 0.0761974 -0.0729953 -0.0194855 -0.142012 0.00903809 -0.0891688 -0.0114613 0.0389753 -0.0599436 -0.0896204 0.213657 -0.161139 -0.0316075 0.105715 0.0624298 -0.100503 0.109551 0.0373837 -0.041152 -0.0961217 -0.0302451 0.0234315 -0.0487151 -0.025992 0.133331 0.0386518 -0.0840328 -0.0223781 0.0167849 0.222479 0.00279338 -0.0257513 -0.223712 -0.00140286 0.0516911 -0.00335051 0.0687934 0.00131066 0.0601467 -0.000493673 -0.0359428 -0.0641521 -0.00242213 -0.0705629 0.0648298 -0.0463526 0.149087 -0.0295548 0.0176642 -0.0222374 -0.0427325 -0.103342 0.091807 0.0989284 -0.00165881 -0.0448416 -0.0145755 0.0826921 -0.123743 -0.138526 -0.0318884 -0.0709513 -0.0824997 -0.0454195 0.0189942 -0.00157844 -0.08965 0.0363191 0.0309813 0.00426412 0.138776 -0.0758769 -0.00837658 -0.132126 0.215193 -0.0355246 -0.0332465 0.0831706 0.130704 -0.0748739 0.0330799 -0.0290979 0.0857347 -0.13163 -0.0635607 0.0262102 0.133112 -0.0502279 0.0276645 -0.0444996 0.0707574 -0.0657356 -0.00764039 -0.0751259 -0.0294467 
0.131144 -0.0207223 -0.172474 -0.00957177 0.114094 0.162668 0.0282299 -0.0125571 -0.066744 -0.0919391 0.0655636 0.112622 0.106083 -0.150115 -0.151244 -0.0307266 -0.0712192 0.0615867 -0.166546 0.170677 0.151925 -0.0617497 0.0784183 0.124956 -0.030077 -0.0583118 0.00604967 -0.19499 -0.0116764 0.0707243 -0.0375001 0.00547864 -0.101265 0.0752363 -0.0765718 -0.019478 -0.145433 0.0133135 -0.0870969 -0.0101778 0.0302287 -0.0637555 -0.0911944 0.2122 -0.163728 -0.0322379 0.10831 0.0633298 -0.101997 0.11098 0.0456304 -0.0358852 -0.0974063 -0.0268282 0.0257852 -0.0482817 -0.0257802 0.137769 0.0426305 -0.0830109 -0.0231745 0.0162583 0.227105 -0.00106029 -0.0231979 -0.221542 -0.00141695 0.0512666 -0.00953065 0.0692684 -0.000153394 0.0603076 -0.00157231 -0.0323413 -0.0630571 -0.00182691 -0.065113 0.0604292 -0.0427443 0.151539 -0.028228 0.00845593 -0.0194249 -0.0445533 -0.105857 0.0850942 0.0989087 -0.00528397 -0.0391436 -0.0140421 0.0775759 -0.125593 -0.131744 -0.02689 -0.0737047 -0.0855849 -0.0419026 0.0226322 0.00367686 -0.0903762 0.0392136 0.0422368 0.00269315 0.142177 -0.0771498 -0.00510541 -0.13281 0.214151 -0.0340151 -0.0358826 0.0838039 0.132529 -0.0732664 0.0348166 -0.0310332 0.0872663 -0.126556 -0.0599953 0.0254961 0.135139 -0.0528999 0.0172459 -0.0428837 0.0653966 -0.0659238 -0.000865888 -0.0728975 -0.0277544 
0.131323 -0.0254832 -0.167282 -0.0016058 0.115296 0.151327 0.0363964 -0.0025147 -0.058685 -0.0879745 0.0647719 0.107845 0.104965 -0.168831 -0.152953 -0.016475 -0.0729262 0.0681615 -0.175756 0.170785 0.165479 -0.074848 0.0811831 0.122346 -0.0313074 -0.0675656 -0.0105918 -0.210221 -0.00524595 0.0666118 -0.0347394 0.0225846 -0.0997848 0.0782236 -0.0762738 -0.030341 -0.146811 0.0172175 -0.0823352 -0.0162773 0.0317295 -0.0692806 -0.0937134 0.203292 -0.154106 -0.0356753 0.100376 0.058971 -0.103444 0.102834 0.0390875 -0.0399042 -0.0958052 -0.0316109 0.0115164 -0.0526246 -0.00963607 0.118757 0.0373906 -0.0758297 -0.0131073 0.0135077 0.213337 0.00535455 -0.0229434 -0.224795 -0.00771977 0.0471169 -0.00375652 0.0587931 -0.0096967 0.0576013 -0.00921479 -0.0320463 -0.0700062 -0.00733779 -0.0621064 0.0655638 -0.0483783 0.15346 -0.0361678 0.00585066 -0.0283677 -0.0419112 -0.102603 0.100634 0.0972766 -0.00601072 -0.046132 -0.0234754 0.0810349 -0.117025 -0.141859 -0.0269126 -0.0737957 -0.0791575 -0.0480881 0.0224331 -0.00176307 -0.0822744 0.0454677 0.0229151 -8.05387e-05 0.148696 -0.0553254 -0.0160901 -0.12108 0.226503 -0.0222012 -0.0376472 0.0608142 0.131102 -0.0745064 0.0215209 -0.0205975 0.0906686 -0.130111 -0.0592932 0.0294692 0.137343 -0.0580381 0.0300852 -0.0482423 0.0750455 -0.0668384 -0.00745065 -0.0781183 -0.0304743 
0.13472 -0.0256482 -0.174885 -0.0100826 0.120195 0.165634 0.0258764 -0.0145229 -0.0647585 -0.0978037 0.0580193 0.108096 0.0995318 -0.15723 -0.150899 -0.0250736 -0.0748257 0.0605753 -0.165421 0.167833 0.154483 -0.0564879 0.0812723 0.119749 -0.0291204 -0.0580505 0.00356381 -0.202851 -0.015013 0.0671441 -0.0334317 0.00536326 -0.10701 0.0735208 -0.0660883 -0.0184711 -0.142556 0.00969341 -0.0813381 -0.0161358 0.0310304 -0.0600177 -0.0903749 0.212732 -0.160487 -0.0252205 0.106872 0.0675897 -0.100231 0.111436 0.0417078 -0.0398857 -0.090853 -0.0280339 0.0257741 -0.0549863 -0.0185722 0.13427 0.0418783 -0.085409 -0.0177889 0.0198994 0.22613 0.000241856 -0.0215752 -0.227244 -0.0029041 0.0560141 -0.000312448 0.0687706 -0.000680167 0.0636005 -0.00125024 -0.0373344 -0.0706622 -0.00378617 -0.0691425 0.0619306 -0.0430958 0.15493 -0.0200369 0.0142729 -0.0233614 -0.044586 -0.103819 0.0832693 0.095953 -0.000372863 -0.0427974 -0.0136054 0.0839738 -0.118844 -0.137327 -0.0278415 -0.0742765 -0.0810029 -0.0391653 0.0238254 -0.000194232 -0.0895578 0.0430985 0.0379563 0.000539291 0.136642 -0.074837 -0.0115236 -0.13074 0.213057 -0.0343971 -0.0251741 0.0868792 0.130909 -0.0720818 0.0335935 -0.0298865 0.0901742 -0.132226 -0.0596516 0.0188341 0.129173 -0.0528239 0.0242348 -0.0356137 0.0641879 -0.0661225 -0.00663259 -0.0744678 -0.0314203 
0.134774 -0.011813 -0.176789 -0.00231742 0.113588 0.157948 0.0337358 -0.0213691 -0.0727342 -0.0880221 0.0628421 0.11031 0.109477 -0.148242 -0.149613 -0.028137 -0.0667403 0.0542555 -0.16408 0.178474 0.150478 -0.0690484 0.0805734 0.115113 -0.0275151 -0.0555711 -0.00542009 -0.197101 -0.00883168 0.0816715 -0.0414318 0.0211238 -0.101732 0.074994 -0.074968 -0.0239239 -0.141114 0.0301314 -0.0792338 -0.0176279 0.0237347 -0.0667555 -0.0865548 0.203688 -0.16492 -0.0230349 0.111716 0.0608911 -0.102175 0.111374 0.0518996 -0.0252937 -0.0959342 -0.0230316 0.0317538 -0.0571909 -0.0224848 0.13108 0.0448049 -0.086714 -0.023894 0.00922957 0.224788 -0.00893035 -0.0198143 -0.2194 -0.000505711 0.0519988 -0.0151043 0.0619409 0.00190067 0.063619 -0.00402781 -0.0252799 -0.0634945 -0.00140099 -0.0603997 0.0543728 -0.039943 0.161735 -0.0273486 0.00229283 -0.0194745 -0.0445929 -0.0972396 0.076369 0.0926039 -0.0050895 -0.0311474 -0.0159867 0.0712952 -0.12713 -0.129162 -0.0246388 -0.0793237 -0.09233 -0.0306073 0.0266875 0.00718173 -0.094731 0.0395664 0.0496254 0.00331783 0.153978 -0.0846153 -0.00605265 -0.129711 0.225508 -0.0199158 -0.0336508 0.0796627 0.134565 -0.0843255 0.0375357 -0.0288807 0.0863609 -0.126435 -0.0603483 0.0243708 0.137801 -0.0572247 0.0230629 -0.0358693 0.0678883 -0.0588338 -0.00406725 -0.0644128 -0.0309529 
0.143409 0.00193285 -0.19086 0.00198304 0.115863 0.159094 0.0321242 -0.0118471 -0.0605487 -0.0756786 0.07788 0.117174 0.104427 -0.160137 -0.156303 -0.00861969 -0.0342632 0.0638732 -0.176054 0.181321 0.14678 -0.058712 0.085667 0.113747 -0.0398141 -0.0545516 0.00414929 -0.19635 -0.00195197 0.0756479 -0.0460226 0.0415496 -0.0821039 0.0847758 -0.0856003 -0.0302639 -0.122074 0.0460798 -0.0814426 -0.00930062 0.0184084 -0.0560905 -0.0880116 0.192302 -0.164908 -0.0315934 0.111221 0.0507664 -0.110317 0.115914 0.0638561 -0.0177187 -0.111614 -0.020714 0.0227173 -0.0541905 -0.012484 0.114922 0.041822 -0.0818944 -0.0387902 -0.00761889 0.225134 -0.0341618 -0.0154035 -0.227598 -0.00769819 0.0585518 -0.0217254 0.0709607 0.00118855 0.0542734 -0.00836177 -0.0162838 -0.0638179 -0.00965901 -0.0502516 0.0721762 -0.0597041 0.134542 -0.0381269 0.0187424 -0.0216664 -0.0479753 -0.0883482 0.0844475 0.0883761 -0.00983039 -0.0279572 -0.0120384 0.0607099 -0.136206 -0.150143 -0.0202348 -0.0468371 -0.0828367 -0.0261128 0.0231865 -0.0123496 -0.0876546 0.032904 0.038787 -0.000553695 0.168389 -0.0834722 -0.0123954 -0.124773 0.209686 -0.0156301 -0.0451501 0.0661789 0.145696 -0.0670254 0.0455714 -0.0158853 0.0631188 -0.131901 -0.0782008 0.0333637 0.136477 -0.0533388 0.037853 -0.0219101 0.0799078 -0.0397793 -0.0141045 -0.0561797 -0.0418973 
0.148889 -0.0137338 -0.189034 0.0119895 0.114524 0.149537 0.0375265 -0.0137893 -0.065164 -0.0872598 0.0635054 0.105524 0.105753 -0.16136 -0.157048 -0.00818402 -0.0457975 0.062111 -0.167658 0.179231 0.158924 -0.0747654 0.0909377 0.112426 -0.0296715 -0.0670094 -0.00930082 -0.212131 -0.0112377 0.0832036 -0.0466917 0.0426351 -0.0917034 0.0790489 -0.0773494 -0.0382189 -0.132174 0.0380225 -0.077389 -0.0249618 0.0113958 -0.0633826 -0.0845588 0.191693 -0.155124 -0.020716 0.105905 0.0521279 -0.103794 0.112272 0.0604806 -0.024165 -0.087785 -0.0238295 0.0187647 -0.0637612 0.00322179 0.106106 0.0519095 -0.0823649 -0.0170183 0.00279061 0.208664 -0.0195359 -0.0224565 -0.228919 -0.00891127 0.0537804 -0.011252 0.0545024 -0.00781983 0.0545848 -0.0143231 -0.0304028 -0.0753475 -0.00481703 -0.049214 0.0601838 -0.0536459 0.161112 -0.0348039 0.00246952 -0.0321955 -0.0499958 -0.0870701 0.0915385 0.079749 -0.0155254 -0.0379277 -0.0209796 0.0656208 -0.12149 -0.14759 -0.0237524 -0.0658424 -0.0778599 -0.028296 0.0290715 -0.00183536 -0.0894523 0.0473693 0.0370386 0.00455808 0.166878 -0.0718778 -0.0262082 -0.120394 0.227364 -0.0143054 -0.035436 0.0605523 0.135616 -0.0737037 0.0265147 -0.0204702 0.0836054 -0.132435 -0.0663836 0.0275548 0.137133 -0.0649222 0.0390358 -0.0302682 0.0756372 -0.0473787 -0.0175403 -0.0619804 -0.0404062 
0.147022 -0.0245711 -0.188507 0.00915848 0.116683 0.145164 0.0312994 -0.0129629 -0.0589815 -0.100476 0.0622507 0.106202 0.100086 -0.162447 -0.170463 -0.00391742 -0.0557305 0.0602864 -0.170961 0.179693 0.167764 -0.0803313 0.0956018 0.108818 -0.0287479 -0.0661742 -0.00233255 -0.210422 -0.0118492 0.0740115 -0.0464438 0.0337377 -0.0907691 0.0781054 -0.0794763 -0.038541 -0.138614 0.0378719 -0.0758362 -0.0293391 0.0121153 -0.060959 -0.0859047 0.189506 -0.148459 -0.026713 0.10135 0.0515913 -0.102107 0.112929 0.0428038 -0.0277368 -0.0817397 -0.0214473 0.016108 -0.0665534 0.00916198 0.107956 0.0403358 -0.0842257 -0.0111097 0.0108687 0.217841 -0.00770929 -0.0251851 -0.220741 -0.0145539 0.0576099 -0.0025256 0.054777 -0.0128347 0.0516187 -0.0154467 -0.0299019 -0.072575 -0.00623568 -0.0461628 0.0559947 -0.0569618 0.158156 -0.0368763 0.00434355 -0.0327121 -0.0514889 -0.0943193 0.0986637 0.0783634 -0.00511618 -0.0398339 -0.0253069 0.0795673 -0.119614 -0.147667 -0.0197905 -0.0596233 -0.0759527 -0.0364098 0.0324481 -0.000595109 -0.0867419 0.0489835 0.0235368 -0.00037618 0.160867 -0.0614292 -0.0221508 -0.116046 0.228096 -0.0177148 -0.0415049 0.0597179 0.137233 -0.0676102 0.0294477 -0.0153263 0.0894375 -0.134993 -0.0573783 0.0334464 0.134896 -0.0700401 0.0418772 -0.0320074 0.0684556 -0.0551597 -0.0120956 -0.0657958 -0.0389478 
0.147255 -0.0217415 -0.192855 0.013743 0.119523 0.140237 0.0289398 -0.0154734 -0.0615106 -0.0907364 0.063982 0.109163 0.102512 -0.155866 -0.165428 -0.00582741 -0.04362 0.064233 -0.166108 0.185869 0.160877 -0.08253 0.098259 0.111332 -0.0256821 -0.0644287 -0.00316751 -0.208842 -0.0133596 0.0769143 -0.0453423 0.0376433 -0.0871801 0.0748921 -0.0824592 -0.0350903 -0.139406 0.041675 -0.0786346 -0.0292288 0.00884705 -0.0555267 -0.0883907 0.192134 -0.154686 -0.024304 0.103644 0.0512999 -0.0959099 0.113854 0.0522406 -0.0220316 -0.0877497 -0.0252652 0.0188122 -0.0669816 0.00692832 0.106719 0.0509264 -0.0830788 -0.0143985 0.00351371 0.212562 -0.010651 -0.0249848 -0.228194 -0.012774 0.0608878 -0.00344293 0.0579764 -0.00552134 0.0576194 -0.0125405 -0.0300565 -0.0760129 -0.00683946 -0.0484353 0.0627776 -0.0573012 0.157318 -0.04187 0.00711745 -0.0333981 -0.05111 -0.0889922 0.0913658 0.0782284 -0.00554814 -0.0337963 -0.0302764 0.066948 -0.115064 -0.145085 -0.0239207 -0.0563788 -0.0824256 -0.0321283 0.0318882 -0.00375119 -0.0937298 0.0434738 0.0291469 0.00644014 0.162677 -0.0687283 -0.0224697 -0.118968 0.223869 -0.00785382 -0.0385324 0.0582906 0.139373 -0.068847 0.0327712 -0.0181467 0.0825581 -0.131792 -0.0676369 0.0312831 0.136176 -0.0705805 0.0456772 -0.0340038 0.0718957 -0.0542087 -0.0160041 -0.0629985 -0.03595 
0.14296 -0.0223379 -0.187461 0.00948073 0.118586 0.144613 0.0269467 -0.0163707 -0.0612264 -0.0916022 0.064823 0.113119 0.1033 -0.151557 -0.16143 -0.0148176 -0.0465225 0.060644 -0.169348 0.185599 0.153673 -0.0762127 0.0982555 0.111762 -0.0288111 -0.0599236 0.000311815 -0.203578 -0.0162427 0.0712861 -0.0424907 0.0316623 -0.0871452 0.0758338 -0.084128 -0.0294911 -0.138978 0.0461756 -0.0848044 -0.0232659 0.0150375 -0.0526606 -0.0959305 0.193902 -0.163668 -0.0255663 0.101836 0.0530452 -0.0928154 0.115677 0.0525082 -0.0209528 -0.0923203 -0.0238514 0.0225533 -0.0662191 0.0011676 0.112157 0.0495127 -0.0848273 -0.0210294 0.00251864 0.214889 -0.00952877 -0.0221391 -0.229552 -0.00749487 0.0652248 -0.00465887 0.0662877 0.00135881 0.0583439 -0.00631396 -0.0275926 -0.071628 -0.00436892 -0.0563336 0.0609866 -0.0548351 0.155594 -0.0421856 0.00865387 -0.0266345 -0.0499769 -0.0903637 0.0839552 0.0864723 -0.000375032 -0.0344812 -0.0286943 0.0655885 -0.119494 -0.137307 -0.0255479 -0.0610953 -0.0888146 -0.0309923 0.0274496 -0.00284926 -0.0953537 0.0400354 0.0354831 0.00516345 0.16054 -0.0711005 -0.0203388 -0.124437 0.218526 -0.00878844 -0.0388211 0.064508 0.142933 -0.0708264 0.0401816 -0.0213199 0.0809891 -0.132892 -0.0694475 0.0289151 0.136365 -0.0673452 0.0430481 -0.0365037 0.0709252 -0.0507983 -0.013765 -0.0625619 -0.0320658 
0.136731 -0.02981 -0.180542 -0.0106348 0.114496 0.158589 0.0204571 -0.000473581 -0.0622084 -0.102694 0.0528876 0.103557 0.0965019 -0.168722 -0.157422 -0.0217055 -0.0682304 0.0574996 -0.167721 0.169568 0.150563 -0.0573815 0.0932323 0.10528 -0.0375324 -0.058851 0.00638912 -0.208288 -0.0226168 0.0501689 -0.0350827 0.00638209 -0.097108 0.074232 -0.0711183 -0.0269562 -0.139366 0.0225071 -0.0879384 -0.0140428 0.026714 -0.0575438 -0.0962154 0.212349 -0.160828 -0.0237852 0.100205 0.0619677 -0.0990986 0.120788 0.0393291 -0.0393252 -0.0895437 -0.0240276 0.0126271 -0.0662724 0.0012349 0.114114 0.0470804 -0.088126 -0.0140278 0.0188827 0.215497 0.00609291 -0.0235709 -0.240261 -0.00361733 0.0608948 0.0119779 0.0643741 -0.00271488 0.0533373 0.00126991 -0.033494 -0.07405 -0.00855428 -0.0743659 0.0621356 -0.0495185 0.155933 -0.0292613 0.0111185 -0.0271725 -0.0435872 -0.100361 0.0901544 0.0935166 0.00177468 -0.0437605 -0.0236628 0.0794904 -0.113527 -0.143592 -0.0321586 -0.0665945 -0.0776974 -0.0335451 0.0264796 -0.0135889 -0.0891795 0.0392448 0.0332213 0.0022561 0.142444 -0.0645093 -0.0270085 -0.127429 0.218467 -0.0318221 -0.0268559 0.0804518 0.134385 -0.0655742 0.0321573 -0.0317709 0.0846672 -0.134369 -0.0670741 0.0257719 0.124421 -0.0604462 0.0342446 -0.0328693 0.0654286 -0.0558499 -0.0241271 -0.0741466 -0.0307286 
0.135614 -0.0260696 -0.178326 -0.00703965 0.117885 0.157822 0.0226551 -0.00422854 -0.0551654 -0.104099 0.056072 0.103955 0.0971456 -0.164512 -0.156307 -0.0227547 -0.0660665 0.0581628 -0.172693 0.170143 0.153601 -0.0620637 0.0933471 0.113921 -0.0317793 -0.0681502 0.0040253 -0.205228 -0.0184346 0.0544195 -0.028184 0.00624513 -0.0947451 0.0751516 -0.0733204 -0.0240929 -0.14016 0.0212858 -0.0910419 -0.0150436 0.0289785 -0.0568259 -0.0965466 0.20873 -0.160368 -0.0257922 0.0975046 0.0634769 -0.0961173 0.117581 0.036567 -0.0365181 -0.0872103 -0.0297177 0.0123789 -0.0608123 -0.00376803 0.118477 0.0454917 -0.0863627 -0.0202691 0.0202987 0.214437 0.0014053 -0.0253847 -0.234276 -0.00340794 0.0599671 0.00371538 0.06643 -0.00135359 0.0544047 -0.00283532 -0.0366536 -0.0694256 -0.00491386 -0.0711219 0.0627956 -0.0503383 0.157331 -0.0333127 0.0101768 -0.0262503 -0.0424735 -0.0988464 0.0933489 0.0920881 0.000274567 -0.0478291 -0.0222559 0.0804271 -0.116971 -0.140752 -0.0311607 -0.0653963 -0.0803256 -0.0398735 0.0250681 -0.011514 -0.0888449 0.0410801 0.0306052 0.00255107 0.14331 -0.0666371 -0.0220652 -0.126956 0.216791 -0.0265398 -0.029594 0.0782912 0.134303 -0.0670115 0.0341699 -0.0302822 0.0883445 -0.137041 -0.0626888 0.0273693 0.132826 -0.0595084 0.0335876 -0.0424824 0.0683016 -0.0589689 -0.0182981 -0.0751292 -0.0306982 
0.139423 -0.0287664 -0.186149 -0.00222326 0.118892 0.146075 0.022611 -0.00684185 -0.0646842 -0.100604 0.0517435 0.10292 0.0982177 -0.163031 -0.16385 -0.0140859 -0.0588906 0.0633851 -0.167735 0.177689 0.154104 -0.0712941 0.0990953 0.107303 -0.0334823 -0.0661301 0.00206194 -0.208326 -0.0193416 0.0575474 -0.0416586 0.0160922 -0.0945048 0.0720337 -0.075332 -0.0306742 -0.142409 0.026573 -0.0883218 -0.022529 0.0179781 -0.0558115 -0.0908369 0.204159 -0.15743 -0.0174862 0.101653 0.0604569 -0.0998025 0.120038 0.0400982 -0.037948 -0.0854045 -0.0270521 0.0105619 -0.0693502 0.00840649 0.109704 0.0520877 -0.0841621 -0.0078045 0.0222852 0.210209 0.00516714 -0.024731 -0.236545 -0.0117469 0.0597933 0.00674179 0.0585697 -0.00613883 0.0532927 -0.002058 -0.0335287 -0.0759987 -0.00517672 -0.0630641 0.0631554 -0.0515677 0.152657 -0.0332835 0.00718037 -0.0362488 -0.0462765 -0.0981058 0.0961254 0.0818927 -0.00136253 -0.0440367 -0.0272142 0.0774767 -0.108291 -0.143804 -0.0328971 -0.0609886 -0.0749561 -0.0353519 0.0330481 -0.0105512 -0.0905085 0.0422601 0.0274243 0.00532878 0.148868 -0.0631235 -0.027318 -0.124569 0.224781 -0.0237794 -0.0294395 0.0724124 0.135554 -0.0617105 0.0307275 -0.0325039 0.0859166 -0.134311 -0.0626891 0.0268984 0.128243 -0.0707518 0.0392096 -0.0368378 0.0660531 -0.0612757 -0.0222326 -0.0784289 -0.0369284 
0.141088 -0.0243573 -0.181422 0.00019249 0.118705 0.149302 0.0230244 -0.00478992 -0.0657771 -0.0995215 0.0520952 0.102405 0.0978404 -0.167726 -0.161275 -0.00532637 -0.0560684 0.0589249 -0.173663 0.177765 0.157469 -0.0713791 0.096341 0.105263 -0.0308939 -0.064006 -0.0035867 -0.209031 -0.015573 0.0574633 -0.0362077 0.0270598 -0.0961666 0.0757927 -0.07875 -0.0321812 -0.142689 0.0307866 -0.0827794 -0.0212967 0.0180957 -0.0580305 -0.0887473 0.200202 -0.149179 -0.0196986 0.102306 0.0560716 -0.105332 0.116852 0.0457197 -0.0370065 -0.0891414 -0.0294808 0.00867481 -0.0694455 0.00481955 0.110223 0.0516033 -0.0844412 -0.0112379 0.0183788 0.207287 -0.00134861 -0.0216111 -0.233998 -0.0129142 0.0600024 0.00066084 0.0576463 -0.0051942 0.0546053 -0.00471032 -0.0322952 -0.0759191 -0.00693269 -0.0584629 0.0630309 -0.053727 0.157998 -0.0321586 0.00439192 -0.0328228 -0.0469575 -0.0977895 0.0940365 0.083259 -0.00257902 -0.0444782 -0.0267978 0.0730167 -0.111655 -0.149844 -0.0251519 -0.0598675 -0.0679716 -0.0306649 0.0299395 -0.0163738 -0.0863813 0.0390648 0.0253589 -0.00252256 0.157519 -0.064891 -0.0258368 -0.12509 0.225848 -0.0184406 -0.0370567 0.0665296 0.138717 -0.0679321 0.0333287 -0.023796 0.0825281 -0.140337 -0.0604016 0.0271011 0.131051 -0.0695312 0.0433629 -0.0321527 0.0678039 -0.0517045 -0.0231556 -0.0734755 -0.0418461 
0.143682 -0.00632808 -0.194701 0.00152468 0.10608 0.151187 0.0314225 -0.00394728 -0.046941 -0.0986601 0.0711672 0.108236 0.0948831 -0.169836 -0.16451 -0.0247145 -0.0478117 0.0574767 -0.174023 0.176115 0.141822 -0.0601119 0.0831242 0.113121 -0.0414175 -0.0691828 0.0144766 -0.19689 -0.014762 0.0655853 -0.0491183 0.0213449 -0.0766683 0.0823083 -0.0838891 -0.0334588 -0.12188 0.027713 -0.101616 -0.0127197 0.0264352 -0.0658007 -0.0883708 0.204708 -0.162572 -0.0157055 0.104036 0.0543969 -0.109644 0.122268 0.0447703 -0.0210083 -0.0949232 -0.0229552 0.0157225 -0.05638 -0.0130366 0.101288 0.0452247 -0.080105 -0.0279224 0.00523301 0.216611 -0.0129088 -0.0306343 -0.233805 -0.00300839 0.0479484 -0.00726775 0.0644947 -0.00751625 0.0341979 -0.00728718 -0.0251958 -0.0593621 -0.00571898 -0.0592732 0.0704529 -0.0628911 0.142438 -0.0408284 0.0140315 -0.0342763 -0.0493325 -0.0870686 0.104936 0.0807228 -0.0192521 -0.0423811 -0.00769752 0.073603 -0.130826 -0.15128 -0.0365911 -0.0526777 -0.0802197 -0.0323903 0.016448 -0.00243908 -0.0958854 0.0370142 0.035387 0.0127287 0.151147 -0.078279 -0.0234335 -0.120652 0.225627 -0.0360918 -0.0359597 0.0788915 0.133668 -0.062286 0.0271254 -0.0315704 0.0685079 -0.131202 -0.0792784 0.0440012 0.133043 -0.0551803 0.0362689 -0.034496 0.0842537 -0.041184 -0.0250247 -0.0594527 -0.0395442 
0.132057 -0.00427758 -0.176748 -0.00630665 0.107897 0.155966 0.0241966 -0.00205284 -0.0454122 -0.0941129 0.0743981 0.109022 0.0956832 -0.177275 -0.162624 -0.0194376 -0.0596802 0.0620583 -0.184501 0.173539 0.148316 -0.0504165 0.0733666 0.118092 -0.0428874 -0.0601472 0.0104171 -0.194372 -0.00435192 0.0588383 -0.0375419 0.0158394 -0.0856036 0.0817976 -0.0786802 -0.0279902 -0.126437 0.0224304 -0.0949921 -0.00430933 0.0347227 -0.0656784 -0.0911235 0.211249 -0.156119 -0.0294724 0.106309 0.0584829 -0.111422 0.113712 0.0426949 -0.0257441 -0.10567 -0.0260415 0.0134568 -0.0526704 -0.0221102 0.107454 0.0390489 -0.0841882 -0.03079 0.00308405 0.220089 -0.00238118 -0.0287578 -0.235733 0.000767035 0.0464545 -0.00423274 0.065508 -0.00330758 0.0392968 0.000907624 -0.0256891 -0.0580771 -0.0117323 -0.0696247 0.079556 -0.0592237 0.141907 -0.0295469 0.0230387 -0.0251907 -0.0428159 -0.0933473 0.10255 0.0926327 -0.00871281 -0.0432215 -0.00852522 0.0735926 -0.129784 -0.152748 -0.0290027 -0.0596178 -0.0796653 -0.0389112 0.0125943 -0.0106254 -0.0925254 0.0343124 0.0310474 0.00335582 0.148526 -0.0721484 -0.0165 -0.120997 0.220679 -0.0314096 -0.0367787 0.0771472 0.135306 -0.0708869 0.035636 -0.0297301 0.0677249 -0.140179 -0.0753905 0.0339309 0.12635 -0.0513439 0.0373982 -0.0350507 0.0794975 -0.0461516 -0.0187382 -0.0656423 -0.037531 
0.132043 -0.0085093 -0.178479 -0.0101147 0.113525 0.156044 0.0301109 -0.000703197 -0.0499943 -0.0953332 0.065908 0.112046 0.0991067 -0.177858 -0.160652 -0.0161899 -0.0573025 0.0555745 -0.188725 0.182837 0.145026 -0.0526276 0.0810922 0.104089 -0.0519194 -0.0509671 0.000700747 -0.197504 -0.00461981 0.0505875 -0.0353836 0.0307949 -0.0869286 0.0875525 -0.0789878 -0.0284099 -0.118537 0.0435022 -0.0911627 -0.00938965 0.0384709 -0.0622251 -0.0892231 0.202003 -0.162496 -0.0315272 0.10618 0.0582308 -0.108769 0.118377 0.0349018 -0.0348766 -0.1096 -0.0186387 0.0184425 -0.0588619 -0.0174647 0.109325 0.0327793 -0.0870761 -0.0339903 0.00258241 0.221666 -0.0125966 -0.0164192 -0.231762 -0.00199259 0.0498741 -0.00589889 0.0604917 -0.00499635 0.04241 0.00323839 -0.0104749 -0.0598535 -0.0151403 -0.0647511 0.0753151 -0.0548332 0.132291 -0.0318386 0.0227262 -0.0250315 -0.0415767 -0.0918395 0.0918522 0.0957036 0.00522819 -0.0361789 -0.0110723 0.0817005 -0.131933 -0.149767 -0.0301442 -0.0540803 -0.0772348 -0.0310739 0.018412 -0.0174297 -0.0850483 0.0279831 0.0268912 -0.00520466 0.159071 -0.0719189 -0.0172244 -0.123461 0.220385 -0.0242983 -0.0356504 0.0721965 0.143776 -0.0733479 0.0444124 -0.0261339 0.0612057 -0.135841 -0.0793382 0.0320884 0.127404 -0.0522018 0.0457203 -0.0240101 0.0819625 -0.0454136 -0.0257665 -0.0690117 -0.0445431 
0.131922 -0.0035052 -0.178273 -0.00731374 0.115684 0.153464 0.0266563 -0.00579079 -0.0495037 -0.0924035 0.0726773 0.114244 0.100298 -0.169997 -0.164716 -0.00973851 -0.0539853 0.061583 -0.190246 0.180213 0.15346 -0.0559887 0.0794138 0.108108 -0.0437464 -0.0538785 0.00265797 -0.192544 -0.000989106 0.0612765 -0.038474 0.0315532 -0.0842915 0.0852535 -0.0829841 -0.0293895 -0.124475 0.039699 -0.0860307 -0.00778147 0.0322396 -0.058762 -0.0852438 0.199072 -0.157291 -0.0343433 0.108338 0.0534096 -0.110467 0.11266 0.0419848 -0.0283134 -0.112033 -0.0199856 0.0180373 -0.05479 -0.0178705 0.112214 0.0324662 -0.0857264 -0.0336481 -0.000660995 0.223332 -0.0115012 -0.0202139 -0.227836 -0.00670871 0.0546258 -0.00907803 0.0643509 0.000230121 0.0455804 0.000277366 -0.0187095 -0.0585501 -0.00995708 -0.0613711 0.0742982 -0.0602742 0.132534 -0.0327102 0.0250548 -0.0214129 -0.0399779 -0.0961762 0.0969475 0.0943635 0.0010083 -0.0355794 -0.0125037 0.0727668 -0.135658 -0.151683 -0.0240285 -0.0528017 -0.078575 -0.0367817 0.0199624 -0.0152175 -0.0861135 0.0295404 0.0261598 -0.00366264 0.162657 -0.0728395 -0.0121982 -0.124805 0.220008 -0.0225812 -0.0451767 0.0678865 0.14111 -0.0752041 0.047455 -0.0216634 0.0643508 -0.13972 -0.0734454 0.0330787 0.129918 -0.0531684 0.045441 -0.0280119 0.0785009 -0.0453722 -0.0171194 -0.0660799 -0.0418313 
0.13096 -0.0074463 -0.172761 -0.0160109 0.112033 0.159515 0.0207781 0.000161522 -0.0583005 -0.0912022 0.0692294 0.112092 0.100699 -0.176601 -0.1622 -0.0116909 -0.0555882 0.0607326 -0.192027 0.17963 0.142878 -0.0438258 0.0809978 0.105633 -0.0564933 -0.0453007 0.00657432 -0.190698 -0.00450967 0.044895 -0.0398465 0.0228183 -0.0914411 0.0864428 -0.0815975 -0.0280241 -0.124942 0.0370531 -0.0877922 0.00187001 0.0337323 -0.058529 -0.0932099 0.203277 -0.159156 -0.0354457 0.10555 0.059665 -0.112751 0.12122 0.0439449 -0.0374658 -0.117639 -0.018077 0.00961768 -0.059793 -0.0161568 0.112214 0.0370885 -0.0837265 -0.0316971 0.00708192 0.221573 -0.00705734 -0.0189495 -0.237089 -0.00230843 0.0540501 -0.005443 0.0634198 -0.00219813 0.0427896 0.0111745 -0.0119697 -0.0614402 -0.0155899 -0.0679353 0.0758559 -0.0552503 0.130626 -0.0235015 0.0221332 -0.0205174 -0.0404121 -0.0995138 0.0916631 0.098552 0.00233453 -0.0381007 -0.0113989 0.0750655 -0.130597 -0.149394 -0.0234884 -0.054807 -0.0735728 -0.0329276 0.016859 -0.0239195 -0.0837919 0.0272182 0.0310319 -0.00998247 0.159583 -0.0666426 -0.0174319 -0.12543 0.214999 -0.0286791 -0.0384407 0.0763394 0.144406 -0.0660643 0.0525429 -0.0312345 0.0603493 -0.141568 -0.0714221 0.0243495 0.120009 -0.0562539 0.0403583 -0.0240142 0.0746849 -0.043675 -0.0225895 -0.075863 -0.0452646 
0.129477 0.00128986 -0.177028 -0.0183482 0.114468 0.162992 0.0234585 0.000437621 -0.0577019 -0.0930801 0.0674485 0.111592 0.101423 -0.172821 -0.161046 -0.0132138 -0.0513833 0.0597168 -0.18992 0.17702 0.146008 -0.0447251 0.0793485 0.101725 -0.0516741 -0.0487673 0.00492809 -0.18804 -0.00184801 0.0498968 -0.0363603 0.0246438 -0.0870346 0.0881974 -0.0802405 -0.0285518 -0.116697 0.038981 -0.0861859 -0.0017764 0.0362014 -0.0570047 -0.081482 0.203042 -0.161485 -0.0348755 0.112015 0.0556726 -0.11732 0.119234 0.0421038 -0.0371105 -0.117734 -0.0154803 0.0145449 -0.055856 -0.0185931 0.114554 0.0344001 -0.0909921 -0.0358842 0.00641868 0.224313 -0.016286 -0.0161206 -0.230984 -0.00356871 0.0546646 -0.00879151 0.0646905 0.000798954 0.0435844 0.00631748 -0.0133393 -0.0573577 -0.0114543 -0.0666605 0.0764277 -0.0557968 0.124165 -0.0298401 0.0279071 -0.0168715 -0.0366453 -0.097485 0.0922804 0.0972399 0.00322688 -0.0338664 -0.00891737 0.0749732 -0.13902 -0.150891 -0.0266869 -0.0497351 -0.0754526 -0.0311936 0.0237511 -0.0277496 -0.0828032 0.0227109 0.0319532 -0.00706952 0.164625 -0.0762985 -0.0127506 -0.128722 0.216779 -0.0314258 -0.0423638 0.0756731 0.140235 -0.0719256 0.0548853 -0.0282081 0.0566607 -0.140726 -0.0768584 0.0288168 0.123862 -0.0507421 0.0425562 -0.0215339 0.0756554 -0.0430291 -0.0246683 -0.071801 -0.0450784 
0.135154 0.000981214 -0.180158 -0.019161 0.117591 0.173928 0.026447 -0.00261322 -0.0562644 -0.0937186 0.068257 0.111299 0.0987777 -0.177223 -0.160267 -0.0141974 -0.0504068 0.0623379 -0.189723 0.171647 0.143415 -0.0346567 0.0763345 0.0988854 -0.0552575 -0.0504024 0.00452723 -0.189821 -0.00453543 0.0510077 -0.0351924 0.0237494 -0.0931379 0.0885532 -0.072006 -0.0270304 -0.112262 0.0302788 -0.0812453 -0.00199756 0.0369678 -0.0557473 -0.0837217 0.20285 -0.163478 -0.033929 0.107718 0.0605592 -0.11669 0.120422 0.0442396 -0.0374362 -0.117188 -0.0154703 0.0116223 -0.0565435 -0.019301 0.114605 0.0311404 -0.0862198 -0.0359046 0.00818044 0.227642 -0.0241715 -0.0132483 -0.23725 -0.00217443 0.0560584 -0.00942055 0.0688718 0.00189395 0.0441654 0.00715964 -0.0166768 -0.0656704 -0.011508 -0.0662852 0.0762028 -0.0572611 0.122708 -0.0235549 0.0301891 -0.0169742 -0.0351684 -0.0964568 0.089619 0.0973487 6.47702e-05 -0.0375929 -0.0025109 0.0788092 -0.140504 -0.153599 -0.0243457 -0.050158 -0.0738733 -0.0296122 0.0180351 -0.0306595 -0.0780586 0.0276792 0.0366757 -0.0115264 0.159902 -0.0733696 -0.015693 -0.125039 0.211063 -0.0377616 -0.0313624 0.0801778 0.135756 -0.0669695 0.0570884 -0.0298973 0.0564815 -0.141642 -0.0733884 0.0234979 0.119997 -0.0484392 0.0389858 -0.0164946 0.0757397 -0.0370125 -0.0269719 -0.0722978 -0.0486106 
0.133507 -0.00621292 -0.178071 -0.0148265 0.113151 0.165027 0.0320909 0.00428082 -0.0509208 -0.0968047 0.0664754 0.107515 0.0997815 -0.178202 -0.157258 -0.0226764 -0.0558492 0.0582388 -0.190388 0.175012 0.144345 -0.0501465 0.0839031 0.10064 -0.0520592 -0.058236 -8.66326e-07 -0.195174 -0.00434057 0.0436437 -0.0293861 0.0255035 -0.0888017 0.0898759 -0.0779677 -0.0290902 -0.116451 0.0387525 -0.089794 -0.00744223 0.042428 -0.0620111 -0.0922787 0.202428 -0.16796 -0.0366274 0.100451 0.0614608 -0.10904 0.119801 0.0307264 -0.0349403 -0.110903 -0.0178895 0.00804435 -0.0578881 -0.0135701 0.110223 0.0321532 -0.0870222 -0.0362789 0.00914899 0.222067 -0.0174095 -0.0179265 -0.230068 -0.000213022 0.0506549 -0.00638139 0.066548 -0.00610044 0.0420948 0.00364852 -0.00905785 -0.0604877 -0.0184201 -0.06671 0.0734194 -0.0551327 0.129095 -0.0369558 0.0214025 -0.0214799 -0.0397732 -0.0915043 0.0941583 0.0968882 0.00316176 -0.0383645 -0.0110494 0.0888184 -0.134295 -0.147168 -0.0342254 -0.0509575 -0.0807838 -0.0339798 0.0211856 -0.024217 -0.0805353 0.0279774 0.0298485 -0.00440368 0.159779 -0.0668871 -0.0180806 -0.121865 0.219471 -0.0263355 -0.0346411 0.0737521 0.141817 -0.0694216 0.0470568 -0.0267302 0.0596877 -0.132768 -0.0782177 0.0368435 0.128636 -0.0493549 0.0398184 -0.0285958 0.0834324 -0.0457587 -0.0312344 -0.0723189 -0.041548 
0.131894 -0.00963416 -0.174808 -0.0106844 0.111163 0.158624 0.0252319 -0.00209333 -0.0577257 -0.0934636 0.0687914 0.110716 0.0985982 -0.171577 -0.16003 -0.0199878 -0.0595652 0.0615227 -0.183001 0.174022 0.146165 -0.0526658 0.0793106 0.107955 -0.0424057 -0.0529489 0.00752519 -0.193888 -0.00648611 0.0520578 -0.0375138 0.0186526 -0.0921133 0.0812459 -0.0793419 -0.0293942 -0.131354 0.0312703 -0.0886725 -0.00612096 0.0340583 -0.0614304 -0.0917107 0.210863 -0.160875 -0.032208 0.106179 0.0572848 -0.111351 0.114762 0.0425986 -0.0319087 -0.109516 -0.0235475 0.0119269 -0.057794 -0.0193925 0.116634 0.0390812 -0.0855594 -0.0281769 0.00615035 0.223235 -0.00294583 -0.0212099 -0.231751 -0.00216554 0.0525294 -0.00460827 0.067048 -0.00127678 0.0472832 0.00577241 -0.019235 -0.0625328 -0.0143731 -0.0691921 0.0714571 -0.0544329 0.139677 -0.0313197 0.0191038 -0.0215718 -0.0443919 -0.0982749 0.089983 0.0966375 -0.00128406 -0.038668 -0.0150809 0.0755124 -0.128088 -0.147571 -0.0286452 -0.05799 -0.0795937 -0.0331194 0.0184937 -0.0155434 -0.088396 0.0273838 0.0335227 -0.000883261 0.154529 -0.0714143 -0.0153484 -0.12489 0.221168 -0.0273676 -0.0403895 0.07832 0.140712 -0.071381 0.0435772 -0.0270527 0.0648115 -0.138502 -0.0721926 0.0330366 0.125632 -0.0546913 0.0367592 -0.0321614 0.0741634 -0.0454319 -0.0214003 -0.0695544 -0.0387543 
0.133522 -0.0117871 -0.173466 -0.013432 0.112682 0.159495 0.0220574 0.000273614 -0.0609147 -0.0984664 0.0672524 0.111178 0.0995333 -0.164057 -0.159598 -0.021865 -0.0550256 0.0581465 -0.183644 0.17607 0.14654 -0.0505395 0.0785471 0.111432 -0.0412451 -0.051973 0.00937257 -0.187652 -0.00636435 0.0500689 -0.0373834 0.0160675 -0.0935425 0.0825184 -0.0841438 -0.0260446 -0.133042 0.0305521 -0.0914282 -0.00475078 0.0343376 -0.0559267 -0.0913729 0.209114 -0.158528 -0.033019 0.106775 0.057476 -0.111504 0.116651 0.0415384 -0.0331388 -0.108969 -0.0228312 0.0145402 -0.0578758 -0.0225098 0.122179 0.0413214 -0.0897741 -0.029299 0.012212 0.222418 -0.00283895 -0.0262874 -0.226823 -4.95804e-05 0.0550278 -0.00456019 0.0657521 0.000836647 0.0470358 0.00822468 -0.0185289 -0.0597466 -0.0128458 -0.0676998 0.0687425 -0.0522967 0.139185 -0.0294356 0.0208883 -0.019749 -0.0482427 -0.0976587 0.088886 0.097125 0.00090656 -0.0384123 -0.0147209 0.077562 -0.128319 -0.146188 -0.0265602 -0.0562067 -0.0775726 -0.0316927 0.0185378 -0.01809 -0.0897026 0.0253998 0.0337092 -0.00085545 0.155356 -0.080106 -0.0114095 -0.130505 0.216779 -0.0293054 -0.0443355 0.0838395 0.142942 -0.0727728 0.0474308 -0.0285418 0.0647941 -0.139675 -0.0726738 0.0313288 0.124689 -0.057443 0.036862 -0.031323 0.0717366 -0.0482596 -0.0203829 -0.07128 -0.0409782 
0.133685 -0.00335596 -0.174876 -0.00613303 0.113592 0.154546 0.0267156 -0.00721736 -0.0650877 -0.0849674 0.0751035 0.116679 0.104114 -0.16189 -0.161109 -0.0118521 -0.0454443 0.0677712 -0.184043 0.178516 0.152451 -0.054681 0.0718054 0.116316 -0.0385749 -0.0473122 0.0052552 -0.187731 0.0027517 0.0670039 -0.0452372 0.0339875 -0.0915461 0.0850159 -0.0856837 -0.0307913 -0.13134 0.0337734 -0.0819883 -0.00733026 0.0285968 -0.0583821 -0.0818316 0.204097 -0.154156 -0.0362089 0.114616 0.0519773 -0.117859 0.106953 0.0556856 -0.029905 -0.11458 -0.0234705 0.0186269 -0.0524753 -0.0262377 0.12194 0.0413275 -0.0872076 -0.0287421 0.000936065 0.222908 -0.00925865 -0.0226752 -0.222449 -0.00593153 0.051597 -0.0142797 0.0634104 -0.00157289 0.0481826 0.00296379 -0.0187694 -0.0613787 -0.0134626 -0.0584536 0.0731965 -0.0555394 0.133118 -0.0297468 0.0246374 -0.0197211 -0.049929 -0.097053 0.0867462 0.0957649 -0.0051237 -0.0329667 -0.0120304 0.0672999 -0.132071 -0.150266 -0.0205398 -0.0555236 -0.0743273 -0.0319474 0.0199777 -0.0145979 -0.0887985 0.0270337 0.0347615 -0.00132458 0.166533 -0.0813828 -0.0087596 -0.129163 0.217939 -0.0241967 -0.0510521 0.0739388 0.143797 -0.0780291 0.0473711 -0.0222127 0.0587989 -0.139803 -0.0760715 0.0306507 0.125581 -0.0554364 0.0387435 -0.0276328 0.0729642 -0.0459029 -0.0142622 -0.0679382 -0.0464995 
0.137388 -0.00166046 -0.176368 -0.00397988 0.10971 0.161314 0.0350887 -0.00766779 -0.0582146 -0.0935918 0.0752914 0.112585 0.102095 -0.166304 -0.156157 -0.0222971 -0.0528125 0.0572598 -0.185097 0.176047 0.14657 -0.0548185 0.0767011 0.112288 -0.0412447 -0.057798 0.00115545 -0.190634 -0.00170822 0.063219 -0.0394105 0.0306595 -0.0911203 0.0882251 -0.083542 -0.0294488 -0.12423 0.0360094 -0.0863539 -0.00556708 0.0357568 -0.063593 -0.0880909 0.19892 -0.162896 -0.0334576 0.107611 0.0546933 -0.113605 0.114156 0.0462314 -0.0252407 -0.109382 -0.0196489 0.0173324 -0.0540624 -0.0231046 0.119855 0.0354636 -0.0827402 -0.0363667 0.00574603 0.224458 -0.0189457 -0.0219822 -0.22028 0.000869185 0.0475961 -0.0176868 0.0664115 -0.00352853 0.04639 -0.00079314 -0.00930615 -0.0554959 -0.0140114 -0.0593853 0.0651415 -0.05551 0.139514 -0.0336862 0.0161274 -0.0196544 -0.0485391 -0.0937475 0.0922079 0.0940263 -0.00975796 -0.0404781 -0.0101729 0.0787103 -0.138132 -0.144318 -0.0271372 -0.0579998 -0.0823297 -0.0320651 0.0184332 -0.00941527 -0.0852639 0.0280892 0.0372349 0.000496102 0.164327 -0.0781536 -0.00968742 -0.124183 0.224165 -0.0254578 -0.0447144 0.0746526 0.141507 -0.0757049 0.0434433 -0.0242221 0.0641131 -0.132356 -0.0726065 0.0380924 0.133885 -0.0506968 0.0338219 -0.0314027 0.080145 -0.0440565 -0.017725 -0.0644918 -0.040438 
0.127829 -0.00739282 -0.175965 -0.0122154 0.111458 0.153617 0.0168506 -0.00861633 -0.0656501 -0.0864322 0.0732117 0.11806 0.102653 -0.15669 -0.16323 -0.0111318 -0.0522956 0.0628358 -0.1819 0.181009 0.147656 -0.0552029 0.0855375 0.107354 -0.0439835 -0.0377075 0.0119074 -0.188209 -0.0024101 0.0552225 -0.0451332 0.0269186 -0.0872325 0.0825288 -0.0877461 -0.0241734 -0.132643 0.0486624 -0.0838246 -0.00242807 0.025876 -0.0531157 -0.0906106 0.20199 -0.16139 -0.0353087 0.115211 0.05068 -0.114643 0.114105 0.0478223 -0.0292163 -0.117791 -0.0159376 0.0215787 -0.0552887 -0.0150932 0.123451 0.0386106 -0.0900082 -0.0309091 0.00219446 0.231215 -0.0072383 -0.015098 -0.224147 -0.00646444 0.0626368 -0.00596279 0.0745904 0.00211082 0.0525801 0.00669448 -0.0110295 -0.0561211 -0.0155204 -0.0643271 0.0720574 -0.0561865 0.125737 -0.0340973 0.0262662 -0.0187826 -0.049427 -0.104684 0.0830104 0.0979966 0.00583689 -0.0285821 -0.0179268 0.0702487 -0.132401 -0.141768 -0.0236421 -0.0492979 -0.0795301 -0.0319416 0.0272477 -0.0130165 -0.0889723 0.0216746 0.0321099 -0.00507315 0.163433 -0.0760159 -0.00743636 -0.131878 0.212195 -0.0220215 -0.0536685 0.0727885 0.152386 -0.0708255 0.0537439 -0.0206764 0.0601501 -0.136598 -0.0791567 0.0330018 0.124804 -0.0550453 0.0410047 -0.0237457 0.0698148 -0.049294 -0.0125091 -0.0677602 -0.0386204 
0.133541 0.000676679 -0.176721 -0.0062945 0.112199 0.152045 0.0245514 -0.00502352 -0.0612275 -0.0840818 0.0730172 0.112988 0.102672 -0.173299 -0.160804 -0.00451949 -0.0450895 0.0650489 -0.189755 0.183684 0.146768 -0.0521985 0.0797936 0.106898 -0.0502953 -0.0471552 -0.000988443 -0.194262 -0.00041074 0.0580744 -0.0447108 0.039425 -0.0861802 0.085713 -0.0841775 -0.0309699 -0.122981 0.044458 -0.0845781 -0.00275945 0.0270799 -0.058059 -0.0861917 0.197375 -0.15606 -0.0293002 0.113845 0.0514902 -0.119162 0.11534 0.0525968 -0.0304207 -0.1183 -0.0186308 0.0132829 -0.0594519 -0.0141925 0.10808 0.0406544 -0.0823811 -0.0310837 0.000564618 0.217318 -0.0144382 -0.0165652 -0.233329 -0.00576068 0.0533017 -0.012078 0.0614003 -4.18441e-05 0.0445818 0.0047388 -0.0105641 -0.0603212 -0.0145431 -0.0620825 0.0771777 -0.0588046 0.129456 -0.0292495 0.0239126 -0.0257568 -0.0447686 -0.0961457 0.0945389 0.0916866 -0.00539361 -0.036373 -0.0133154 0.0658783 -0.131897 -0.153059 -0.0238557 -0.0518 -0.0726763 -0.0290904 0.0211714 -0.0209283 -0.0852295 0.0249071 0.0303661 -0.00467291 0.168698 -0.0731953 -0.0158944 -0.124846 0.22135 -0.0205699 -0.0454875 0.066683 0.144228 -0.0714153 0.0468585 -0.0249802 0.0567756 -0.141739 -0.0787389 0.0285694 0.124627 -0.0568205 0.0462426 -0.0218862 0.0790231 -0.039709 -0.0218852 -0.0686034 -0.0482978 
