0.0939164 -0.0714363 -0.0753888 -0.0272011 0.0496954 0.181352 0.0124952 0.00206247 -0.105056 -0.0557694 -0.044687 0.110649 0.0592751 -0.150525 -0.0931626 -0.0324964 -0.119487 0.0755241 -0.0542484 0.113808 0.151899 -0.00977272 0.0857948 0.161009 -0.0868669 0.0222227 0.0163572 -0.288451 -0.0760288 0.102397 -0.106124 -0.0216331 -0.0553395 0.087424 0.0550784 -0.0313229 -0.0537275 0.0734105 -0.103048 -0.0903361 -0.0423943 -0.0744745 -0.050014 0.142561 -0.117933 0.0177002 0.165603 0.0147384 -0.182785 0.128359 0.0903788 -0.144695 0.0375524 0.0299886 0.165166 0.00774532 0.0485003 0.117579 0.00934241 -0.151604 0.0535431 0.0341843 0.189016 -0.0529666 0.115041 -0.17506 -0.0555426 0.0246336 -0.0506276 0.0805059 -0.0766643 -0.00321534 -0.060587 -0.0690098 -0.0797192 0.0209794 -0.0363232 0.0311005 0.0787153 0.0833526 -0.0121774 0.0140823 -0.0739396 -0.0932401 -0.07981 -0.057682 0.0615974 0.0153332 0.0219325 0.119121 0.0765264 -0.102692 -0.0813496 0.0117401 -0.102068 0.0579345 0.011162 0.0716297 0.0716793 -0.0145084 0.133078 0.068947 -0.0742221 0.0270515 -0.0622452 -0.0666676 -0.127009 0.0262643 -0.13441 -0.00629141 0.0852076 0.137707 -0.0110222 -0.0972397 0.035893 0.134347 -0.0947667 -0.113247 -0.0384123 0.0987169 0.0110292 -0.0213015 0.0545028 -0.0289762 -0.0088547 0.0758645 0.016562 -0.0976199 
0.0871811 -0.0741637 -0.0734528 -0.0140595 0.0499334 0.159014 0.0218004 -0.000799295 -0.108015 -0.0496845 -0.0345838 0.123722 0.0673112 -0.151278 -0.118188 -0.0192928 -0.118345 0.0812878 -0.0718522 0.137436 0.162913 -0.04618 0.0872903 0.160803 -0.0870573 0.0258226 0.00844028 -0.281564 -0.0659422 0.103578 -0.12594 -0.00212035 -0.0498822 0.0962244 0.0311168 -0.0426354 -0.0635444 0.0998233 -0.103756 -0.0974917 -0.0446247 -0.0791716 -0.0414172 0.123758 -0.114135 0.000499585 0.168868 0.000771468 -0.185097 0.125637 0.088038 -0.14969 0.0192477 0.0383937 0.169989 0.00504111 0.0475532 0.114632 -0.00208521 -0.145726 0.062762 0.0270517 0.19139 -0.0476852 0.122914 -0.157875 -0.0695146 0.0203042 -0.0617053 0.0731309 -0.0851743 -0.002925 -0.059998 -0.0460065 -0.0706376 0.0235125 -0.0102484 0.0361158 0.0734339 0.0652492 -0.030211 0.00674913 -0.0725246 -0.0954374 -0.0896534 -0.0476624 0.0632917 0.0292159 0.0334439 0.107387 0.0734968 -0.111984 -0.0756324 0.018519 -0.0976011 0.0570516 0.00298355 0.071329 0.079658 -0.00907872 0.125938 0.0527873 -0.081548 0.052694 -0.0420515 -0.0573985 -0.120898 0.047708 -0.123533 -0.0342103 0.0582698 0.152968 -0.00933043 -0.0834977 0.0446109 0.127854 -0.0935386 -0.100531 -0.031392 0.10783 -0.00993674 -0.00735004 0.0473714 -0.0284687 -0.0101448 0.0886897 0.0078651 -0.107932 
0.0775745 -0.0796303 -0.0778262 -0.0191046 0.0455219 0.155188 0.00819357 0.00247941 -0.0991889 -0.0583847 -0.050739 0.129466 0.0498496 -0.1558 -0.120482 -0.0224936 -0.130656 0.0600989 -0.0549673 0.130454 0.146993 -0.0317084 0.0926755 0.151632 -0.0895485 0.0370877 0.033139 -0.279506 -0.0795828 0.0962764 -0.127146 -0.0239856 -0.0390363 0.0897382 0.0342918 -0.0420851 -0.0568162 0.0944379 -0.115006 -0.0903255 -0.0436463 -0.0781134 -0.0382662 0.133084 -0.115065 0.0120549 0.170648 -0.00379414 -0.172543 0.136753 0.0913002 -0.146772 0.0287089 0.0392812 0.183577 0.0018737 0.0501836 0.10884 -7.5447e-05 -0.146585 0.0619717 0.0195066 0.189775 -0.0378207 0.126836 -0.174386 -0.0728202 0.0218576 -0.0490999 0.079447 -0.0863225 -0.00759317 -0.0573484 -0.0510264 -0.0653239 0.0302962 -0.0188232 0.0378589 0.0713142 0.0704288 -0.0239506 0.00776337 -0.0662081 -0.0876353 -0.0868874 -0.062932 0.061708 0.0377542 0.0352017 0.110994 0.061656 -0.106214 -0.079735 0.0166918 -0.0942336 0.0613723 0.0136305 0.0667779 0.0855767 -0.0153171 0.121828 0.0544682 -0.0796693 0.0330746 -0.0496127 -0.0686145 -0.125731 0.0359582 -0.1404 -0.023766 0.0739198 0.1499 -0.000443626 -0.0884939 0.0362886 0.12808 -0.0878211 -0.103705 -0.0321831 0.102121 -0.00271823 -0.00225646 0.0545466 -0.0410356 -0.00372657 0.0872353 0.0176766 -0.101191 
0.0948264 -0.110462 -0.0709742 0.00213845 0.0555112 0.150965 0.0210035 -0.00964593 -0.0781568 -0.10751 -0.0699456 0.131093 0.0388053 -0.135291 -0.119183 -0.0327288 -0.137486 0.0595676 -0.0676164 0.119435 0.153641 -0.00938556 0.0974823 0.163074 -0.0899794 -0.00069248 0.0111506 -0.279143 -0.11174 0.114494 -0.119543 -0.0187834 -0.0548156 0.0883425 0.0427742 -0.0349397 -0.0635568 0.0697162 -0.13005 -0.0831592 -0.0501412 -0.0437349 -0.042544 0.125247 -0.106176 0.0120097 0.150471 -0.00338922 -0.130448 0.161066 0.088245 -0.160603 0.0538619 0.042046 0.184962 -0.00682939 0.0573542 0.115736 0.00612336 -0.128456 0.0693863 0.0503107 0.165997 -0.0363339 0.100513 -0.189036 -0.052181 0.0098923 -0.0457749 0.0789362 -0.0715601 -0.000975442 -0.0386799 -0.0487044 -0.0949686 0.0376691 -0.0192265 -0.00658126 0.0614515 0.088368 0.0123243 0.00831232 -0.0864717 -0.099502 -0.0772966 -0.0529029 0.0479876 0.0175692 -0.00186384 0.109657 0.0792488 -0.0995266 -0.0763229 0.00291812 -0.0962937 0.0774537 0.000416031 0.0573077 0.0934 0.00744308 0.130175 0.0523624 -0.0687726 0.0227426 -0.0553537 -0.0848748 -0.133192 0.0242107 -0.151299 0.00946196 0.085598 0.134399 -0.00169961 -0.0952959 0.0151201 0.156741 -0.059806 -0.0810224 -0.046168 0.097983 -0.0101065 0.00926017 0.0488348 -0.0445952 -0.0153675 0.0756122 0.0098609 -0.102654 
0.0941106 -0.105261 -0.0695331 0.00269343 0.056015 0.150044 0.0236034 -0.0237932 -0.0885437 -0.0980706 -0.0674454 0.14116 0.0433527 -0.107978 -0.129291 -0.0463507 -0.121933 0.0668107 -0.0519222 0.12207 0.150963 -0.0170388 0.0936338 0.180905 -0.0850334 0.00722247 0.0164397 -0.26036 -0.0990815 0.125724 -0.130163 -0.0294437 -0.0569554 0.0744135 0.0389979 -0.0392736 -0.0762797 0.0779317 -0.129957 -0.0848632 -0.0608013 -0.0278582 -0.0445528 0.122567 -0.113764 0.00637318 0.152313 -0.00702478 -0.126654 0.152992 0.096921 -0.14027 0.0565451 0.0398082 0.195192 -0.0025933 0.05636 0.140131 0.00973052 -0.138324 0.0685512 0.0547945 0.181042 -0.0389246 0.0978303 -0.17552 -0.0475051 0.00992836 -0.0581361 0.0881671 -0.0598557 0.00671774 -0.0356632 -0.0425844 -0.0937503 0.0443006 -0.0149108 -0.013521 0.0747349 0.0808034 0.0046429 0.0154531 -0.0731188 -0.102778 -0.0677542 -0.0763895 0.0480179 0.0242107 0.0136374 0.105303 0.0699609 -0.0981006 -0.0556273 0.0108476 -0.0871338 0.0534326 0.0106296 0.0660687 0.100148 -0.000671634 0.133074 0.0717451 -0.0629465 0.0284799 -0.0742607 -0.0697305 -0.128291 0.0108172 -0.141057 0.000770437 0.0994803 0.138195 0.00367648 -0.0844084 0.0161216 0.157954 -0.0619454 -0.0806989 -0.0473163 0.0982246 -0.0218132 -0.00539776 0.0393164 -0.0668986 -0.0278239 0.100051 0.0103401 -0.100303 
0.0902385 -0.100352 -0.0465175 -0.00539497 0.033241 0.154727 0.0169255 -0.0240706 -0.107336 -0.0946825 -0.0706656 0.133115 0.049399 -0.0914888 -0.12059 -0.0519671 -0.123738 0.0584273 -0.0395662 0.114247 0.144283 -0.00944478 0.0949697 0.181267 -0.0942209 0.0164709 0.0167945 -0.245914 -0.0961039 0.124238 -0.136382 -0.0392725 -0.0591732 0.0738142 0.0404415 -0.0377646 -0.0761106 0.084212 -0.1241 -0.0731035 -0.0799323 -0.0319465 -0.045969 0.109946 -0.104446 0.00317088 0.151963 -0.00603201 -0.134027 0.163741 0.108242 -0.131839 0.0600033 0.0515123 0.195769 -0.00351247 0.064417 0.142696 0.0141266 -0.142948 0.0709563 0.0667745 0.175449 -0.0405099 0.0975956 -0.163189 -0.0382201 0.00236604 -0.0719413 0.0920218 -0.0640752 -0.000428079 -0.0354267 -0.0268973 -0.0882337 0.0362792 -0.0106853 -0.0289514 0.0934378 0.0882262 0.015813 -0.00297868 -0.0655425 -0.108095 -0.0652261 -0.0934144 0.0410839 0.0175791 0.0235352 0.114886 0.0668753 -0.0961946 -0.0366254 0.0255339 -0.0918711 0.0552398 0.0162965 0.0763311 0.101155 0.00731841 0.137593 0.0918294 -0.073928 0.028971 -0.0700833 -0.0662243 -0.124873 -0.00082948 -0.136878 -0.00615931 0.101259 0.142002 0.00771912 -0.0822315 0.014457 0.162971 -0.0473466 -0.0710731 -0.0493759 0.0962734 -0.0229251 -0.0267889 0.0443118 -0.082998 -0.0261633 0.106824 0.0206628 -0.0965588 
0.0935788 -0.10208 -0.0563337 -0.00473348 0.0325517 0.1661 0.0112014 -0.0343741 -0.100569 -0.100093 -0.0539934 0.136296 0.0467908 -0.0935874 -0.127659 -0.0541621 -0.124455 0.0637638 -0.0402162 0.11049 0.148567 -0.0118267 0.0950867 0.181853 -0.0904556 0.0290322 0.0213187 -0.256828 -0.0953117 0.11707 -0.122222 -0.038499 -0.0664908 0.0735956 0.0417564 -0.0317833 -0.0795506 0.0925318 -0.107342 -0.0692277 -0.0762706 -0.0272608 -0.0657992 0.112863 -0.107137 -0.0121732 0.15132 -0.00595138 -0.130392 0.155164 0.0961263 -0.122436 0.0587931 0.0521752 0.186444 -0.00343743 0.0694349 0.156125 0.00437893 -0.149681 0.0652706 0.0612514 0.201756 -0.0464426 0.0941003 -0.159912 -0.0280811 0.0135061 -0.0602246 0.104628 -0.0623177 0.00717357 -0.0363571 -0.0212931 -0.0894419 0.0186451 -0.0219192 -0.0289886 0.0828192 0.0905433 0.00261847 0.0158353 -0.0629882 -0.117685 -0.0713912 -0.0955342 0.0497736 0.0223386 0.0234669 0.096766 0.0764278 -0.0986773 -0.0280127 0.0231295 -0.0817503 0.0393336 0.0144033 0.0742434 0.0980719 0.00454705 0.129139 0.0869967 -0.0806111 0.0345745 -0.0618736 -0.0592692 -0.119124 -0.00593012 -0.137044 -0.0067861 0.101119 0.147714 0.00732715 -0.0765299 0.0237974 0.161994 -0.056915 -0.0841753 -0.0419632 0.0906772 -0.0195766 -0.0243152 0.0451522 -0.0789524 -0.0308819 0.107627 0.0190503 -0.0845034 
0.0809806 -0.109741 -0.0673552 -0.00693024 0.0589411 0.12926 0.0162014 0.00204665 -0.0755823 -0.0641322 -0.0720311 0.140114 0.0294403 -0.135926 -0.124277 -0.0505139 -0.122509 0.0800728 -0.0364621 0.125503 0.143367 -0.0133837 0.106026 0.179904 -0.0866928 0.0297272 0.0367125 -0.271821 -0.0760155 0.0986393 -0.120338 -0.0515163 -0.0459792 0.06278 0.0542081 -0.0610993 -0.0748913 0.107381 -0.131666 -0.0979556 -0.0624797 -0.0234008 -0.0727311 0.152715 -0.132533 -0.0162353 0.140775 0.00469288 -0.103113 0.150563 0.0959081 -0.123256 0.0476516 0.0260832 0.19018 -0.0119037 0.0694171 0.121435 0.0111701 -0.163472 0.0691219 0.0103647 0.186178 -0.00652923 0.0977388 -0.20479 -0.0475488 0.00965043 -0.0292142 0.0907402 -0.0700779 0.0150344 -0.0331805 -0.0340638 -0.115922 0.00977282 -0.0358178 0.0215368 0.0879371 0.0794428 -0.0121292 0.0365229 -0.0671492 -0.102111 -0.0280335 -0.126623 0.0557167 0.0677719 0.0594884 0.0844367 0.0630626 -0.0657456 -0.0617649 -0.00254646 -0.0722715 0.0257997 0.0223536 0.0667574 0.0821986 -0.0242182 0.133099 0.0669307 -0.0569359 0.0096466 -0.070399 -0.0931752 -0.111241 -0.0143073 -0.091037 0.0146306 0.108881 0.165043 0.000634306 -0.0753724 0.0275136 0.140712 -0.0560028 -0.117877 -0.0525317 0.0761655 -0.0235149 0.0221486 0.0379236 -0.063743 -0.0342351 0.078959 0.0182187 -0.088058 
0.0554541 -0.0804845 -0.0606523 -0.0300698 0.0261136 0.127306 -0.0427201 -0.0278415 -0.089967 -0.020845 -0.0466303 0.144023 0.0415627 -0.0810007 -0.104854 -0.0383596 -0.104478 0.0729098 0.000722695 0.122315 0.108961 0.00642732 0.126576 0.202555 -0.0913059 0.0844739 0.0859562 -0.25071 -0.0672655 0.0960442 -0.113891 -0.0705068 -0.0159052 0.0473786 0.0312122 -0.0253729 -0.072656 0.141553 -0.111063 -0.0369352 -0.101833 -0.0138304 -0.0956156 0.138292 -0.130933 -0.0149952 0.162457 0.000552795 -0.0962013 0.151714 0.134529 -0.080633 0.0316468 0.0390981 0.195505 0.00259345 0.0954182 0.138873 0.0358948 -0.166155 0.0366426 -0.00554626 0.196277 -0.017766 0.0923081 -0.206148 -0.0283279 0.0370886 -0.028677 0.129836 -0.0526869 0.0269258 -0.0411527 -0.0189207 -0.067046 -0.00272103 -0.0614148 0.0393108 0.0889802 0.0748593 -0.010053 0.0525292 -0.0379511 -0.093553 -0.0454024 -0.148582 0.0575388 0.0591055 0.0791433 0.0658381 0.00573594 -0.0624671 -0.0131948 0.015984 -0.0539723 0.00360134 0.0247029 0.0913649 0.0936513 -0.0472869 0.112157 0.0870097 -0.0672767 0.026037 -0.0772305 -0.0784077 -0.12795 -0.0644277 -0.0750411 -0.0115341 0.0988505 0.189274 0.0253975 -0.0548829 0.0154478 0.139074 -0.054119 -0.143838 -0.0636729 0.0783379 0.00314322 -0.00535697 0.040456 -0.0919929 -0.0604097 0.108022 0.0202734 -0.0433505 
0.0707134 -0.0912317 -0.0631938 -0.0153659 0.0298738 0.129352 -0.0347122 -0.0400574 -0.08707 -0.0702949 -0.0614848 0.149133 0.0301088 -0.0684684 -0.117566 -0.0465528 -0.102313 0.0574198 -0.0226981 0.119222 0.0980671 0.0227078 0.120022 0.202654 -0.0928487 0.0596505 0.0800588 -0.230802 -0.0974233 0.0989975 -0.121457 -0.0614521 -0.0309379 0.0559787 0.0185874 -0.0204609 -0.0845939 0.116347 -0.138918 -0.0250789 -0.0960889 0.00412855 -0.0854449 0.133395 -0.118383 0.00809354 0.155897 -0.00180356 -0.0947497 0.171062 0.138223 -0.0918368 0.0443687 0.0375977 0.200331 -0.00634421 0.0796315 0.153151 0.0509474 -0.154313 0.0440617 0.0337719 0.181119 -0.0151264 0.0743054 -0.207651 -0.0170782 0.0353378 -0.0377415 0.135024 -0.0390799 0.0175872 -0.0166095 -0.0133942 -0.0719037 0.0149227 -0.0564338 0.00268958 0.0718816 0.0818479 0.0187932 0.0471609 -0.051819 -0.113923 -0.0548969 -0.133838 0.0475996 0.0323714 0.0383504 0.0807421 0.0158881 -0.07204 -0.0176776 0.007892 -0.055829 0.0337458 0.0296313 0.0690741 0.100401 -0.0365176 0.106534 0.0944028 -0.0576586 0.0274311 -0.099081 -0.0841289 -0.148048 -0.0529051 -0.111589 -0.00504892 0.128515 0.182882 0.027218 -0.0554552 -0.00700969 0.144372 -0.0570357 -0.121466 -0.0590529 0.0769509 -0.00492881 0.0014671 0.0417084 -0.0964815 -0.0432532 0.0992093 0.0120305 -0.0679257 
0.0744762 -0.095389 -0.0419072 -0.00911489 0.0289841 0.144527 -0.024028 -0.0527792 -0.097695 -0.0938072 -0.0705415 0.145501 0.0179493 -0.0664889 -0.109143 -0.0602459 -0.11891 0.0411962 -0.00453065 0.107688 0.109899 0.0197442 0.114987 0.187424 -0.0801461 0.0667925 0.058787 -0.238125 -0.0944046 0.0972725 -0.109127 -0.0603723 -0.0485754 0.0581538 0.0359947 -0.0176759 -0.0794389 0.117433 -0.115536 -0.0391941 -0.0822853 0.000480013 -0.0811929 0.12011 -0.117907 0.0112821 0.1584 -0.0117398 -0.101693 0.160095 0.119561 -0.0813947 0.0576392 0.0492694 0.2127 -0.00933786 0.0856278 0.164342 0.0285166 -0.155845 0.0531575 0.0449098 0.191854 -0.026311 0.0937414 -0.185213 -0.00748771 0.0255423 -0.0365063 0.149803 -0.0451514 0.0274743 -0.0243078 0.00345257 -0.0711442 0.00516753 -0.0551639 -0.0129536 0.0804015 0.0936496 0.00880883 0.0469695 -0.0420873 -0.116404 -0.0492461 -0.152615 0.0541717 0.0410176 0.029929 0.0810131 0.0465996 -0.0705098 -0.00570899 0.00859055 -0.0639466 0.0185572 0.0435706 0.0795839 0.10884 -0.0244652 0.0996274 0.103266 -0.065527 0.0236238 -0.0933782 -0.0726511 -0.130936 -0.0404868 -0.106222 -0.00633202 0.127522 0.171981 0.0089718 -0.0636444 0.0179931 0.149263 -0.0475528 -0.1229 -0.0511248 0.0816786 0.00258591 0.000786427 0.044145 -0.103538 -0.040453 0.10627 0.0359978 -0.0577579 
0.0794811 -0.103306 -0.06633 -0.00816565 0.0371011 0.128527 -0.00852567 -0.03884 -0.103583 -0.0823839 -0.0873125 0.142268 0.0336943 -0.0700594 -0.112906 -0.0397321 -0.104823 0.0374094 -0.013972 0.118068 0.113307 -0.0022543 0.116463 0.171583 -0.0862933 0.05482 0.0470032 -0.249542 -0.105079 0.111912 -0.129243 -0.0238979 -0.0361031 0.0643567 0.0272666 -0.0278157 -0.0656184 0.124863 -0.125748 -0.0636139 -0.085391 -0.012928 -0.0518851 0.108773 -0.10881 0.0334922 0.160724 -0.0145629 -0.11405 0.154479 0.123151 -0.113838 0.0675683 0.0505465 0.218911 -0.0103177 0.0851078 0.14624 0.0295363 -0.153927 0.0660524 0.044397 0.168411 -0.0345559 0.106635 -0.172876 -0.0390331 0.0355019 -0.0448069 0.107387 -0.0589817 0.0115592 -0.0367219 -0.019638 -0.0732757 0.0355407 -0.0263626 -0.0133488 0.0817424 0.0802015 0.00800262 0.0227837 -0.0643225 -0.114631 -0.059496 -0.12868 0.045441 0.0368674 0.0318365 0.0911387 0.0358882 -0.0802768 -0.0260327 0.014418 -0.0721101 0.0569999 0.0429026 0.0779282 0.11274 -0.013761 0.114624 0.0843937 -0.0678952 0.0375536 -0.0952528 -0.0865929 -0.149257 -0.0217462 -0.123385 -0.0143509 0.108213 0.166578 0.00717086 -0.0775227 0.0169636 0.149519 -0.0582931 -0.110839 -0.0538856 0.0914316 -0.00760917 0.00667423 0.0578496 -0.0880978 -0.027888 0.0983209 0.0187121 -0.0892036 
0.0792832 -0.0923062 -0.0706129 -0.0134786 0.0402519 0.144047 -0.00525268 -0.0423607 -0.0985186 -0.0844175 -0.0813601 0.138416 0.0366894 -0.0906247 -0.120633 -0.0360352 -0.123245 0.0472036 -0.0289692 0.112857 0.122717 0.000423574 0.115197 0.1652 -0.0934915 0.0440267 0.0400641 -0.256445 -0.0977243 0.115657 -0.127149 -0.0245557 -0.0444052 0.0659131 0.0379726 -0.0289844 -0.0649892 0.108596 -0.118485 -0.0619406 -0.0817288 -0.0259096 -0.0507983 0.113715 -0.11077 0.0274414 0.163017 -0.00391156 -0.124311 0.158032 0.1155 -0.116027 0.0616416 0.0500242 0.205178 -0.0106534 0.0861873 0.141502 0.0188005 -0.150224 0.0636419 0.0496442 0.182452 -0.0346651 0.106802 -0.179974 -0.0430552 0.0293229 -0.0483314 0.109128 -0.0642172 0.00890204 -0.0376389 -0.0206965 -0.0768936 0.0326728 -0.0302197 -0.0141168 0.0757657 0.0801443 0.0160434 0.0212968 -0.0677274 -0.104399 -0.0684474 -0.109977 0.0425882 0.0314505 0.0244102 0.0994708 0.0480225 -0.0870577 -0.036102 0.0135058 -0.0758068 0.0561464 0.0280197 0.0825356 0.108631 -0.00630063 0.123291 0.0805859 -0.0730189 0.0347019 -0.0791647 -0.0844051 -0.143256 -0.00691819 -0.128146 -0.00470018 0.104656 0.159008 0.00935764 -0.0772393 0.013866 0.155757 -0.0599199 -0.0956916 -0.0481487 0.0943839 -0.00252724 -0.00143904 0.0596812 -0.0853902 -0.0302877 0.096119 0.0131298 -0.0882522 
0.0746021 -0.0933078 -0.0614967 -0.0148159 0.044365 0.144555 -0.0107291 -0.039477 -0.0907447 -0.0899627 -0.0715115 0.138855 0.0426103 -0.084702 -0.121368 -0.0245453 -0.124646 0.0512605 -0.0466323 0.121483 0.137296 -0.0132674 0.1202 0.170544 -0.0922025 0.0407705 0.0339135 -0.254435 -0.0949236 0.109182 -0.121729 -0.0199857 -0.038229 0.0756996 0.0281645 -0.0181297 -0.066044 0.120958 -0.118168 -0.0628739 -0.0805737 -0.0259521 -0.0479974 0.0994087 -0.104613 0.0142422 0.165233 -0.00767541 -0.132761 0.160753 0.100592 -0.128161 0.0519058 0.0555134 0.207332 -0.00451036 0.0808041 0.14723 0.00517495 -0.151577 0.0579221 0.052203 0.188906 -0.0447575 0.111874 -0.160842 -0.0514705 0.0376941 -0.0578037 0.115776 -0.0627365 0.00994588 -0.0436221 -0.0176176 -0.0673575 0.0314208 -0.0202876 -0.0120378 0.0756999 0.0650026 0.00677192 0.0249192 -0.069197 -0.109571 -0.0827455 -0.0951411 0.0438849 0.0390301 0.0286891 0.103059 0.0586034 -0.101999 -0.03436 0.0180889 -0.0661162 0.0642374 0.0115766 0.0856514 0.104262 0.000578775 0.11786 0.0609943 -0.0863619 0.0391976 -0.0682796 -0.0660641 -0.146616 -0.0132033 -0.124573 -0.0257389 0.0852701 0.168371 0.0117477 -0.0694943 0.0292474 0.155367 -0.0609386 -0.0921643 -0.042672 0.105636 -0.00164103 0.00372928 0.0598506 -0.0740761 -0.0349316 0.103136 0.0156402 -0.0898292 
0.0979754 -0.100595 -0.0663183 -0.00700917 0.0491785 0.171396 0.0248923 -0.0261399 -0.0924818 -0.0882599 -0.0688617 0.133823 0.0448816 -0.114191 -0.0885224 -0.0366721 -0.120772 0.0563688 -0.0342185 0.0997114 0.136728 0.0115109 0.0919417 0.171039 -0.0888747 0.0132855 0.0206632 -0.274997 -0.103503 0.132334 -0.120581 -0.0102689 -0.0421082 0.0874565 0.0556348 -0.0282932 -0.034519 0.0640036 -0.1052 -0.0806274 -0.0447071 -0.0552686 -0.0227189 0.104618 -0.119447 0.0221774 0.157582 -0.0047087 -0.13846 0.148448 0.109234 -0.148894 0.0722833 0.0557979 0.205318 0.00786103 0.0696002 0.125562 -0.00553381 -0.1266 0.0529063 0.0484395 0.167253 -0.0683624 0.113145 -0.160289 -0.0557595 0.0105132 -0.0644702 0.0879116 -0.0784386 -0.00319712 -0.0681253 -0.0460605 -0.0718443 0.046722 -0.0149387 -0.0111241 0.0798279 0.0814841 0.0139128 0.0114966 -0.0644056 -0.0913555 -0.0682028 -0.0656828 0.0481041 0.00908778 -0.00478039 0.130167 0.0729649 -0.108263 -0.0631506 0.0193524 -0.102273 0.0729692 0.00765859 0.0720406 0.10679 0.00778521 0.13867 0.0722987 -0.0692856 0.0278295 -0.0629155 -0.0793375 -0.133928 0.00565301 -0.157366 0.00458774 0.0841693 0.123176 0.00589177 -0.105277 0.0224834 0.1558 -0.0524199 -0.087629 -0.050005 0.11487 0.0259467 -0.023826 0.0589915 -0.0561095 -0.0176086 0.090848 0.0248287 -0.0884806 
0.106616 -0.0967121 -0.0931395 -0.0102054 0.0520848 0.16603 0.02273 -0.0252964 -0.109617 -0.0810023 -0.0460778 0.130383 0.0518708 -0.117416 -0.115005 -0.0270025 -0.113376 0.0760819 -0.0356133 0.112779 0.146595 -0.00294851 0.0991981 0.175279 -0.0881497 0.0263762 0.0336781 -0.278297 -0.0804867 0.121736 -0.135041 -0.0173469 -0.0565369 0.077986 0.0439975 -0.0413682 -0.0538449 0.0754163 -0.0928862 -0.0756925 -0.0558809 -0.0423663 -0.0342941 0.128164 -0.130922 0.00728725 0.169998 -0.00222713 -0.145826 0.146731 0.0988097 -0.141676 0.0502133 0.0570372 0.184676 -0.00429511 0.0852975 0.138038 0.00367847 -0.138843 0.0575571 0.043489 0.20177 -0.051091 0.0940714 -0.163876 -0.0513909 0.00973851 -0.0423047 0.0825782 -0.079933 0.0106682 -0.055552 -0.0288803 -0.0735137 0.0178427 -0.0231739 0.00334188 0.0691096 0.0743595 0.0111563 0.0280613 -0.0688123 -0.1072 -0.0742116 -0.0483004 0.0458538 0.0131989 0.00798035 0.0984652 0.0855966 -0.0975628 -0.0760302 0.00278767 -0.0800611 0.0497006 0.00470616 0.0928971 0.0973694 -0.007596 0.121958 0.0621939 -0.0515977 0.046601 -0.0652488 -0.0712395 -0.124952 0.0287479 -0.138915 -0.0063265 0.0925793 0.142619 0.0148393 -0.0933873 0.019015 0.150389 -0.0584659 -0.0996469 -0.042584 0.0967838 0.00288888 -0.0199483 0.0619568 -0.0543007 -0.0459697 0.0857052 0.00304925 -0.0819769 
0.101619 -0.082399 -0.0857744 -0.017812 0.0500247 0.174831 0.0172176 -0.00380134 -0.0963276 -0.0583534 -0.0295989 0.112683 0.0503819 -0.149083 -0.113274 -0.032239 -0.100669 0.0957107 -0.027925 0.112856 0.165565 -0.0150487 0.0853451 0.199369 -0.078396 0.0384119 0.0354904 -0.287228 -0.0408176 0.102047 -0.104668 -0.0375556 -0.0589206 0.0768904 0.063082 -0.0496513 -0.0505285 0.079835 -0.0828123 -0.103167 -0.0457478 -0.05315 -0.0519456 0.15245 -0.127023 -0.0273078 0.168956 0.0127875 -0.150285 0.126825 0.0808418 -0.12784 0.0469172 0.0353522 0.169593 0.00518094 0.0758161 0.131268 0.00248488 -0.177178 0.0528402 0.0212229 0.219077 -0.0480969 0.0860185 -0.16161 -0.043918 -0.00800438 -0.033685 0.0837816 -0.101394 0.00500291 -0.0717473 -0.0349723 -0.0849365 -0.0217865 -0.0286147 0.0501408 0.0883197 0.0746419 -0.0161855 0.0526543 -0.0609732 -0.114796 -0.0375226 -0.0720763 0.0498872 0.0375357 0.0436799 0.0928359 0.103854 -0.0806245 -0.0780722 -0.000475685 -0.0638798 0.0243194 0.00906 0.0998533 0.0683355 -0.0273179 0.128705 0.0600723 -0.0556309 0.0368177 -0.0610705 -0.0615831 -0.0942842 0.00741634 -0.101603 -0.00348182 0.0920516 0.154076 0.00410857 -0.089901 0.0424505 0.13166 -0.0681357 -0.136287 -0.0373 0.0839239 0.00522324 -0.0141319 0.053352 -0.0466702 -0.0605413 0.0796404 0.0138545 -0.0775891 
0.0898893 -0.0726937 -0.0735377 -0.0216253 0.0648962 0.170041 0.0126149 -0.00438942 -0.0949226 -0.0311166 -0.040996 0.109405 0.0472774 -0.145944 -0.086395 -0.0315175 -0.0984718 0.101234 -0.00232582 0.111116 0.170049 -0.0281037 0.106104 0.174386 -0.0630706 0.0461149 0.0183117 -0.301804 -0.024242 0.0987871 -0.0816735 -0.0274444 -0.0358827 0.0654734 0.0870419 -0.0476786 -0.0344935 0.111453 -0.0657336 -0.1298 -0.040633 -0.0527028 -0.058852 0.142567 -0.149798 -0.0182535 0.167437 0.0107461 -0.146649 0.107607 0.0700564 -0.102892 0.0513817 0.0296389 0.177018 0.00781027 0.0945621 0.117587 -0.0159527 -0.183477 0.041548 -0.00288141 0.214574 -0.0593207 0.122509 -0.156267 -0.0606482 0.00882722 -0.0372409 0.101893 -0.0935973 0.0172707 -0.0945448 -0.046082 -0.0866253 -0.0219399 -0.0407548 0.0602132 0.102403 0.0698119 -0.0528015 0.0591892 -0.0508152 -0.0927467 -0.0173917 -0.107019 0.0550264 0.0696418 0.0654734 0.0872166 0.0984666 -0.0670791 -0.0697657 -0.00201623 -0.0586056 -0.0081233 0.019474 0.126384 0.0572155 -0.0330201 0.133081 0.0606941 -0.0583494 0.0253292 -0.0553294 -0.0557998 -0.0754479 -0.00596711 -0.0498235 -0.00704348 0.0670509 0.14846 -0.0116078 -0.0916252 0.0757334 0.124058 -0.0663038 -0.160919 -0.0301199 0.101085 0.0217525 -0.0079106 0.0446833 -0.0438097 -0.050994 0.0803489 0.0468218 -0.0535585 
0.0799698 -0.0707717 -0.0796089 -0.0182706 0.0654557 0.158636 0.000205398 -0.0196599 -0.0904915 -0.0321789 -0.0335639 0.124888 0.0431017 -0.150424 -0.101111 -0.0108189 -0.120143 0.106543 -0.026697 0.112743 0.164107 -0.00521348 0.105611 0.191871 -0.0694066 0.043932 0.0396265 -0.2976 -0.0309788 0.114232 -0.101637 -0.0306938 -0.03906 0.0650312 0.0688725 -0.0414405 -0.0535071 0.0863534 -0.0800477 -0.0893385 -0.0493874 -0.0510257 -0.0510457 0.158283 -0.140197 -0.00979272 0.183029 0.0109917 -0.142253 0.117064 0.0952076 -0.115584 0.0362946 0.0279791 0.177358 0.00857982 0.0930771 0.119606 0.00174334 -0.161202 0.0437171 -0.00295212 0.210672 -0.0304562 0.103002 -0.186188 -0.0593697 0.00794523 -0.024938 0.104111 -0.0858652 0.0262311 -0.0755923 -0.0449714 -0.0769287 -0.0119538 -0.050499 0.0671282 0.0753566 0.0695184 -0.00983991 0.0669358 -0.0579085 -0.0853978 -0.0455382 -0.0754996 0.051639 0.0489401 0.0369919 0.0883275 0.0762019 -0.0688491 -0.0884547 -0.00312241 -0.0698554 0.0195007 -0.0059184 0.112531 0.0805359 -0.0354815 0.128103 0.0481209 -0.0503071 0.0274352 -0.0585384 -0.0703671 -0.103843 0.0074524 -0.0745728 -0.00210506 0.0767361 0.158332 0.000693329 -0.0886065 0.0446816 0.136147 -0.0677858 -0.141909 -0.0474773 0.0969982 0.0236484 0.00109483 0.0476988 -0.0510622 -0.0699798 0.0908705 0.018652 -0.0574168 
0.0793706 -0.0689713 -0.0865253 -0.0147366 0.0597195 0.156226 -0.0148168 -0.0382201 -0.0878385 -0.0539765 -0.0251505 0.138767 0.0429563 -0.129729 -0.118855 -0.00346104 -0.120248 0.0982869 -0.0444038 0.122035 0.155692 -0.00282127 0.11606 0.197709 -0.0785333 0.0457313 0.0489497 -0.285425 -0.0454974 0.115153 -0.107766 -0.0203273 -0.0373307 0.0679234 0.0379359 -0.0249458 -0.0685293 0.0955821 -0.0924974 -0.0539671 -0.0621563 -0.0370974 -0.060852 0.144969 -0.130392 -0.0042242 0.188772 0.00202119 -0.144609 0.132677 0.0995691 -0.113011 0.0268057 0.0326481 0.174359 0.00819754 0.0926149 0.13951 0.00964844 -0.144104 0.0361422 0.0150876 0.220289 -0.0375561 0.0955391 -0.190648 -0.051816 0.0186649 -0.0345582 0.121389 -0.0707773 0.0255697 -0.0611705 -0.026115 -0.0640531 -0.00658546 -0.0496451 0.0500771 0.0522453 0.0610188 -0.0017361 0.0680342 -0.0658901 -0.0978347 -0.0725728 -0.058391 0.0479496 0.028973 0.0187036 0.0828633 0.0669993 -0.0860387 -0.0786588 -0.000491317 -0.0505524 0.0343094 -0.0124706 0.103823 0.0910975 -0.0270943 0.108651 0.0418973 -0.0587384 0.0465921 -0.0651996 -0.0618511 -0.12257 0.0043666 -0.0934661 -0.0188302 0.0776312 0.169611 0.0144646 -0.0780246 0.0311499 0.139622 -0.0695445 -0.133345 -0.0366303 0.102746 0.0178718 0.00289359 0.0480033 -0.0536574 -0.0710564 0.0990318 0.00577418 -0.0621296 
0.0800644 -0.082186 -0.0767552 -0.00629386 0.0577356 0.156894 -0.0106508 -0.0376696 -0.0798439 -0.0825255 -0.0297257 0.143165 0.03637 -0.128668 -0.122477 -0.0140462 -0.136112 0.0826914 -0.056847 0.126779 0.157559 -0.0135741 0.119421 0.191194 -0.0757076 0.0343293 0.041644 -0.284542 -0.0641784 0.107137 -0.103803 -0.0195093 -0.0365787 0.0767392 0.0283873 -0.0197125 -0.0725921 0.0969727 -0.105198 -0.0561067 -0.0492472 -0.0422294 -0.0617522 0.135328 -0.13021 -0.00454753 0.183066 -0.00524601 -0.142817 0.142902 0.0845573 -0.119621 0.0331359 0.0396766 0.182907 0.00441762 0.0856115 0.14077 -0.000387434 -0.139654 0.0366336 0.0279396 0.21556 -0.0359793 0.0971854 -0.178994 -0.0484192 0.0169549 -0.0389811 0.127185 -0.0705167 0.0205409 -0.0568966 -0.0172464 -0.0556881 -0.000818831 -0.0448144 0.0307268 0.0488773 0.0696933 -0.00847546 0.0560077 -0.06667 -0.103243 -0.0806104 -0.0476385 0.0506294 0.0310015 0.00523558 0.0857842 0.0805581 -0.0980536 -0.0717041 -0.00290209 -0.0604924 0.0366022 -0.0170393 0.0947444 0.0984504 -0.0211437 0.105116 0.0372726 -0.0618053 0.0425814 -0.0559177 -0.0567742 -0.125456 0.0176793 -0.103619 -0.026767 0.0749835 0.169477 0.00926813 -0.0816604 0.0337847 0.145154 -0.0654923 -0.122297 -0.0229842 0.114319 0.0168129 0.00785546 0.0419655 -0.049288 -0.0592664 0.100055 0.0155305 -0.0611347 
0.0811048 -0.0752049 -0.0764564 -0.0143944 0.0534484 0.153855 0.00785776 -0.0240764 -0.0893262 -0.0718477 -0.0479655 0.134219 0.0455543 -0.138847 -0.11507 -0.0108421 -0.135642 0.0711149 -0.0656246 0.127741 0.145502 -0.0126694 0.117587 0.174648 -0.0939583 0.0264898 0.0275749 -0.282935 -0.0643971 0.106952 -0.119196 -0.00300848 -0.0370708 0.0833246 0.0287369 -0.0317989 -0.0569116 0.106715 -0.114387 -0.0601321 -0.0492759 -0.0569363 -0.0484172 0.124249 -0.128916 0.0140117 0.178883 -0.00108868 -0.156169 0.149335 0.0929933 -0.131802 0.0314999 0.044377 0.183315 5.99434e-05 0.0821096 0.12854 -7.0886e-05 -0.134111 0.0412395 0.0321501 0.197015 -0.0451167 0.110789 -0.178446 -0.0587651 0.0140893 -0.0537302 0.104263 -0.0796253 0.00835481 -0.0579409 -0.011604 -0.0552962 0.0152569 -0.0312243 0.0257823 0.0609666 0.0640145 0.000554482 0.0305238 -0.0750443 -0.0971365 -0.0802202 -0.0489705 0.0465821 0.0259688 0.00732925 0.103031 0.0753457 -0.105854 -0.0772757 -0.000566431 -0.0716414 0.0563148 -0.00465315 0.0885445 0.0994204 -0.00910905 0.113707 0.0426474 -0.0689627 0.0514077 -0.0574438 -0.0712806 -0.133061 0.0311992 -0.110945 -0.0250725 0.0738015 0.167851 0.00812794 -0.0863204 0.0286637 0.143041 -0.0670198 -0.108635 -0.0285796 0.118187 0.013933 0.00496289 0.0516245 -0.041014 -0.040189 0.0890506 0.00681252 -0.0855794 
0.0860906 -0.0580133 -0.0895284 -0.0101509 0.0477813 0.159626 -0.00971955 -0.0383443 -0.0895738 -0.0683784 -0.0148679 0.128526 0.051061 -0.134642 -0.131353 0.011563 -0.123897 0.0806611 -0.0713923 0.129962 0.161343 -0.021649 0.116102 0.18356 -0.0845566 0.0435077 0.0348149 -0.282748 -0.0478137 0.104609 -0.111586 -0.00127308 -0.0420324 0.0846127 0.0191963 -0.0235001 -0.064841 0.115324 -0.0885489 -0.0468653 -0.0630008 -0.0490753 -0.0544541 0.124318 -0.1118 -0.00426091 0.192255 -0.00532365 -0.166288 0.138796 0.0882705 -0.119175 0.0132425 0.048165 0.169249 0.00262505 0.0888618 0.139582 0.00384414 -0.142758 0.0342787 0.0258344 0.225358 -0.052399 0.0995492 -0.168936 -0.0516362 0.0228137 -0.043027 0.114881 -0.0774053 0.0171233 -0.0600423 -0.00504811 -0.046054 -0.00912855 -0.0329167 0.0425165 0.0414712 0.0579134 -0.00418836 0.0505431 -0.0738018 -0.109572 -0.0964369 -0.0284783 0.0440114 0.0180395 0.0103755 0.0818734 0.0796602 -0.112886 -0.0770565 0.000514517 -0.0493572 0.0480316 -0.0130509 0.100298 0.0922395 -0.0118208 0.0957454 0.0321434 -0.0718011 0.0715557 -0.0516085 -0.0516927 -0.127246 0.0333917 -0.10255 -0.0446637 0.060883 0.177937 0.0132186 -0.0710131 0.0398714 0.137502 -0.077214 -0.117087 -0.0215248 0.107636 0.00893098 0.00805975 0.0598862 -0.0382008 -0.0555114 0.0949493 0.00299363 -0.0745519 
0.0827123 -0.0818921 -0.0738057 -0.00437911 0.0494379 0.14747 0.00841068 -0.0202476 -0.072162 -0.0892246 -0.0390771 0.138282 0.040676 -0.149638 -0.125004 -0.00529629 -0.144653 0.0665701 -0.0838399 0.129322 0.152728 -0.0106349 0.114148 0.175552 -0.0977712 0.0224535 0.0267726 -0.288978 -0.0738566 0.10468 -0.119765 0.00209299 -0.0330232 0.0914039 0.0193121 -0.0329684 -0.0572415 0.106318 -0.119144 -0.0483473 -0.0420151 -0.0574659 -0.0535555 0.119714 -0.119739 0.00739681 0.175708 -0.0116374 -0.151182 0.15238 0.0872042 -0.137084 0.0289987 0.0516348 0.179545 -0.000317089 0.0831821 0.119383 -0.006307 -0.123675 0.040985 0.0285204 0.192433 -0.038641 0.101951 -0.184992 -0.05162 0.00915234 -0.0443182 0.100138 -0.0802433 0.00158531 -0.053604 -0.00668897 -0.0495236 0.0145363 -0.0326951 0.0242939 0.0447394 0.068647 0.00277558 0.032943 -0.0781327 -0.0983147 -0.0872252 -0.0241999 0.0506044 0.0194179 -0.0104711 0.096701 0.0789639 -0.113575 -0.0836075 -0.00252152 -0.0763214 0.0648162 -0.0162542 0.0748512 0.105243 -0.00254227 0.108694 0.0290724 -0.0685244 0.0560759 -0.0441119 -0.076729 -0.133096 0.0409816 -0.122027 -0.0287029 0.0650116 0.166117 0.00533874 -0.0908244 0.0257025 0.14768 -0.0679931 -0.105289 -0.0252628 0.115822 0.0128987 0.0181896 0.0488382 -0.0343224 -0.033936 0.087023 0.00418317 -0.0838812 
0.0851091 -0.0677168 -0.0739055 -0.0112947 0.0412634 0.151161 0.0117677 -0.0161115 -0.0811295 -0.0753644 -0.0349574 0.124319 0.0504581 -0.144982 -0.11547 -0.00147154 -0.139362 0.0624159 -0.0799161 0.132231 0.150708 -0.0121092 0.114116 0.168033 -0.105867 0.0262409 0.0205059 -0.287636 -0.063878 0.105635 -0.125816 0.00638414 -0.0299318 0.0934461 0.0240515 -0.0316253 -0.0439036 0.122099 -0.115009 -0.0531511 -0.0507449 -0.0655527 -0.050137 0.11314 -0.119582 0.0151292 0.180285 -0.00721003 -0.16583 0.153119 0.0853216 -0.133344 0.0239158 0.0607424 0.182654 -0.000255939 0.0844635 0.11219 -0.00577161 -0.130503 0.0366302 0.0262164 0.193899 -0.0533612 0.108325 -0.174401 -0.0513859 0.00959377 -0.049625 0.0936603 -0.0841426 -0.00388016 -0.059418 -0.00299168 -0.0431552 0.0103899 -0.0276206 0.0295823 0.0550237 0.0624658 0.00597061 0.0241651 -0.0825533 -0.101053 -0.0836868 -0.0238024 0.0430097 0.0159466 0.00353201 0.10814 0.0839468 -0.121129 -0.0817881 -0.00102932 -0.0765954 0.0626471 -0.009375 0.0841237 0.106853 -0.00153815 0.112913 0.0372609 -0.0701199 0.0584738 -0.0475386 -0.070786 -0.129701 0.0415133 -0.113542 -0.032327 0.0591907 0.16848 0.00537359 -0.0928142 0.0322379 0.143977 -0.0647463 -0.110463 -0.0260029 0.114053 0.0150056 0.00995548 0.0610612 -0.0253413 -0.0304632 0.0844898 0.0127887 -0.0862406 
0.0881746 -0.0719684 -0.0752178 -0.00214828 0.0330624 0.150496 0.0129191 -0.0239149 -0.0708259 -0.0931069 -0.03423 0.126117 0.0432471 -0.139157 -0.121449 -0.000191799 -0.14117 0.0549362 -0.0805987 0.127415 0.15305 -0.0151223 0.115433 0.157923 -0.105837 0.0286566 0.0186871 -0.288858 -0.076899 0.10694 -0.125799 0.0166448 -0.0236655 0.098651 0.0232707 -0.0309369 -0.0337258 0.132437 -0.109356 -0.0550666 -0.0512287 -0.061895 -0.0456611 0.0978264 -0.114594 0.0106209 0.178464 -0.0207272 -0.159714 0.15804 0.0803619 -0.13119 0.033273 0.0764706 0.189101 -0.0015154 0.0936446 0.108236 -0.0139366 -0.132312 0.0352243 0.0257084 0.193635 -0.0636991 0.109427 -0.161784 -0.0475495 0.0104051 -0.0491808 0.100741 -0.0843121 -0.0107922 -0.0618117 0.00637765 -0.0387092 0.00859194 -0.0223937 0.0133866 0.0464641 0.0609687 0.000923364 0.0270093 -0.0814338 -0.107198 -0.0851118 -0.0188525 0.0393169 0.0135306 -1.63744e-05 0.106154 0.0892533 -0.132565 -0.0746073 -0.00375292 -0.0723244 0.065477 -0.00897353 0.0858398 0.11166 0.00791801 0.109009 0.0342754 -0.0717066 0.0648072 -0.0381793 -0.0710105 -0.126052 0.0408599 -0.12355 -0.037852 0.0497016 0.166028 0.00477431 -0.0934169 0.0394327 0.144191 -0.0544857 -0.111402 -0.0153179 0.113994 0.0196024 0.0158233 0.0698853 -0.0270076 -0.0182922 0.0811938 0.0268338 -0.0808528 
0.091773 -0.0669226 -0.0670648 -0.00657843 0.0239119 0.153676 0.0201655 -0.0142336 -0.0705686 -0.0922918 -0.0272031 0.115869 0.0512255 -0.149611 -0.122546 0.00365625 -0.147474 0.0551174 -0.0941716 0.121621 0.15926 -0.00755087 0.10768 0.153822 -0.117104 0.0232003 0.0128522 -0.28786 -0.0706261 0.106625 -0.131507 0.0150182 -0.0265282 0.105009 0.0265074 -0.038561 -0.0273065 0.12898 -0.107316 -0.0495815 -0.0531023 -0.0697042 -0.0449867 0.095774 -0.108286 0.00466216 0.173795 -0.0180311 -0.167735 0.159598 0.0796631 -0.137328 0.027227 0.083626 0.177843 -0.00180068 0.0935673 0.0976491 -0.0188433 -0.129173 0.0374662 0.0256076 0.189483 -0.0615261 0.105078 -0.162217 -0.044086 0.00163255 -0.0483943 0.0873734 -0.0913616 -0.0216397 -0.059824 0.00720274 -0.0386628 0.00620257 -0.0198641 0.0126305 0.0472258 0.0620026 0.0135442 0.0161075 -0.0839736 -0.104473 -0.0861022 -0.00412142 0.0389886 0.00385742 -0.00499127 0.114733 0.095608 -0.139298 -0.0818693 0.000245809 -0.0821245 0.0723378 -0.0165918 0.0821139 0.112067 0.0182133 0.115725 0.0343486 -0.0741391 0.0674222 -0.0262971 -0.0758155 -0.120766 0.0503574 -0.127572 -0.0373537 0.045427 0.161077 0.00400911 -0.095055 0.0371112 0.148066 -0.0545238 -0.098368 -0.0203723 0.106837 0.0165139 0.0112746 0.0721876 -0.0213308 -0.0128017 0.0763648 0.0220378 -0.0853148 
0.0925753 -0.0485586 -0.0545774 -0.00105899 0.0273094 0.178263 0.023292 -0.0236649 -0.0931119 -0.0667653 -0.0193921 0.118271 0.0575054 -0.137737 -0.0932253 -0.00348255 -0.131141 0.0764634 -0.0616859 0.111747 0.165194 -0.0162829 0.105637 0.164646 -0.0922947 0.0138975 -0.000832063 -0.284053 -0.0607045 0.127877 -0.119989 0.0153316 -0.0180569 0.108407 0.043595 -0.0314032 -0.018738 0.109419 -0.0819411 -0.0686473 -0.0523861 -0.0850045 -0.0206179 0.0799176 -0.124088 -0.00880727 0.183485 -0.0196782 -0.178209 0.152333 0.100188 -0.127386 0.0325424 0.0821356 0.187296 0.0161698 0.0930408 0.101469 -0.0266023 -0.128898 0.0249555 0.0265656 0.190299 -0.101037 0.124489 -0.131856 -0.0592192 -0.00980515 -0.0897773 0.107199 -0.0925249 -0.00737367 -0.08951 -0.000792418 -0.036067 0.0090208 -0.00391648 0.00868048 0.0675464 0.0599657 -0.0110944 0.00834324 -0.0600565 -0.0897524 -0.0775273 -0.0182139 0.0341028 -0.0006039 0.0137465 0.133502 0.0887864 -0.14393 -0.0694207 0.0138943 -0.0843138 0.0528747 -0.0185868 0.11009 0.102304 0.0180881 0.123624 0.0571802 -0.0751044 0.0651211 -0.0209454 -0.048574 -0.103884 0.0340776 -0.114563 -0.0415483 0.0234787 0.142796 0.00728782 -0.0987753 0.0569157 0.140262 -0.0309904 -0.0947068 -0.0118457 0.13659 0.0406247 -0.0264793 0.0652939 -0.0305934 -0.0141471 0.0950282 0.0572373 -0.0664117 
0.0967928 -0.0504284 -0.0722302 -0.000811948 0.0280006 0.175114 0.0257354 -0.0221897 -0.0929336 -0.0613441 -0.0310524 0.109042 0.0599883 -0.13114 -0.0847127 0.00156876 -0.120433 0.0722873 -0.0490639 0.110356 0.159852 -0.017571 0.112235 0.15482 -0.091904 0.0125058 -0.0043402 -0.293037 -0.0684024 0.133321 -0.117812 0.0296212 -0.0113083 0.104396 0.0499589 -0.0286868 -0.00403585 0.113733 -0.0803015 -0.0792055 -0.0565281 -0.0839387 -0.0132857 0.0780635 -0.1261 0.00656177 0.185861 -0.0146182 -0.171642 0.14964 0.101411 -0.126716 0.0473697 0.0846289 0.19331 0.0125845 0.105924 0.0880969 -0.0151791 -0.137632 0.0232032 0.0246699 0.178081 -0.109242 0.122451 -0.130181 -0.0620483 -0.00343387 -0.0817692 0.0972645 -0.0944811 -0.0087381 -0.0975292 -0.00970169 -0.0390172 0.0128729 -0.00418568 0.00990212 0.0687757 0.0619393 -0.00852532 0.0092798 -0.0690863 -0.0905597 -0.0689348 -0.0160512 0.024909 -0.00201575 0.016545 0.131996 0.0857722 -0.134623 -0.0734002 0.00487601 -0.0846294 0.0576156 -0.0108227 0.122085 0.101734 0.0126472 0.130874 0.0564443 -0.0647161 0.0650723 -0.0302259 -0.0578842 -0.110272 0.0323373 -0.111377 -0.0304093 0.0204237 0.140193 0.00420775 -0.109703 0.0533324 0.140079 -0.0274471 -0.10733 -0.0152688 0.134397 0.0473438 -0.0231343 0.0773793 -0.0252101 -0.0167224 0.0823055 0.0600597 -0.065055 
0.099602 -0.0532685 -0.0693254 -0.00341611 0.025102 0.170983 0.0203606 -0.0187795 -0.0865963 -0.0616123 -0.0211519 0.108951 0.0611398 -0.141582 -0.0902355 0.00826815 -0.11426 0.0825271 -0.0662823 0.108257 0.160328 -0.00237846 0.109136 0.152206 -0.104778 0.0186945 0.00483824 -0.295491 -0.072975 0.125337 -0.12063 0.0324959 -0.00756957 0.112517 0.0541483 -0.0349753 0.00140165 0.118781 -0.0784529 -0.0730967 -0.0594667 -0.0810709 -0.0211829 0.083826 -0.120825 0.00132339 0.180209 -0.0142007 -0.176896 0.149007 0.10521 -0.13538 0.0400362 0.0875137 0.1787 0.0103827 0.106511 0.0783625 -0.0163926 -0.136568 0.0256383 0.0154746 0.174405 -0.100015 0.120617 -0.146698 -0.0591035 0.00212215 -0.0711052 0.0936141 -0.0949693 -0.024588 -0.0905788 -0.018873 -0.0488621 0.00469929 -0.0119612 0.0159301 0.0590294 0.0565771 -0.00190655 0.0170299 -0.0753483 -0.0953189 -0.0735466 -0.0104044 0.0294641 -0.00880444 0.00873028 0.134688 0.0848033 -0.139852 -0.0816389 0.00794607 -0.0871778 0.070885 -0.0166486 0.109888 0.0948718 0.0154263 0.131443 0.0527741 -0.0702849 0.0706356 -0.0141643 -0.0726509 -0.109973 0.0294384 -0.118385 -0.0302637 0.0175501 0.142148 0.0054011 -0.101407 0.0494192 0.134359 -0.0404392 -0.113919 -0.0208927 0.118272 0.0464028 -0.0123166 0.0811814 -0.0195296 -0.00122564 0.0690316 0.0536474 -0.0755892 
0.104839 -0.0631793 -0.0734686 0.00896274 0.0303994 0.175684 0.01732 -0.0152483 -0.081107 -0.0631893 -0.0221862 0.109724 0.0595861 -0.141092 -0.0908058 0.0150248 -0.110965 0.0865066 -0.0605422 0.104524 0.173671 -0.0150045 0.120824 0.151128 -0.091419 0.00284002 -0.00137725 -0.303487 -0.0821557 0.128263 -0.10888 0.0313111 -0.00288491 0.113606 0.0529666 -0.0318518 -0.00583096 0.108794 -0.0730931 -0.0825426 -0.0682204 -0.0806338 -0.0218685 0.0761568 -0.116731 -0.0154527 0.170008 -0.0171814 -0.162387 0.153899 0.109959 -0.134438 0.0477472 0.0841067 0.174442 0.00952034 0.116946 0.0716104 -0.0172092 -0.133231 0.0263148 0.0144353 0.168775 -0.109939 0.121193 -0.146208 -0.0685881 0.00626917 -0.0752104 0.0989621 -0.0959558 -0.0152463 -0.102237 -0.02981 -0.0606264 0.00726095 -0.00052954 0.00898874 0.0538324 0.0696491 -0.0127345 0.00481519 -0.0714458 -0.0910744 -0.0734228 -0.0061723 0.0258154 -0.00689824 0.0104654 0.125216 0.0806441 -0.135954 -0.083409 0.0135762 -0.0827486 0.070387 -0.0237942 0.114431 0.0849343 0.0238119 0.140805 0.0475591 -0.0741942 0.0644967 0.00140345 -0.0713139 -0.10283 0.0214713 -0.111839 -0.0298732 -0.00185153 0.133987 0.0108637 -0.102021 0.06211 0.142228 -0.028692 -0.0987501 -0.0161739 0.132195 0.0435618 -0.0149188 0.0770428 -0.0248008 0.000660542 0.0708594 0.0655951 -0.0644567 
0.0975877 -0.0469104 -0.0615361 -0.00835453 0.0329083 0.196747 0.0259166 -0.029708 -0.0859135 -0.0872224 -0.021123 0.0994431 0.0676173 -0.131822 -0.0983584 4.92477e-05 -0.135156 0.08426 -0.0760049 0.0868774 0.187738 -0.0142736 0.097875 0.145199 -0.0856943 -0.00224658 -0.020261 -0.29219 -0.0713377 0.132916 -0.103368 0.0198323 -0.0356448 0.108138 0.0651664 -0.0294952 -0.0172365 0.0922139 -0.055472 -0.0735219 -0.0517996 -0.0768139 -0.00962829 0.075652 -0.108348 -0.0163585 0.176706 -0.0145273 -0.182312 0.139127 0.0824978 -0.144392 0.0480043 0.0873079 0.164886 0.0177425 0.101761 0.104311 -0.0298665 -0.144899 0.0326604 0.0461127 0.19346 -0.109283 0.115579 -0.11938 -0.0546305 0.00456045 -0.0767884 0.0918881 -0.0847732 -0.00669966 -0.0883847 -0.0281061 -0.0520292 0.0130138 -0.0140958 -0.0148748 0.05859 0.0644713 -0.00230114 0.0167834 -0.0639438 -0.0872252 -0.097588 0.0116031 0.0352192 -0.0136189 -0.00095252 0.124814 0.103474 -0.151847 -0.069397 0.007571 -0.0917187 0.0623489 -0.031047 0.122037 0.0871738 0.034358 0.133262 0.0473521 -0.0767266 0.0721549 -0.0104726 -0.0488715 -0.107484 0.0423343 -0.134389 -0.0288236 0.0195538 0.118901 -0.00599803 -0.0973085 0.0534305 0.155919 -0.0515916 -0.0769257 -0.0170733 0.119592 0.0418497 -0.0290449 0.0744524 -0.02887 -0.0183688 0.0818297 0.0368549 -0.0658237 
0.0930629 -0.0600282 -0.0623029 -0.0114822 0.0373179 0.175943 0.0246934 -0.0161504 -0.082668 -0.0794313 -0.0292487 0.105578 0.0649733 -0.142906 -0.106017 0.0107083 -0.138705 0.0788155 -0.0869098 0.101659 0.183436 -0.016862 0.104649 0.148088 -0.0995122 0.010743 -0.0128055 -0.299225 -0.0655888 0.118095 -0.112908 0.0262108 -0.0339723 0.106066 0.0514666 -0.0357558 -0.0227929 0.111074 -0.0732187 -0.068824 -0.0501142 -0.0729904 -0.0255807 0.084776 -0.107226 -0.00727696 0.175837 -0.0146181 -0.177546 0.136637 0.0827734 -0.150962 0.0366045 0.0819249 0.167197 0.0103209 0.104663 0.0994222 -0.0224089 -0.140642 0.0411604 0.0342768 0.184812 -0.0847617 0.117568 -0.141995 -0.0570106 0.00877369 -0.0578113 0.0861547 -0.0912674 -0.00766989 -0.0783806 -0.0208566 -0.053368 0.0110333 -0.0190465 0.00815404 0.0558089 0.0576924 0.00204724 0.0186063 -0.0741847 -0.0916421 -0.0930807 0.00175263 0.0428844 0.00160319 -0.00248492 0.115085 0.0988883 -0.139041 -0.0793382 0.00231335 -0.0903137 0.0719967 -0.0260551 0.109996 0.092508 0.0308884 0.129363 0.0342558 -0.0779886 0.0742295 -0.0100527 -0.067151 -0.116886 0.0455477 -0.124516 -0.0349539 0.0206787 0.138127 -0.006265 -0.0979998 0.051843 0.153788 -0.0598619 -0.090519 -0.0268939 0.11308 0.0302581 -0.0047579 0.0729117 -0.0242968 -0.0207965 0.0773175 0.0200342 -0.0770298 
0.0940158 -0.050082 -0.0678215 -0.00899114 0.0354144 0.182305 0.0239952 -0.0258353 -0.0865728 -0.0850563 -0.0278371 0.10689 0.0617634 -0.141363 -0.106956 0.00633367 -0.133444 0.0779539 -0.079663 0.104785 0.177946 -0.0150872 0.0982123 0.149296 -0.0941471 0.0105432 -0.0123727 -0.293056 -0.0655811 0.12434 -0.111005 0.0241539 -0.0349807 0.104483 0.0545102 -0.0309473 -0.0199502 0.105165 -0.0704999 -0.0710108 -0.0501452 -0.0730664 -0.013922 0.085986 -0.107607 -0.00448054 0.184464 -0.0153592 -0.182875 0.141867 0.0819474 -0.146568 0.0387773 0.0815237 0.172396 0.011388 0.0951217 0.10642 -0.0228679 -0.1442 0.0348098 0.0395762 0.195312 -0.0966065 0.116945 -0.134804 -0.0558339 0.00110691 -0.0715673 0.0866598 -0.086559 -0.00781092 -0.0799194 -0.0162289 -0.0495358 0.0102507 -0.0144933 0.00306253 0.0573643 0.0577191 0.00112226 0.0221464 -0.0724408 -0.0925152 -0.0918737 0.00166561 0.0350565 -0.00381773 0.00166754 0.120546 0.0988004 -0.143701 -0.0778184 0.00432303 -0.0829101 0.0686974 -0.0211048 0.114219 0.0893438 0.0269695 0.120448 0.0417235 -0.0775531 0.0751422 -0.0242462 -0.0540885 -0.113329 0.0456252 -0.129057 -0.0309327 0.0283024 0.134419 -0.00574765 -0.0948096 0.0481104 0.147047 -0.0569666 -0.0908211 -0.0211988 0.115514 0.0330686 -0.0120355 0.0775885 -0.0266027 -0.0201835 0.0791195 0.0282137 -0.0790676 
0.0953798 -0.0351266 -0.0560405 -0.0155008 0.0422271 0.209815 0.0346133 -0.0422953 -0.0882412 -0.0848533 -0.0144232 0.102245 0.074851 -0.129582 -0.097846 -0.010708 -0.130143 0.088498 -0.080234 0.0928633 0.186134 -0.0129755 0.0785515 0.161256 -0.0838966 0.00306799 -0.0328234 -0.283647 -0.0499305 0.134133 -0.0911624 0.0162285 -0.0550256 0.105312 0.0730674 -0.0206649 -0.0192776 0.0875598 -0.0474942 -0.075266 -0.0367371 -0.0721001 -0.00865937 0.081706 -0.110838 -0.0210076 0.18051 -0.00275605 -0.188217 0.126979 0.0694296 -0.142065 0.0394813 0.0774103 0.16679 0.0238224 0.0773284 0.129465 -0.0366695 -0.149068 0.024694 0.0562267 0.213418 -0.117521 0.116449 -0.111225 -0.0430975 -0.0032748 -0.08841 0.0888805 -0.0780016 0.00100697 -0.0828916 -0.0197301 -0.0472778 0.0111567 -0.0189783 -0.00361521 0.0704719 0.0584141 -0.000292641 0.0301505 -0.0572358 -0.0847282 -0.0939424 2.19247e-05 0.0449842 -0.0084283 -5.25702e-05 0.125929 0.116109 -0.15424 -0.0560241 0.0100544 -0.0906758 0.0458689 -0.0268524 0.119191 0.0832635 0.0308427 0.12606 0.0546851 -0.0822715 0.0761895 -0.0270599 -0.0297985 -0.102474 0.0434184 -0.126391 -0.0225666 0.0328914 0.117882 -0.0148223 -0.0855352 0.0496313 0.152147 -0.0669919 -0.0800972 -0.0247757 0.118692 0.0409157 -0.0374367 0.0655127 -0.0254654 -0.0388386 0.0922869 0.020995 -0.0707022 
0.0940012 -0.0296936 -0.0574924 -0.0105667 0.0389128 0.20501 0.0302432 -0.0380867 -0.077259 -0.0932738 -0.0199956 0.101918 0.0632051 -0.136744 -0.103832 -0.00276333 -0.131074 0.0786615 -0.0808511 0.0922515 0.187488 -0.0105839 0.0833216 0.151952 -0.0827719 0.00306091 -0.023318 -0.282123 -0.0517198 0.132847 -0.0918148 0.0187363 -0.0388114 0.108082 0.0714281 -0.0262876 -0.0075933 0.0973862 -0.0550273 -0.0796482 -0.0382081 -0.0749466 -0.000843095 0.0773849 -0.106097 -0.0145503 0.184656 -0.0143587 -0.18951 0.131606 0.0708762 -0.136234 0.0452102 0.0822232 0.174277 0.0235486 0.0831025 0.114912 -0.0362176 -0.154801 0.0217268 0.0442248 0.208254 -0.120668 0.120548 -0.111284 -0.049143 -0.00567341 -0.0883887 0.0952056 -0.0825171 -0.0101834 -0.0896381 -0.0206883 -0.040585 0.0132752 -0.0138304 1.81607e-05 0.0630641 0.056275 -0.00410754 0.0317147 -0.0557938 -0.0834602 -0.0846821 -0.000975395 0.0369714 -0.00406609 0.000968154 0.132517 0.111827 -0.15847 -0.0678823 0.00865438 -0.0824729 0.0535649 -0.0216227 0.121517 0.0860201 0.0311842 0.123987 0.0511575 -0.0810249 0.0755461 -0.0302265 -0.0356232 -0.100331 0.0415538 -0.127054 -0.031024 0.0281308 0.119125 -0.0151761 -0.0878917 0.0582344 0.1458 -0.0641405 -0.0851832 -0.0172456 0.121061 0.0467987 -0.0248746 0.0739152 -0.0279365 -0.0212295 0.0891343 0.040701 -0.0724666 
0.0910644 -0.0257169 -0.0500213 -0.0124337 0.0308961 0.1977 0.029069 -0.0227726 -0.0828571 -0.0746032 -0.0230917 0.104493 0.0589785 -0.1498 -0.0904474 0.00111109 -0.13439 0.0710932 -0.0784435 0.0992745 0.169646 -0.00213601 0.0899915 0.15062 -0.0937815 0.00349475 -0.0167137 -0.281925 -0.0556681 0.127573 -0.105451 0.0137964 -0.0245467 0.11233 0.0579352 -0.0294265 0.00230808 0.101611 -0.0708489 -0.0647206 -0.0411088 -0.0858153 -0.000191545 0.0715038 -0.114042 -0.00883118 0.187903 -0.0203411 -0.193922 0.147723 0.0901162 -0.14033 0.0330621 0.0881856 0.180655 0.0235137 0.084579 0.100427 -0.0308908 -0.142291 0.0163756 0.0343555 0.192119 -0.122999 0.128816 -0.123016 -0.0540446 -0.012715 -0.0960313 0.0946858 -0.083221 -0.0103268 -0.0877137 -0.0105333 -0.0290635 0.0202745 -0.0102425 0.00846715 0.0656362 0.0503909 -0.000658015 0.0211682 -0.0543757 -0.0736888 -0.0791678 0.0012684 0.0347941 -0.00352558 0.0072488 0.143241 0.094574 -0.161459 -0.0758969 0.0138154 -0.0872925 0.0619546 -0.0181291 0.111865 0.0892454 0.0334854 0.120093 0.0518586 -0.0804863 0.0702035 -0.0313192 -0.0424112 -0.106101 0.0344912 -0.131029 -0.0353403 0.0262664 0.127728 -0.000607382 -0.0923701 0.0525145 0.139424 -0.0527255 -0.0844481 -0.0241249 0.123627 0.0513959 -0.0249351 0.0811761 -0.0252879 -0.00413604 0.0900219 0.04903 -0.076309 
0.0863936 -0.0217689 -0.0581912 -0.0174146 0.0294785 0.20228 0.0192011 -0.0319805 -0.0846063 -0.0731085 -0.0211047 0.104119 0.0568524 -0.147706 -0.0961265 0.00251803 -0.137956 0.0726862 -0.0661945 0.0967763 0.169615 -0.000833475 0.0912375 0.145499 -0.0915417 0.0171203 -0.0091298 -0.283025 -0.0498836 0.127696 -0.101021 0.00897519 -0.0245735 0.102716 0.0691096 -0.0240334 0.00190154 0.10189 -0.0591581 -0.0693533 -0.0448181 -0.0851106 -0.0015882 0.0792131 -0.116041 -0.00628508 0.194645 -0.015727 -0.195756 0.141942 0.0826462 -0.128173 0.0384416 0.0881649 0.181141 0.0216924 0.0906713 0.101222 -0.0350764 -0.150254 0.0143781 0.0328083 0.207934 -0.119711 0.128904 -0.121748 -0.0540207 -0.00800511 -0.0882986 0.0993661 -0.0828241 -0.00970789 -0.0913703 -0.0131882 -0.0275715 0.0138818 -0.0192852 0.0108634 0.0674725 0.0523072 -0.00085153 0.0295378 -0.0522597 -0.0724437 -0.0803501 -0.00436745 0.0323598 0.00226118 0.0132071 0.139471 0.0968489 -0.153931 -0.0736174 0.0148922 -0.0823284 0.051636 -0.0149342 0.123863 0.088216 0.0246032 0.120741 0.0546644 -0.080545 0.0637772 -0.0318106 -0.0369551 -0.0999068 0.0327275 -0.124626 -0.0298618 0.0299795 0.125111 -0.000829677 -0.0914636 0.0545494 0.139676 -0.0559783 -0.0913291 -0.0195371 0.120378 0.055845 -0.0320733 0.086556 -0.0338197 -0.0138011 0.0929991 0.053862 -0.0664814 
