{
  "descriptor": [
    -0.07833895832300186,
    0.08309115469455719,
    0.11548826098442078,
    0.010862203314900398,
    -0.056970104575157166,
    -0.03665883094072342,
    -0.0607139877974987,
    -0.0990319699048996,
    0.09627610445022583,
    -0.08714134246110916,
    0.18946442008018494,
    -0.020464705303311348,
    -0.22848840057849884,
    0.022359199821949005,
    -0.04598742350935936,
    0.13571949303150177,
    -0.18792179226875305,
    -0.10990295559167862,
    -0.04532145336270332,
    0.019939474761486053,
    0.04295140132308006,
    0.014447510242462158,
    0.016737649217247963,
    0.05216536298394203,
    -0.0636688843369484,
    -0.37534305453300476,
    -0.10801400989294052,
    -0.11386698484420776,
    0.06911155581474304,
    -0.02678866870701313,
    -0.09624417871236801,
    0.0599406361579895,
    -0.1224440336227417,
    -0.027095096185803413,
    0.04796921834349632,
    0.035638123750686646,
    0.017907477915287018,
    -0.024392642080783844,
    0.21496258676052094,
    0.0574343167245388,
    -0.24146528542041779,
    -0.030048642307519913,
    0.034830786287784576,
    0.27173951268196106,
    0.18899530172348022,
    0.03475324437022209,
    0.03270838409662247,
    -0.05655253678560257,
    0.0771619901061058,
    -0.21437232196331024,
    0.015422888100147247,
    0.19485129415988922,
    0.13857941329479218,
    0.10347257554531097,
    0.0034117503091692924,
    -0.12375131994485855,
    0.0527740940451622,
    0.054650649428367615,
    -0.15446841716766357,
    0.059994056820869446,
    0.07969357818365097,
    -0.12408657371997833,
    0.045395076274871826,
    -0.00035145747824572027,
    0.22075457870960236,
    0.06213323399424553,
    -0.10627735406160355,
    -0.11518701910972595,
    0.12127935141324997,
    -0.17532134056091309,
    -0.08103939145803452,
    0.00588312279433012,
    -0.16549845039844513,
    -0.12902121245861053,
    -0.2906055152416229,
    -0.028066689148545265,
    0.42213869094848633,
    0.12314110994338989,
    -0.1620948612689972,
    0.0599183514714241,
    -0.11696188151836395,
    -0.0858907401561737,
    0.057978320866823196,
    0.13916194438934326,
    -0.0986679196357727,
    0.055072490125894547,
    -0.038041237741708755,
    0.008700182661414146,
    0.22742076218128204,
    -0.019918274134397507,
    0.019057786092162132,
    0.18600967526435852,
    -0.035494133830070496,
    0.06342577934265137,
    0.059897150844335556,
    0.026867929846048355,
    -0.06236538663506508,
    -0.058562666177749634,
    -0.12079284340143204,
    -0.03606894239783287,
    -0.058486007153987885,
    -0.10759780555963516,
    0.02338096871972084,
    0.12792187929153442,
    -0.2701629400253296,
    0.11819437146186829,
    -0.006938084494322538,
    -0.021297108381986618,
    0.04480013623833656,
    0.054950255900621414,
    -0.0899927020072937,
    -0.07760795205831528,
    0.17440597712993622,
    -0.17533737421035767,
    0.1753435581922531,
    0.23252487182617188,
    0.07320888340473175,
    0.07504701614379883,
    0.0664307102560997,
    0.050611160695552826,
    -0.04521223157644272,
    -0.016637656837701797,
    -0.14261384308338165,
    -0.05174468830227852,
    0.0750017762184143,
    -0.05239242687821388,
    0.02851947769522667,
    -0.015700843185186386
  ]
}