-0.0367089 -0.000955333 0.0752824 0.0592729 0.101663 0.190883 0.0619812 -0.0534601 0.0764905 -0.0587169 -0.00407641 0.0542724 0.033111 -0.135667 0.0464824 0.0227855 -0.179717 0.0754941 -0.116586 -0.0315238 0.228637 -0.0534039 0.0359513 0.193921 0.112867 -0.14923 -0.141363 -0.236963 0.0279884 0.109432 0.191219 0.0195599 -0.0769725 0.0529427 0.0761359 0.0400019 -0.087229 -0.0930711 -0.0172228 -0.00934679 0.12242 -0.0795266 -0.0195525 0.0776591 -0.0479965 -0.112011 0.0807141 0.00141657 -0.00910751 -0.0604191 0.0259629 -0.111166 0.0506884 -0.0849339 0.0624449 0.114121 -0.0154951 0.135161 -0.0326563 -0.041354 -0.0764098 0.0197076 0.0536697 -0.0936316 0.104748 -0.0618507 -0.0020321 -0.0583701 -0.101416 0.106032 -0.0182567 0.15055 -0.102139 -0.118423 -0.00524001 0.0337968 -0.0659527 0.0561745 -0.013284 0.152638 -0.0201012 0.0304151 0.0376671 0.0530552 -0.0949437 0.0500818 0.107474 0.00769908 -0.1537 0.00134831 0.0428969 -0.0717701 -0.0456057 -0.0317878 -0.132707 -0.00457126 -0.133896 0.0566312 0.0355906 0.0720919 0.0902837 -0.0666132 -0.0610532 0.0291951 0.043256 0.0153157 -0.045758 0.0451332 0.0036384 0.0140423 -0.100607 0.0218079 -0.101711 -0.0988388 0.0707911 0.162828 -0.091084 0.0460121 -0.0458187 0.206244 0.0965835 -0.0118945 -0.124824 0.0143002 -0.0999293 0.143394 -0.0468657 0.0610156 
-0.0211178 -0.00127506 0.0667163 0.0824216 0.103271 0.183344 0.0729012 -0.0743905 0.0866201 -0.0752661 -0.0152527 0.052992 0.0306488 -0.128501 0.0378097 0.0058406 -0.153797 0.0893492 -0.115864 -0.0309253 0.212291 -0.0513041 0.0389476 0.220783 0.106996 -0.185147 -0.149503 -0.23868 0.00138619 0.12473 0.185315 0.0242599 -0.0870844 0.0522736 0.0843677 0.0279505 -0.0658659 -0.0990262 -0.0263067 -0.0059393 0.118118 -0.0619151 -0.0160869 0.0501973 -0.0524602 -0.109863 0.0704629 0.00752096 0.0169 -0.0427619 0.0395505 -0.118743 0.0789167 -0.0794832 0.054954 0.10625 0.00150223 0.128065 -0.011289 -0.0378787 -0.0683154 0.0451053 0.0287406 -0.123288 0.0900076 -0.0694136 0.0183446 -0.0744562 -0.114033 0.0868174 -0.0169166 0.144538 -0.0932508 -0.110989 -0.0158845 0.0463874 -0.0604056 0.0399643 -0.0106373 0.155651 -0.0157354 0.0378241 0.0248328 0.0474096 -0.0737735 0.0616986 0.0884435 -0.0146818 -0.174844 -0.00681318 0.0368007 -0.0694319 -0.014185 -0.0489775 -0.133231 -0.0101792 -0.132546 0.0485649 0.0425722 0.0732749 0.104402 -0.057587 -0.0494641 0.0480247 0.0447443 -0.0062504 -0.0373933 0.0348893 -0.0213515 0.0498151 -0.0908886 0.00694517 -0.077547 -0.100956 0.0289707 0.172259 -0.0955009 0.058559 -0.0687143 0.193119 0.0796442 -0.00471372 -0.139956 0.011742 -0.102032 0.139054 -0.0773528 0.0451114 
-0.0335051 0.0119696 0.0397935 0.0680255 0.11287 0.185967 0.04731 -0.0857105 0.05887 -0.0644261 -0.00135101 0.0606872 0.0418692 -0.113185 0.00222331 0.0266373 -0.152638 0.0995946 -0.117252 -0.00173921 0.229025 -0.0882648 0.0460205 0.214066 0.114078 -0.160612 -0.1423 -0.226091 0.0271993 0.126732 0.178387 0.0179186 -0.0845613 0.0355992 0.0666325 0.0530121 -0.109295 -0.092617 -0.0236128 -0.0172015 0.0934611 -0.0577577 -0.00811834 0.0760204 -0.0444497 -0.104238 0.100358 0.0162681 -0.0221137 -0.0519016 0.0212483 -0.109442 0.0541734 -0.0954147 0.058473 0.110512 -0.0160048 0.160049 -0.0118271 -0.0551205 -0.0741291 0.0561466 0.0847549 -0.104962 0.0955573 -0.059762 -0.0152013 -0.0536809 -0.121068 0.10169 -0.00731594 0.151423 -0.0941249 -0.117529 -0.0126953 0.0435938 -0.0545497 0.0553621 -0.0154161 0.133808 -0.0299167 0.039739 0.0162557 0.0385452 -0.11327 0.0715003 0.0799979 -0.00270956 -0.144017 -0.0104207 0.039611 -0.070788 -0.029279 -0.0335471 -0.101643 -0.0085397 -0.135969 0.0747386 0.0276721 0.0589084 0.0901467 -0.06264 -0.0587452 0.0420452 0.0238111 0.0418462 -0.0512165 0.0490985 0.0020128 0.0148264 -0.0893043 0.0271314 -0.0822277 -0.077884 0.0472757 0.169047 -0.106416 0.0551816 -0.0388694 0.205636 0.0622239 -0.0214794 -0.13238 0.00202719 -0.133277 0.15977 -0.0761905 0.0413941 
-0.041909 0.018869 0.0414383 0.0641377 0.10815 0.185183 0.0305266 -0.0893656 0.0538009 -0.0612727 0.000348876 0.0631282 0.0468249 -0.112313 -0.00346007 0.043719 -0.146251 0.0909109 -0.117474 0.00360519 0.239799 -0.0945356 0.05022 0.204708 0.116184 -0.137765 -0.137422 -0.229117 0.0353322 0.12854 0.181618 0.0316887 -0.069043 0.0370927 0.0626309 0.0565795 -0.107882 -0.0714017 -0.0156929 -0.0240213 0.0817804 -0.0628818 -0.00247549 0.0739686 -0.0287616 -0.100327 0.114555 0.00648079 -0.0414201 -0.0642085 0.0225648 -0.108332 0.0564072 -0.0952956 0.0647959 0.115158 -0.0155414 0.156706 -0.0157548 -0.0706177 -0.0751474 0.0437472 0.0896727 -0.105846 0.107656 -0.0520905 -0.0235355 -0.0414102 -0.123453 0.105255 -0.0136358 0.141105 -0.107941 -0.126228 -0.00636273 0.0423785 -0.0504938 0.0614181 -0.0175818 0.137308 -0.0387349 0.0411119 0.0161736 0.0357307 -0.117823 0.059617 0.0793757 0.00392993 -0.134665 -0.00692363 0.0304617 -0.0739676 -0.0367263 -0.0163334 -0.0958824 0.00484492 -0.131099 0.087405 0.0223628 0.0574412 0.0851529 -0.0660847 -0.0738265 0.0500598 0.0221649 0.0470215 -0.0537325 0.0466075 0.0110902 -0.00668565 -0.104785 0.0365727 -0.0950741 -0.0730986 0.0670029 0.163126 -0.121095 0.0435651 -0.0348138 0.210017 0.0633503 -0.0146215 -0.121059 -0.00320751 -0.12345 0.164803 -0.0628184 0.0366807 
-0.0162872 0.00130251 0.0261314 0.0635372 0.109711 0.182458 0.0515527 -0.0680097 0.049015 -0.0690564 0.00712142 0.0780448 0.0539545 -0.120853 -0.0139101 0.0371703 -0.132456 0.100384 -0.13409 0.00893361 0.238485 -0.0862915 0.045345 0.22825 0.0975854 -0.147432 -0.121141 -0.235409 0.0267689 0.130093 0.157369 0.0395753 -0.0772566 0.0564383 0.0402524 0.0390081 -0.105853 -0.0769806 -0.0288595 -0.00900383 0.0918699 -0.0622557 -0.00989837 0.0808539 -0.0407396 -0.106995 0.109138 0.00314188 -0.0422302 -0.0511961 0.0377517 -0.119195 0.0424917 -0.0875483 0.060275 0.113515 -0.0128079 0.165944 -0.00943261 -0.0546351 -0.068611 0.0439191 0.0869304 -0.106376 0.0897335 -0.0733317 -0.0218517 -0.0456449 -0.119045 0.0998359 -0.0242793 0.130192 -0.104488 -0.115577 -0.0136005 0.0432296 -0.0405656 0.0706403 -0.026893 0.127284 -0.0416178 0.0389417 0.013592 0.0212153 -0.120137 0.0795657 0.0913507 -0.0136273 -0.149892 -0.00860885 0.0370257 -0.0904137 -0.0509659 -0.0248732 -0.0958772 0.0164676 -0.133568 0.0671153 0.0313982 0.0581791 0.0827372 -0.0663647 -0.0658671 0.0818051 0.0218492 0.0264139 -0.0718371 0.059526 -0.0170827 -0.0182013 -0.0957407 0.0437814 -0.0862584 -0.0761017 0.0533811 0.162302 -0.11397 0.031128 -0.0300399 0.211972 0.0613595 -0.00941629 -0.127505 0.00949568 -0.124038 0.14833 -0.0865025 0.0226975 
-0.00836467 -0.0261733 0.0251006 0.0561122 0.116001 0.185797 0.0472599 -0.0600265 0.0438826 -0.077043 0.00515076 0.0754288 0.0511598 -0.119353 -0.00983174 0.0263344 -0.151201 0.0996332 -0.129251 0.012153 0.241473 -0.0788251 0.0526578 0.224147 0.0965668 -0.141078 -0.116791 -0.246369 0.0198563 0.114951 0.154089 0.0188895 -0.0916697 0.0500493 0.045954 0.0472826 -0.12396 -0.083539 -0.0330713 -0.0136551 0.0965176 -0.0552642 -0.034335 0.100295 -0.0559543 -0.104692 0.101238 0.0156556 -0.0329411 -0.0443168 0.0216645 -0.118464 0.0413306 -0.0873245 0.060816 0.0980799 -0.00735583 0.170328 -0.00854742 -0.057535 -0.0585918 0.0506101 0.0985149 -0.0785342 0.0800656 -0.0833782 -0.0170085 -0.0301354 -0.0886351 0.106038 -0.018451 0.14123 -0.0915788 -0.119745 -0.0232778 0.0319933 -0.0613257 0.0668992 -0.0199189 0.139813 -0.0313149 0.0421664 0.0120916 0.0110444 -0.12137 0.0755498 0.104367 0.000639742 -0.150228 -0.0161091 0.05793 -0.0737553 -0.0532857 -0.0306759 -0.108171 0.000454808 -0.134549 0.0644291 0.0324714 0.0483341 0.0880333 -0.0653294 -0.0552877 0.0548083 0.0213339 0.024625 -0.0751208 0.0616965 -0.00966957 -0.006844 -0.074852 0.0494294 -0.0872218 -0.0821308 0.0555266 0.172937 -0.113059 0.0232797 -0.0341376 0.202472 0.0593139 -0.0128895 -0.126212 0.0103253 -0.136044 0.143685 -0.0831696 0.0381161 
-0.0179052 -0.0131602 0.0414594 0.061958 0.10555 0.192431 0.0475916 -0.0737822 0.0540167 -0.0691154 0.00188168 0.0668795 0.0469752 -0.108357 0.00796261 0.0246346 -0.152159 0.103275 -0.121345 -0.00693591 0.227006 -0.0732765 0.0563637 0.231641 0.102584 -0.151236 -0.122293 -0.23784 0.014309 0.116969 0.168744 0.0198168 -0.0886928 0.0503818 0.050811 0.049006 -0.108788 -0.0855257 -0.0254799 0.00196085 0.0948662 -0.0577098 -0.0253359 0.0755516 -0.0549552 -0.122315 0.0945105 0.0124539 -0.0151834 -0.0402587 0.0354463 -0.122097 0.0543737 -0.0805434 0.0582092 0.107883 0.00377012 0.167831 -0.00304719 -0.0551089 -0.0719628 0.0551227 0.0826009 -0.10475 0.083288 -0.0637319 -0.00717476 -0.0445476 -0.108289 0.109343 -0.0197025 0.150483 -0.0936965 -0.108163 -0.0112734 0.0323031 -0.0582331 0.0508242 -0.0183024 0.133624 -0.0242393 0.0421587 0.0214964 0.0205021 -0.114126 0.071687 0.0956383 -0.00510493 -0.153579 -0.0161615 0.0445273 -0.074266 -0.0271732 -0.0351155 -0.106288 0.000940049 -0.141051 0.0701292 0.0383251 0.0620816 0.0903415 -0.0669975 -0.0575715 0.0574875 0.0333052 0.0219158 -0.0687928 0.0372545 -0.0152558 0.00329577 -0.0869982 0.0464611 -0.0682578 -0.0829727 0.0452008 0.173647 -0.100069 0.0437045 -0.0436534 0.202125 0.0719438 -0.023952 -0.128473 0.000261004 -0.138736 0.152041 -0.086347 0.0476037 
-0.0113442 -0.0298386 0.0457736 0.0737683 0.106141 0.179593 0.0665542 -0.0679428 0.080395 -0.102513 -0.0149682 0.0517059 0.040744 -0.105011 0.0234784 -0.00158043 -0.155326 0.0815119 -0.113076 -0.0133933 0.228467 -0.0650096 0.0437602 0.222775 0.106078 -0.17276 -0.141944 -0.249024 -0.00563358 0.121204 0.178799 0.016057 -0.0855457 0.0502509 0.074546 0.0410057 -0.080917 -0.0841818 -0.0404496 -0.0212805 0.116041 -0.0497812 -0.0230742 0.073438 -0.0568537 -0.103711 0.0806821 0.00702198 0.012882 -0.0439963 0.00694096 -0.129435 0.0896662 -0.070993 0.0708854 0.104129 -0.00135977 0.146581 -0.00362747 -0.0664183 -0.0604556 0.0567696 0.051245 -0.105764 0.0743058 -0.0577816 0.0186615 -0.0553701 -0.0854842 0.0806261 -0.0185734 0.134536 -0.0928184 -0.122371 -0.0140222 0.0436431 -0.0685206 0.033499 -0.00833754 0.156465 -0.0206962 0.0463341 0.00985937 0.0199926 -0.0806997 0.0725025 0.0937686 -0.00763295 -0.170491 -0.0145051 0.0640716 -0.072103 -0.0184386 -0.0594977 -0.129657 -0.00954814 -0.133868 0.0621813 0.0484397 0.0610354 0.0999474 -0.0623335 -0.0342038 0.0390302 0.016738 0.00314843 -0.0573281 0.0437641 -0.0284395 0.0338957 -0.0775721 0.0157856 -0.0936709 -0.109503 0.0333773 0.183141 -0.100526 0.0304691 -0.0593407 0.187682 0.0739402 -0.00195087 -0.136385 0.0198325 -0.127908 0.133205 -0.0770398 0.0518882 
-0.00716902 -0.00964031 0.0368085 0.0725781 0.0973505 0.181645 0.0601345 -0.0662487 0.0502818 -0.0795284 0.000539928 0.0486727 0.0573648 -0.112904 0.00796748 0.0125236 -0.148284 0.0967377 -0.119594 -0.0046975 0.238828 -0.0817798 0.0501418 0.227436 0.104773 -0.171544 -0.13627 -0.247971 0.0140927 0.133403 0.158715 0.0247269 -0.0859118 0.0537084 0.0570724 0.0296404 -0.100871 -0.0821627 -0.0331544 -0.0162364 0.0913584 -0.0711429 -0.0215189 0.081938 -0.05121 -0.106468 0.0938771 0.00993022 -0.0186102 -0.0454403 0.0301355 -0.116858 0.0716262 -0.0772827 0.0530271 0.103767 0.00706855 0.144366 0.00863962 -0.0668749 -0.0569538 0.0564482 0.0612561 -0.0987253 0.068613 -0.0641984 0.00539625 -0.0586075 -0.0993793 0.0797657 -0.0312503 0.129278 -0.0986614 -0.121095 -0.0162109 0.0341818 -0.0559891 0.0420192 -0.0116015 0.162758 -0.0256881 0.0257256 0.00726834 0.015827 -0.0961391 0.0838062 0.085848 -0.0237063 -0.159695 -0.0128635 0.0502495 -0.076929 -0.0314826 -0.0441013 -0.128924 -0.00609126 -0.138247 0.0746538 0.0467725 0.0556226 0.104265 -0.051976 -0.0383186 0.0649197 0.0252915 0.00788881 -0.0586447 0.0673064 -0.0139177 0.00924562 -0.0847851 0.0302167 -0.0926857 -0.102797 0.0352041 0.182304 -0.104083 0.0365925 -0.0445131 0.198103 0.0589992 -0.0181857 -0.13996 0.0146983 -0.128824 0.137976 -0.0819667 0.0427745 
-0.0191104 -0.0271442 0.0433192 0.0688379 0.110912 0.184269 0.0534895 -0.0754301 0.0581879 -0.0772783 -0.0121167 0.0561839 0.0441057 -0.112325 0.017639 0.0159106 -0.154799 0.0928813 -0.112109 -0.00613883 0.22227 -0.069636 0.0461017 0.229358 0.104945 -0.154683 -0.135883 -0.249934 0.00565609 0.114929 0.173112 0.0175367 -0.0987052 0.0422844 0.0685628 0.0491924 -0.099936 -0.0935424 -0.0295828 -0.0127906 0.106222 -0.0532966 -0.0266158 0.0765396 -0.0504008 -0.106928 0.0905013 0.0204579 -0.000515161 -0.0518834 0.0217701 -0.133286 0.0770159 -0.0856194 0.0630339 0.100972 0.000302991 0.155736 0.00638823 -0.0625299 -0.0587671 0.062274 0.0632629 -0.0957114 0.0801062 -0.0610205 0.00616704 -0.0476149 -0.0870838 0.0810585 -0.0208887 0.148414 -0.0850095 -0.120406 -0.0163157 0.0373661 -0.0713186 0.0512673 -0.00639429 0.150893 -0.0106527 0.0463899 0.0102996 0.0183778 -0.0980146 0.0700461 0.0966924 0.000418779 -0.163991 -0.021159 0.0531355 -0.0527063 -0.0199175 -0.0441345 -0.127725 -0.0018997 -0.13247 0.0641263 0.042364 0.0552696 0.099591 -0.0679935 -0.0452692 0.0380912 0.0243016 0.0108037 -0.0612775 0.0405649 -0.0194992 0.033413 -0.0763648 0.0339475 -0.0771522 -0.102093 0.031779 0.179894 -0.117058 0.0420883 -0.067419 0.18119 0.0638574 -0.0136373 -0.129949 0.00605467 -0.142002 0.147697 -0.0970768 0.0433902 
-0.011885 -0.0232147 0.036554 0.0617515 0.115353 0.187192 0.0469625 -0.0693191 0.0618864 -0.0811626 0.010219 0.0675335 0.0473394 -0.0965322 0.00880295 0.00642669 -0.144077 0.0995221 -0.127013 0.00695853 0.225556 -0.0812259 0.053037 0.23991 0.111559 -0.154486 -0.117837 -0.225875 0.017565 0.106043 0.179035 0.010303 -0.0908216 0.0501478 0.0431647 0.0611885 -0.124744 -0.0815386 -0.0423962 -0.0110684 0.10368 -0.0496718 -0.0421321 0.0942711 -0.0606726 -0.119811 0.0840623 0.0239299 -0.0106288 -0.0422873 0.0129236 -0.10982 0.0504943 -0.0972397 0.0589732 0.105251 -0.0247779 0.184936 -0.00348979 -0.0642871 -0.0772376 0.055596 0.0962784 -0.0904783 0.0701645 -0.0546508 -0.00262149 -0.0342506 -0.103472 0.117408 -0.0110005 0.148116 -0.0877026 -0.112626 -0.0161739 0.0231027 -0.0608839 0.0510782 -0.0166182 0.138849 -0.0364438 0.0482323 0.0161631 0.00156205 -0.10749 0.0629245 0.0996458 0.00250576 -0.146105 -0.0145192 0.0634799 -0.0741996 -0.0287428 -0.0367878 -0.0987866 -0.0127428 -0.142349 0.0556402 0.0355086 0.0437695 0.0835432 -0.0658414 -0.0494693 0.0436813 0.0110585 0.0373123 -0.0727562 0.0364 0.00307284 -0.0027446 -0.0674132 0.058742 -0.0848095 -0.0730305 0.0541342 0.166713 -0.105812 0.0269317 -0.0276361 0.206932 0.0676215 -0.0180444 -0.140447 0.0174285 -0.141374 0.144954 -0.076187 0.0462509 
-0.0207815 -0.00904062 0.0586514 0.0753529 0.0965812 0.190327 0.0611238 -0.0798049 0.0757849 -0.0847321 -0.0176197 0.0551608 0.0388651 -0.112409 0.0369611 0.00736779 -0.150257 0.0759283 -0.111331 -0.0245791 0.205796 -0.0559553 0.0427775 0.229541 0.106773 -0.165042 -0.138546 -0.24195 -0.00331147 0.116791 0.189721 0.0256732 -0.0884179 0.0540774 0.0689012 0.0427899 -0.0726568 -0.0859411 -0.0291328 0.00468179 0.116739 -0.0607192 -0.0178443 0.0539841 -0.0486849 -0.108809 0.0842149 0.00531924 0.00773558 -0.0449303 0.0352512 -0.128249 0.086822 -0.0756756 0.0636207 0.110545 -0.000485364 0.15133 0.00270933 -0.053809 -0.0763306 0.0569692 0.0420107 -0.128249 0.0868505 -0.0543205 0.0220582 -0.063246 -0.109817 0.086648 -0.0220334 0.143083 -0.0965606 -0.104855 -9.00131e-05 0.0439589 -0.065207 0.0358123 -0.0107318 0.156962 -0.0162616 0.0403595 0.0230253 0.0292638 -0.0860212 0.0617358 0.0938857 -0.0171061 -0.177636 -0.0136417 0.0385293 -0.0714149 -0.00362447 -0.0486465 -0.12754 0.00141329 -0.127085 0.0575036 0.0496313 0.0675434 0.0908162 -0.0621917 -0.0500526 0.0566357 0.0249776 0.000695751 -0.0586547 0.0327319 -0.0325423 0.0329282 -0.0849503 0.0235612 -0.0782022 -0.103122 0.0278749 0.173764 -0.105831 0.0463129 -0.0652716 0.193655 0.0845605 -0.010578 -0.133862 0.00867357 -0.118444 0.141022 -0.0867848 0.0470516 
-0.00638368 -0.0221818 0.0442809 0.0833827 0.095093 0.174041 0.0801727 -0.074644 0.0835558 -0.097892 -0.0231142 0.0522926 0.0428273 -0.11346 0.0242867 0.00484688 -0.140775 0.0752092 -0.11432 -0.014798 0.209008 -0.0587707 0.0390005 0.236466 0.0898051 -0.176685 -0.145729 -0.25547 -0.0110832 0.128703 0.173247 0.0365888 -0.0886066 0.0555337 0.0691858 0.0301482 -0.0570505 -0.0763595 -0.0383817 -0.00150571 0.113543 -0.0537066 -0.018714 0.0462248 -0.0462219 -0.101857 0.0798208 0.00466163 0.0198207 -0.0406501 0.0257494 -0.138776 0.101799 -0.0648901 0.0663375 0.104857 0.0120695 0.141179 0.00689379 -0.050365 -0.0636397 0.0623084 0.0317628 -0.131419 0.0744606 -0.0625913 0.0300661 -0.073585 -0.0995752 0.0573303 -0.0317565 0.127079 -0.0946667 -0.10177 -0.00803246 0.0498446 -0.0570847 0.0352646 -0.00891916 0.156476 -0.0112378 0.0389283 0.00520281 0.0214345 -0.073123 0.0770804 0.0873305 -0.0262083 -0.18676 -0.0202861 0.0495405 -0.0722642 -0.00237987 -0.0599506 -0.130449 0.00451483 -0.124758 0.0526887 0.0599526 0.0716466 0.100785 -0.0635293 -0.0429433 0.0671131 0.0244226 -0.0160827 -0.0537598 0.0400534 -0.0451377 0.0451211 -0.0841088 0.0147391 -0.077071 -0.116202 0.0102678 0.185465 -0.102168 0.0414998 -0.078132 0.183042 0.0686355 0.000687454 -0.13522 0.019162 -0.125166 0.134268 -0.105036 0.0345947 
-0.0152094 -0.0246566 0.0812364 0.11307 0.0897448 0.166705 0.0850697 -0.11225 0.110522 -0.101432 -0.0318905 0.0648173 0.0164788 -0.0901441 0.0444489 -0.0106677 -0.125099 0.0679852 -0.0920644 -0.0401664 0.174446 -0.0383546 0.0277079 0.240123 0.104941 -0.161864 -0.157135 -0.234886 -0.0253656 0.121698 0.193527 0.054435 -0.0873849 0.043716 0.0820236 0.0288225 -0.0366208 -0.062696 -0.0259077 0.00685698 0.133571 -0.0283457 -0.0199061 0.000521263 -0.0489727 -0.11219 0.0576238 -0.0192631 0.0639233 -0.0591117 0.0439589 -0.120888 0.133309 -0.0607447 0.0794308 0.107529 0.0163607 0.141978 0.00428757 -0.0356518 -0.0809763 0.0539637 0.00457091 -0.160144 0.093246 -0.0337587 0.0565076 -0.0876496 -0.113848 0.0745427 -0.0136317 0.140732 -0.0843917 -0.0750994 0.00492367 0.0572667 -0.0646409 0.00837444 -0.0135376 0.146259 -0.0146148 0.0657667 0.0303054 0.0270574 -0.039203 0.0312449 0.092838 -0.0185513 -0.205608 -0.0293483 0.0285368 -0.0578445 0.0437215 -0.0624326 -0.123611 -0.00871551 -0.103301 0.0356433 0.0760078 0.0794722 0.0947039 -0.0585933 -0.0397191 0.0654614 0.0265107 -0.0254049 -0.0260681 -0.00423185 -0.0398506 0.0637513 -0.0871056 0.00562255 -0.0613081 -0.119668 0.0153086 0.166729 -0.103078 0.0460028 -0.0924535 0.162878 0.0872717 0.0100063 -0.140945 -0.00700348 -0.101581 0.155637 -0.0882111 0.048895 
-0.0171668 -0.0293999 0.0751287 0.101452 0.104244 0.173502 0.0780795 -0.098791 0.0935281 -0.110622 -0.0328054 0.0685988 0.0196933 -0.0996147 0.0326268 -0.00614148 -0.139383 0.0734866 -0.103036 -0.0270629 0.194457 -0.051023 0.0316717 0.229367 0.108748 -0.167151 -0.156772 -0.236635 -0.022536 0.118131 0.191857 0.0404659 -0.0946904 0.0429247 0.0830861 0.0350492 -0.0609966 -0.0792826 -0.0292566 -0.00652055 0.130725 -0.0315935 -0.0163633 0.022814 -0.0484867 -0.108765 0.0670469 -0.0143852 0.0404324 -0.0518942 0.0286262 -0.132174 0.116646 -0.0689832 0.0745646 0.103471 0.00260903 0.151288 -0.00434066 -0.0414279 -0.0705243 0.0632603 0.0226276 -0.142685 0.0946773 -0.0417142 0.0360267 -0.0781245 -0.112654 0.0773193 -0.00974113 0.14315 -0.0816749 -0.0920186 -0.00792531 0.056948 -0.0627373 0.0125672 -0.0106183 0.150112 -0.0177429 0.0555675 0.0229818 0.0262931 -0.0618708 0.0438235 0.0925048 -0.0102011 -0.196637 -0.0230806 0.041943 -0.0598768 0.0192765 -0.0548321 -0.122369 -0.00225476 -0.111756 0.0432184 0.0583622 0.0775341 0.0898651 -0.065575 -0.0462358 0.053966 0.0251332 -0.00711575 -0.0338873 0.0163478 -0.0377607 0.0541205 -0.0856194 0.00683117 -0.0719342 -0.110622 0.0239279 0.169973 -0.107467 0.0524618 -0.0787386 0.174468 0.0769353 0.00708385 -0.138681 -0.00383613 -0.105882 0.1502 -0.0845462 0.0406893 
-0.00972978 -0.0155285 0.0643361 0.0951182 0.105048 0.176943 0.0927415 -0.0930443 0.0906309 -0.0967707 -0.0158691 0.0642037 0.028261 -0.101041 0.0331896 -0.00389605 -0.140311 0.0810846 -0.10773 -0.0385336 0.210524 -0.0453475 0.0140402 0.224368 0.112614 -0.169123 -0.15874 -0.233249 -0.00711753 0.139996 0.176968 0.0438681 -0.0949201 0.0489194 0.0850859 0.0247204 -0.0607761 -0.0901305 -0.0193579 -0.00995458 0.129959 -0.0381246 -0.00507631 0.037813 -0.048615 -0.104926 0.0696502 -0.0144967 0.0298278 -0.0658803 0.0347486 -0.121509 0.100013 -0.0675815 0.074728 0.112443 -0.00677255 0.151551 -0.0131993 -0.0376392 -0.0669623 0.0480796 0.0296777 -0.133093 0.0872942 -0.0415422 0.0303261 -0.0764068 -0.107237 0.0740121 -0.00838579 0.140461 -0.0871779 -0.106058 -0.0110041 0.0600076 -0.0613252 0.0148941 -0.0167903 0.145328 -0.011862 0.057207 0.0274225 0.0331172 -0.0677557 0.0546914 0.0979573 -0.0220489 -0.190022 -0.0111801 0.0437377 -0.0767118 -0.00316601 -0.0535405 -0.132403 -0.00712331 -0.119667 0.038307 0.0648014 0.0787274 0.0960891 -0.0544367 -0.0348422 0.0584158 0.0161363 -0.00532606 -0.0380549 0.0329892 -0.0401766 0.0461244 -0.0790137 -0.00448285 -0.0900223 -0.110476 0.0305613 0.171414 -0.103243 0.0479609 -0.0725801 0.174041 0.0839422 0.000647224 -0.136907 0.00500667 -0.102024 0.147538 -0.0775504 0.0417462 
-0.0312844 -0.0284533 0.100651 0.105183 0.103502 0.17186 0.0663134 -0.111521 0.100936 -0.0995882 -0.0290683 0.0657288 0.00763955 -0.0881503 0.0615368 -0.00489053 -0.1456 0.0541796 -0.0844953 -0.041218 0.186521 -0.041483 0.0205313 0.216836 0.132839 -0.150259 -0.159351 -0.219482 -0.0170401 0.109423 0.210746 0.0287663 -0.0873898 0.0386941 0.0966114 0.0480572 -0.0623396 -0.0873711 -0.0171652 -0.0188522 0.137247 -0.0309027 -0.0144397 0.0144284 -0.0376305 -0.103972 0.0542025 -0.0130755 0.0519587 -0.0705469 0.0243324 -0.120077 0.126197 -0.0805191 0.0866596 0.106816 -0.0186278 0.148338 -0.020645 -0.0358274 -0.0760123 0.0498484 0.0142098 -0.130247 0.106139 -0.0133087 0.0349804 -0.0651706 -0.110166 0.085698 0.000898844 0.155471 -0.0851432 -0.105657 0.000476751 0.0596665 -0.0677211 0.00354079 -0.0044098 0.160876 -0.0110089 0.0548943 0.0403581 0.0358563 -0.0553038 0.0121334 0.0977954 0.00801939 -0.191909 -0.0133661 0.0384355 -0.0466998 0.0291319 -0.0347138 -0.136417 -0.00938092 -0.110037 0.0289563 0.0605423 0.0682985 0.0933289 -0.0645167 -0.0514137 0.0131755 0.0211547 0.00495334 -0.0188135 -0.00602112 -0.0210905 0.0594793 -0.0798735 -0.000850518 -0.0808651 -0.108376 0.0470814 0.162602 -0.113964 0.0656042 -0.0873005 0.172336 0.0891598 0.00436008 -0.138486 -0.0101586 -0.0940517 0.166461 -0.0522464 0.0564855 
-0.0190972 -0.0148746 0.0780146 0.0966541 0.101842 0.176444 0.0786787 -0.105347 0.0902483 -0.103488 -0.0251964 0.0589006 0.0262369 -0.0949422 0.0338659 0.000179745 -0.14434 0.0709166 -0.11035 -0.0287717 0.202631 -0.0537467 0.023982 0.226035 0.11358 -0.166038 -0.165404 -0.227649 -0.00566341 0.124647 0.193277 0.0429237 -0.0995762 0.044034 0.0848085 0.0375235 -0.0683092 -0.0769688 -0.018723 -0.00903568 0.122236 -0.0376458 -0.0131652 0.0215701 -0.0350502 -0.108139 0.0659976 -0.00457824 0.0305421 -0.0600412 0.0228394 -0.122068 0.112631 -0.0737807 0.0722879 0.104497 -0.00760046 0.158238 -0.011999 -0.0455171 -0.0727751 0.0653677 0.031596 -0.13707 0.0893513 -0.0251406 0.0335021 -0.0750943 -0.118941 0.0727465 -0.00932507 0.144769 -0.0841711 -0.0914759 -0.00506175 0.051155 -0.0583298 0.00609836 -0.0061297 0.15403 -0.00637217 0.0500665 0.022607 0.024839 -0.0679425 0.0423669 0.0879787 -0.0106956 -0.187526 -0.0159129 0.0489962 -0.0643779 0.0185762 -0.0432047 -0.125383 -0.00311891 -0.117571 0.0431674 0.0594549 0.0773478 0.0953739 -0.0636539 -0.0527174 0.0521638 0.0204688 0.00624344 -0.0319977 0.0214271 -0.0239183 0.0476342 -0.0822441 0.0101453 -0.0838169 -0.102507 0.0320767 0.172782 -0.11221 0.0653342 -0.0747335 0.17636 0.0741237 -0.000779859 -0.136944 -0.00197988 -0.112051 0.156167 -0.0820688 0.037474 
-0.0298864 -0.0243679 0.0911395 0.0962906 0.0990052 0.170661 0.0732485 -0.108123 0.0975137 -0.107486 -0.0269177 0.0587399 0.0228496 -0.0823242 0.0521645 0.00218659 -0.150056 0.0429675 -0.0995506 -0.0339226 0.195304 -0.054049 0.0191804 0.204242 0.122366 -0.152615 -0.170535 -0.22224 -0.0154115 0.114483 0.208414 0.0381342 -0.0904526 0.0397383 0.0899115 0.0494546 -0.0650315 -0.0723052 -0.0142852 -0.0127773 0.129498 -0.0314595 -0.0157072 0.0103168 -0.025347 -0.0963122 0.0559086 -0.0135242 0.0383955 -0.0715608 0.00463085 -0.126573 0.122281 -0.0747581 0.0785849 0.105219 -0.0215465 0.157076 -0.0267359 -0.0356697 -0.075507 0.060111 0.0227726 -0.133893 0.103308 -0.00558399 0.0358481 -0.0579961 -0.111528 0.0660497 0.0027561 0.148623 -0.0867214 -0.102718 0.00542114 0.0626703 -0.0628342 -0.00631568 -0.00380517 0.164483 -0.00964957 0.0398782 0.0288095 0.0326152 -0.0733243 0.0297131 0.095704 -0.00208462 -0.191344 -0.0185282 0.0457798 -0.0597991 0.030711 -0.0334328 -0.135438 -0.00334411 -0.112109 0.0321427 0.0609717 0.0784286 0.088765 -0.0717191 -0.0598426 0.0269651 0.0173987 0.013696 -0.0260336 0.0128802 -0.0229977 0.0477947 -0.0854706 -0.00180763 -0.089945 -0.105458 0.0442435 0.174425 -0.122052 0.0758757 -0.0829228 0.17508 0.0765411 0.00135005 -0.137208 0.000540707 -0.0978836 0.163586 -0.0682609 0.0477534 
-0.053383 -0.0176137 0.103164 0.118463 0.103778 0.169103 0.050929 -0.142008 0.102894 -0.0924533 -0.0262251 0.0676876 -0.0123251 -0.0793848 0.0665311 0.0051248 -0.150326 0.0464291 -0.0663727 -0.0455618 0.165775 -0.047276 0.0169948 0.195869 0.150835 -0.127855 -0.163268 -0.207841 -0.0158755 0.0989549 0.224685 0.0420492 -0.078999 0.0214773 0.102789 0.0693279 -0.073275 -0.092833 -0.0130324 -0.0238623 0.142379 -0.0256016 -0.00861817 0.0060144 -0.0302376 -0.0860259 0.0618556 -0.0216863 0.0478398 -0.0900839 0.0120727 -0.112926 0.134268 -0.0971956 0.0893325 0.113621 -0.0326616 0.150402 -0.0246179 -0.0246856 -0.0889191 0.0521109 0.0221025 -0.131611 0.129433 0.015882 0.030707 -0.064211 -0.114882 0.100666 0.0107476 0.166958 -0.0766841 -0.0983757 0.0123296 0.0600104 -0.0745207 -0.00356905 -0.0198711 0.142628 -0.0116584 0.0657756 0.0348142 0.0342322 -0.0667196 0.00225148 0.0902443 0.0114672 -0.195421 -0.0129302 0.0359271 -0.0276026 0.0318232 -0.0332022 -0.118801 -0.00252024 -0.103418 0.0283781 0.06474 0.065583 0.0758314 -0.0781144 -0.0511595 -0.0159208 0.0136634 0.0271804 -0.0033142 -0.0162799 -0.0117864 0.0659945 -0.0809954 0.000854629 -0.0703949 -0.115292 0.0598351 0.142648 -0.121846 0.0692939 -0.0714839 0.163299 0.0982575 0.00265678 -0.128007 -0.01689 -0.0883236 0.183385 -0.0359207 0.0597032 
-0.0516841 -0.0316912 0.106323 0.103655 0.0981539 0.168098 0.0503411 -0.128535 0.096495 -0.0972658 -0.0340368 0.0639971 -0.00130803 -0.0749174 0.0752977 0.00110289 -0.157377 0.0324929 -0.0656736 -0.0478372 0.16874 -0.0393285 0.0144757 0.196455 0.141591 -0.122183 -0.161489 -0.213268 -0.0245281 0.0973688 0.219471 0.0327372 -0.0843986 0.0264693 0.100189 0.0706699 -0.0669328 -0.0944715 -0.0110799 -0.0147673 0.143793 -0.0283784 -0.0118453 0.00710511 -0.0270788 -0.0838916 0.0600247 -0.0164005 0.052347 -0.086803 0.0102065 -0.125987 0.136685 -0.0860134 0.0943274 0.109168 -0.0288512 0.150048 -0.022194 -0.0273537 -0.0797604 0.0562813 0.0119778 -0.121162 0.119552 0.00910359 0.0367834 -0.0537337 -0.0985464 0.0832334 0.00764069 0.163111 -0.0786964 -0.105472 0.017537 0.0649294 -0.0818116 -0.00538223 -0.00820789 0.157429 -0.00156361 0.0567208 0.0401921 0.0366449 -0.071091 0.00457256 0.102207 0.0128709 -0.197468 -0.0172724 0.0358485 -0.0277116 0.0396186 -0.0309513 -0.141096 0.000169039 -0.10342 0.025552 0.0673577 0.0655401 0.0809358 -0.0748109 -0.05372 -0.0129924 0.0141452 0.0175017 -0.0188512 -0.0124121 -0.0264732 0.0674203 -0.0748181 -0.00391205 -0.0784483 -0.119856 0.0481738 0.15705 -0.123086 0.0683568 -0.0900382 0.159586 0.0964523 -0.000355915 -0.12767 -0.016053 -0.0953293 0.179728 -0.0492967 0.063901 
-0.00931584 -0.0292271 0.0655243 0.0847322 0.100956 0.189773 0.076319 -0.0741113 0.0738465 -0.0989433 -0.0156564 0.0549096 0.0349866 -0.111758 0.0453657 -0.0132251 -0.151398 0.0671855 -0.105181 -0.0224722 0.202496 -0.0530898 0.0212629 0.228503 0.113047 -0.169353 -0.150222 -0.23815 -0.0109822 0.11177 0.191688 0.0159512 -0.103685 0.0510697 0.0789263 0.0422772 -0.0842935 -0.104513 -0.0340236 -0.0139491 0.128373 -0.0541091 -0.027306 0.0587357 -0.0472465 -0.107747 0.066406 0.00899214 0.0178156 -0.0503803 0.017944 -0.132117 0.0994718 -0.0842271 0.0613471 0.103237 -0.0293823 0.158648 -0.00309042 -0.0465376 -0.0696399 0.0637361 0.0398847 -0.120846 0.0783713 -0.0401732 0.0323114 -0.0731248 -0.105199 0.0666975 -0.0164003 0.140312 -0.0852623 -0.110992 -0.0125366 0.0423266 -0.0641091 0.0169281 0.000658604 0.173404 -0.00984652 0.0296671 0.0174162 0.017261 -0.0718157 0.0526066 0.0981581 -0.0173673 -0.180831 -0.00950006 0.0603429 -0.0614025 -0.00399631 -0.0447379 -0.139595 -0.004426 -0.121311 0.0326506 0.0503825 0.0644489 0.0946017 -0.0580621 -0.0414064 0.028105 0.0101798 0.00885923 -0.0425181 0.0325404 -0.0345465 0.0482922 -0.0643031 0.0120572 -0.0861364 -0.113741 0.0309742 0.172291 -0.108226 0.0540029 -0.0656165 0.180173 0.073795 -0.017899 -0.139295 0.0150506 -0.107676 0.140534 -0.0769459 0.0414589 
-0.0113823 -0.0149328 0.0523219 0.0761562 0.106059 0.192226 0.0794313 -0.0759305 0.0686952 -0.0839928 -0.0150435 0.0550047 0.0394865 -0.111139 0.0390645 -0.00300034 -0.150087 0.0781707 -0.1095 -0.0276237 0.206525 -0.0538722 0.0235225 0.225398 0.109695 -0.167856 -0.153077 -0.237598 0.000105438 0.12069 0.182861 0.0260645 -0.105772 0.0487955 0.0737737 0.0417178 -0.0858935 -0.106734 -0.0273572 -0.00525461 0.126136 -0.054465 -0.0188838 0.0636811 -0.0518822 -0.101224 0.0755493 0.0115786 0.0104038 -0.0541439 0.0266838 -0.123867 0.0829244 -0.0835834 0.0608488 0.10626 -0.0167008 0.16113 -0.000864293 -0.0420188 -0.071124 0.0632381 0.0461506 -0.119257 0.0779698 -0.0504464 0.0218536 -0.0651426 -0.103608 0.0749176 -0.0116629 0.149311 -0.0860967 -0.107944 -0.0111947 0.0482287 -0.0689915 0.0284589 -0.0075631 0.156704 -0.00878752 0.0390041 0.0222922 0.0283013 -0.0855021 0.0636488 0.100346 -0.0211759 -0.1776 -0.0128365 0.0510297 -0.0648312 -0.0127089 -0.0515636 -0.132363 -0.00575625 -0.123006 0.0435853 0.047415 0.0661517 0.0933773 -0.0555691 -0.0369804 0.044475 0.00883274 0.00859431 -0.0549245 0.0434937 -0.0306841 0.0443771 -0.0653089 0.0124539 -0.0865063 -0.10975 0.0296713 0.173013 -0.104079 0.048461 -0.0620185 0.185971 0.0789661 -0.019663 -0.13453 0.0140989 -0.120857 0.140788 -0.0871527 0.0443763 
-0.0206327 -0.028279 0.0789617 0.101308 0.10501 0.173198 0.0736162 -0.0927518 0.0920975 -0.0959814 -0.021207 0.0584318 0.022173 -0.100422 0.0520504 -0.00790077 -0.147986 0.06199 -0.0923188 -0.023486 0.198085 -0.0574461 0.0254033 0.219692 0.125357 -0.165795 -0.162974 -0.233797 -0.0127569 0.116678 0.200625 0.0290138 -0.0869554 0.0412819 0.0865714 0.0447207 -0.0756857 -0.0907341 -0.029934 -0.0233101 0.130849 -0.044669 -0.0228667 0.0350023 -0.0463771 -0.10128 0.0609358 -0.00397587 0.0389856 -0.0613593 0.0159194 -0.119189 0.115808 -0.0852065 0.0766354 0.105233 -0.0186275 0.144605 -0.012435 -0.0390908 -0.0746443 0.0539338 0.0251748 -0.124788 0.0926008 -0.0265704 0.0310864 -0.0712047 -0.109703 0.0720223 -0.00676589 0.149488 -0.0886701 -0.109194 -0.00533877 0.0542227 -0.0642941 0.00973946 -0.00307859 0.170635 -0.0171676 0.0395005 0.0243468 0.0306811 -0.0597033 0.038987 0.0933852 -0.00310907 -0.182638 -0.0146391 0.0485689 -0.049889 0.00981654 -0.0411919 -0.138075 -0.0132089 -0.118717 0.0355963 0.0569443 0.0632144 0.0986733 -0.0619541 -0.0411908 0.0179155 0.0152885 0.0102445 -0.0256279 0.0186494 -0.0140815 0.0547044 -0.077896 0.00446045 -0.0871297 -0.116402 0.0400602 0.170889 -0.107628 0.056605 -0.0728725 0.183366 0.0787449 -0.00463688 -0.143827 0.00651387 -0.104086 0.156135 -0.0583749 0.0535147 
-0.00557215 -0.0372185 0.0576869 0.0837368 0.106619 0.189823 0.0704557 -0.0820624 0.0678441 -0.0979615 -0.0148101 0.0717859 0.0334142 -0.112728 0.030195 -0.00896316 -0.154854 0.0744185 -0.103106 -0.0141336 0.204364 -0.0507437 0.0350644 0.236033 0.105286 -0.154689 -0.136959 -0.245066 -0.00952805 0.115095 0.175068 0.0178145 -0.104183 0.0495986 0.0720895 0.0404892 -0.0885113 -0.0944305 -0.0307015 -0.00720354 0.12644 -0.0499155 -0.0326031 0.0590198 -0.0629193 -0.111869 0.0748061 0.00703573 0.0202378 -0.0430888 0.0291153 -0.124043 0.093483 -0.0756373 0.074109 0.0976557 -0.00744488 0.163301 -0.00505628 -0.0460282 -0.0685636 0.0599426 0.0568828 -0.113853 0.081204 -0.0534725 0.0268943 -0.0643977 -0.0984316 0.080853 -0.0183165 0.147364 -0.0844044 -0.099805 -0.0102696 0.0436442 -0.0678498 0.0227788 -0.00361388 0.168392 -0.0110923 0.0419459 0.0278306 0.0178234 -0.0765689 0.0500027 0.105805 -0.0052729 -0.17954 -0.016876 0.0566195 -0.0605944 -0.00453597 -0.0396578 -0.138145 -0.013823 -0.119579 0.0405093 0.0591188 0.0583717 0.0966508 -0.055819 -0.0427343 0.0411688 0.0158657 0.00449603 -0.0479833 0.0343772 -0.0324352 0.043834 -0.0613531 0.0255489 -0.0772111 -0.106712 0.0302512 0.178204 -0.108664 0.0474879 -0.0673763 0.184162 0.0750166 -0.0164136 -0.134441 -4.21662e-05 -0.119826 0.152014 -0.0797358 0.0478695 
-0.0101276 -0.0303101 0.0625525 0.106063 0.108794 0.177686 0.0736699 -0.0988672 0.087804 -0.102311 -0.0199671 0.0658488 0.0221801 -0.0925457 0.0343557 -0.0185579 -0.126291 0.0820681 -0.094082 -0.0226103 0.195284 -0.0627857 0.0317386 0.241345 0.123069 -0.174829 -0.151958 -0.231659 -0.0195087 0.117946 0.195753 0.0311051 -0.0986074 0.0422917 0.0767453 0.0445729 -0.0827935 -0.0963573 -0.0366918 -0.017339 0.127491 -0.0332622 -0.0270683 0.0411763 -0.0545889 -0.107633 0.0624988 -0.00129919 0.0393008 -0.0538857 0.030288 -0.117721 0.111108 -0.0876208 0.0679773 0.105175 -0.0129658 0.159689 0.0057277 -0.0429922 -0.0702343 0.065756 0.0314241 -0.135863 0.0845399 -0.0429513 0.0337728 -0.0750112 -0.114143 0.089219 -0.00751539 0.148339 -0.0835868 -0.102739 -0.0192078 0.0485969 -0.0597503 0.0173311 -0.0107421 0.156465 -0.0297536 0.0523268 0.0193216 0.0153414 -0.0601097 0.0396924 0.0909692 -0.016266 -0.187927 -0.0234556 0.045748 -0.05453 0.0151761 -0.0552734 -0.117329 -0.0137137 -0.115973 0.0358172 0.0522869 0.0641489 0.0925187 -0.0541683 -0.037021 0.0420974 0.0138173 0.00470704 -0.0358694 0.0148497 -0.0272354 0.0541808 -0.0724643 0.0111679 -0.0748733 -0.108909 0.0274352 0.165367 -0.103408 0.0420651 -0.0643257 0.182239 0.0719483 -0.00294543 -0.149999 0.00354266 -0.10995 0.148435 -0.0763273 0.0444066 
-0.0358643 -0.0265538 0.108744 0.124713 0.094496 0.160361 0.0617454 -0.135711 0.110666 -0.100695 -0.0373709 0.0720643 -0.00298973 -0.0764928 0.0530581 -0.0102321 -0.127959 0.0495981 -0.072013 -0.048911 0.16243 -0.0411059 0.0175234 0.221711 0.134683 -0.138443 -0.163022 -0.209539 -0.0209229 0.107861 0.215025 0.0533468 -0.0904788 0.0209807 0.0899208 0.0392669 -0.0589648 -0.0731363 -0.0087566 -0.00310005 0.140216 -0.0172351 -0.0251277 -0.0174493 -0.0311891 -0.108357 0.0451472 -0.0274677 0.0745566 -0.0854649 0.0399811 -0.0993522 0.152483 -0.0818781 0.0801787 0.103202 2.90521e-05 0.144293 -0.00832796 -0.0323758 -0.0800723 0.0536052 -0.00292424 -0.142163 0.104882 -0.00358206 0.0570372 -0.0764056 -0.11594 0.0811044 0.00358437 0.156863 -0.0763789 -0.0831754 0.0106892 0.0629563 -0.0726756 -0.0116851 -0.0126056 0.163099 -0.01376 0.0693151 0.0495915 0.0346246 -0.0327352 -0.00288648 0.0951768 0.00658717 -0.203997 -0.0390435 0.0132152 -0.0278188 0.0589326 -0.0330554 -0.127466 -0.0172946 -0.0887238 0.0230683 0.0682853 0.069429 0.0895568 -0.0625191 -0.0503318 0.0363476 0.0229187 -0.00562897 -0.00352177 -0.0192443 -0.0170039 0.0675683 -0.0821243 -0.000334819 -0.0679895 -0.112648 0.0332221 0.154307 -0.128949 0.0702242 -0.0933384 0.153843 0.0812261 0.0103524 -0.144028 -0.0361265 -0.0875972 0.180008 -0.0661018 0.0580911 
-0.0305501 -0.030082 0.0991979 0.108655 0.0975228 0.169632 0.0748279 -0.107539 0.108104 -0.104723 -0.0284742 0.0623125 0.00677869 -0.0900775 0.0583955 -0.00632246 -0.144691 0.051837 -0.0923554 -0.0415824 0.183924 -0.0447735 0.0175823 0.219023 0.126215 -0.155318 -0.163003 -0.22279 -0.0222787 0.10341 0.209624 0.0347007 -0.088498 0.0430958 0.092305 0.0462143 -0.0564667 -0.0811889 -0.023502 -0.0142237 0.142541 -0.0298227 -0.0172496 0.00740831 -0.0345034 -0.103771 0.0511444 -0.0162013 0.051576 -0.0705145 0.0170903 -0.12792 0.128684 -0.0758964 0.0836697 0.107241 -0.0173213 0.146405 -0.0180895 -0.0351838 -0.0765541 0.0553116 0.00967701 -0.137964 0.104108 -0.00694832 0.0407096 -0.0699768 -0.109089 0.0799897 -0.00201137 0.149029 -0.0811505 -0.0974989 0.00468981 0.0590634 -0.0666225 0.00340667 -0.00697718 0.152744 -0.0138797 0.0549726 0.0328588 0.0287103 -0.0567139 0.0230742 0.0980836 0.00148326 -0.198655 -0.0162828 0.0448554 -0.0524258 0.033067 -0.0440208 -0.133132 -0.00426678 -0.110669 0.0234471 0.0649333 0.0762826 0.0904068 -0.0719459 -0.0504729 0.0202146 0.0243343 0.0018723 -0.0187313 -0.00351704 -0.0311608 0.0583817 -0.0830146 0.00199879 -0.074865 -0.114409 0.0432238 0.161173 -0.115412 0.0637163 -0.0849475 0.166373 0.0868551 0.0073415 -0.138748 -0.00169187 -0.0922842 0.16339 -0.0622158 0.0502568 
-0.0321279 -0.0232694 0.107053 0.111287 0.100154 0.17112 0.065725 -0.116645 0.109568 -0.0954418 -0.0276955 0.0625111 0.00476594 -0.0834246 0.0582259 -0.0067965 -0.135009 0.0635103 -0.0901442 -0.0465859 0.178698 -0.0447849 0.0252889 0.224193 0.132837 -0.155942 -0.16235 -0.212123 -0.0151707 0.103023 0.216613 0.0415888 -0.089818 0.0340255 0.0904405 0.0448579 -0.0663977 -0.0771156 -0.016938 -0.00964795 0.135787 -0.0268576 -0.0270497 -0.00130819 -0.0368521 -0.113807 0.0426071 -0.014211 0.0580746 -0.073411 0.0323125 -0.105437 0.131312 -0.0855123 0.0726143 0.106655 -0.00889695 0.147558 -0.0147411 -0.0354047 -0.084595 0.0525955 0.00891011 -0.141162 0.103485 -0.00745742 0.0422957 -0.0698577 -0.123252 0.0946738 0.00325024 0.156492 -0.0822355 -0.0933005 0.00188756 0.0541295 -0.0677608 -0.0034121 -0.00881434 0.155904 -0.0171843 0.0599746 0.0427496 0.0302446 -0.0479814 0.00874662 0.0943407 0.0056007 -0.193359 -0.0216877 0.0298923 -0.0425075 0.041114 -0.0359267 -0.123075 -0.0128511 -0.107512 0.0264906 0.0583962 0.0724907 0.0945123 -0.0662842 -0.054731 0.0283328 0.0297094 0.0024507 -0.0128426 -0.016927 -0.00861879 0.0560233 -0.0857654 0.00926223 -0.0700218 -0.105766 0.0472142 0.156797 -0.118508 0.0685369 -0.0791469 0.17007 0.0860527 0.00229749 -0.144757 -0.0167259 -0.0890243 0.170964 -0.0577229 0.0537747 
-0.00727463 -0.0294919 0.090064 0.0978364 0.102578 0.186301 0.0771806 -0.0820316 0.0844641 -0.0918973 -0.0144239 0.0669676 0.0286683 -0.104388 0.0522115 -0.00834787 -0.13754 0.0746631 -0.110745 -0.0254382 0.198742 -0.0476881 0.0324572 0.238037 0.116651 -0.166716 -0.152574 -0.230312 -0.0112903 0.108253 0.193403 0.034603 -0.0995945 0.0602546 0.0707539 0.0361236 -0.0761852 -0.0809534 -0.0269516 -0.00572869 0.129488 -0.0472914 -0.0323208 0.0279 -0.052611 -0.125785 0.0534179 -0.00451628 0.0338333 -0.0488152 0.0447761 -0.117893 0.0948517 -0.0778369 0.0670918 0.10198 -0.0134922 0.154851 -0.00734312 -0.0375311 -0.0764346 0.0494697 0.0251958 -0.137184 0.0904443 -0.036263 0.0335679 -0.0695703 -0.121745 0.093378 -0.0140846 0.152452 -0.0888214 -0.0914091 -0.0110942 0.0410519 -0.0550964 0.0140172 -0.00330931 0.165352 -0.0198404 0.0396404 0.0370644 0.0195109 -0.0590987 0.0303307 0.105059 -0.00528022 -0.183136 -0.0132005 0.0444776 -0.0659855 0.0112563 -0.0335464 -0.13347 -0.00938484 -0.117332 0.0268853 0.0549299 0.0715121 0.0943653 -0.0577276 -0.0543623 0.0500821 0.0303474 -0.000498766 -0.0361968 0.0111369 -0.0162499 0.0365691 -0.0850578 0.0251193 -0.0781741 -0.100185 0.0469663 0.162614 -0.103755 0.0557697 -0.0712275 0.189534 0.0818825 -0.00362943 -0.142831 0.00508888 -0.0918553 0.149921 -0.0644045 0.0458984 
-0.00276119 -0.0357561 0.0672882 0.089297 0.108287 0.177619 0.0841803 -0.0708003 0.0795297 -0.109435 -0.0169571 0.0618809 0.0340334 -0.107704 0.0347997 -0.0156881 -0.143276 0.0762177 -0.121 -0.0151484 0.209352 -0.0562022 0.0245658 0.234425 0.110478 -0.175651 -0.156261 -0.233923 -0.0100859 0.111577 0.189116 0.0278276 -0.109741 0.0537504 0.0706567 0.0372422 -0.0903151 -0.092086 -0.038614 -0.0122079 0.132402 -0.0402094 -0.0320664 0.058495 -0.0509279 -0.113347 0.0600251 0.00446701 0.0260846 -0.0475864 0.0177879 -0.12766 0.0901529 -0.0839166 0.0599016 0.0966379 -0.0252737 0.164571 -0.00200477 -0.0451852 -0.0670195 0.0637542 0.0362979 -0.114121 0.0700541 -0.0511025 0.0335006 -0.0716907 -0.104891 0.0714591 -0.00965799 0.141947 -0.0764151 -0.100836 -0.0229197 0.0395127 -0.0637325 0.016736 -0.00586182 0.169611 -0.0167602 0.0377837 0.0187705 0.0115413 -0.0699869 0.0517898 0.103049 -0.014485 -0.184028 -0.0208754 0.0617946 -0.0650876 -0.00532129 -0.0504933 -0.131195 -0.00773401 -0.121119 0.0280292 0.0453453 0.0664159 0.0865174 -0.0581532 -0.0408777 0.0500843 0.0114527 0.00441206 -0.0464837 0.040285 -0.0221712 0.0408013 -0.0666601 0.0183635 -0.0972327 -0.101807 0.0299504 0.170568 -0.104686 0.0448836 -0.0611045 0.183349 0.0664883 -0.00132545 -0.148101 0.0180915 -0.110069 0.132043 -0.0828779 0.036587 
0.00720531 -0.033517 0.0492434 0.0837607 0.109705 0.186249 0.0811696 -0.0687791 0.0688545 -0.0980013 -0.0130378 0.060511 0.0393743 -0.104893 0.0346183 -0.0195674 -0.131618 0.0909766 -0.104772 -0.0220805 0.209596 -0.0504107 0.0317022 0.245888 0.108035 -0.180506 -0.13982 -0.241523 -0.0120186 0.124197 0.174109 0.0190912 -0.1043 0.0541799 0.0698092 0.0320547 -0.0844899 -0.10714 -0.0375524 -0.00958254 0.121706 -0.045161 -0.0287621 0.0681276 -0.0644208 -0.109619 0.0676819 0.00855956 0.0224457 -0.0422535 0.0355838 -0.126923 0.0901666 -0.079899 0.0576008 0.102369 -0.00924179 0.160636 0.00818736 -0.0446716 -0.0602934 0.0632662 0.0382866 -0.119941 0.0651387 -0.0651358 0.0304856 -0.0716766 -0.100767 0.0770075 -0.0182481 0.140755 -0.0852372 -0.112135 -0.0265222 0.042879 -0.0622683 0.0263053 -0.00591372 0.162204 -0.0186411 0.0423118 0.0178582 0.0145109 -0.067064 0.0591251 0.0988653 -0.026621 -0.183229 -0.0155874 0.0562342 -0.066088 -0.0102672 -0.0552025 -0.130256 -0.0118068 -0.125789 0.0389936 0.0498816 0.0622202 0.0972662 -0.0463669 -0.0290974 0.0527839 0.0103435 -0.00568094 -0.053598 0.0353648 -0.0368836 0.0451514 -0.0596807 0.013526 -0.0815666 -0.109948 0.0195372 0.174298 -0.0970057 0.0337117 -0.0644088 0.184512 0.0716419 -0.0125122 -0.148305 0.0148564 -0.117066 0.130915 -0.0885829 0.0404191 
-0.0185187 -0.0126847 0.0728123 0.0851372 0.105084 0.20451 0.0570937 -0.0804042 0.0795064 -0.0910237 -0.010335 0.0601709 0.0185654 -0.118509 0.0507034 -0.0101388 -0.160286 0.0747116 -0.0970096 -0.0324958 0.206173 -0.0477766 0.0365093 0.212269 0.129475 -0.164676 -0.142656 -0.233981 -0.00820632 0.104327 0.203613 0.00680947 -0.0887521 0.0472909 0.0887433 0.0471022 -0.0842392 -0.106213 -0.0247319 -0.0187404 0.130024 -0.0559294 -0.024669 0.0625777 -0.0637679 -0.114868 0.0719465 -0.000269073 0.0155269 -0.0441604 0.028416 -0.112032 0.0876145 -0.082712 0.0640922 0.104615 -0.0198492 0.14506 -0.0139806 -0.0526551 -0.0811124 0.0475441 0.0486522 -0.125542 0.0957483 -0.0451027 0.0245173 -0.0670403 -0.110398 0.109936 -0.00672266 0.15305 -0.0908266 -0.114245 -0.00999904 0.0374448 -0.0742913 0.0203543 -0.00938106 0.169648 -0.0249472 0.0421313 0.0376571 0.0335475 -0.0699485 0.0404894 0.0981966 -0.00301621 -0.170713 -0.00106623 0.0499659 -0.0656475 -0.0135977 -0.041442 -0.129925 -0.0230131 -0.123664 0.0497198 0.0364263 0.061781 0.0898078 -0.0534699 -0.0416348 0.017263 0.0224192 0.0165478 -0.0318342 0.025454 -0.0178182 0.0439984 -0.0753995 0.0121593 -0.0835198 -0.102614 0.0522435 0.157191 -0.101099 0.0471934 -0.0488297 0.191621 0.0955989 -0.0163507 -0.132797 0.00451573 -0.0894678 0.141622 -0.0366589 0.0646636 
-0.00307849 -0.024423 0.0690258 0.0876817 0.102578 0.193744 0.0837039 -0.0797236 0.0751786 -0.0894903 -0.0183821 0.0586637 0.0296199 -0.115613 0.0504578 -0.0126001 -0.14522 0.0835738 -0.10328 -0.0398923 0.199912 -0.034785 0.0299521 0.225264 0.106131 -0.168986 -0.152604 -0.247303 -0.0160903 0.117234 0.182256 0.029576 -0.102945 0.0540292 0.0876118 0.0292639 -0.0658958 -0.0964845 -0.023051 -0.00391832 0.130352 -0.0471068 -0.0280119 0.048567 -0.0654685 -0.107152 0.0658485 -0.0010241 0.0248754 -0.0497232 0.043226 -0.125378 0.09466 -0.0701391 0.0601525 0.100615 0.00285856 0.14446 -0.00191833 -0.0386757 -0.0668848 0.0543227 0.0260365 -0.132024 0.0878839 -0.0595458 0.0379961 -0.0703146 -0.101256 0.0852071 -0.0128905 0.145901 -0.0842739 -0.10347 -0.0188646 0.044844 -0.0764118 0.0190789 -0.00668536 0.161318 -0.011769 0.0463498 0.027409 0.0273713 -0.0659494 0.0473355 0.105074 -0.0228765 -0.193104 -0.0127543 0.0480074 -0.0651104 -0.000601281 -0.0553528 -0.14184 -0.0133389 -0.116798 0.0392301 0.0521105 0.0739376 0.0981907 -0.0470414 -0.0361063 0.0485405 0.0273832 -0.0162359 -0.0405148 0.0293585 -0.0363847 0.0565947 -0.071996 0.00653072 -0.0779783 -0.116141 0.0279707 0.169939 -0.103008 0.0402665 -0.0755044 0.17536 0.0883867 -0.00990083 -0.137107 0.00834248 -0.0957922 0.134474 -0.0764433 0.048959 
-0.0173971 -0.0272735 0.0903386 0.0775139 0.0904853 0.186182 0.0763691 -0.0726314 0.0811186 -0.0886569 -0.0273884 0.0495889 0.034832 -0.106335 0.0650325 0.00395544 -0.158031 0.0556182 -0.105184 -0.0465504 0.204942 -0.0311882 0.0265903 0.211283 0.105279 -0.155353 -0.159505 -0.242864 -0.0121437 0.110745 0.191848 0.0290861 -0.0947314 0.0581707 0.0873803 0.0352606 -0.054723 -0.0809256 -0.0156254 0.000400189 0.128388 -0.0506856 -0.0203786 0.0312532 -0.0415305 -0.106227 0.0607749 -0.00462505 0.0293412 -0.0590989 0.0327121 -0.133925 0.103754 -0.0612104 0.0716624 0.1022 0.00619636 0.136892 -0.0092155 -0.0437674 -0.0680504 0.0499416 0.00917137 -0.123375 0.091438 -0.0387801 0.0375777 -0.0558508 -0.0917521 0.0716283 -0.0152026 0.144486 -0.0920977 -0.109005 -0.00113385 0.0529842 -0.0767754 0.0137039 0.00173745 0.170102 0.000488263 0.0352834 0.0375503 0.0373729 -0.0719293 0.0427241 0.111449 -0.00832756 -0.191287 -0.0125044 0.0443269 -0.0644235 0.00987389 -0.0415573 -0.15776 -0.000448661 -0.117253 0.0418825 0.056064 0.0796601 0.102805 -0.0585391 -0.0508405 0.041146 0.033156 -0.018367 -0.0452071 0.0221247 -0.0341364 0.0464396 -0.0851951 0.00435236 -0.0906359 -0.116742 0.038421 0.181642 -0.108511 0.0559778 -0.0925707 0.174585 0.0903494 -0.00558989 -0.12839 0.00710417 -0.100305 0.142393 -0.073663 0.0572186 
-0.0103641 -0.00728732 0.0611106 0.0747352 0.100777 0.196554 0.0635055 -0.0606982 0.0576949 -0.0705242 -0.000198514 0.0553808 0.0419751 -0.133878 0.0322716 0.00641257 -0.157282 0.098116 -0.121008 -0.0208966 0.22534 -0.0578922 0.0419505 0.22154 0.109746 -0.169486 -0.139094 -0.246609 0.0047297 0.116493 0.173584 0.0168973 -0.0929705 0.0612807 0.0731969 0.0295682 -0.0908631 -0.0973922 -0.0256636 -0.0113131 0.110805 -0.0710441 -0.0235484 0.0771266 -0.0596251 -0.117952 0.0836161 0.00943561 -0.0120083 -0.0429847 0.0462198 -0.122027 0.061266 -0.0800091 0.0503342 0.101775 -0.00518251 0.137561 -0.002174 -0.0544989 -0.0648428 0.0433772 0.0492591 -0.108272 0.0847788 -0.0702092 0.0100639 -0.0627261 -0.106196 0.0969664 -0.0213189 0.143178 -0.0913122 -0.117245 -0.0214973 0.0307172 -0.0679531 0.0437596 -0.00940321 0.164366 -0.0217339 0.0306432 0.0252068 0.0288677 -0.0894337 0.0651655 0.0997927 -0.0147705 -0.162587 -0.00357424 0.0450218 -0.0747283 -0.0317043 -0.0412405 -0.138296 -0.00969094 -0.133919 0.0553055 0.0350662 0.0618075 0.0983583 -0.0501285 -0.0448434 0.0496226 0.0388056 0.00126683 -0.0492425 0.0516292 -0.0163728 0.0251062 -0.0845266 0.0260173 -0.0872497 -0.0995558 0.0435978 0.166519 -0.102309 0.0427407 -0.0526404 0.194085 0.0793986 -0.0154945 -0.134588 0.0143791 -0.100415 0.131788 -0.0653391 0.0454408 
-0.00516499 -0.0177254 0.0723232 0.0842871 0.101562 0.194072 0.0753388 -0.0620864 0.0726628 -0.0804271 -0.0107906 0.0583696 0.0355892 -0.121161 0.0494395 0.0052809 -0.137837 0.0890088 -0.122255 -0.0285058 0.208324 -0.0475307 0.043078 0.233556 0.107339 -0.174279 -0.144839 -0.24376 -0.00669274 0.105755 0.185765 0.0357957 -0.0934094 0.0696616 0.0650454 0.0319667 -0.0704979 -0.085476 -0.0307131 0.00200126 0.125756 -0.0572452 -0.0250891 0.0464822 -0.058643 -0.119636 0.0708395 -0.0016343 0.00806162 -0.0423218 0.0497081 -0.130096 0.0743082 -0.0738051 0.0549814 0.104931 0.00258361 0.144253 0.00164177 -0.0422002 -0.0752747 0.0498251 0.0262267 -0.137332 0.0877883 -0.056373 0.0213125 -0.064256 -0.114655 0.0985177 -0.0209504 0.14677 -0.0929481 -0.0974875 -0.0125283 0.0366371 -0.0616163 0.0364213 -0.0128318 0.151075 -0.0247625 0.038858 0.0279096 0.0210032 -0.0775305 0.0593646 0.103041 -0.0198349 -0.183826 -0.00981644 0.0447222 -0.0750893 -0.0133328 -0.0485407 -0.126072 0.00296179 -0.126265 0.0442522 0.0423051 0.0741928 0.0889403 -0.061501 -0.0480025 0.0646482 0.0368583 -0.00971938 -0.0516506 0.0291759 -0.024841 0.0263937 -0.0927526 0.0299265 -0.0737591 -0.104758 0.044096 0.160028 -0.0990403 0.038601 -0.0613906 0.195835 0.0890987 -0.00338459 -0.13576 0.0191171 -0.0978973 0.129885 -0.0738263 0.0413701 
-0.013955 -0.0151448 0.0789975 0.0708069 0.0978472 0.198118 0.0690506 -0.069956 0.046483 -0.0872772 -0.00951402 0.0504456 0.0406574 -0.116925 0.0462763 -0.00345334 -0.173226 0.07627 -0.114831 -0.029579 0.220717 -0.051116 0.0289088 0.20713 0.11554 -0.155071 -0.157252 -0.237395 0.00523485 0.107375 0.177183 0.0131952 -0.11113 0.0551772 0.0794667 0.0370189 -0.100265 -0.0965342 -0.0160619 -0.010802 0.122069 -0.0636377 -0.0246733 0.0715472 -0.0533924 -0.107142 0.0788875 0.00523037 -0.0107679 -0.0547733 0.023585 -0.123568 0.0735241 -0.0751738 0.0568587 0.0958112 -0.0156715 0.156174 -0.00900525 -0.0551152 -0.0619857 0.0630756 0.0496341 -0.0948784 0.08357 -0.0390711 0.0228742 -0.0570533 -0.0961378 0.084068 -0.0121096 0.150773 -0.0784916 -0.108701 -0.00931579 0.0310335 -0.0812715 0.0124747 0.000775086 0.175292 -0.00670453 0.0279883 0.0300384 0.0220862 -0.0951309 0.0533477 0.108563 -0.0114257 -0.173 -0.00629512 0.0625631 -0.0672655 -0.0170706 -0.0365989 -0.154569 -0.0111485 -0.126285 0.0526215 0.0428804 0.0643609 0.0903916 -0.0493192 -0.042569 0.0370128 0.021724 0.0147177 -0.0469678 0.0601439 -0.0166644 0.025433 -0.0640911 0.0231962 -0.103139 -0.104633 0.0471061 0.172698 -0.11343 0.0532836 -0.0560294 0.181561 0.07834 -0.0236524 -0.132863 0.00828141 -0.105282 0.139643 -0.0641344 0.0514818 
