{
  "descriptor": [
    -0.09535636752843857,
    -0.019513212144374847,
    0.024745803326368332,
    -0.0562225766479969,
    -0.10418513417243958,
    -0.026169568300247192,
    0.050333354622125626,
    -0.03900866582989693,
    0.1464281678199768,
    -0.11836642771959305,
    0.25525984168052673,
    -0.06126844882965088,
    -0.2617310881614685,
    -0.09835303574800491,
    -0.06708136945962906,
    0.11677862703800201,
    -0.11243847757577896,
    -0.17520985007286072,
    -0.04648158326745033,
    -0.03856728971004486,
    0.09826347231864929,
    -0.0002965119492728263,
    -0.09381505101919174,
    0.03397069871425629,
    -0.19374895095825195,
    -0.3162875175476074,
    -0.03461918979883194,
    -0.14425891637802124,
    -0.006409709341824055,
    -0.09775865077972412,
    0.026636503636837006,
    0.08931515365839005,
    -0.10268065333366394,
    -0.03482460230588913,
    0.012650709599256516,
    0.0633024275302887,
    -0.03667469322681427,
    -0.053202781826257706,
    0.211929053068161,
    0.041094716638326645,
    -0.2402745634317398,
    0.011976192705333233,
    -0.000010789061889227014,
    0.30552423000335693,
    0.13754740357398987,
    0.010288257151842117,
    0.05267198011279106,
    -0.022122887894511223,
    0.14761704206466675,
    -0.3009856343269348,
    -0.008439219556748867,
    0.15872961282730103,
    0.13954192399978638,
    0.029696209356188774,
    0.14307793974876404,
    -0.09865379333496094,
    0.007014105562120676,
    0.13010375201702118,
    -0.21287137269973755,
    0.04048144072294235,
    -0.004363234154880047,
    0.0036455404479056597,
    0.01991122215986252,
    -0.1063450500369072,
    0.16080382466316223,
    0.011422212235629559,
    -0.12767557799816132,
    -0.03630858287215233,
    0.18551363050937653,
    -0.1815696358680725,
    -0.11501830071210861,
    0.06193600594997406,
    -0.11517724394798279,
    -0.22635626792907715,
    -0.22911402583122253,
    0.05770818889141083,
    0.40797436237335205,
    0.1898173987865448,
    -0.14382602274417877,
    0.09350308030843735,
    0.012449855916202068,
    -0.029313083738088608,
    0.09628459811210632,
    0.049648500978946686,
    -0.03544297069311142,
    0.051945049315690994,
    -0.030792368575930595,
    -0.01657053641974926,
    0.19366759061813354,
    -0.002253710525110364,
    -0.0019600046798586845,
    0.2021157145500183,
    -0.025781964883208275,
    -0.0031413650140166283,
    0.05638118460774422,
    -0.03620215877890587,
    -0.04269852489233017,
    0.02587588131427765,
    -0.05446028709411621,
    0.018726326525211334,
    0.05314738675951958,
    -0.11870719492435455,
    0.047460172325372696,
    0.05314389616250992,
    -0.1951649785041809,
    0.1437084823846817,
    -0.059981584548950195,
    0.01061165053397417,
    -0.03803979232907295,
    0.021814445033669472,
    -0.08032722771167755,
    0.06612751632928848,
    0.13143852353096008,
    -0.2746441662311554,
    0.17612619698047638,
    0.17181378602981567,
    0.017333611845970154,
    0.10928983986377716,
    0.08328737318515778,
    -0.07182082533836365,
    0.011705495417118073,
    -0.0327640064060688,
    -0.18671353161334991,
    -0.12832026183605194,
    0.07439151406288147,
    -0.07509934902191162,
    0.0655713751912117,
    -0.02558428980410099
  ]
}