0.0277658 0.110821 -0.0534512 -0.0459154 -0.00444263 0.196879 -0.0236343 -0.0160018 -0.0473111 0.00791313 0.112182 0.0342874 0.0445101 -0.174352 -0.0874199 0.0467534 -0.174712 0.0580677 -0.043078 0.00694077 0.233436 -0.0376061 0.0172554 0.0542784 0.0365802 0.0429627 0.0390408 -0.222569 0.121806 0.138467 -0.00775435 -0.0243999 -0.00635147 0.0308805 0.0340446 -0.0393696 -0.0986171 0.0462316 0.0748036 -0.00843916 -0.0421864 -0.154844 -0.0504364 0.163732 -0.038544 -0.043424 0.165859 -0.051187 -0.242133 -0.0518982 0.0349783 0.070832 -0.0334729 0.00139932 0.017758 0.0757876 0.0339883 0.0895889 -0.0894589 -0.125606 -0.0312013 -0.0925605 0.280713 -0.0258563 0.0874465 -0.0882595 -0.028818 -0.00981622 -0.028618 0.110842 -0.050049 0.0225633 -0.142777 -0.0899848 0.0287559 -0.0566363 -0.0614223 0.0609092 -0.0330178 0.148256 -0.0699771 0.0330889 0.031303 0.00874636 -0.0958489 0.0429926 0.0555274 -0.0222199 0.0229199 0.0431936 0.045078 -0.134243 -0.156704 0.0870773 -0.0613237 -0.0594253 -0.0412932 0.105166 0.0690212 -0.0185586 0.0655775 0.0181293 -0.0764074 0.0808666 -0.0231312 0.063564 -0.00912653 0.136333 0.0125172 -0.138691 -0.0109868 0.0710053 -0.116323 -0.0565385 0.148573 0.102313 -0.128666 -0.0756506 0.0977531 0.124788 0.0645718 -0.0604763 0.00840059 -0.0226566 0.0128404 0.117871 0.10565 0.0403467 
0.0144414 0.113272 -0.0161732 -0.0159721 0.00579703 0.203552 -0.00748255 -0.0328089 -0.021987 0.0185364 0.115121 0.0181038 0.0258776 -0.170471 -0.0445729 0.0305966 -0.178664 0.0727783 -0.0265894 -0.0243292 0.239163 -0.0459659 0.00354839 0.0572601 0.0825158 0.0156551 -0.00355308 -0.219793 0.14223 0.139547 0.0413339 -0.0266664 -0.0157277 0.0102179 0.0749947 -0.0265505 -0.107253 0.0201444 0.0927923 -0.0396114 -0.018417 -0.148619 -0.0649256 0.151252 -0.0391976 -0.0545593 0.136579 -0.04368 -0.215415 -0.0975143 0.0116175 0.0936984 -0.00254011 -0.032772 0.00875212 0.0904348 0.0229908 0.0866874 -0.104206 -0.118114 -0.0441609 -0.0922808 0.262001 -0.0300179 0.0985382 -0.0473424 -0.015156 -0.0253672 -0.0417121 0.119706 -0.0365699 0.049166 -0.145714 -0.110262 0.0199892 -0.0608882 -0.0752027 0.048421 -0.0226882 0.164238 -0.0799464 0.0405135 0.0373758 0.0145098 -0.0682083 0.0206907 0.0535939 -0.013581 0.00568804 0.0380026 0.0562893 -0.102531 -0.139191 0.0840805 -0.0750065 -0.0884037 -0.0483705 0.095201 0.0682676 -0.0126647 0.0812403 0.0167241 -0.0685133 0.0380154 -0.0129293 0.0818953 0.0382432 0.111738 0.0620265 -0.111097 -0.0193899 0.048316 -0.126558 -0.073219 0.173229 0.103675 -0.134718 -0.0572705 0.0964929 0.128237 0.0733414 -0.0771656 -0.024207 -0.022356 0.0128773 0.138365 0.125966 0.0586444 
0.0421911 0.096059 -0.0135476 -0.0382453 0.0167031 0.206649 0.00824271 -0.0106176 -0.0393646 -0.0231297 0.104938 0.0611984 0.0467718 -0.189267 -0.0804009 0.0340992 -0.193431 0.0481495 -0.0947912 0.0144711 0.242392 -0.0102765 0.00369605 0.0924312 0.0338234 0.00903716 0.00966856 -0.213735 0.108849 0.148742 -0.014305 -0.0385207 -0.0281429 0.0574339 0.0343499 -0.0470209 -0.108841 0.0292914 0.0490815 0.00304855 -0.0196954 -0.140487 -0.0440003 0.15378 -0.0412471 -0.0487334 0.152279 -0.0489456 -0.22668 -0.0199815 0.049167 0.0501622 -0.0453498 -0.00120659 0.0407329 0.0682544 0.000307843 0.113723 -0.103273 -0.104699 -0.0394087 -0.0794724 0.263049 -0.0242714 0.0781198 -0.10668 -0.025798 -0.0129182 -0.0600789 0.10569 -0.0324219 0.0381857 -0.126759 -0.0807316 0.0267211 -0.0274802 -0.0623242 0.0399035 -0.018714 0.172165 -0.0388771 0.0192064 0.0461309 0.0163785 -0.100146 0.0388645 0.0733816 -0.0255723 -0.00513409 0.0665068 0.048936 -0.154659 -0.15704 0.0940671 -0.0969817 -0.0475766 -0.0566953 0.0669959 0.0758011 -0.00868111 0.0724058 0.0262823 -0.0831997 0.0836744 -0.0383201 0.0575456 -0.0281019 0.146159 -0.000909862 -0.128527 0.0123435 0.0758195 -0.126224 -0.0445412 0.136338 0.1278 -0.128111 -0.0368045 0.0707595 0.150948 0.0633288 -0.0505883 -0.00531164 -0.0163706 0.0169802 0.127397 0.0976026 0.0212378 
0.039794 0.124177 -0.0368254 -0.0171712 -0.00491496 0.182212 -0.0199912 -0.0411684 -0.0439583 -0.0122223 0.110374 0.042332 0.0421732 -0.186219 -0.0884072 0.0469327 -0.174257 0.0479614 -0.0570317 0.0221994 0.234172 -0.0186995 0.0170254 0.0690754 0.0437044 0.0198622 0.018413 -0.221872 0.116569 0.170339 -0.0190543 -0.0185815 -0.00307353 0.0347113 0.0440046 -0.0539081 -0.0900086 0.0432327 0.0731781 -0.00265397 -0.0499189 -0.15357 -0.0453727 0.152092 -0.0370383 -0.0162673 0.172955 -0.0585563 -0.227647 -0.0353711 0.0624751 0.0940572 -0.0227505 0.00222729 0.029671 0.0596575 0.0385541 0.0685127 -0.0816866 -0.111457 -0.0273421 -0.0967574 0.25082 -0.0236057 0.0744519 -0.121669 -0.0128346 -0.0210479 -0.0402845 0.101148 -0.0403261 0.0214919 -0.141444 -0.0885175 0.0302391 -0.0399122 -0.066156 0.0523454 -0.0339711 0.195471 -0.0453148 0.0258348 0.0326942 0.0209655 -0.074775 0.0474017 0.0401543 -0.0415912 -0.0069893 0.0483688 0.0257833 -0.133219 -0.154774 0.0959025 -0.0961876 -0.0694212 -0.0424099 0.0939511 0.0880178 -0.0327657 0.0742031 0.0401418 -0.0668871 0.0979009 -0.0312756 0.0465738 -0.000432073 0.162386 0.0215227 -0.11822 -0.00608391 0.0621874 -0.134575 -0.0552637 0.12022 0.114702 -0.138036 -0.0622169 0.0745765 0.135949 0.0559963 -0.0388315 -0.00472331 -0.0231376 0.0299304 0.119812 0.115812 0.0336518 
0.0331662 0.112359 -0.0405403 -0.0229888 -0.0159264 0.191516 -0.0217992 -0.0146553 -0.0404105 0.002845 0.12405 0.0437908 0.0425248 -0.190411 -0.0848582 0.0390381 -0.167642 0.0513924 -0.0603471 0.0201944 0.224163 -0.0336015 0.0120873 0.075954 0.0368977 0.0307452 0.0377939 -0.221941 0.115154 0.13825 -0.00335343 -0.0196736 -0.00823507 0.041392 0.0207915 -0.0416734 -0.102886 0.0517699 0.0627509 0.00701805 -0.038116 -0.161301 -0.0692842 0.157462 -0.0357202 -0.0460904 0.158236 -0.0564965 -0.234998 -0.0438375 0.0571516 0.0877418 -0.0377286 -0.00707422 0.0161894 0.0725583 0.0187914 0.0803773 -0.0798877 -0.112683 -0.0411996 -0.104064 0.262812 -0.0320254 0.0819188 -0.112111 -0.0095936 -0.0199454 -0.0431021 0.114344 -0.0480172 0.0196275 -0.140442 -0.0784847 0.0287778 -0.0586129 -0.0590399 0.0680556 -0.0401488 0.175881 -0.0746065 0.01856 0.0335068 0.00398903 -0.0861944 0.0439244 0.0602889 -0.0363726 0.0071566 0.0400122 0.0279178 -0.140529 -0.150795 0.0954416 -0.0718039 -0.0613155 -0.036897 0.0734295 0.0757419 -0.0261257 0.0597026 0.032001 -0.0823864 0.10051 -0.0180043 0.0546316 -0.00308959 0.141568 0.018265 -0.139638 -0.018544 0.0800133 -0.122198 -0.0531563 0.140882 0.0965755 -0.135195 -0.0760607 0.0962598 0.13397 0.0590266 -0.0506389 -0.00532425 -0.0129665 0.0373991 0.11556 0.109274 0.0334138 
0.0600914 0.087491 -0.000742415 -0.0276932 0.0135097 0.190064 -0.000205804 -0.00684937 -0.0457501 -0.0380323 0.105267 0.0610875 0.0393154 -0.178703 -0.072917 0.0234907 -0.172653 0.0312803 -0.0903094 0.0290535 0.242719 -0.0028787 0.0113948 0.10549 0.0462757 0.0137867 0.027011 -0.206395 0.109417 0.14448 -0.0220949 -0.0528264 -0.0233555 0.0664702 0.0246739 -0.0545822 -0.104885 0.0572806 0.0373793 -0.00272228 -0.0258804 -0.128714 -0.0516482 0.159196 -0.04745 -0.0394816 0.150801 -0.055091 -0.21496 -0.0074303 0.0646887 0.0733118 -0.0454175 0.00189468 0.0633574 0.0480736 -0.000162568 0.110459 -0.0912782 -0.122387 -0.0339128 -0.100082 0.25005 -0.0109638 0.0664992 -0.118742 -0.0161231 -0.00652816 -0.0466283 0.11615 -0.0299375 0.0375529 -0.123184 -0.0737187 0.0293578 -0.041505 -0.0628401 0.0491917 -0.0109434 0.197691 -0.040992 0.0220086 0.0551882 -0.003168 -0.0724306 0.00909407 0.0756322 -0.00993076 -0.00151207 0.0628528 0.0460824 -0.150868 -0.157564 0.094432 -0.102432 -0.0653232 -0.037723 0.0576212 0.0833115 -0.0341505 0.0633863 0.0472277 -0.0722342 0.0922503 -0.0595842 0.0446166 -0.0300078 0.145189 0.0252977 -0.145223 0.0274529 0.0963882 -0.144086 -0.0292214 0.143686 0.121294 -0.129725 -0.0605113 0.0609241 0.150539 0.0521231 -0.0217861 -0.00970197 -0.0121475 0.0308809 0.116022 0.126837 0.019706 
0.032737 0.116252 -0.0365228 -0.0387925 0.00695068 0.189723 0.0430759 -0.00126858 -0.0463461 -0.00623068 0.0847118 0.0559819 0.0696398 -0.217303 -0.0915172 0.00879661 -0.205571 0.0305956 -0.112271 0.0373704 0.218575 -0.0302582 -0.0243345 0.069786 0.00561808 -0.0021962 -0.0298389 -0.219871 0.10592 0.162677 -0.0414604 0.000603829 -0.0413119 0.060351 0.0352124 -0.0722033 -0.0856943 0.0410081 0.0373079 -0.00789729 0.00909937 -0.181272 -0.0369898 0.147415 -0.0479723 -0.0165855 0.156857 -0.0316081 -0.237499 -0.0244843 0.0405043 0.0453637 -0.0397421 0.00258888 0.0459627 0.0559011 -0.0162722 0.0739076 -0.0949995 -0.116738 -0.0258716 -0.0723361 0.238387 -0.0160514 0.0655477 -0.107895 -0.0100508 -0.0289319 -0.0542657 0.0351414 -0.0461188 0.0121819 -0.119383 -0.0636299 0.0347404 -0.00386939 -0.0659926 0.0352457 0.000533352 0.184576 -0.0379037 0.00218614 0.0315067 0.0306154 -0.0856894 0.0624634 0.0770806 -0.0306182 0.00981753 0.0672538 0.0426654 -0.159892 -0.14376 0.0817876 -0.146236 -0.0580566 -0.0366789 0.0498014 0.0858442 -0.027198 0.0896973 0.0360167 -0.0691057 0.109845 -0.0529127 0.040061 -0.0350753 0.208153 -0.0230482 -0.090584 0.0219455 0.0624982 -0.159043 -0.0637244 0.0894127 0.120135 -0.151656 -0.0379055 0.0659137 0.132281 0.048839 -0.045161 -0.00467206 0.00601628 0.0227513 0.107148 0.0577127 -0.00497613 
0.0315371 0.0984672 0.000180421 -0.0454333 0.0157857 0.162435 0.0567081 0.0166568 -0.00557234 0.0391177 0.115896 0.0721117 0.0557178 -0.227083 -0.0676698 -0.00902093 -0.202141 0.0422351 -0.142161 0.0470665 0.180246 -0.0265107 -0.0119901 0.0913806 -0.00899955 0.0493493 -0.000520251 -0.196153 0.14065 0.0837334 -0.0219341 0.00111414 -0.0557401 0.074226 0.0123145 -0.0720068 -0.093157 0.117088 0.0329318 0.00811148 0.0385604 -0.15652 -0.114372 0.152749 -0.0839626 -0.0717886 0.101222 0.00141758 -0.183544 -0.0237313 0.0294213 0.0956199 -0.106122 -0.0124714 0.0515335 0.031031 -0.0192887 0.0886463 -0.115237 -0.11144 -0.0520919 -0.13913 0.264572 0.0252755 0.0548938 -0.111696 0.00297074 0.00450461 -0.0214119 0.100364 -0.0409042 0.0514366 -0.0848991 0.0176782 0.0278157 -0.0777454 -0.0910972 0.0884614 0.00556455 0.145158 -0.0556151 0.0385596 0.0562812 -0.00011771 -0.0520801 -0.0208809 0.127813 0.0459818 0.0556381 0.0323929 0.0591771 -0.132377 -0.115611 0.0636688 -0.112515 -0.116939 -0.0289803 0.00495498 0.0819167 -0.0511402 0.0619223 0.0220083 -0.0779389 0.107041 -0.0198106 0.0285109 -0.0247656 0.162389 0.0763357 -0.109277 0.0290609 0.147824 -0.151727 -0.0129525 0.144114 0.0801448 -0.135635 -0.083206 0.0723897 0.120648 0.0646896 0.00010635 -0.00978232 0.0399857 0.00824479 0.0805597 0.071389 0.0191114 
0.0407743 0.140881 -0.0754876 -0.0203483 0.0159923 0.195231 0.0316865 -0.0319869 -0.0531784 0.117354 0.147192 0.0524133 0.0884899 -0.187381 -0.0833076 0.0257308 -0.131951 0.135025 -0.0699544 0.0190407 0.209594 -0.052283 -0.0292375 0.0896978 0.0329925 0.0104821 -0.0178938 -0.185547 0.14754 0.190498 -0.0425382 0.0252937 -0.0385304 0.0389402 0.0368109 -0.0678064 -0.104381 0.00666914 0.0989172 -0.0281203 -0.038078 -0.173085 -0.0467788 0.150059 -0.0636062 -0.100646 0.132038 0.0101688 -0.201787 -0.0646464 0.107175 0.10658 -0.0781423 -0.0250718 0.00595848 0.0755876 0.00570214 0.0554506 -0.0803441 -0.0966393 -0.0368365 -0.117739 0.259936 -0.0317063 0.0488164 -0.0907923 -0.032499 -0.016128 -0.0706352 0.0816519 -0.0378233 0.0472393 -0.128176 -0.0746629 -0.0166108 -0.048292 -0.0365484 0.0651574 -0.0117366 0.122955 -0.0502596 0.0300861 0.0531585 0.0361537 -0.0696769 0.0369469 0.0644625 -0.0283408 0.0869199 0.0542516 -0.00629994 -0.130115 -0.13438 0.101817 -0.10045 -0.106873 -0.0585444 0.061283 0.0526924 -0.0382305 0.124628 0.0631662 -0.0535711 0.0968856 -0.000568529 0.0630134 0.00601783 0.131616 0.0449369 -0.0749026 -0.0154856 0.0647297 -0.112273 -0.0314161 0.116454 0.0727156 -0.11226 -0.0408529 0.0720061 0.113807 0.0593568 -0.0988862 -0.00267626 -0.0159787 0.00374163 0.12424 0.0784936 0.0286464 
0.0341464 0.136425 -0.064692 -0.0406575 0.0371052 0.197498 0.015947 -0.0330709 -0.0451612 0.0814836 0.131594 0.0499503 0.0890148 -0.169551 -0.101366 0.0370123 -0.129106 0.136219 -0.0998826 0.00653096 0.241573 -0.0519307 -0.0124125 0.0894646 0.0409757 -0.00320829 -0.00802744 -0.184612 0.144524 0.180369 -0.0150521 0.00482029 -0.044126 0.0374862 0.0311784 -0.0629833 -0.117731 0.0132261 0.0864796 -0.0156392 -0.0414649 -0.141636 -0.0439931 0.166284 -0.0477183 -0.0895145 0.135361 0.00115247 -0.210514 -0.0700286 0.0919535 0.0817882 -0.0847736 -0.0343772 -0.0085396 0.0752416 0.00507613 0.0877786 -0.072134 -0.112515 -0.0240253 -0.10184 0.25444 -0.0187748 0.0536732 -0.114024 -0.039692 0.012461 -0.0547748 0.105387 -0.018575 0.0521692 -0.120579 -0.105905 -0.0249952 -0.0379645 -0.0516964 0.080305 -0.0258007 0.11379 -0.0583324 0.0490923 0.0488783 0.0361031 -0.0909121 0.0392932 0.0752255 -0.0222562 0.0566786 0.037818 -0.00267695 -0.143382 -0.140537 0.0877395 -0.0799514 -0.089913 -0.0703848 0.0745611 0.033438 -0.0229577 0.107346 0.0441057 -0.0625922 0.117413 -0.00981063 0.0537678 -0.0266209 0.135948 0.0406683 -0.103562 -0.015261 0.0645927 -0.127864 -0.00436554 0.121323 0.0883392 -0.145188 -0.0423406 0.0608145 0.120866 0.0451272 -0.0628994 -0.0225001 -0.0138501 -0.00707519 0.110559 0.0458046 0.0195961 
0.0452058 0.13215 -0.0848094 -0.0308171 0.0357065 0.170376 0.0083056 -0.0691483 -0.0549508 0.0781763 0.13168 0.0582508 0.0902726 -0.164243 -0.107824 0.0618654 -0.141813 0.112571 -0.091004 0.0421489 0.222559 -0.0418862 0.00773884 0.0893686 0.0210276 0.0255286 9.7656e-05 -0.201418 0.14017 0.198568 -0.0517014 0.0214735 -0.0388382 0.0273529 0.0359627 -0.053737 -0.106676 0.0423103 0.0876738 -0.0125231 -0.067286 -0.140798 -0.0506151 0.160448 -0.0546779 -0.03522 0.159086 0.00917543 -0.210157 -0.0501574 0.0946372 0.0943306 -0.0778297 -0.0225039 0.023938 0.0527455 0.0245012 0.0810889 -0.0666573 -0.095462 -0.0196467 -0.107874 0.269596 -0.00834507 0.0570145 -0.133271 -0.0442712 0.0248543 -0.0406982 0.0955206 -0.0232072 0.0523146 -0.119837 -0.0866907 -0.0137959 -0.0368981 -0.0542021 0.0846021 -0.0238791 0.130504 -0.0208865 0.0458654 0.0200346 0.0248116 -0.096533 0.0373555 0.0541679 -0.0276608 0.0462978 0.0436667 0.000620056 -0.127084 -0.140356 0.0912275 -0.0930286 -0.0898357 -0.0595757 0.0813029 0.0762089 -0.0494029 0.112518 0.045396 -0.058249 0.110547 -0.0227174 0.0443854 -0.0284045 0.152283 0.0555342 -0.0840616 -0.00304552 0.0837256 -0.117905 -0.0128182 0.104589 0.102739 -0.146189 -0.047935 0.0390707 0.117791 0.0391798 -0.0497032 -0.000176893 -0.00729175 -0.021551 0.122381 0.050776 0.01484 
0.0332097 0.110156 -0.0554967 -0.0314524 0.0330211 0.182211 0.0235114 -0.0450635 -0.0625952 0.0883206 0.112399 0.0479812 0.0907616 -0.166299 -0.0824014 0.0308588 -0.152554 0.124328 -0.0703932 0.0209292 0.236207 -0.0546556 -0.0131296 0.118723 0.0425413 0.00815767 -0.0195774 -0.204452 0.145699 0.19836 -0.0350676 -0.00176846 -0.0502022 0.0256202 0.0508838 -0.0563571 -0.130271 0.00454655 0.0734619 -0.0437785 -0.0462963 -0.153387 -0.0432082 0.173486 -0.0539489 -0.0609002 0.142008 0.0217122 -0.201206 -0.0729297 0.0938895 0.0754299 -0.0459591 -0.0459908 0.0359482 0.0731562 0.00953085 0.0934248 -0.058278 -0.115948 -0.0151377 -0.0875988 0.250323 0.00960993 0.0517432 -0.100326 -0.0436778 -0.00215294 -0.0550946 0.0800072 -0.0340033 0.0581352 -0.124647 -0.109129 -0.0210168 -0.0312856 -0.0538899 0.069029 0.0107277 0.146052 -0.0265169 0.0286919 0.0341322 0.0254099 -0.0792945 0.0155461 0.0662152 -0.0150254 0.0567222 0.05449 0.00686831 -0.105012 -0.129907 0.0873092 -0.120936 -0.0875374 -0.0649492 0.0800071 0.0722331 -0.0468897 0.143111 0.0583585 -0.04803 0.0755992 -0.0293369 0.0485899 -0.022415 0.132458 0.0556243 -0.0763367 0.0125768 0.0736509 -0.128518 -0.0444317 0.113595 0.118774 -0.131866 -0.0383477 0.0370049 0.121688 0.0448869 -0.0845927 -0.0221529 -0.0313254 -0.0396741 0.142875 0.0489825 0.0208827 
0.0639843 0.0985747 -0.0662882 -0.0163247 0.0433199 0.204814 0.0359198 -0.0284288 -0.0492677 0.0481208 0.121663 0.0652247 0.0822138 -0.190189 -0.0819287 0.0207086 -0.1527 0.12424 -0.101039 0.0290318 0.230602 -0.0346099 0.0152137 0.139163 0.0331524 -0.0350816 -0.00712116 -0.224471 0.111035 0.186175 -0.0355852 -0.0127703 -0.0490791 0.0550063 0.034756 -0.0649928 -0.123059 -0.00443086 0.032424 -0.0166066 -0.0296064 -0.142472 -0.0548633 0.185024 -0.0888369 -0.0688068 0.142536 0.0105928 -0.191945 -0.0166622 0.112056 0.0481599 -0.062465 -0.0367251 0.0294087 0.0662004 0.0116125 0.0980093 -0.0423763 -0.101115 -0.0284006 -0.0837408 0.246212 -0.0206501 0.0473046 -0.142441 -0.0343713 -0.0103954 -0.0637437 0.10795 -0.0367175 0.0637102 -0.113903 -0.092701 -0.0276543 -0.0328355 -0.0587553 0.0688398 -0.0149104 0.15334 -0.0284989 0.0253073 0.0265353 0.0110118 -0.0794247 0.0432854 0.0697362 -0.0417356 0.0182327 0.0586774 0.0193716 -0.131808 -0.15456 0.0537737 -0.110478 -0.0807197 -0.0778273 0.0681371 0.0700699 -0.0371512 0.122575 0.0512022 -0.0337699 0.0917486 -0.0324083 0.0235945 -0.0419982 0.144139 0.0209467 -0.0757109 0.0176024 0.0876149 -0.105223 -0.0470911 0.0959036 0.117969 -0.118949 -0.0411333 0.0429827 0.143655 0.0524367 -0.0635144 -0.0297983 0.0025254 -0.0187944 0.110915 0.0492989 0.0214253 
-0.0285503 0.0718919 -0.03247 -0.0519453 0.0386098 0.185851 -0.0779605 -0.0591105 -0.125204 0.0510354 0.0411232 0.00256928 0.0237631 -0.0799456 0.000127521 0.0818493 -0.0997993 0.0819768 0.104807 -0.0241326 0.198104 -0.0505399 0.105804 0.0694248 0.0777241 0.0921332 -0.0153577 -0.249744 0.163593 0.07574 0.0619031 -0.0172523 -0.0437218 -0.0478198 0.059635 0.034065 -0.129742 0.0482734 0.127082 0.0146139 -0.0656851 -0.0441543 -0.0860799 0.0801585 -0.0466767 -0.00713196 0.180194 -0.0345999 -0.190839 -0.108776 0.0080115 0.0641072 0.0349513 -0.0506218 -0.0187523 0.0735445 0.171185 0.153434 -0.05265 -0.0952002 -0.0143001 0.00997347 0.24661 -0.067306 0.131406 -0.0365204 -0.0329449 0.0287644 -0.000287116 0.147597 -0.0470625 0.137967 -0.152753 -0.0527786 0.0215274 -0.0728185 -0.0986498 0.0787173 0.0108589 0.0889999 -0.0908693 0.0877042 0.0231948 -0.00307975 -0.0856668 -0.0284432 0.0384147 0.027524 -0.0134287 -0.0699265 0.0457215 0.0220369 -0.053035 0.0756429 0.0339554 -0.0683821 -0.00321373 0.205141 0.0157335 0.00127202 0.0354801 -0.0175393 -0.099458 0.059051 -0.0213047 0.0844963 0.0163065 0.0159182 0.100529 -0.0899347 -0.0286604 0.0745868 -0.0407426 -0.0883833 0.153435 0.126057 -0.130923 -0.102997 0.0345455 0.117457 0.0448142 -0.0794462 -0.0172175 -0.0903431 -0.132139 0.16973 0.00740845 0.0738034 
