0.0993974 -0.0735427 -0.0905992 0.00407225 0.040595 0.107113 0.0542501 0.104899 -0.0148156 -0.0891572 -0.00458928 0.0704453 0.10497 -0.205509 -0.139312 0.0754672 -0.140768 -0.00178612 -0.186992 0.134603 0.249285 -0.116239 0.0945453 0.0159357 -0.0803715 -0.0504481 -0.113993 -0.291152 -0.0470565 0.0762563 -0.0514597 0.112111 -0.0345768 0.103274 -0.0539022 -0.0783495 -0.0834611 0.134298 -0.0395325 -0.0437555 -0.0303438 -0.0958089 -0.0578264 0.0625969 -0.0251664 -0.0809217 0.0745472 -0.0459683 -0.110737 0.10189 0.0190255 -0.101776 -0.0294922 0.0611914 0.0484792 -0.0475511 0.0910088 -0.00393359 -0.0418808 -0.0953282 0.0364802 -0.0277465 0.10978 -0.0302097 0.0298443 -0.174045 -0.0506516 0.0500914 0.010643 -0.0385568 -0.0558369 0.0142399 -0.0794793 -0.0351347 -0.0781612 0.0122911 0.00826839 -0.0121746 -0.0241517 0.171966 -0.0449668 -0.0722961 -0.0515224 -0.0174551 -0.0990047 0.138996 0.0763433 0.0194662 0.020973 -0.0279578 0.0476203 -0.142679 -0.15635 0.0381474 -0.103653 0.0478289 -0.0415598 0.0480799 -0.00964309 0.0434605 0.100436 -0.05966 -0.0880253 0.156056 0.0457006 -0.0597662 -0.0984029 0.189851 -0.0302287 -0.0779774 -0.10528 0.0975291 -0.118153 -0.0643178 0.0842531 0.147786 -0.0662905 -0.0253702 0.0274064 0.135631 -0.0505071 0.0782096 0.0525708 0.0596003 0.0149122 -0.0116271 -0.00203239 -0.0276151 
0.0872911 -0.0497875 -0.07454 0.00396811 0.0275475 0.102835 0.0265854 0.105107 -0.00990044 -0.0803968 0.0104347 0.0696256 0.092474 -0.200994 -0.138241 0.086549 -0.137613 -0.00444004 -0.180893 0.127045 0.254771 -0.122042 0.109113 0.00316589 -0.0594558 -0.0261721 -0.094845 -0.276255 -0.0360626 0.0558554 -0.0336298 0.109835 -0.0115195 0.110373 -0.0643987 -0.0801127 -0.0762177 0.170409 -0.0164425 -0.0342366 -0.0355524 -0.0956334 -0.0547645 0.0502731 -0.0212128 -0.103239 0.0855833 -0.070174 -0.116554 0.102253 0.0244002 -0.0657646 -0.0443477 0.0759079 0.0483313 -0.0456102 0.113609 -0.013962 -0.0479893 -0.118938 0.0203622 -0.0549982 0.113964 -0.0331724 0.0315435 -0.15249 -0.0532568 0.0627789 0.0126189 -0.00237136 -0.0550855 0.0181059 -0.0907184 -0.013377 -0.0524668 -0.0137758 0.00327229 -0.00760048 -0.0344892 0.168539 -0.07352 -0.0578441 -0.0222747 -0.0156208 -0.0952329 0.123755 0.0773362 0.0379411 0.0450841 -0.0397308 0.0351609 -0.146781 -0.151917 0.0450771 -0.0821156 0.0298628 -0.0412484 0.0750401 -0.0216509 0.0353345 0.074072 -0.0642243 -0.0890873 0.177709 0.0617369 -0.0461332 -0.0900483 0.18224 0.000151468 -0.116466 -0.127195 0.115926 -0.124099 -0.0434899 0.117074 0.125419 -0.0577617 -0.0494562 0.0577627 0.145255 -0.0298139 0.097217 0.0597163 0.0494581 0.0264542 -0.0164768 0.0441216 0.000517218 
0.0504347 -0.0532129 -0.0678542 -0.00892739 -0.00502783 0.0886172 -0.0252302 0.0563252 -0.0291378 -0.0771859 0.00379869 0.0551304 0.100005 -0.158932 -0.121113 0.0882993 -0.190732 -0.0257061 -0.152963 0.146737 0.221496 -0.139619 0.149482 0.012733 -0.069966 0.0100481 -0.0789532 -0.2797 -0.0605982 0.040322 -0.0300851 0.0918305 -0.00967309 0.101794 -0.0760377 -0.0197387 -0.0860749 0.190993 -0.0288921 0.000413414 -0.0512063 -0.116123 -0.0687435 0.0518029 -0.0345194 -0.0804617 0.124002 -0.0504392 -0.113014 0.130868 0.00610525 -0.0840633 -0.0492549 0.100823 0.0789379 -0.0402922 0.134225 0.00694987 -0.0199867 -0.11752 0.0130669 -0.0230514 0.128794 -0.0153168 0.0425273 -0.13424 -0.0366806 0.0706789 0.0310071 0.0271388 -0.063979 0.0367625 -0.0770621 0.0295167 -0.00342934 -0.0389721 -0.0194222 -0.00762542 -0.0231674 0.16497 -0.0506692 -0.065386 -0.0455119 -0.0354368 -0.149397 0.133962 0.0657439 0.0361762 0.0401116 -0.0459408 0.0507149 -0.129313 -0.0896048 0.0114373 -0.0948128 0.0288995 -0.0619872 0.117119 0.0243961 0.0174441 0.0518043 -0.0701993 -0.0873468 0.151987 0.0790278 -0.0211267 -0.118456 0.181546 -0.00534437 -0.111182 -0.131991 0.147616 -0.098479 -0.0583195 0.0871012 0.14104 -0.0211753 -0.063514 0.0540107 0.148726 -0.00740146 0.0789212 0.0644117 0.0489324 -0.0354305 0.00468642 0.0294177 0.042249 
0.0663435 -0.0271363 -0.110266 -0.00513752 -0.0125472 0.119015 -0.0347012 0.0581893 -0.0527823 -0.0550629 0.0116904 0.0547739 0.0835153 -0.160294 -0.131297 0.0956385 -0.135971 0.0128697 -0.122103 0.140301 0.196094 -0.134256 0.14274 0.0443708 -0.0732651 0.0259641 -0.0414775 -0.283428 -0.0582502 0.0310949 -0.0392726 0.0972467 -0.00267619 0.111441 -0.0847488 -0.0151314 -0.0543356 0.178537 -0.0307993 -0.00313347 -0.0574242 -0.111221 -0.0369742 0.0624416 -0.0365597 -0.0801914 0.171775 -0.0601259 -0.15869 0.143319 0.0370084 -0.101578 -0.0524436 0.107902 0.0851291 -0.0166543 0.143997 0.0158016 0.0258565 -0.150092 0.00497595 -0.0119068 0.147493 -0.0734465 0.0461361 -0.122248 -0.0402011 0.0522583 0.0150127 0.059542 -0.0814765 0.0216982 -0.0922173 0.0469535 -0.000423626 -0.0638312 -0.00465496 0.040725 -0.0310781 0.0925283 -0.0744314 -0.0164614 -0.0592008 -0.0701374 -0.135085 0.136618 0.0416539 0.0125854 0.0581698 -0.025225 0.0474752 -0.138574 -0.104745 -0.0188326 -0.0260173 0.0606135 -0.0363545 0.146809 0.00331624 0.0193529 0.025165 -0.0634582 -0.0715838 0.172717 0.0485399 -0.0170686 -0.12823 0.137999 -0.0497557 -0.122246 -0.119589 0.16418 -0.047021 -0.0667764 0.0900883 0.0915899 -0.0115918 -0.125409 0.073236 0.124723 0.0146818 0.068138 0.102354 0.0415525 -0.0357179 -0.0128565 0.0306483 0.0198795 
0.0569295 -0.0635373 -0.0930135 0.000418115 -0.000867455 0.133834 -0.0151441 0.0668154 -0.044407 -0.0733835 -0.0427778 0.0433597 0.0845602 -0.151387 -0.0796892 0.0660717 -0.157061 2.23964e-05 -0.118062 0.130471 0.176828 -0.128886 0.162116 0.0749492 -0.0726405 -0.0129313 -0.0714926 -0.321038 -0.10014 0.0254222 -0.0102424 0.0894787 -0.0143187 0.11161 -0.0672205 0.00640325 -0.0472471 0.156679 -0.0764761 -0.00383847 -0.024175 -0.10538 -0.0400432 0.064439 -0.0564926 -0.0608963 0.168444 -0.042964 -0.124246 0.153403 0.0372721 -0.163642 -0.00444249 0.0927006 0.110938 -0.0052706 0.14528 0.0331948 0.059857 -0.151534 -0.000728795 0.0299517 0.0954922 -0.0898993 0.0592358 -0.125075 -0.0304073 0.0388427 0.00459906 0.0452198 -0.086593 0.0413214 -0.0842324 0.0325123 0.000237828 -0.0379673 -0.0242866 0.0244192 -0.000746484 0.111797 -0.0586759 -0.0356556 -0.0754886 -0.0699845 -0.131559 0.133584 0.0518704 0.00575551 0.016071 -0.0246138 0.0525194 -0.125181 -0.0757427 -0.0636643 -0.0610327 0.083545 -0.0377236 0.145806 0.0151592 0.0378022 0.038675 -0.0635481 -0.0551373 0.147092 0.0321125 -0.0450073 -0.160163 0.121584 -0.0737229 -0.0795028 -0.106544 0.160657 -0.0433104 -0.111162 0.0546613 0.124761 -0.000486419 -0.118394 0.0378024 0.145086 0.0325716 0.0567157 0.0808134 0.0455985 -0.0594863 -0.0147987 -0.00493448 0.0201829 
0.044844 -0.0521512 -0.0785491 -0.00452155 -0.0173582 0.11725 -0.0108365 0.0815473 -0.0517528 -0.0526868 -0.0293519 0.0535955 0.0928715 -0.156609 -0.0985068 0.0796413 -0.150997 -0.00978006 -0.12536 0.139319 0.174888 -0.14795 0.146811 0.0848593 -0.0830076 0.00572275 -0.0599967 -0.2991 -0.0706166 0.02042 -0.0236323 0.0974508 -0.00658276 0.114418 -0.0998852 -0.00897529 -0.0557858 0.176316 -0.071864 0.00744345 -0.0311076 -0.122521 -0.0374413 0.044877 -0.0306819 -0.0791721 0.166196 -0.0544772 -0.14604 0.139162 0.0408011 -0.152288 -0.0178019 0.0888586 0.104414 0.00568069 0.131954 0.0389763 0.0472903 -0.142591 -0.00174468 0.0177926 0.101899 -0.0861344 0.0599146 -0.100959 -0.041391 0.0289153 -0.0158962 0.026767 -0.103136 0.0260615 -0.0957947 0.0550096 0.0222346 -0.0357073 0.00490921 0.0371331 0.00297418 0.0976726 -0.0730913 -0.0538208 -0.066493 -0.0689732 -0.130171 0.129042 0.0554771 0.0124548 0.0366213 -0.0254242 0.0379359 -0.131434 -0.0720112 -0.0323249 -0.0461622 0.0951125 -0.0326216 0.133683 0.0229793 0.0432655 0.030957 -0.0727002 -0.0785155 0.168267 0.0387924 -0.0311939 -0.15101 0.121233 -0.0664726 -0.11893 -0.123301 0.17786 -0.0381647 -0.102273 0.068045 0.114122 -0.00945789 -0.102539 0.0482038 0.1482 0.0183583 0.0497107 0.0745596 0.0368252 -0.0570619 0.00784889 -0.0144464 0.00388676 
0.0618848 -0.0131252 -0.0825417 -0.00857046 -0.0150158 0.146449 -0.0023037 0.093092 -0.0544913 -0.0383661 -0.00946299 0.0550003 0.0905669 -0.189129 -0.0946198 0.0947646 -0.133364 -0.0158112 -0.149404 0.133973 0.162637 -0.116244 0.127175 0.0705771 -0.0908736 0.00868354 -0.0601816 -0.282548 -0.0476029 0.0133817 -0.0152518 0.107875 -0.0155281 0.126001 -0.108144 -0.0166344 -0.0472887 0.166012 -0.0601351 0.0320448 -0.0312073 -0.129649 -0.0331717 0.0527485 -0.0257837 -0.0846283 0.166754 -0.0542508 -0.169675 0.148462 0.0698649 -0.124099 -0.0587278 0.0808906 0.0838048 0.00186409 0.108925 0.0415759 0.0480791 -0.13035 -0.0305674 -0.00254673 0.115362 -0.11191 0.0597194 -0.121505 -0.0355044 0.0219843 -0.0381283 0.0382789 -0.0907772 0.0257739 -0.0908852 0.0710764 0.0191395 -0.0454489 0.00818507 0.0523485 -0.0141871 0.096647 -0.0600378 -0.0537687 -0.0453242 -0.0562274 -0.123232 0.127587 0.0596588 -0.00526875 0.0388585 -0.00857562 0.0241213 -0.152825 -0.109015 -0.0153831 -0.0286938 0.0980723 -0.0103556 0.113513 -0.00821938 0.0486312 0.00948209 -0.0544695 -0.0868987 0.187424 0.0206239 -0.0256132 -0.147515 0.127912 -0.0573072 -0.129754 -0.114035 0.178906 -0.0424801 -0.0807421 0.0776028 0.0855489 -0.0188699 -0.100295 0.0549722 0.149045 0.0308833 0.0458854 0.0975467 0.049829 -0.0170774 -0.0100731 0.00733026 -0.00733435 
0.0926347 -0.00181646 -0.114683 0.00144481 -0.00620174 0.13668 -0.000577541 0.0620684 -0.0852631 -0.0283136 0.00924375 0.0586213 0.106488 -0.162948 -0.108606 0.120894 -0.0974404 0.00109743 -0.120026 0.137954 0.178643 -0.0994664 0.138157 0.0450739 -0.0818431 0.0133152 -0.0579631 -0.276536 -0.0273828 0.0648866 -0.0632048 0.126867 -0.00927357 0.111406 -0.101849 -0.0389231 -0.0381609 0.165723 -0.0156332 0.0331562 -0.0738578 -0.114352 -0.00767627 0.0429749 -0.0504744 -0.0720749 0.179314 -0.071005 -0.158835 0.150117 0.100869 -0.08447 -0.0668133 0.111315 0.0708089 -0.0276024 0.160812 0.0159381 0.0465419 -0.111487 -0.0180843 -0.0160702 0.121074 -0.116607 0.0458811 -0.136064 -0.0379045 0.0296181 -0.0223652 0.0274525 -0.0755798 0.034754 -0.0975413 0.0635715 0.00992573 -0.0348193 0.0139917 0.0348697 -0.0320934 0.105361 -0.0321798 -0.042739 -0.0325089 -0.0399617 -0.110156 0.147397 0.036059 -0.0246917 0.032992 -0.0186005 0.00759749 -0.142467 -0.134488 0.00476308 -0.0346335 0.0636908 -0.00898609 0.149162 -0.000547956 0.0323314 0.0226242 -0.0363012 -0.0573326 0.215816 0.0114957 -0.0342154 -0.128389 0.157887 -0.0396446 -0.125721 -0.122225 0.153733 -0.0341395 -0.0725617 0.0667637 0.0910442 -0.013326 -0.0890222 0.0355355 0.14067 0.0131517 0.0384046 0.114505 0.0316167 -0.0193173 -0.0067604 0.0234877 0.0120751 
0.0801269 -0.0247712 -0.0864143 -0.0167685 -0.0185576 0.113578 -0.0106737 0.0793708 -0.00881754 -0.0717741 0.0173388 0.0473746 0.114224 -0.167892 -0.126878 0.109989 -0.134062 -0.0213609 -0.190085 0.153931 0.19615 -0.105025 0.127971 0.0502845 -0.117638 -0.00428133 -0.0637943 -0.265692 -0.0495851 0.0405811 -0.0385515 0.102063 0.00883189 0.124459 -0.100016 -0.019661 -0.0356851 0.194054 -0.0571621 0.0249375 -0.0685334 -0.115635 -0.0471186 0.0345184 -0.0115825 -0.0856761 0.1305 -0.0445959 -0.141677 0.161662 0.0354041 -0.106366 -0.0545071 0.110141 0.0745763 -0.0245634 0.116747 -0.000639258 0.00996288 -0.122587 -0.0222346 -0.0163851 0.118629 -0.0831895 0.0237416 -0.135487 -0.0274043 0.0513131 -0.0148179 0.00362858 -0.0679691 -0.0125629 -0.0899244 0.0375968 0.0145158 -0.0288297 0.00820862 0.0209643 -0.0267732 0.12117 -0.0248852 -0.0579538 -0.0573247 -0.0455608 -0.122487 0.165661 0.0461136 -0.00605412 0.0370202 0.00112102 0.0354852 -0.171559 -0.116204 0.0151716 -0.0513004 0.0792683 -0.0462243 0.100734 0.00367164 0.03894 0.0513405 -0.0661163 -0.0916843 0.178646 0.0400029 -0.0298986 -0.129556 0.138357 -0.04205 -0.125821 -0.128158 0.158689 -0.0575602 -0.055873 0.067017 0.122092 -0.0353109 -0.0651132 0.0315484 0.136783 -0.00220633 0.0598447 0.0969273 0.0655244 -0.00913386 -0.00964872 0.0136592 0.000859258 
0.0894763 -0.0327743 -0.0802303 -0.0201584 -0.0219653 0.114768 -0.00742861 0.0837757 0.0185644 -0.0814724 0.0402907 0.0326295 0.14141 -0.151721 -0.11784 0.0857075 -0.118643 0.000306822 -0.230226 0.15823 0.195643 -0.100765 0.129188 0.078122 -0.129617 -0.0364979 -0.0798685 -0.252172 -0.0493807 0.0287563 -0.00986259 0.0994376 0.000846605 0.127915 -0.105756 -0.00604362 -0.0453433 0.196547 -0.0692306 0.0409077 -0.0573703 -0.100909 -0.0932778 0.0355734 -0.0230843 -0.114675 0.090243 -0.0131275 -0.112785 0.16215 0.0118716 -0.100377 -0.0562303 0.0994638 0.0392739 -0.0259254 0.104384 0.00302979 0.0192817 -0.125618 -0.043951 -0.000189056 0.108422 -0.0773185 -0.0234455 -0.136262 0.0081939 0.061944 -0.0138459 -0.00664249 -0.0505477 -0.0228434 -0.073588 0.0319786 0.00852399 -0.0427079 -0.0144287 0.00728718 -0.0262227 0.140636 -0.0213715 -0.0567979 -0.0615145 -0.0596117 -0.116275 0.188445 0.0568687 -0.0204472 0.022607 -0.0175489 0.0496114 -0.178536 -0.0871537 0.00501607 -0.0600645 0.0500958 -0.0776007 0.0810875 -0.0140194 0.0310513 0.0650076 -0.0654609 -0.0826097 0.188405 0.0523785 -0.0272278 -0.128751 0.130675 -0.0197493 -0.114281 -0.124301 0.1632 -0.0697822 -0.0362479 0.0440124 0.132427 -0.0462981 -0.0642252 0.0320586 0.137725 -0.0117173 0.0490168 0.0575709 0.0920227 -0.0254916 -0.0247186 -0.0196633 0.013895 
0.0988212 -0.0763178 -0.0589279 0.016715 -0.00638638 0.172094 0.041102 0.0417775 0.0125154 -0.116738 -0.0349071 -0.0192392 0.121728 -0.0932607 -0.0268071 0.0615815 -0.109598 0.0256494 -0.135943 0.0522567 0.214603 -0.0761029 0.131806 0.112665 -0.068086 -0.120162 -0.141239 -0.310944 -0.106952 0.0768401 0.0390974 0.0872602 -0.0379908 0.116179 0.00206436 0.0155945 0.024447 0.0960511 -0.0320822 -0.00161 -0.0239864 -0.0700667 -0.0122496 -0.00221148 -0.0338584 -0.110927 0.10451 -0.0167958 -0.0565704 0.126797 0.0217082 -0.206956 0.0635069 0.117199 0.069521 0.0167105 0.166047 0.0243283 0.0600394 -0.137111 -0.0221537 0.0805175 0.0287442 -0.18087 0.0216513 -0.0765235 0.0249275 0.00564076 -0.0279686 -0.0174935 -0.068646 0.0267991 -0.0975767 -0.0248364 -0.0241677 -0.0101808 -0.0114504 -0.0306078 0.0108456 0.130153 0.00652995 -0.042387 -0.0733995 -0.0602846 -0.102571 0.191618 0.0324223 -0.0677385 -0.0675214 -0.0198889 0.0835115 -0.151008 -0.0312837 -0.0705924 -0.0957726 0.0887433 -0.0830501 0.148552 0.00484264 0.109745 0.101383 -0.0540899 -0.0472342 0.153597 0.0590402 -0.0632617 -0.114999 0.06806 -0.104506 -0.0173453 -0.14173 0.0672467 -0.0328871 -0.119417 0.0137805 0.189439 0.0047736 -0.0330912 -0.0499502 0.122842 0.0311181 0.00264823 0.0482422 0.0634025 -0.0741659 -0.0126303 -0.063107 0.0323337 
0.0799672 -0.0354175 -0.0788867 0.0363951 -0.0155761 0.185274 0.0160017 0.0299079 -0.00429363 -0.108843 -0.017999 0.0143079 0.0955499 -0.12808 -0.0599906 0.0493478 -0.121402 0.031568 -0.10837 0.0767581 0.211435 -0.1104 0.138339 0.114987 -0.0375174 -0.101096 -0.110763 -0.315229 -0.102522 0.0764581 0.0287084 0.0643406 -0.012162 0.12063 -0.0080143 0.0104998 0.0108396 0.102549 -0.0365547 -0.021344 -0.024329 -0.0995126 0.0105786 0.0178268 -0.0539859 -0.118687 0.152708 -0.0444393 -0.0939586 0.149821 0.0402457 -0.172768 0.0469798 0.1178 0.0988506 0.0235942 0.154565 0.0192435 0.0482812 -0.16481 -0.0327096 0.0552924 0.0780786 -0.194662 0.0455591 -0.0815187 0.00865247 -0.0116118 -0.0549507 0.0281516 -0.0752569 0.0305085 -0.120962 -0.000828742 0.00296558 -0.0181936 -0.0060254 -0.00712363 0.00359859 0.128662 -0.0541474 -0.0316033 -0.0455352 -0.051859 -0.104824 0.176184 0.0224165 -0.0497715 -0.0219531 -0.008336 0.062963 -0.169661 -0.0426909 -0.0661503 -0.0741172 0.0575642 -0.0691661 0.168537 0.00160789 0.0778455 0.072383 -0.0378592 -0.0444897 0.154521 0.0507768 -0.03198 -0.101559 0.0892243 -0.110785 -0.043206 -0.138091 0.0835916 -0.0273265 -0.114523 0.033669 0.156495 0.0118622 -0.0645415 0.00744893 0.155315 0.0425756 0.00290183 0.0558734 0.0427339 -0.0533813 0.00518673 0.00209195 0.0438289 
0.0642784 -0.0539259 -0.0695391 0.0578842 -0.0213059 0.175294 -0.00785486 0.0143559 -0.0118841 -0.102095 0.001726 0.0414324 0.0853105 -0.113895 -0.0644804 0.00814789 -0.113347 0.0407902 -0.0503668 0.122909 0.202914 -0.14082 0.127594 0.149495 -0.0120351 -0.053966 -0.0942744 -0.311287 -0.0899788 0.0705912 0.0333386 0.0441987 0.0139769 0.114469 -0.000401556 0.0291696 0.0104483 0.128449 -0.0329152 -0.0689594 -0.00978824 -0.104308 7.19363e-05 0.023156 -0.0857608 -0.148895 0.17669 -0.0548065 -0.0830745 0.138897 0.0150762 -0.145026 0.0733108 0.126457 0.150451 0.0346083 0.136774 0.0205628 0.0280378 -0.211333 -0.0390984 0.0344144 0.117854 -0.188936 0.0474444 -0.0382425 0.0282559 -0.0374568 -0.0590877 0.0409521 -0.0832629 0.0268531 -0.13397 0.0175908 0.0296223 -0.0414389 -0.00524698 0.00529745 0.0397531 0.131525 -0.101999 0.00688244 -0.0231823 -0.0697485 -0.0545239 0.127368 0.0283568 0.00774218 0.0341878 -0.0100069 0.0825348 -0.147998 -0.00448988 -0.0492958 -0.0747686 -0.00447735 -0.0602502 0.188817 0.0175038 0.0267818 0.0624873 -0.0220455 -0.0371162 0.126309 0.0378891 0.018724 -0.0661468 0.0542933 -0.080396 -0.0472497 -0.132605 0.103889 -0.0348989 -0.119199 0.0552196 0.132038 0.0186792 -0.122512 0.0243602 0.153543 0.0475734 -0.00897243 0.0510632 0.0178644 -0.0771756 0.0481797 0.0600592 0.0715454 
0.0627528 -0.0538489 -0.0781162 0.0357954 -0.0324802 0.132467 -0.0270159 0.0429531 0.0010605 -0.121096 -0.00426258 0.0335203 0.077275 -0.139819 -0.0925959 0.0171751 -0.129483 0.00644434 -0.0778488 0.151235 0.200315 -0.143226 0.138966 0.0948932 -0.0393449 -0.0188748 -0.0731969 -0.308406 -0.0939103 0.0367978 0.0150815 0.0427114 0.0351994 0.121488 -0.0161375 0.00754464 0.015498 0.191893 -0.044151 -0.074824 -0.0260083 -0.104361 -0.0165512 0.0394445 -0.0669611 -0.125029 0.167687 -0.0583197 -0.0900365 0.165337 -0.0127374 -0.128997 0.053739 0.139657 0.14504 -0.00464616 0.140983 -0.0153113 0.0126454 -0.230288 -0.0215542 0.00234809 0.122257 -0.131172 0.0345814 -0.0655233 0.0199844 -0.00871173 -0.0122496 0.0239676 -0.0899601 -0.0070312 -0.117555 0.0340239 0.0294626 -0.0661902 -0.0132679 0.00528028 0.0321032 0.143429 -0.103556 -0.00102291 -0.041132 -0.0773361 -0.0494625 0.11542 0.0224817 0.038768 0.0674295 -0.0171899 0.0890856 -0.148835 -0.0254929 -0.050236 -0.0679762 0.000115921 -0.0440561 0.175756 0.00750304 0.00866453 0.0464852 -0.0357147 -0.0410059 0.128163 0.0416805 -0.00271368 -0.0712703 0.0877822 -0.0551188 -0.0700493 -0.119176 0.129398 -0.0642354 -0.0942963 0.0659112 0.117821 0.0104983 -0.144216 0.046894 0.133198 0.0290112 0.0463093 0.0767314 0.032708 -0.0434561 -0.000983284 0.0830681 0.0548539 
0.0671737 -0.0199669 -0.0922624 0.0460869 -0.0433131 0.158412 -0.0266152 0.046047 -0.00841951 -0.0875567 0.0320321 0.0491696 0.0734356 -0.179605 -0.107688 0.0327382 -0.129431 0.0272056 -0.0692126 0.140876 0.195694 -0.132316 0.128458 0.0986595 -0.0443754 -0.0328459 -0.0519106 -0.301321 -0.0778393 0.052845 -0.00432529 0.0291022 0.042734 0.118591 -0.0187416 -0.00473553 0.0187235 0.142224 -0.0327842 -0.0534737 -0.0322618 -0.132266 -0.0090888 0.0406769 -0.0771916 -0.139984 0.177776 -0.067149 -0.116414 0.174272 0.0228169 -0.107769 0.0204285 0.140457 0.12192 0.00756229 0.141162 -0.0356311 0.00118071 -0.191676 -0.0341849 -0.0124566 0.13928 -0.156213 0.0468458 -0.0899905 0.0084481 -0.0370045 -0.0390287 0.0335845 -0.0950235 -0.00872394 -0.129875 0.0319338 0.0364302 -0.0565127 0.00299196 0.0341171 0.0111205 0.134447 -0.107787 -0.0192632 -0.0222893 -0.0459322 -0.0565833 0.15306 0.0116394 0.00765351 0.0610265 -0.000189772 0.0641259 -0.165136 -0.0595925 -0.0246263 -0.0629014 -0.0070698 -0.0543881 0.167389 0.000112274 0.0166003 0.0517864 -0.0269726 -0.0464443 0.127712 0.0688307 0.0109478 -0.0428543 0.0995521 -0.0787039 -0.0684676 -0.137569 0.106255 -0.0232942 -0.0960714 0.0618464 0.104065 0.0190055 -0.11706 0.0616943 0.144716 0.035053 0.0066861 0.0795773 0.024099 -0.0165217 0.0194824 0.0950823 0.0625803 
0.0913814 -0.0182564 -0.119886 0.0393575 -0.0208006 0.138038 -0.0122742 0.0348017 -0.0218304 -0.091276 0.0469369 0.0552848 0.089257 -0.161048 -0.131168 0.0590771 -0.0918052 0.0449574 -0.11213 0.156998 0.200965 -0.126265 0.141421 0.105738 -0.0681062 -0.04005 -0.0403823 -0.285525 -0.059024 0.0646976 -0.0418311 0.0625477 0.0388815 0.12826 -0.0488405 -0.0158833 0.000133113 0.163665 -0.0521024 -0.0479368 -0.0528 -0.111411 -0.0201671 0.0389059 -0.075494 -0.106121 0.166906 -0.0548506 -0.146572 0.171587 0.0267972 -0.107727 -0.00211427 0.122121 0.097597 -0.00418354 0.138812 -0.0115347 0.00196566 -0.159085 -0.0278134 0.000485201 0.154404 -0.143343 0.0425752 -0.0987755 -0.0180897 -0.00544553 -0.0476308 0.0403118 -0.0911122 -0.0235831 -0.118971 0.0333912 0.0208017 -0.0486827 0.0203915 0.0328132 -0.0139825 0.0990968 -0.0931217 -0.016302 -0.0573632 -0.0770928 -0.0842602 0.165499 0.00392253 -0.0171265 0.0357685 0.0116497 0.0784268 -0.17955 -0.0837025 -0.0204755 -0.0315453 0.0219664 -0.0611134 0.15121 0.00863683 0.0160993 0.0603447 -0.0375828 -0.0493038 0.156626 0.0515672 -0.00127479 -0.0652857 0.114921 -0.0702553 -0.0974894 -0.121447 0.132664 -0.00999215 -0.0722689 0.063416 0.102593 -0.00551947 -0.110559 0.0684484 0.151335 0.00616695 0.0231072 0.0695956 0.0447551 -0.0185 0.0155943 0.0577586 0.0136108 
0.0976633 -0.0336056 -0.134389 0.0316236 -0.00503708 0.131352 -0.00557696 0.0465135 -0.031518 -0.0802778 0.0335727 0.0670431 0.0950092 -0.164485 -0.113218 0.0414693 -0.0835191 0.0336971 -0.117101 0.18305 0.169705 -0.124469 0.159915 0.0990075 -0.0778237 -0.0309841 -0.0432597 -0.294633 -0.069285 0.0452676 -0.0349482 0.0754212 0.0329382 0.129745 -0.0667132 -0.0130129 -0.0108062 0.18345 -0.0713402 -0.0385594 -0.0410104 -0.10643 -0.0471879 0.0596136 -0.108396 -0.0982036 0.155951 -0.0402744 -0.123351 0.192438 0.0337846 -0.106872 -0.0210498 0.10759 0.0956369 -0.0242889 0.130412 -0.00108297 0.0182123 -0.150319 -0.040336 -0.0073 0.146559 -0.135104 0.0412719 -0.132345 -0.0113701 0.00589291 -0.0430033 0.0395657 -0.0831679 -0.00640899 -0.0991457 0.0556375 0.00900265 -0.0588471 0.00784884 0.0323986 -0.00810686 0.114075 -0.0959575 -0.0259518 -0.0593471 -0.0785683 -0.0718319 0.13723 0.0194838 -0.00638282 0.0448429 -0.00656318 0.0693999 -0.164742 -0.0811024 -0.0364047 -0.0302498 0.00698187 -0.0440709 0.138964 -0.0058814 -0.00197286 0.0432401 -0.0305713 -0.0415089 0.165133 0.0323106 -0.0145912 -0.085957 0.123639 -0.0427519 -0.0857221 -0.104331 0.157181 -0.018972 -0.0599413 0.0494815 0.0900126 0.0034726 -0.132308 0.0696205 0.165013 0.0042306 0.0372298 0.0630642 0.0632777 -0.0207645 -0.0147406 0.0479287 0.015582 
0.103093 -0.0461406 -0.136007 0.0383914 -0.0197347 0.122549 -0.0166026 0.0357493 -0.0216218 -0.106718 0.0384418 0.0670171 0.0815908 -0.15932 -0.135913 0.0234479 -0.104887 0.0212008 -0.111588 0.181244 0.162663 -0.128419 0.175728 0.0680453 -0.0840187 -0.0258993 -0.0324404 -0.285272 -0.0995147 0.0289665 -0.0437469 0.047947 0.0373703 0.123756 -0.0610215 -0.0158735 -0.0177432 0.194067 -0.0670142 -0.0402081 -0.0553018 -0.100616 -0.0673793 0.0506037 -0.112039 -0.0994335 0.134703 -0.0447148 -0.104765 0.220926 0.0154263 -0.0901478 -0.0133774 0.127463 0.0886676 -0.0478607 0.147846 -0.015592 0.00161259 -0.144682 -0.0298384 -0.002851 0.157784 -0.11735 0.0359443 -0.137406 -0.0056914 0.017181 -0.0260832 0.0514406 -0.0756589 -0.0155089 -0.0844661 0.0657736 0.00500204 -0.0633899 0.00302413 -0.00293872 -0.0141774 0.130613 -0.102629 -0.0423699 -0.058207 -0.0782931 -0.0805197 0.132489 0.011169 -0.00114746 0.0489648 -0.0163914 0.0789404 -0.162721 -0.0583681 -0.0362958 -0.0326249 -0.0147435 -0.0447952 0.135754 -0.00122082 -0.00164347 0.0476064 -0.0202065 -0.0427119 0.144912 0.0644476 -0.017229 -0.0663465 0.129302 -0.0478756 -0.0763849 -0.0973571 0.151825 -0.00615785 -0.0499416 0.046954 0.101964 0.0171475 -0.112076 0.0856981 0.155618 -0.0115372 0.0341601 0.0648104 0.0502571 -0.00150458 -0.0187091 0.069957 0.0342307 
0.0992014 -0.0766236 -0.123241 0.0422648 0.00404121 0.104723 -0.00622556 0.0552308 0.00724372 -0.112696 0.032948 0.0895999 0.0813426 -0.176653 -0.143496 0.0326036 -0.0985405 0.0287523 -0.136757 0.18187 0.192172 -0.128238 0.158329 0.0802986 -0.0786431 -0.026323 -0.0352154 -0.297971 -0.0959041 0.0369478 -0.0420546 0.0735502 0.0436793 0.130515 -0.0686283 -0.0336203 -0.0249768 0.192501 -0.0694479 -0.0509444 -0.0303259 -0.0920824 -0.0733358 0.0491003 -0.0956361 -0.115262 0.115507 -0.0584036 -0.0907347 0.184404 0.0131695 -0.106241 -0.00614517 0.109183 0.0892516 -0.0380444 0.134166 -0.0196549 -0.0179746 -0.139605 -0.0170163 -0.0258494 0.138531 -0.0914669 0.0317246 -0.146768 -0.0187042 0.0283645 -0.0119813 0.0324592 -0.0774793 -0.0207213 -0.0908513 0.0344019 -0.013634 -0.0455851 0.00432333 0.00695669 -0.0246483 0.131476 -0.116218 -0.0208602 -0.0514676 -0.0719903 -0.0721847 0.13034 0.0394037 0.0202097 0.035409 -0.0276244 0.0714618 -0.162812 -0.0814925 -0.0151496 -0.0439656 0.00131098 -0.0557673 0.102832 -0.000819934 -0.000522033 0.0589066 -0.0514883 -0.0512918 0.157214 0.0682878 -0.0371431 -0.0725737 0.123326 -0.0496439 -0.0888687 -0.109512 0.14734 -0.0333285 -0.0523083 0.0625016 0.102719 -0.0175134 -0.116773 0.0729976 0.153887 -0.0131741 0.0717606 0.0453543 0.0540772 0.00504056 -0.0141877 0.0535628 0.0157983 
0.0903668 -0.0566466 -0.130303 0.0413898 -0.0119507 0.0972909 -0.0187407 0.0518778 0.0105369 -0.0991394 0.0343819 0.0874727 0.0787285 -0.176242 -0.153981 0.0351893 -0.104067 0.0181501 -0.118344 0.181056 0.186623 -0.13974 0.160319 0.0558031 -0.0756385 -0.0145547 -0.0271982 -0.29016 -0.095656 0.0445059 -0.0456158 0.068628 0.0616835 0.12027 -0.0653566 -0.0369189 -0.0181116 0.203275 -0.0579545 -0.0576817 -0.0522988 -0.105232 -0.0666604 0.0447986 -0.087725 -0.11184 0.119567 -0.0640237 -0.0929278 0.188567 0.0167596 -0.0784199 -0.00437223 0.116415 0.0921947 -0.0398477 0.140538 -0.0420091 -0.0249847 -0.14515 -0.0175784 -0.0445925 0.143404 -0.091841 0.0376481 -0.147289 -0.0224949 0.0302805 -0.0131012 0.032144 -0.0774695 -0.0286114 -0.102803 0.0316621 -0.00625925 -0.0425413 0.0100084 0.0040686 -0.0250546 0.140499 -0.12692 -0.0344674 -0.0440519 -0.0541883 -0.0665292 0.121985 0.0263354 0.024225 0.0638558 -0.0260662 0.0496172 -0.161652 -0.0789636 -0.00218336 -0.0425994 -0.0107568 -0.0487454 0.112641 -0.000452959 -0.00775217 0.0621111 -0.0398021 -0.055912 0.148464 0.0750207 -0.0298247 -0.0589979 0.124939 -0.0402331 -0.0905603 -0.119653 0.138095 -0.0360102 -0.0508475 0.0687592 0.100289 -0.00942512 -0.113797 0.0850505 0.155605 -0.0130695 0.0658856 0.0567228 0.0440119 0.0228429 -0.0114047 0.0827511 0.0299622 
0.089981 -0.0278994 -0.132851 0.0325239 -0.023221 0.118364 -0.00974734 0.0430082 -0.00276838 -0.0985912 0.0321808 0.0627445 0.0887628 -0.180773 -0.139921 0.0416249 -0.105764 0.0309407 -0.118431 0.171921 0.183065 -0.124019 0.150933 0.064816 -0.0935042 -0.0452705 -0.046327 -0.294451 -0.0944154 0.0624223 -0.0527596 0.0545865 0.0561399 0.123337 -0.0395861 -0.0269748 0.0126973 0.169017 -0.0645374 -0.0479314 -0.0598507 -0.117785 -0.0315327 0.045084 -0.085984 -0.0914811 0.145684 -0.0502551 -0.121007 0.203845 0.0192921 -0.116642 -0.0060892 0.129249 0.0851915 -0.0257933 0.137101 -0.0465713 -0.0126413 -0.133272 -0.016667 -0.0109058 0.136263 -0.129134 0.0505071 -0.151703 -0.0207522 -0.00481737 -0.0384519 0.0147505 -0.0839089 -0.0433064 -0.105675 0.0262996 0.00150317 -0.0332676 0.0150001 0.016881 -0.0144113 0.117187 -0.096354 -0.0440541 -0.0703763 -0.0459495 -0.0814712 0.166362 0.000367396 -0.0205719 0.041399 0.00864248 0.0596563 -0.179687 -0.0811089 -0.0234532 -0.0457995 0.0130833 -0.061646 0.130126 -0.00151014 0.0176114 0.0650721 -0.0311951 -0.0538907 0.141499 0.0766385 -0.0267878 -0.0578911 0.133894 -0.0775011 -0.0635328 -0.122692 0.108923 -0.0122273 -0.0684625 0.0305991 0.106548 0.00590553 -0.0967752 0.0625376 0.150698 -0.008034 0.0373054 0.0649824 0.0584277 0.0147708 -0.0152561 0.0579305 0.0129814 
0.096642 -0.0269233 -0.139872 0.023215 -0.0274707 0.12025 -0.0181569 0.034752 -0.0207454 -0.106371 0.0402303 0.0595777 0.0968882 -0.146516 -0.146897 0.0478362 -0.0930062 0.0259801 -0.130803 0.178386 0.166417 -0.125434 0.155081 0.0713378 -0.102234 -0.0407793 -0.0277438 -0.263562 -0.0972596 0.0509929 -0.0615312 0.0575741 0.045344 0.128055 -0.0675433 -0.00806685 -0.00582125 0.169948 -0.0798034 -0.0301917 -0.0729699 -0.110237 -0.0320446 0.0450324 -0.0788058 -0.0783307 0.148498 -0.0425294 -0.140438 0.217906 0.0173117 -0.119377 -0.0213618 0.128672 0.0812482 -0.024362 0.118642 -0.0151379 0.00460344 -0.129188 -0.0226647 0.0139617 0.150108 -0.131197 0.0384979 -0.130253 -0.0211149 0.0106466 -0.0496379 0.0309956 -0.0771123 -0.0456611 -0.0916434 0.039399 0.0106805 -0.0375579 0.0268843 0.00686152 -0.0222411 0.0943806 -0.0825398 -0.0515097 -0.0839407 -0.0759263 -0.110463 0.174373 -0.00732377 -0.0351436 0.0392229 0.0196963 0.0690672 -0.191075 -0.0765802 -0.025004 -0.0211299 0.0362237 -0.0620814 0.128039 0.00265773 0.0160076 0.0497054 -0.0314811 -0.0586912 0.148827 0.0584524 -0.00980498 -0.0839734 0.131288 -0.0896377 -0.0866574 -0.107861 0.13417 0.00298024 -0.0520074 0.026482 0.0983324 0.00835252 -0.0913956 0.0790821 0.151523 -0.0145519 0.0235137 0.0732605 0.0650242 0.00534632 -0.0163146 0.0447335 -0.000823789 
0.0722234 -0.00704867 -0.11556 0.0371375 -0.0507073 0.145885 -0.0218374 0.045114 -0.0220805 -0.062321 0.0253395 0.049819 0.096762 -0.16375 -0.119179 0.0507551 -0.101889 0.0304367 -0.0823122 0.158555 0.174792 -0.139123 0.133307 0.0889066 -0.0727258 -0.0374609 -0.0509172 -0.281295 -0.0866471 0.0674988 -0.0412964 0.0517728 0.0511414 0.117705 -0.0401173 -0.00799991 0.0277551 0.150962 -0.0488759 -0.0454828 -0.0621414 -0.13607 0.00805294 0.0250082 -0.071361 -0.121821 0.178856 -0.0577434 -0.12628 0.197919 0.0510494 -0.120553 0.00266293 0.145073 0.120414 0.0011301 0.137887 -0.0477084 0.0192731 -0.173058 -0.0305876 -0.00679658 0.12298 -0.167539 0.048834 -0.0985655 -0.0113127 -0.0262651 -0.0626504 0.0132544 -0.091486 -0.0194367 -0.124109 0.034814 0.0325709 -0.0329883 0.030055 0.0335745 0.0113182 0.107619 -0.0934845 -0.0431477 -0.0408402 -0.0426275 -0.0701036 0.165426 -0.00852829 -0.0107153 0.0760047 0.0153867 0.0321714 -0.177336 -0.0644873 -0.015319 -0.0531742 0.0209202 -0.0504278 0.163302 -0.00323088 0.0215522 0.059533 -0.0180492 -0.0521954 0.144586 0.0623604 0.00353507 -0.0621001 0.100546 -0.0924105 -0.0689164 -0.142582 0.112651 0.000517057 -0.0860512 0.0372879 0.0945714 0.0229593 -0.0969975 0.0475113 0.146936 0.0176629 0.000415923 0.095692 0.0309932 -0.00326639 0.0145997 0.0754845 0.0349538 
0.0922027 -0.010019 -0.146837 0.0261465 -0.0376724 0.141713 -0.0276783 0.0234226 -0.0209512 -0.101121 0.0383291 0.0416474 0.103342 -0.140327 -0.1359 0.0414639 -0.0946207 0.0315201 -0.101672 0.152148 0.179183 -0.122029 0.152557 0.0845647 -0.0776147 -0.0514841 -0.0272644 -0.277123 -0.0939419 0.0717552 -0.0429392 0.0429371 0.0498644 0.116376 -0.0437534 -0.00829757 0.00964404 0.15372 -0.0616821 -0.0342299 -0.0714191 -0.115975 -0.0137978 0.0551931 -0.0848878 -0.0869427 0.16653 -0.040955 -0.13417 0.20015 0.0300173 -0.107608 0.0102524 0.135166 0.0907953 -0.0133546 0.1441 -0.0263994 0.025532 -0.169372 -0.0321433 0.0137131 0.146162 -0.143613 0.0272921 -0.116074 -0.00619554 0.00310469 -0.0399862 0.0254941 -0.0790822 -0.0392363 -0.109383 0.0148705 0.0262775 -0.0347542 0.00449898 0.0104407 -0.0156493 0.121533 -0.079459 -0.0400801 -0.0622079 -0.0658539 -0.0965316 0.183421 -0.00970082 -0.0421228 0.037577 0.0107275 0.0563654 -0.187415 -0.0698154 -0.0347304 -0.0434534 0.014365 -0.0627579 0.16368 0.00222021 0.00756818 0.0657939 -0.0136451 -0.0345933 0.151664 0.0456444 -0.0125565 -0.079901 0.130322 -0.0938419 -0.0766774 -0.108102 0.115025 -0.00698336 -0.0711564 0.0210325 0.112552 -0.000255457 -0.0988847 0.0695633 0.147231 0.00411511 0.0014036 0.0737582 0.0447758 -0.0112182 -0.0060441 0.0536706 0.0302779 
0.0826892 -0.0011732 -0.114684 0.0307639 -0.043316 0.169012 -0.0152042 0.0429986 -0.0279179 -0.0692455 0.0293227 0.0373749 0.0953816 -0.169126 -0.128418 0.0413688 -0.0993945 0.0601708 -0.0862954 0.11655 0.196354 -0.12932 0.147223 0.0849433 -0.0680356 -0.0636838 -0.0584637 -0.292298 -0.0785073 0.0664869 -0.0207371 0.0404973 0.0297623 0.106189 -0.0288323 -0.0318765 0.000121733 0.136723 -0.0289654 -0.0212056 -0.0715893 -0.119995 -0.0276332 0.0330316 -0.0763121 -0.130485 0.155745 -0.0624964 -0.127191 0.185015 0.056621 -0.0893981 0.0084794 0.129861 0.0636624 -0.00200702 0.184874 -0.0310892 0.0241669 -0.163813 -0.0225183 0.0125007 0.127937 -0.164738 0.0408304 -0.127062 -0.00319238 -0.0193216 -0.052501 0.0427149 -0.0806355 -0.0119616 -0.1246 0.024942 -7.69966e-06 -0.0429667 0.00602679 0.0163368 -0.0099108 0.11981 -0.109402 -0.0417212 -0.0335457 -0.0394173 -0.078251 0.172311 -0.0028697 -0.0365447 0.0429838 -0.010881 0.0345609 -0.167601 -0.0648954 -0.0255478 -0.0389431 0.00156404 -0.0569757 0.177356 -0.0238051 0.0423935 0.07132 -0.00535325 -0.0517439 0.170936 0.0868649 -0.0178392 -0.0496057 0.108313 -0.0807697 -0.0688068 -0.141715 0.09793 0.00199063 -0.0854126 0.0420142 0.117411 0.0107709 -0.0862781 0.0652513 0.150058 0.0101712 -0.011974 0.0643673 0.0163151 -0.00577522 0.00634048 0.0593636 0.0484233 
0.091762 -0.0244555 -0.138254 0.00933879 -0.0295789 0.153872 -0.0239649 0.058418 -0.01584 -0.11132 0.0271101 0.0573468 0.0962613 -0.169367 -0.15215 0.0194716 -0.101278 0.0205648 -0.114908 0.159733 0.182874 -0.115155 0.14411 0.0855366 -0.0893728 -0.0408887 -0.0250561 -0.277602 -0.0921015 0.0457338 -0.0334637 0.0163158 0.0371748 0.116764 -0.0558127 -0.0222786 -0.0137201 0.163083 -0.0742549 -0.0253944 -0.0585917 -0.104766 -0.042353 0.0690554 -0.0840312 -0.108393 0.147465 -0.0471282 -0.128419 0.213315 0.0253716 -0.095946 0.001781 0.123 0.0883035 -0.021781 0.134781 -0.00908195 0.0129881 -0.183319 -0.0311049 0.0110841 0.160631 -0.125933 0.0187161 -0.145472 0.000403453 0.00526298 -0.0351848 0.0282187 -0.0673725 -0.0357292 -0.0999425 0.0267169 0.00922072 -0.0369073 -0.00443775 0.00894763 -0.00781303 0.133383 -0.0994039 -0.0351314 -0.0397916 -0.0584878 -0.0806194 0.15701 0.0155559 -0.0119453 0.057655 -0.00282614 0.0552046 -0.186807 -0.0746954 -0.0205749 -0.0323164 0.00314673 -0.0452217 0.142518 -0.0265335 0.00756062 0.0596628 -0.00478218 -0.0526349 0.157669 0.034462 -0.0142239 -0.0818657 0.116526 -0.0909387 -0.0801841 -0.0864864 0.128185 -0.0204261 -0.0554271 0.031406 0.114725 -0.0110038 -0.105069 0.0748002 0.147525 -0.00770597 0.0122408 0.0694906 0.0301164 -0.00343736 -0.00861692 0.0577575 0.0253171 
0.0631084 -0.0224447 -0.131108 0.0234641 -0.0144017 0.127156 -0.0416075 0.0559104 -0.0127515 -0.0699265 0.0307791 0.0771515 0.0634056 -0.193549 -0.167323 0.0358174 -0.113075 0.0307445 -0.105171 0.159802 0.173094 -0.154949 0.171996 0.0698358 -0.0655259 -0.00987679 -0.0162912 -0.287643 -0.0685695 0.00602405 -0.0100591 0.021363 0.0338497 0.0855592 -0.0753247 -0.0301554 -0.0687874 0.192966 -0.0685995 -0.016957 -0.059693 -0.0927195 -0.0978522 0.0777185 -0.0905078 -0.112561 0.137111 -0.0622905 -0.111485 0.183963 0.0266417 -0.0389716 -0.0232305 0.082112 0.0617722 -0.0304557 0.161747 -0.001814 0.0123741 -0.164052 -0.0299533 -0.0243993 0.172998 -0.0869234 0.0435538 -0.168962 -0.017159 0.0306163 -0.0109025 0.0802406 -0.0592294 0.0139008 -0.0904569 0.051535 -0.00348993 -0.0624366 -0.0227722 0.0388415 -0.0295651 0.131876 -0.147353 -0.0234856 -0.0312584 -0.0522261 -0.0852716 0.115298 0.0309243 0.0335148 0.0691745 -0.0608141 0.0302326 -0.130249 -0.0717895 -0.0211611 0.000510544 -0.028615 -0.0295692 0.137663 -0.0326555 -0.00758106 0.0377611 -0.028378 -0.0639153 0.150715 0.0629262 -0.0126363 -0.0619705 0.112286 -0.0167873 -0.0955708 -0.104172 0.167047 -0.0106422 -0.0444302 0.0717682 0.100203 -0.0264512 -0.121062 0.10257 0.157739 -0.0195563 0.0445794 0.044633 0.0157749 -0.0115071 0.00538585 0.0645485 0.0474077 
0.0532756 -0.0308799 -0.10697 0.015066 -0.00289965 0.135444 -0.0299282 0.0629229 -0.0179166 -0.0431364 0.0462684 0.0974083 0.0720059 -0.207671 -0.143846 0.0256829 -0.123864 0.0575987 -0.107192 0.150162 0.183466 -0.139832 0.154006 0.0878986 -0.0586577 0.00326212 -0.0136536 -0.297886 -0.0556513 0.0194273 -0.0134929 0.0194412 0.0349602 0.0981236 -0.0602105 -0.0417629 -0.0711217 0.176679 -0.0591892 -0.018336 -0.0293457 -0.10814 -0.095782 0.0998438 -0.117784 -0.141154 0.136241 -0.0621778 -0.112371 0.158996 0.0453021 -0.0537536 -0.0376561 0.0754023 0.067626 -0.0126529 0.138897 0.00423532 -0.00780363 -0.157074 -0.0339665 -0.0539251 0.174379 -0.0704869 0.0581135 -0.174737 -0.0217919 0.0215707 -0.0145279 0.0818689 -0.0618621 0.0182084 -0.0933778 0.0310983 -0.00616308 -0.0605822 -0.0394106 0.0512352 -0.0213826 0.128446 -0.149606 -0.00822585 -0.00468585 -0.0371723 -0.0874286 0.0993581 0.0677088 0.0422168 0.0699477 -0.049268 0.0252021 -0.13781 -0.0802724 -0.0132713 -0.0339663 -0.0406533 -0.0471418 0.124078 -0.026543 -0.013609 0.0460344 -0.0233531 -0.059336 0.145523 0.0737962 -0.0186694 -0.0639723 0.112317 -0.0191497 -0.100613 -0.105078 0.161676 -0.026869 -0.0487299 0.0791303 0.0950322 -0.0333551 -0.129298 0.0905884 0.162876 0.00570629 0.0336427 0.0253135 0.0170167 -0.00849855 0.0186632 0.0667361 0.056065 
0.0369535 -0.0407829 -0.0780878 0.0278258 -0.0096633 0.130943 -0.0431709 0.0514194 -0.0201949 -0.0506981 0.0646599 0.102984 0.0428321 -0.180714 -0.124223 -0.00338294 -0.124399 0.0517152 -0.0555445 0.144147 0.165432 -0.135409 0.138243 0.0956968 -0.0254899 0.0503916 0.0173 -0.274792 -0.034921 -0.00549418 0.0128388 0.00426363 0.0342961 0.0904489 -0.0510841 -0.0177332 -0.0596058 0.188288 -0.0305984 -0.0259803 0.00923282 -0.0924833 -0.100506 0.0968256 -0.138729 -0.166406 0.140012 -0.0810362 -0.0933682 0.127875 0.0162548 -0.0156865 -0.0318611 0.0890316 0.09765 -0.00315759 0.13495 0.0229893 -0.0236567 -0.177533 -0.0514251 -0.0773207 0.202552 -0.0717502 0.0578321 -0.123805 0.0107365 0.00469544 0.0069594 0.119897 -0.0604974 0.035879 -0.0930143 0.0630198 0.0250805 -0.0988531 -0.052343 0.0690805 -0.0160562 0.112869 -0.181436 0.0380564 0.0376113 -0.0496783 -0.059837 0.0562249 0.0861362 0.0837918 0.0880438 -0.0686099 0.0535604 -0.120261 -0.0470749 -0.02354 -0.017729 -0.0922245 -0.0298185 0.136101 -0.0129721 -0.0390918 0.00374335 -0.0179479 -0.0459029 0.135833 0.0688498 0.0182893 -0.0343012 0.0814268 0.00411307 -0.114006 -0.101498 0.167785 -0.0385571 -0.0405193 0.110284 0.0643381 -0.0130082 -0.181296 0.112371 0.143074 0.0361211 0.0341311 0.0280289 -0.00110803 -0.027062 0.0345981 0.105049 0.098834 
0.0414464 -0.0257031 -0.0742035 0.0256508 -0.0110659 0.124339 -0.0461498 0.0434092 -0.021545 -0.0564959 0.0757151 0.107908 0.0418154 -0.173094 -0.128341 -0.00170341 -0.111997 0.0433379 -0.0598827 0.150203 0.164186 -0.129533 0.136088 0.108379 -0.0193214 0.0477458 0.0329368 -0.253536 -0.0174924 0.00596297 0.009214 0.00122679 0.0439779 0.0933732 -0.0629855 -0.0224186 -0.0621276 0.193148 -0.0250128 -0.0166225 -0.000223612 -0.0930062 -0.097007 0.0915946 -0.131155 -0.159838 0.140867 -0.0838868 -0.100225 0.130857 0.0193419 0.00924724 -0.0325226 0.085009 0.095433 -0.00379741 0.124723 0.0343693 -0.0367525 -0.171639 -0.0629135 -0.0808868 0.210852 -0.0728233 0.0459498 -0.116951 0.00877304 -4.42175e-05 -0.0120381 0.11953 -0.0600048 0.0265528 -0.102786 0.0689459 0.0412535 -0.0980842 -0.0396257 0.0646236 -0.0162994 0.124094 -0.180778 0.0322061 0.044735 -0.0492023 -0.0532505 0.0511349 0.0759536 0.0765732 0.086812 -0.0609353 0.0495173 -0.130348 -0.0494766 0.000157888 -0.00872699 -0.0972862 -0.031916 0.131584 -0.00609181 -0.0482492 -0.001927 -0.0137479 -0.0532952 0.153318 0.0557201 0.0306749 -0.030277 0.0856215 0.0182879 -0.135671 -0.0938579 0.174421 -0.0454113 -0.0193534 0.110223 0.0640218 -0.0186042 -0.173544 0.122217 0.159795 0.0334813 0.0326446 0.0164238 -0.00470388 -0.0239517 0.0444515 0.112661 0.0900391 
0.0199773 -0.0124322 -0.0544951 0.0122866 -0.0251011 0.103336 -0.0494599 0.0544119 -0.0238033 -0.0423435 0.0639792 0.110899 0.027495 -0.178662 -0.128082 -0.0100553 -0.12337 0.0312475 -0.0522892 0.142938 0.153669 -0.127166 0.121686 0.122447 -0.0206749 0.0732645 0.0545272 -0.249011 0.000531348 -0.002331 -0.00312216 -0.018138 0.0514401 0.0850564 -0.0730209 -0.0351171 -0.0756971 0.209533 -0.0503299 -0.00782728 0.00561886 -0.0969338 -0.10437 0.108837 -0.120717 -0.131497 0.147463 -0.0933129 -0.120886 0.108308 0.0254311 0.014759 -0.0329733 0.0672058 0.104415 0.0103327 0.107137 0.0462478 -0.0291798 -0.174733 -0.0545158 -0.0930244 0.209373 -0.0424306 0.0576229 -0.124018 0.000784695 -0.00815175 -0.0105488 0.12559 -0.0651194 0.0162637 -0.0985274 0.0703968 0.0562991 -0.0932248 -0.051682 0.085155 -0.00807632 0.11289 -0.190859 0.0340625 0.0445113 -0.0496743 -0.0515448 0.0168781 0.0892973 0.0842706 0.090457 -0.0577927 0.0281382 -0.119171 -0.0464876 -0.00481186 -0.00481073 -0.0889574 -0.0125039 0.118478 0.0180159 -0.0570013 -0.010565 -0.00661136 -0.0523071 0.142674 0.0291593 0.0159619 -0.0364403 0.0797484 0.0221391 -0.158749 -0.0653756 0.187328 -0.0549114 -0.0325016 0.118177 0.0596347 -0.0319728 -0.190809 0.121984 0.154398 0.0332887 0.0401852 0.000390637 -0.0159575 -0.0207535 0.059946 0.109702 0.0749667 
0.0299945 -0.0392136 -0.0674212 0.00991916 -0.0138315 0.0958162 -0.0412853 0.0590415 0.000782407 -0.0525078 0.0494446 0.131482 0.0444724 -0.178693 -0.144844 -0.0108543 -0.133286 0.0142297 -0.0990274 0.162188 0.14724 -0.132056 0.137303 0.132781 -0.0451765 0.0539797 0.0407745 -0.250229 -0.0338767 -0.00306907 -0.0121433 -0.00760214 0.049025 0.097003 -0.10447 -0.0389128 -0.102759 0.219749 -0.0941772 0.00272787 -0.00435043 -0.0936878 -0.126397 0.102668 -0.115167 -0.135392 0.117563 -0.0744864 -0.0924412 0.144454 0.0347719 -0.00473435 -0.0339953 0.0542162 0.107123 -0.000175197 0.0937745 0.055742 -0.0200503 -0.16068 -0.054525 -0.0778713 0.194782 -0.0246173 0.0429876 -0.14599 -0.00854344 0.0224757 -0.0230046 0.112589 -0.0565827 0.0148264 -0.082827 0.0737586 0.0414351 -0.0647123 -0.0450975 0.0468053 -0.0106663 0.131886 -0.173825 0.00681372 0.0312257 -0.0531092 -0.0664249 0.0185783 0.100091 0.0807703 0.0872931 -0.0567531 0.0141556 -0.126009 -0.0398755 0.000363052 -0.0155228 -0.0661627 -0.0237005 0.0858712 0.0213495 -0.0506634 0.0165286 -0.0153377 -0.0619236 0.139239 0.0238256 -0.00481426 -0.0715778 0.0783908 0.0119265 -0.150241 -0.0512842 0.209226 -0.0460416 -0.0269556 0.099301 0.0835093 -0.0366356 -0.154738 0.113862 0.174823 0.0143776 0.0490592 -0.00909001 -0.00860086 -0.0219853 0.0586548 0.0848125 0.0598754 
0.0415429 -0.0520072 -0.0655788 0.0146016 -0.000198058 0.105007 -0.0356108 0.0683227 0.00273562 -0.0657943 0.0430408 0.131011 0.0498141 -0.18482 -0.151698 -0.0114295 -0.129495 0.0281152 -0.122542 0.165205 0.162496 -0.13075 0.139571 0.144207 -0.0487988 0.0270374 0.0188013 -0.253316 -0.0386852 -0.00439312 -0.00717449 -0.00639017 0.0310594 0.100462 -0.107057 -0.0403593 -0.122656 0.199473 -0.106949 0.0027614 -0.00647474 -0.0832355 -0.135524 0.10996 -0.111617 -0.144732 0.107079 -0.0647865 -0.0830091 0.158126 0.0391052 -0.0149224 -0.037904 0.0431641 0.092667 -0.00747778 0.0931381 0.0590962 -0.00918464 -0.15882 -0.0469892 -0.0568048 0.184237 -0.0170272 0.0267196 -0.165623 -0.00877268 0.0196943 -0.0270298 0.113436 -0.049576 0.0201665 -0.0725596 0.068677 0.0154055 -0.0640054 -0.0443185 0.037507 -0.0112026 0.141956 -0.163236 0.00305194 0.0236516 -0.0575219 -0.0645544 0.0294636 0.100586 0.0745574 0.0750975 -0.0579244 0.020791 -0.122365 -0.0489187 -0.0027474 -0.015817 -0.0574147 -0.0342385 0.0814422 0.00204681 -0.0401065 0.0298715 -0.0139971 -0.0615941 0.141416 0.0268098 -0.00993565 -0.0785503 0.0801807 0.0153125 -0.138985 -0.0495341 0.208162 -0.0495621 -0.0238008 0.0909115 0.0944189 -0.0329435 -0.141533 0.110536 0.180735 -0.000578576 0.0515074 -0.0190607 -0.00514668 -0.0298302 0.0493948 0.0731483 0.053064 
0.0569534 -0.0603568 -0.0880992 0.0250169 0.00217194 0.0988911 -0.0330497 0.0618957 0.000433784 -0.0756925 0.0534046 0.137024 0.0513288 -0.181017 -0.168807 -0.0018611 -0.108864 0.0302681 -0.127909 0.178784 0.160091 -0.131762 0.136681 0.147561 -0.0549198 0.0282783 0.0300646 -0.24902 -0.0417786 -0.000908562 -0.0243775 0.0113871 0.0325435 0.104644 -0.11963 -0.041893 -0.119221 0.19903 -0.108717 -0.00354479 -0.00982903 -0.0779442 -0.126797 0.106408 -0.106677 -0.143406 0.109381 -0.0640649 -0.0864495 0.161312 0.0385693 -0.0223465 -0.0374059 0.0465653 0.0938928 -0.0144603 0.0862573 0.0587833 -0.00828234 -0.154654 -0.0468751 -0.0525465 0.190375 -0.0218551 0.0167878 -0.1568 -0.0125809 0.0197305 -0.0259071 0.101198 -0.0554687 0.00726927 -0.0699968 0.0721253 0.0151144 -0.0655075 -0.0284751 0.0364426 -0.0225895 0.132441 -0.154696 0.00686462 0.0107608 -0.0770773 -0.0655622 0.0456613 0.0898196 0.0656033 0.0687512 -0.0544158 0.0292188 -0.129103 -0.0619305 0.00162728 -0.0038573 -0.0456089 -0.0324141 0.0742618 0.00418187 -0.0438064 0.0280924 -0.0223484 -0.0550638 0.151447 0.0205862 -0.00822295 -0.0787921 0.0873817 0.00190553 -0.143529 -0.046907 0.212728 -0.0377238 -0.0193138 0.0866559 0.0829815 -0.0377878 -0.141139 0.116747 0.173141 -0.0111869 0.0542509 -0.008321 0.00022238 -0.0267982 0.0454562 0.0661078 0.0357013 
0.0420749 -0.07565 -0.058813 0.0256475 0.00589024 0.100633 -0.050321 0.0493878 0.00816734 -0.0972813 0.0479293 0.121207 0.0481513 -0.169217 -0.148331 0.0115534 -0.131037 0.0333974 -0.115342 0.171647 0.193536 -0.133328 0.140685 0.126012 -0.0356678 0.0395036 0.0138592 -0.267085 -0.0488592 -0.00154431 0.00280279 0.000218227 0.0367293 0.100005 -0.0753126 -0.0181716 -0.100517 0.207706 -0.0765375 -0.0311097 -0.00256644 -0.0711929 -0.111093 0.102513 -0.105249 -0.154452 0.120371 -0.0737688 -0.0792078 0.140405 0.0096459 -0.0469017 -0.0236515 0.0689891 0.114292 -0.0127584 0.0959338 0.0500157 -0.0291492 -0.176986 -0.0406208 -0.0647596 0.191792 -0.0233099 0.0416199 -0.13742 -0.0115002 0.0257834 -0.00345933 0.104243 -0.0481425 0.0206112 -0.0757369 0.0416355 0.0146572 -0.0756077 -0.0437274 0.0416874 -0.0129737 0.139673 -0.149766 0.0211331 0.0166894 -0.0690394 -0.0770226 0.0440175 0.0946695 0.0949738 0.0688054 -0.0562625 0.0507995 -0.129559 -0.0547792 0.000659182 -0.0269603 -0.0519057 -0.0445044 0.100108 0.000988565 -0.0370305 0.0227051 -0.0356055 -0.063292 0.127232 0.0477167 0.00566257 -0.0647535 0.0772804 0.0120952 -0.137948 -0.0804913 0.190567 -0.0611113 -0.021387 0.109256 0.0945315 -0.0407223 -0.145535 0.0920597 0.162032 0.00297315 0.0657232 0.00366923 -0.00138913 -0.0303129 0.0497955 0.0886335 0.059975 
0.052777 -0.0766443 -0.0392872 0.0449369 0.00782516 0.115123 -0.0323819 0.0428038 0.000443459 -0.101956 0.0523855 0.113401 0.0382462 -0.172453 -0.130156 0.0128996 -0.139586 0.0393942 -0.107804 0.166745 0.200438 -0.13456 0.141338 0.133069 -0.0257676 0.0257191 -0.00676855 -0.270893 -0.0387703 0.000953107 0.00236036 0.00578253 0.0259902 0.111335 -0.0581142 -0.0167201 -0.090399 0.197749 -0.0660482 -0.0513996 0.00223777 -0.0773358 -0.10236 0.0819858 -0.106874 -0.161735 0.122483 -0.0715868 -0.0869199 0.142721 0.00482962 -0.0501153 -0.014163 0.0738227 0.12593 -0.0100085 0.0993858 0.0524489 -0.0399345 -0.17292 -0.0438364 -0.0542321 0.19626 -0.0451317 0.0516239 -0.102097 -0.013933 0.00692956 -0.0243455 0.113413 -0.0612446 0.0288092 -0.0849607 0.0578609 0.0146658 -0.087908 -0.0257428 0.0320564 -0.00201229 0.134577 -0.142901 0.0152602 0.0124299 -0.0822452 -0.065232 0.040441 0.0820818 0.0944719 0.0652624 -0.0359927 0.0846695 -0.127262 -0.0545195 0.00201166 -0.0305968 -0.0501763 -0.0454322 0.109078 0.0114026 -0.0247265 0.0331921 -0.0364874 -0.0650036 0.111055 0.0576828 0.0203351 -0.0420397 0.071709 0.0216964 -0.132537 -0.0864052 0.192185 -0.0502539 -0.0351978 0.130435 0.0980503 -0.0204528 -0.133522 0.0958071 0.168167 0.0113731 0.0535898 0.0126272 0.00229982 -0.0297034 0.062401 0.112409 0.0585105 
0.0419518 -0.056751 -0.0429437 0.0294988 -0.0240774 0.11842 -0.0336481 0.0467896 -0.0072613 -0.056827 0.0821659 0.100297 0.0551309 -0.169888 -0.137492 0.0316521 -0.160302 0.0536436 -0.10962 0.153191 0.188268 -0.140212 0.138476 0.100481 -0.0539153 0.0409601 -0.00286492 -0.247545 -0.0271052 -0.00432731 -0.0298552 0.0212571 0.0335355 0.113287 -0.0702826 -0.0161667 -0.0762134 0.195931 -0.0402537 -0.029218 -0.0138443 -0.111378 -0.100764 0.0477712 -0.101148 -0.182134 0.119446 -0.0692567 -0.109808 0.145497 0.0037318 -0.0422157 -0.0469291 0.108006 0.102329 0.00123992 0.120487 0.0156819 -0.0546455 -0.151392 -0.0375024 -0.0584486 0.204272 -0.0502943 0.0489471 -0.0734371 -0.0197455 0.0105392 -0.0187548 0.111839 -0.0768478 0.0149104 -0.0882229 0.0819849 0.0339268 -0.0967379 -0.0120347 0.0315961 -0.0129935 0.089408 -0.137465 0.00435837 0.012188 -0.0736214 -0.0895596 0.0826153 0.0735046 0.0803926 0.0870712 -0.0251237 0.0825904 -0.139688 -0.048854 0.0136663 -0.0325458 -0.0480856 -0.067448 0.118332 0.0242932 -0.0114972 0.0412017 -0.0468062 -0.0743417 0.113916 0.108008 0.0355466 -0.0294079 0.0787771 0.000964506 -0.141056 -0.120958 0.187919 -0.0147622 -0.0421113 0.131556 0.0844651 0.00346937 -0.112848 0.109657 0.149717 0.0212273 0.0205006 0.0384688 0.00594336 -0.0262693 0.0687004 0.108486 0.0752207 
0.0419518 -0.056751 -0.0429437 0.0294988 -0.0240774 0.11842 -0.0336481 0.0467896 -0.0072613 -0.056827 0.0821659 0.100297 0.0551309 -0.169888 -0.137492 0.0316521 -0.160302 0.0536436 -0.10962 0.153191 0.188268 -0.140212 0.138476 0.100481 -0.0539153 0.0409601 -0.00286492 -0.247545 -0.0271052 -0.00432731 -0.0298552 0.0212571 0.0335355 0.113287 -0.0702826 -0.0161667 -0.0762134 0.195931 -0.0402537 -0.029218 -0.0138443 -0.111378 -0.100764 0.0477712 -0.101148 -0.182134 0.119446 -0.0692567 -0.109808 0.145497 0.0037318 -0.0422157 -0.0469291 0.108006 0.102329 0.00123992 0.120487 0.0156819 -0.0546455 -0.151392 -0.0375024 -0.0584486 0.204272 -0.0502943 0.0489471 -0.0734371 -0.0197455 0.0105392 -0.0187548 0.111839 -0.0768478 0.0149104 -0.0882229 0.0819849 0.0339268 -0.0967379 -0.0120347 0.0315961 -0.0129935 0.089408 -0.137465 0.00435837 0.012188 -0.0736214 -0.0895596 0.0826153 0.0735046 0.0803926 0.0870712 -0.0251237 0.0825904 -0.139688 -0.048854 0.0136663 -0.0325458 -0.0480856 -0.067448 0.118332 0.0242932 -0.0114972 0.0412017 -0.0468062 -0.0743417 0.113916 0.108008 0.0355466 -0.0294079 0.0787771 0.000964506 -0.141056 -0.120958 0.187919 -0.0147622 -0.0421113 0.131556 0.0844651 0.00346937 -0.112848 0.109657 0.149717 0.0212273 0.0205006 0.0384688 0.00594336 -0.0262693 0.0687004 0.108486 0.0752207 
0.04055 -0.067694 -0.0256326 0.0252636 -0.0264746 0.125803 -0.0478429 0.0678778 -0.00847138 -0.0705735 0.0647976 0.0972746 0.0508946 -0.170368 -0.119498 0.0153867 -0.159012 0.0314488 -0.11206 0.148824 0.180097 -0.135244 0.149083 0.135977 -0.0421037 0.0295699 0.0181255 -0.247665 -0.0381989 -0.0271796 -0.00144998 -0.0136316 0.0321375 0.118653 -0.0892615 -0.0126018 -0.10047 0.184969 -0.077505 -0.0143952 -0.00878775 -0.11295 -0.120504 0.0755269 -0.0972355 -0.176907 0.110589 -0.061962 -0.103708 0.157708 0.021835 -0.0526745 -0.0324649 0.077143 0.0983605 0.00574236 0.102775 0.041141 -0.0203917 -0.165322 -0.0467373 -0.0470699 0.186048 -0.0351836 0.0390745 -0.0878602 -0.0125019 0.0100195 -0.0258016 0.124865 -0.0807832 0.0157906 -0.0830497 0.0665243 0.0404857 -0.0966929 -0.0209081 0.0338078 -0.00250668 0.127552 -0.139675 -0.0177326 0.0180559 -0.0844188 -0.0832293 0.0576497 0.0873828 0.0774758 0.0734417 -0.0270968 0.0711245 -0.130411 -0.0428166 0.00821281 -0.0361494 -0.0345203 -0.0597087 0.107226 0.0196129 -0.0213278 0.0391638 -0.0362967 -0.07498 0.104497 0.0848915 0.0188479 -0.0543474 0.0628323 0.00314975 -0.15515 -0.0942083 0.209648 -0.0192806 -0.0443711 0.125012 0.0942843 -0.00719826 -0.113457 0.107159 0.168631 0.0208776 0.0178078 0.0116643 0.00274346 -0.0285706 0.0659737 0.106111 0.0738161 
0.0496717 -0.0626341 -0.0777527 0.0253619 -0.00500937 0.123452 -0.0465097 0.0542438 0.0232835 -0.0626003 0.0715553 0.107178 0.0546427 -0.18911 -0.162008 0.026902 -0.136592 0.0611059 -0.114785 0.143318 0.205202 -0.1325 0.139709 0.118159 -0.0480723 0.0294024 0.0175961 -0.270244 -0.0351854 0.00645051 -0.00344817 0.00750002 0.0404352 0.10029 -0.0644565 -0.0314679 -0.0878753 0.179665 -0.0507212 -0.036051 -0.0218067 -0.0972993 -0.120239 0.092472 -0.0958847 -0.184718 0.103852 -0.0557002 -0.0846417 0.137418 0.0195532 -0.0350914 -0.0229546 0.071123 0.0838451 -0.000449845 0.124597 0.0152989 -0.0334267 -0.172622 -0.0372568 -0.0737521 0.203768 -0.033606 0.0292033 -0.130292 -0.0205739 0.0275322 0.00268962 0.108336 -0.0724722 0.00804995 -0.0943015 0.030501 0.000998509 -0.0848249 -0.0316919 0.0489607 -0.0273218 0.125983 -0.144216 0.0171444 0.0156458 -0.0611297 -0.068954 0.069934 0.0844561 0.0806009 0.0825662 -0.046617 0.0563888 -0.129559 -0.0691094 0.0131619 -0.0221537 -0.0498198 -0.0666798 0.106217 -0.00298183 -0.0254812 0.0666078 -0.0405233 -0.0685349 0.115338 0.0914307 -0.000970006 -0.0413787 0.0629915 0.00169895 -0.123305 -0.101504 0.181207 -0.0279507 -0.0346905 0.120881 0.0969678 -0.0320003 -0.125548 0.101239 0.14751 0.0146209 0.0369983 0.0213067 -0.00242147 -0.0283159 0.0513809 0.0929433 0.0724322 
0.0592468 -0.0531608 -0.0802428 0.0338483 -0.00867842 0.14207 -0.0342246 0.0684656 0.041553 -0.0664064 0.0672903 0.086608 0.0653473 -0.205276 -0.165097 0.0175382 -0.131867 0.0748699 -0.125125 0.119189 0.231714 -0.136175 0.130296 0.122568 -0.03741 -0.0194007 -0.00707048 -0.277806 -0.0402812 0.0248043 0.0212513 -0.00256659 0.0301274 0.099132 -0.0480765 -0.0470506 -0.0871158 0.143278 -0.0423361 -0.0432735 -0.0307906 -0.106999 -0.119049 0.0971196 -0.0777846 -0.209208 0.0844511 -0.0482924 -0.0705537 0.1348 0.0310447 -0.0327899 -0.00339045 0.0582834 0.0550048 0.00433541 0.128646 -0.000471834 -0.0216077 -0.180795 -0.0335783 -0.0665244 0.182944 -0.0497641 0.00907816 -0.146641 -0.011622 0.00973724 -0.00932515 0.089202 -0.0753503 0.00280697 -0.107162 -0.00297973 -0.028807 -0.0759991 -0.0238828 0.0382605 -0.029346 0.163102 -0.145737 -0.00650117 0.0211424 -0.0430319 -0.0541449 0.0893808 0.0771305 0.0571837 0.0770037 -0.0511371 0.0439473 -0.136912 -0.075415 0.0144879 -0.0335345 -0.0486057 -0.0807164 0.104122 -0.0269846 -0.00517198 0.093221 -0.0273573 -0.0700479 0.123476 0.108047 -0.0151676 -0.0279456 0.0644046 -0.00397145 -0.102637 -0.115891 0.147549 -0.0410562 -0.0384756 0.112503 0.115776 -0.0307132 -0.096082 0.0991071 0.151338 0.00550638 0.0226323 0.00507863 -0.00195836 -0.0184885 0.0390463 0.0877051 0.0764862 
0.0590066 -0.033038 -0.064751 0.0171419 -0.0237476 0.162524 -0.0223465 0.072918 0.0146833 -0.0715602 0.0626983 0.0615546 0.0857426 -0.18713 -0.151174 0.0458246 -0.147385 0.0607454 -0.14591 0.0963109 0.241085 -0.139172 0.12896 0.116902 -0.0456589 -0.0523326 -0.0324859 -0.268064 -0.0326113 0.0307116 0.0131303 0.00591054 0.0139708 0.108897 -0.0651499 -0.0354514 -0.0859083 0.119207 -0.0346716 -0.00444444 -0.0378735 -0.124165 -0.0904776 0.0628015 -0.0467291 -0.187416 0.0994783 -0.05413 -0.116738 0.131726 0.0292261 -0.0665955 -0.0161644 0.074678 0.031465 0.0217995 0.135214 0.016182 -0.0197842 -0.148953 -0.0279331 -0.0123241 0.162384 -0.0785972 0.017595 -0.116687 -0.0200682 0.00859222 -0.0355135 0.0783034 -0.0817168 0.00107321 -0.121412 -0.000897617 0.00134948 -0.0544101 -0.003391 0.0247207 -0.030249 0.144095 -0.123689 -0.0437137 0.00396171 -0.0375136 -0.10641 0.153095 0.0639538 0.00750188 0.0333053 -0.0347256 0.0483731 -0.1656 -0.0766876 0.019301 -0.0419932 -0.00464885 -0.100632 0.119065 -0.0164672 0.0424509 0.0886213 -0.0442697 -0.0885599 0.148274 0.118351 0.000872208 -0.0516185 0.0963173 -0.0444273 -0.130393 -0.138973 0.130811 -0.0266012 -0.0537771 0.0999366 0.137226 -0.0298363 -0.0461191 0.0942943 0.170697 0.00199178 -0.00963707 0.00357408 0.0060636 -0.0258649 0.0520286 0.0430734 0.0636204 
0.0529049 -0.0392682 -0.0668859 0.0261363 -0.0652401 0.152329 -0.0355939 0.0878818 0.0166221 -0.0872874 0.0251591 0.0446274 0.0688068 -0.206548 -0.136478 0.0261663 -0.165886 0.00952362 -0.10897 0.0940398 0.206161 -0.135095 0.136615 0.0708926 -0.0539212 -0.0201941 -0.0378326 -0.297995 -0.0766408 0.00774177 0.0285273 0.0149462 0.0210865 0.103788 -0.0501061 -0.0370404 -0.058061 0.156707 -0.0362227 -0.00685605 -0.0484596 -0.13397 -0.102164 0.061902 -0.0385287 -0.164518 0.106094 -0.0728296 -0.0969916 0.156497 0.0282006 -0.0495209 0.0166791 0.0977702 0.0499857 -0.00663917 0.162021 -0.0269566 0.00538892 -0.177921 -0.023816 -0.0289052 0.132765 -0.0805745 0.0207409 -0.137051 0.0144684 0.00264641 -0.00336988 0.0639793 -0.0887443 -0.00704816 -0.116694 0.0269086 -0.00059444 -0.0737058 -0.0255059 0.00283398 -0.0206377 0.192655 -0.128702 -0.0613139 6.50701e-05 -0.0428555 -0.0774215 0.120542 0.0538549 0.0132405 0.0534622 -0.0527522 0.0326996 -0.138861 -0.0618206 -0.0029631 -0.0585084 -0.00312166 -0.0498513 0.125707 -0.0187149 0.0327173 0.067223 -0.0254189 -0.0810291 0.141896 0.112332 -0.0317516 -0.046859 0.101634 -0.0410492 -0.098791 -0.135795 0.129833 -0.0499899 -0.0864951 0.0931242 0.130303 -0.00563499 -0.0876994 0.100653 0.147812 0.01525 0.0155091 0.0461624 0.00406075 0.0121958 0.00372116 0.0898644 0.0815628 
0.069622 0.000942852 -0.0791616 0.0201297 -0.0629987 0.186432 -0.00892043 0.0477582 -0.00226928 -0.0980864 0.0298472 0.020284 0.0871764 -0.192902 -0.116682 0.0403859 -0.163925 0.0254416 -0.118366 0.074152 0.207284 -0.103774 0.127718 0.0791088 -0.0656207 -0.0610251 -0.0562543 -0.293323 -0.0653212 0.0530094 0.00558511 0.0260366 0.00491303 0.118552 -0.0127912 -0.0346305 0.000965792 0.123082 -0.0157685 -0.0072425 -0.0434252 -0.145579 -0.0341023 0.041418 -0.0489291 -0.146497 0.140675 -0.0480349 -0.132141 0.165282 0.0284518 -0.103336 0.0231022 0.125768 0.0523218 0.00968739 0.161259 -0.0187028 0.0040852 -0.169438 -0.0332216 0.0146265 0.139544 -0.144487 0.0330337 -0.0965032 0.0141758 -0.0297316 -0.0417338 0.0334238 -0.105732 -0.0198809 -0.119916 0.0271725 0.0185099 -0.0590978 -0.00975826 -0.00595735 -0.0101939 0.154187 -0.0662828 -0.0614847 -0.0245565 -0.0436867 -0.0970915 0.173117 0.0190466 -0.0414796 0.0177255 0.000484089 0.0668012 -0.183755 -0.064759 -0.0230286 -0.0709168 0.019386 -0.0722071 0.154315 0.00229695 0.0619912 0.0820483 -0.0247541 -0.067774 0.154254 0.102642 -0.0261404 -0.047849 0.124051 -0.0972239 -0.0718091 -0.127535 0.098353 -0.0242627 -0.089862 0.0517117 0.133795 -0.00133481 -0.0461595 0.0693298 0.135112 0.0314803 -0.0197044 0.0652655 0.0216866 -0.00360609 0.00552314 0.0464623 0.050391 
0.0749885 -0.017912 -0.0664375 0.0359993 -0.0518137 0.178563 0.00298672 0.0363558 -0.0081605 -0.130227 0.0170238 0.0277814 0.0785699 -0.17559 -0.105998 0.0140056 -0.164975 0.0327361 -0.116434 0.0820552 0.208997 -0.104755 0.132745 0.102827 -0.0518264 -0.0866448 -0.0647297 -0.296548 -0.0861026 0.0638098 -0.00025383 0.0185761 -0.000887128 0.124346 -0.00743667 -0.0311437 -0.00584947 0.111741 -0.0411969 -0.0195551 -0.029426 -0.134775 -0.0262711 0.0480698 -0.0661757 -0.13358 0.144013 -0.0503217 -0.125615 0.175517 0.0251208 -0.127768 0.0392448 0.121496 0.070465 0.0102455 0.145889 0.00146592 0.00872183 -0.16574 -0.0236385 0.0359365 0.127782 -0.141477 0.0358079 -0.0944325 0.0173969 -0.0479241 -0.0573219 0.0397956 -0.101174 -0.0182089 -0.107412 0.0248499 0.0121115 -0.0529252 -0.0100511 -0.0248276 -0.000902325 0.156721 -0.0685816 -0.0576565 -0.0390785 -0.0619065 -0.0986725 0.166709 0.015495 -0.0502325 -0.00568183 0.00838862 0.0853573 -0.184816 -0.0517087 -0.0457154 -0.0805272 0.0213406 -0.0775817 0.150327 0.0148099 0.06005 0.0772862 -0.017774 -0.0542282 0.145274 0.0890918 -0.0283 -0.0543889 0.127675 -0.108121 -0.0649798 -0.109877 0.0943268 -0.0289011 -0.0957075 0.0342242 0.14319 0.0107116 -0.0495778 0.0674117 0.145528 0.0260341 -0.0143679 0.0383643 0.0261265 -0.00920061 0.00669907 0.0438594 0.039099 
0.0763021 -0.0315824 -0.0668456 0.00424516 -0.0175579 0.174575 -0.00598388 0.0370269 -0.0080712 -0.131403 0.0165118 0.03533 0.0966855 -0.157773 -0.110537 0.0304822 -0.165398 0.0327731 -0.154094 0.0923528 0.230533 -0.101093 0.141003 0.103154 -0.0566823 -0.0631315 -0.066708 -0.297286 -0.0701624 0.0557424 0.014227 0.0349299 -0.0141335 0.1216 -0.0190647 -0.0146968 -0.0469538 0.134678 -0.0458653 -0.0162844 -0.0324326 -0.111881 -0.0614215 0.0747372 -0.0583316 -0.108043 0.133545 -0.0309338 -0.140694 0.14786 0.00533295 -0.119241 0.0232598 0.0918685 0.0608152 0.00466032 0.128347 0.0418049 0.00180965 -0.169461 -0.0222548 0.038379 0.146124 -0.0989129 0.0294238 -0.111031 0.00253281 0.0172595 -0.0362781 0.0535763 -0.0789733 -0.00990031 -0.103614 -0.00777159 0.000376166 -0.0469484 -0.0368028 -0.0232677 -0.00587439 0.164528 -0.0620372 -0.039953 -0.0488387 -0.071483 -0.127067 0.146117 0.044415 -0.031313 -0.0121373 0.000730151 0.0942686 -0.177479 -0.0665257 -0.0316629 -0.0785924 0.0297381 -0.0836892 0.141319 0.00533458 0.046349 0.0839987 -0.0310067 -0.0694686 0.147317 0.064127 -0.0251639 -0.0976476 0.131055 -0.0726252 -0.0908827 -0.0896174 0.121359 -0.0650168 -0.0756173 0.0554207 0.160972 -0.0387403 -0.0648075 0.0642658 0.158881 0.0194144 0.00446436 0.0274901 0.0366467 -0.0279665 0.00762912 0.0199237 0.0292321 
0.0725968 -0.0249306 -0.0771576 -0.0140204 -0.0194686 0.185199 -0.00620649 0.0510246 -0.013399 -0.135107 0.0123026 0.0344514 0.0946876 -0.166508 -0.119933 0.0296764 -0.165918 0.0137273 -0.148441 0.0871807 0.225007 -0.100394 0.131342 0.0973655 -0.06358 -0.0593232 -0.059338 -0.291282 -0.0639365 0.0445259 0.0162942 0.0135621 -0.0187383 0.114199 -0.0319568 -0.0154664 -0.0502761 0.123126 -0.0453147 0.0023576 -0.0261981 -0.111874 -0.056694 0.0737496 -0.0494368 -0.105406 0.136093 -0.0363408 -0.151869 0.146496 -0.00634839 -0.121145 0.0171043 0.0934376 0.0532448 0.0104603 0.124573 0.0591622 -0.00538738 -0.16245 -0.0238172 0.0512635 0.160421 -0.106972 0.0300257 -0.112485 -0.000495195 0.0174311 -0.0348089 0.0434321 -0.0752933 -0.00887818 -0.107362 -0.00227431 0.0127798 -0.0358833 -0.0351348 -0.016334 -0.00811436 0.158466 -0.0712832 -0.0449002 -0.0390804 -0.058229 -0.138286 0.160249 0.0513942 -0.0323858 -0.0126685 -0.00869594 0.0931704 -0.185046 -0.0673721 -0.0269661 -0.0617346 0.0312173 -0.0737728 0.137157 -0.00409355 0.054349 0.0698636 -0.0349742 -0.0770717 0.151994 0.0519491 -0.0144358 -0.102285 0.135212 -0.0951962 -0.0986676 -0.0794968 0.112777 -0.0556042 -0.0750027 0.0509316 0.163057 -0.0457047 -0.055717 0.066916 0.158604 0.0134714 -0.00626532 0.0283125 0.0315943 -0.0370672 0.0143146 -0.00162026 0.0270544 
0.0682771 -0.023066 -0.0713818 -0.00725064 -0.0292858 0.185725 -0.000712354 0.0524254 -0.00626394 -0.135024 0.00404532 0.0237063 0.0979157 -0.171307 -0.108656 0.0288785 -0.172165 -0.00283795 -0.145347 0.0854578 0.222588 -0.10959 0.121726 0.0845695 -0.0555801 -0.0663144 -0.0784363 -0.29637 -0.0712003 0.0475833 0.0304445 0.0237646 -0.0220144 0.116264 -0.02509 -0.0116688 -0.0405867 0.120588 -0.0360964 -0.00315135 -0.0214976 -0.125095 -0.0455358 0.0636936 -0.0354065 -0.108601 0.132961 -0.0355118 -0.144695 0.141011 -0.0097321 -0.12726 0.0269994 0.095468 0.0570256 0.0110181 0.114816 0.0468786 -0.00276544 -0.165405 -0.0251337 0.0507676 0.143643 -0.118621 0.0327829 -0.100819 0.00912811 0.00715238 -0.0379807 0.0226224 -0.0797878 -0.00601771 -0.112776 -0.00213183 0.0154762 -0.0351711 -0.027718 -0.0225243 -0.00141918 0.177223 -0.0676596 -0.0621475 -0.0369376 -0.0524012 -0.135342 0.164232 0.048419 -0.0352065 -0.0100202 -0.0117254 0.0885503 -0.187076 -0.060453 -0.0242496 -0.079169 0.0363547 -0.0687007 0.13251 -0.00349764 0.0603204 0.0688939 -0.0359092 -0.0807901 0.152446 0.0558873 -0.0136581 -0.0974476 0.14369 -0.0969088 -0.0881281 -0.0926533 0.101168 -0.0695408 -0.0834118 0.0486385 0.16316 -0.0410417 -0.0452191 0.0618028 0.156749 0.0161201 -0.00620112 0.0346872 0.038662 -0.0286696 0.00747142 0.000286503 0.0293932 
0.0787365 -0.0523438 -0.0688726 -0.0263912 -0.00671843 0.157575 -0.0125865 0.0434546 0.00829252 -0.16779 -0.00260487 0.0259725 0.0852054 -0.171371 -0.113438 0.0300155 -0.188803 -0.0213509 -0.175478 0.108113 0.215347 -0.0759872 0.133265 0.0718396 -0.0799671 -0.0278119 -0.0614942 -0.296765 -0.0698442 0.0191024 0.024575 0.0289307 -0.0371858 0.115019 -0.0256122 -0.0054821 -0.0512175 0.161115 -0.0523909 0.0005318 -0.0117378 -0.0945407 -0.0862251 0.0949097 -0.0419953 -0.0772959 0.119117 -0.0111776 -0.130429 0.14533 -0.0433249 -0.120755 0.0182037 0.087715 0.0620784 -0.0259967 0.10746 0.0586741 -0.0138043 -0.172424 -0.0175663 0.0418775 0.162346 -0.0530707 0.0167675 -0.128979 0.0216706 0.0441806 0.0173211 0.0328698 -0.0714391 -0.0111759 -0.075784 0.00913281 0.00354028 -0.0607809 -0.0656074 -0.0257606 -0.00808805 0.184413 -0.0285328 -0.0240892 -0.0636902 -0.082617 -0.128864 0.131359 0.0626026 -0.00204335 -0.0242465 -0.0150908 0.126874 -0.160952 -0.0721039 -0.0363355 -0.0804085 0.0338581 -0.0584186 0.111241 0.00669197 0.0328529 0.060989 -0.0535691 -0.0756058 0.135926 0.0329166 -0.0342081 -0.118075 0.151592 -0.0621641 -0.0815456 -0.0481836 0.140697 -0.0942493 -0.0620581 0.0512864 0.163203 -0.0679373 -0.0758273 0.0510376 0.12995 0.0084235 0.0456698 0.0452278 0.0554146 -0.0400571 -0.0210984 -0.00911603 0.0161879 
0.0661187 -0.0287707 -0.0594975 -0.0197226 -0.002005 0.126357 -0.00977217 0.0315722 -0.00646139 -0.13366 0.000113177 0.0458574 0.0969418 -0.19386 -0.119453 0.0607108 -0.190571 -0.0157884 -0.194236 0.136981 0.207247 -0.0775949 0.130751 0.0264004 -0.108971 -0.00385522 -0.0970444 -0.293288 -0.0653685 0.0331971 -0.00904968 0.0785484 -0.026421 0.114029 -0.0283037 -0.0186381 -0.0415065 0.184821 -0.0382508 0.0141547 -0.0205493 -0.0995868 -0.0740384 0.0756667 -0.0462556 -0.0597802 0.134678 -0.0273928 -0.13653 0.146834 -0.0134483 -0.119175 -0.031411 0.100662 0.0587103 -0.045702 0.110136 0.0154528 -0.0225936 -0.132743 -0.00496101 0.0129749 0.13476 -0.0388994 0.0431783 -0.168146 0.00906272 0.0435316 0.014724 0.0154022 -0.0564669 -0.00987434 -0.0560054 0.0292052 -0.00439478 -0.0458966 -0.0664841 -0.0163459 -0.017172 0.170599 -0.0139014 -0.0318288 -0.0660056 -0.0436664 -0.136424 0.135486 0.0664897 -0.00392369 -0.0169314 -0.018602 0.0818379 -0.158202 -0.0857338 -0.0224826 -0.102858 0.0318933 -0.0521159 0.103637 -0.00265032 0.0372015 0.0480991 -0.052219 -0.0822114 0.158996 0.0580213 -0.0419098 -0.111216 0.191389 -0.044416 -0.0728224 -0.0840166 0.129231 -0.108617 -0.0512523 0.0371534 0.141405 -0.0683274 -0.0706898 0.0278227 0.125884 -0.00263682 0.0749468 0.0582858 0.0627637 -0.00666384 -0.029571 -0.00714868 0.0099755 
0.05352 -0.0102533 -0.0619879 -0.0323304 -0.0103122 0.151222 0.0110968 0.00551458 -0.00224204 -0.167157 -0.0327491 0.0202497 0.0928426 -0.172147 -0.12593 0.0415815 -0.214022 -0.0323546 -0.175658 0.100916 0.220404 -0.0801937 0.101631 0.0357786 -0.0882218 -0.0278884 -0.100484 -0.286923 -0.0637585 0.0674926 -0.00121768 0.0459477 -0.0504875 0.0999071 0.0173296 -0.0143696 -0.0175815 0.151951 -0.0307766 -0.0179832 -0.0122295 -0.103613 -0.0130077 0.082389 -0.0238354 -0.0448825 0.153596 -0.0104102 -0.147128 0.130071 -0.038242 -0.1465 0.023593 0.10451 0.095701 -0.02201 0.091306 0.0529647 -0.0210904 -0.177791 0.00235169 0.0535786 0.15486 -0.0645021 0.052211 -0.115141 0.00529586 0.0149741 -0.00630566 -0.00894607 -0.071254 -0.017849 -0.0678903 -0.00113602 0.00675558 -0.0222406 -0.051821 -0.0327786 0.0116919 0.167308 0.0100824 -0.0366767 -0.0691198 -0.0407668 -0.144721 0.133826 0.0459667 -0.0093774 -0.0214448 0.0120473 0.108188 -0.180891 -0.0626474 -0.0394791 -0.115183 0.0450295 -0.0463865 0.128727 0.0247422 0.052086 0.0694334 -0.0349191 -0.0821588 0.142689 0.024737 -0.0330316 -0.114132 0.190234 -0.0934116 -0.052174 -0.0502341 0.0987388 -0.116192 -0.0628497 0.0194976 0.170042 -0.0722077 -0.0304739 0.0134686 0.111241 0.0037457 0.0406929 0.065375 0.0396327 -0.0370813 -0.00728194 -0.0318495 -0.00907107 
0.05352 -0.0102533 -0.0619879 -0.0323304 -0.0103122 0.151222 0.0110968 0.00551458 -0.00224204 -0.167157 -0.0327491 0.0202497 0.0928426 -0.172147 -0.12593 0.0415815 -0.214022 -0.0323546 -0.175658 0.100916 0.220404 -0.0801937 0.101631 0.0357786 -0.0882218 -0.0278884 -0.100484 -0.286923 -0.0637585 0.0674926 -0.00121768 0.0459477 -0.0504875 0.0999071 0.0173296 -0.0143696 -0.0175815 0.151951 -0.0307766 -0.0179832 -0.0122295 -0.103613 -0.0130077 0.082389 -0.0238354 -0.0448825 0.153596 -0.0104102 -0.147128 0.130071 -0.038242 -0.1465 0.023593 0.10451 0.095701 -0.02201 0.091306 0.0529647 -0.0210904 -0.177791 0.00235169 0.0535786 0.15486 -0.0645021 0.052211 -0.115141 0.00529586 0.0149741 -0.00630566 -0.00894607 -0.071254 -0.017849 -0.0678903 -0.00113602 0.00675558 -0.0222406 -0.051821 -0.0327786 0.0116919 0.167308 0.0100824 -0.0366767 -0.0691198 -0.0407668 -0.144721 0.133826 0.0459667 -0.0093774 -0.0214448 0.0120473 0.108188 -0.180891 -0.0626474 -0.0394791 -0.115183 0.0450295 -0.0463865 0.128727 0.0247422 0.052086 0.0694334 -0.0349191 -0.0821588 0.142689 0.024737 -0.0330316 -0.114132 0.190234 -0.0934116 -0.052174 -0.0502341 0.0987388 -0.116192 -0.0628497 0.0194976 0.170042 -0.0722077 -0.0304739 0.0134686 0.111241 0.0037457 0.0406929 0.065375 0.0396327 -0.0370813 -0.00728194 -0.0318495 -0.00907107 
0.0653375 -0.00342978 -0.0708396 -0.0148206 -0.0107381 0.161333 0.0366142 0.0214807 0.00708298 -0.165971 -0.037888 0.0197285 0.0910728 -0.188145 -0.120952 0.0238536 -0.196058 -0.0246537 -0.167377 0.0909458 0.226621 -0.0823102 0.0821987 0.0406069 -0.0714542 -0.0547653 -0.115934 -0.296401 -0.0659039 0.0884269 0.00273468 0.052834 -0.042109 0.109851 0.0300631 -0.0367958 0.000905258 0.133026 -0.0299668 -0.0430861 3.60102e-05 -0.112738 0.0098415 0.0799491 -0.0274779 -0.0605388 0.148413 -0.0209894 -0.136018 0.12667 -0.0239482 -0.145853 0.0437882 0.103053 0.0980387 -0.014012 0.0875314 0.0310681 -0.0144427 -0.189073 -0.00167335 0.0420142 0.133706 -0.0906992 0.0434063 -0.114203 0.00836846 -0.0131196 -0.0238993 -0.0300879 -0.0763074 -0.0253006 -0.0837156 -0.0135479 -0.00499985 -0.0133643 -0.0403986 -0.0365336 0.0163086 0.180905 -0.00729681 -0.0395137 -0.0553043 -0.0284479 -0.111024 0.134454 0.0416334 -0.0183473 -0.0116922 0.0160102 0.0976088 -0.187702 -0.0740656 -0.0442967 -0.124887 0.04037 -0.0378898 0.125897 0.014514 0.0552068 0.0805767 -0.0185404 -0.0654866 0.150908 0.0129095 -0.044401 -0.101169 0.190569 -0.103085 -0.0364337 -0.0505604 0.073669 -0.129972 -0.0771083 0.0173038 0.165223 -0.0613494 -0.0348865 0.0142973 0.114744 0.00934311 0.0374798 0.0629725 0.0393557 -0.0192688 -0.0188474 -0.013605 -0.0118686 
0.0368317 -0.0169309 -0.0307264 -0.0416284 -0.00670206 0.150055 0.043652 -0.00248841 0.0016038 -0.14484 -0.0582535 -0.00496184 0.118551 -0.116216 -0.0688556 0.010009 -0.225449 -0.041661 -0.176892 0.05924 0.223655 -0.0886757 0.0768721 0.0315901 -0.056756 -0.0454558 -0.154918 -0.285685 -0.0673271 0.0934627 0.02926 0.0672579 -0.0832789 0.0896813 0.0375938 -0.00223643 -0.0395206 0.142736 -0.0233621 -0.0231338 0.00750228 -0.105824 -0.0217023 0.0799662 -0.0172953 -0.0308728 0.116924 0.0129115 -0.11363 0.0697643 -0.0388632 -0.144733 0.0547515 0.0760399 0.0998034 -0.00557775 0.0669515 0.0809075 -0.000327798 -0.181593 0.00424468 0.0629243 0.107765 -0.0476419 0.0466139 -0.0798311 0.0243535 0.0435436 -0.00226397 -0.0272939 -0.0492078 0.0100509 -0.0668063 -0.0469835 -0.00122025 0.00228845 -0.0786002 -0.0763867 0.0382837 0.206582 0.0213057 -0.0573469 -0.0555818 -0.0322903 -0.153238 0.0998885 0.0793409 -0.0160036 -0.030502 -0.000674952 0.0872373 -0.166123 -0.0190208 -0.0512552 -0.180367 0.0355431 -0.045606 0.10817 0.0494149 0.0559527 0.0996546 -0.00942442 -0.0678898 0.132705 0.000898282 -0.0468121 -0.145571 0.194018 -0.0755829 -0.0378335 -0.0339672 0.0765738 -0.175594 -0.0879502 0.019512 0.207718 -0.0897648 -0.00979958 -0.0127152 0.117839 0.0189788 0.0174395 0.0304336 0.0488859 -0.0522055 0.000427355 -0.0582303 0.00895101 
0.0754534 -0.04673 -0.0289196 -0.0218761 0.00206698 0.174618 0.0588489 0.0180067 0.00158992 -0.162241 -0.0171601 0.0304534 0.100907 -0.177226 -0.0850979 0.0102351 -0.230007 -0.0153522 -0.174588 0.0886549 0.217799 -0.0400234 0.0717865 0.0647299 -0.113299 -0.0711888 -0.14075 -0.295418 -0.0698699 0.0944643 -0.0193111 0.0265845 -0.075434 0.105008 0.0427223 -0.00749057 -0.0157741 0.0820095 -0.0426281 -0.00263016 0.00989867 -0.100104 -0.0383356 0.0652274 -0.0541013 -0.0612447 0.113569 0.00249084 -0.112012 0.135881 -0.0330956 -0.165565 0.0154919 0.110174 0.0921143 -0.0124768 0.0672084 0.0550119 -0.050769 -0.106187 0.00672813 0.0705809 0.136445 -0.0778739 0.055149 -0.139812 0.0314716 -0.0221459 -0.0213763 -0.0223929 -0.0588007 0.000799902 -0.0551443 -0.00560601 -0.0191312 0.00237549 -0.0488297 -0.0470821 0.0320861 0.169585 0.0447067 -0.052327 -0.0651731 -0.0175063 -0.127649 0.149765 0.0648017 -0.0336631 -0.0628741 0.0365389 0.13267 -0.181086 -0.0577055 -0.027517 -0.163418 0.0288209 -0.0681053 0.0788448 0.0441032 0.0838072 0.105819 -0.0162051 -0.0821327 0.0939517 0.0471042 -0.03062 -0.0902262 0.167765 -0.120022 0.00200882 -0.0456377 0.0495795 -0.0953638 -0.0925827 -0.00456114 0.205701 -0.0386294 0.0093795 -0.033907 0.111726 0.00656419 -0.00475369 0.0415203 0.0526786 -0.0392278 0.0205777 -0.043408 0.000785277 
0.0754534 -0.04673 -0.0289196 -0.0218761 0.00206698 0.174618 0.0588489 0.0180067 0.00158992 -0.162241 -0.0171601 0.0304534 0.100907 -0.177226 -0.0850979 0.0102351 -0.230007 -0.0153522 -0.174588 0.0886549 0.217799 -0.0400234 0.0717865 0.0647299 -0.113299 -0.0711888 -0.14075 -0.295418 -0.0698699 0.0944643 -0.0193111 0.0265845 -0.075434 0.105008 0.0427223 -0.00749057 -0.0157741 0.0820095 -0.0426281 -0.00263016 0.00989867 -0.100104 -0.0383356 0.0652274 -0.0541013 -0.0612447 0.113569 0.00249084 -0.112012 0.135881 -0.0330956 -0.165565 0.0154919 0.110174 0.0921143 -0.0124768 0.0672084 0.0550119 -0.050769 -0.106187 0.00672813 0.0705809 0.136445 -0.0778739 0.055149 -0.139812 0.0314716 -0.0221459 -0.0213763 -0.0223929 -0.0588007 0.000799902 -0.0551443 -0.00560601 -0.0191312 0.00237549 -0.0488297 -0.0470821 0.0320861 0.169585 0.0447067 -0.052327 -0.0651731 -0.0175063 -0.127649 0.149765 0.0648017 -0.0336631 -0.0628741 0.0365389 0.13267 -0.181086 -0.0577055 -0.027517 -0.163418 0.0288209 -0.0681053 0.0788448 0.0441032 0.0838072 0.105819 -0.0162051 -0.0821327 0.0939517 0.0471042 -0.03062 -0.0902262 0.167765 -0.120022 0.00200882 -0.0456377 0.0495795 -0.0953638 -0.0925827 -0.00456114 0.205701 -0.0386294 0.0093795 -0.033907 0.111726 0.00656419 -0.00475369 0.0415203 0.0526786 -0.0392278 0.0205777 -0.043408 0.000785277 
0.0646883 -0.0676063 -0.0415004 -0.039133 0.0273229 0.165598 0.0597132 0.00514607 0.00625103 -0.188111 -0.0397405 0.0427138 0.0909111 -0.159471 -0.0921081 -0.00954751 -0.233334 -0.0216936 -0.167302 0.0777777 0.218159 -0.0322895 0.045682 0.0534187 -0.0975612 -0.0500686 -0.132665 -0.292828 -0.0829006 0.0918188 -0.00944186 0.0232806 -0.0953145 0.087385 0.0610501 -0.00234523 -0.0225082 0.0650103 -0.0392672 -0.020402 0.0466554 -0.0747267 -0.0265958 0.0980515 -0.0537657 -0.0371498 0.117635 0.00956519 -0.102464 0.0986799 -0.0634295 -0.183739 0.0338316 0.0935294 0.103349 -0.011936 0.0371247 0.0857758 -0.0580185 -0.11982 0.0211553 0.0792734 0.144497 -0.0448614 0.0535619 -0.136582 0.0305256 -0.00211048 0.0144121 -0.0356849 -0.0438204 0.00166154 -0.0372117 -0.0407356 -0.025847 0.0188473 -0.0785823 -0.0515468 0.030063 0.168764 0.0453978 -0.0190705 -0.067246 -0.0174647 -0.136574 0.130335 0.086995 -0.0166332 -0.076715 0.02167 0.139498 -0.166391 -0.0554661 -0.0482114 -0.171932 0.0258928 -0.0537269 0.0663224 0.0440352 0.0679204 0.0913468 -0.0230475 -0.0652526 0.0805864 0.0106716 -0.0334102 -0.11167 0.181891 -0.146398 0.0153433 -0.00527211 0.0320307 -0.123957 -0.0935596 -0.0163862 0.201755 -0.07406 -0.0058157 -0.0410529 0.0864937 0.00830089 0.0111982 0.0331072 0.0447065 -0.0541494 0.0116376 -0.076521 -0.00827639 
0.0962921 -0.0157266 -0.0580391 -0.0328994 -0.00986694 0.196809 0.0941063 0.0257146 0.0266322 -0.169721 -0.00835085 0.0161909 0.105977 -0.187376 -0.0841158 -0.00719449 -0.195949 -0.037846 -0.188587 0.0645429 0.191969 -0.00991743 0.0250837 0.045411 -0.127538 -0.0690643 -0.145885 -0.283911 -0.0648834 0.0898543 -0.000810086 0.0475229 -0.0872951 0.116623 0.0474107 -0.0167809 0.0332562 0.0805429 -0.034717 0.00399162 0.0433591 -0.100675 -0.0233703 0.0732049 -0.0490006 -0.0571733 0.10242 0.00964637 -0.112399 0.120058 -0.0432682 -0.15598 0.00915167 0.116212 0.0799119 -0.00818944 0.0375571 0.0558993 -0.0444593 -0.113388 -0.0188035 0.0605663 0.136349 -0.120202 0.038136 -0.134058 0.0608576 -0.0347664 -0.0163043 -0.0466032 -0.0575545 -0.024657 -0.0506993 0.00371151 -0.0141711 0.00010266 -0.0510374 -0.0361967 0.0178929 0.159613 0.0490074 -0.0393062 -0.0571267 -0.0176814 -0.104084 0.155015 0.0732189 -0.0604504 -0.0732619 0.0419999 0.139268 -0.211174 -0.0666465 -0.0491281 -0.153342 0.0250977 -0.0375405 0.0487422 0.0307182 0.0911439 0.0876323 0.000306662 -0.0681184 0.122617 0.0113068 -0.043703 -0.0907376 0.182587 -0.148229 0.0193159 -0.019576 0.0293056 -0.11106 -0.0873349 -0.0188003 0.173651 -0.0501334 -0.0129525 -0.0294311 0.0847169 0.0223928 -2.01635e-05 0.0611029 0.0824469 -0.0156951 -0.0238637 -0.060492 -0.0154006 
0.092715 -0.0266558 -0.0538478 -0.0420442 -0.000465352 0.189471 0.0906085 0.0225776 0.0167755 -0.152778 -0.0107968 0.00304131 0.125621 -0.16542 -0.0670617 0.00884222 -0.193923 -0.0294032 -0.195564 0.0487586 0.210854 -0.0214163 0.0294863 0.0474992 -0.10418 -0.0689236 -0.150025 -0.280168 -0.0613626 0.0982488 0.0107102 0.061632 -0.100565 0.118138 0.0491572 -0.0186016 0.0111645 0.0773974 -0.00984044 -0.00272329 0.0372882 -0.103808 -0.0213978 0.0744894 -0.0344108 -0.0628924 0.086817 0.0277696 -0.106435 0.0930342 -0.0370054 -0.163794 0.0192906 0.0972734 0.0669252 -0.00596086 0.0382173 0.067873 -0.0368571 -0.118289 -0.0127783 0.0572738 0.12264 -0.0982762 0.0270091 -0.112669 0.0451931 -0.00131978 -0.0117257 -0.0599705 -0.0573575 -0.0113301 -0.0598266 -0.03105 -0.0236753 0.00110697 -0.0507354 -0.0539104 0.0212268 0.183249 0.061768 -0.0537355 -0.0498467 -0.0222539 -0.127905 0.148507 0.0853758 -0.0603269 -0.0687346 0.0298618 0.12771 -0.199194 -0.0623326 -0.0361947 -0.173048 0.0379563 -0.0538841 0.0533442 0.0299565 0.0818521 0.106357 -0.0074114 -0.0709613 0.13427 0.0178298 -0.051554 -0.108101 0.186852 -0.129176 0.00565998 -0.0240608 0.0351045 -0.131311 -0.0802353 -0.00567778 0.189533 -0.0689792 0.00872576 -0.0369415 0.091523 0.0239877 -0.00633088 0.0501145 0.0813714 -0.0325896 -0.0208654 -0.0781021 -0.014663 
0.102376 -0.0207771 -0.0534376 -0.0321044 0.0112483 0.197262 0.0849123 0.0203251 0.0051269 -0.147746 -0.00151126 0.00325035 0.123149 -0.180178 -0.0728642 0.0308343 -0.188551 -0.0187854 -0.181089 0.0620365 0.235052 -0.0258626 0.0338009 0.0394524 -0.0939701 -0.0768173 -0.162041 -0.281385 -0.039619 0.111656 0.0107949 0.0574551 -0.0966771 0.115037 0.0651779 -0.0224509 0.013656 0.0634054 0.0198248 -0.0246636 0.0167025 -0.105842 -0.00625111 0.0632281 -0.0279839 -0.0773032 0.0938761 0.0273332 -0.114144 0.10087 -0.0418515 -0.156726 0.0136439 0.103184 0.0612205 -0.0147317 0.0478367 0.0537684 -0.0578276 -0.113613 -0.00794047 0.0537299 0.138525 -0.109249 0.0321466 -0.110811 0.0306467 -0.0140547 -0.0228445 -0.0624596 -0.0610844 -0.00125122 -0.0754209 -0.0312831 -0.0380161 -0.00743163 -0.0283904 -0.0494538 0.0263516 0.18709 0.066307 -0.0547893 -0.0459064 -0.010444 -0.114215 0.153119 0.0636503 -0.0502685 -0.0514637 0.0369958 0.141047 -0.192838 -0.0821399 -0.00884803 -0.163168 0.0288762 -0.061522 0.0737868 0.0113873 0.0862778 0.113365 -0.0124841 -0.0820933 0.121919 0.0333743 -0.0277971 -0.0757036 0.182876 -0.105871 0.0100831 -0.0469818 0.0212451 -0.124348 -0.0701048 0.012045 0.189816 -0.055248 0.0278049 -0.0413895 0.0966508 0.0134017 -0.0111943 0.0654934 0.0731717 -0.0352883 -0.0105851 -0.0515558 -0.0131241 
0.0773381 -0.0245788 -0.0270029 -0.049654 0.0375012 0.165244 0.0835335 0.0625188 0.0426582 -0.098227 0.00377513 -0.0243904 0.160297 -0.145939 -0.024584 0.0479844 -0.151428 0.0133991 -0.239508 0.0733603 0.243387 -0.0656259 0.0702984 0.0761919 -0.0850381 -0.129059 -0.180825 -0.262718 -0.0300873 0.0752009 0.0613266 0.0556956 -0.0753216 0.128033 0.0325974 -0.00317657 0.000945283 0.099088 -0.013955 -0.0128539 0.0131849 -0.0905881 -0.0368044 0.0460697 -0.0237033 -0.105528 0.0442811 0.0600505 -0.0779632 0.0904887 -0.049117 -0.18012 -0.0156778 0.0646706 0.0262 -0.00193717 0.0363019 0.0501841 -0.0334945 -0.115018 -0.0278603 0.0404567 0.0773418 -0.10372 0.0155061 -0.103153 0.0138355 0.037416 -0.0355692 -0.0668878 -0.0371118 0.0211014 -0.0819066 -0.0645241 -0.0394527 -0.00314446 -0.0306382 -0.0156104 0.0365859 0.167792 0.0365568 -0.0633823 -0.050381 -0.00305424 -0.121126 0.168682 0.0798472 -0.0260673 -0.0364672 0.0102532 0.114682 -0.1894 -0.0574013 -0.0220683 -0.151076 0.0310037 -0.111208 0.0654888 -0.024968 0.0865738 0.121834 -0.0520644 -0.0909158 0.135533 0.0582631 -0.0337979 -0.109127 0.143262 -0.0382194 -0.0147694 -0.0988207 0.0542737 -0.126505 -0.0363345 0.0194145 0.197881 -0.0762856 0.0312866 -0.063936 0.134026 0.0037329 0.015434 0.00904296 0.126476 -0.0639145 -0.0206133 -0.096069 -0.00963415 
0.0773381 -0.0245788 -0.0270029 -0.049654 0.0375012 0.165244 0.0835335 0.0625188 0.0426582 -0.098227 0.00377513 -0.0243904 0.160297 -0.145939 -0.024584 0.0479844 -0.151428 0.0133991 -0.239508 0.0733603 0.243387 -0.0656259 0.0702984 0.0761919 -0.0850381 -0.129059 -0.180825 -0.262718 -0.0300873 0.0752009 0.0613266 0.0556956 -0.0753216 0.128033 0.0325974 -0.00317657 0.000945283 0.099088 -0.013955 -0.0128539 0.0131849 -0.0905881 -0.0368044 0.0460697 -0.0237033 -0.105528 0.0442811 0.0600505 -0.0779632 0.0904887 -0.049117 -0.18012 -0.0156778 0.0646706 0.0262 -0.00193717 0.0363019 0.0501841 -0.0334945 -0.115018 -0.0278603 0.0404567 0.0773418 -0.10372 0.0155061 -0.103153 0.0138355 0.037416 -0.0355692 -0.0668878 -0.0371118 0.0211014 -0.0819066 -0.0645241 -0.0394527 -0.00314446 -0.0306382 -0.0156104 0.0365859 0.167792 0.0365568 -0.0633823 -0.050381 -0.00305424 -0.121126 0.168682 0.0798472 -0.0260673 -0.0364672 0.0102532 0.114682 -0.1894 -0.0574013 -0.0220683 -0.151076 0.0310037 -0.111208 0.0654888 -0.024968 0.0865738 0.121834 -0.0520644 -0.0909158 0.135533 0.0582631 -0.0337979 -0.109127 0.143262 -0.0382194 -0.0147694 -0.0988207 0.0542737 -0.126505 -0.0363345 0.0194145 0.197881 -0.0762856 0.0312866 -0.063936 0.134026 0.0037329 0.015434 0.00904296 0.126476 -0.0639145 -0.0206133 -0.096069 -0.00963415 
0.0797158 -0.0444825 -0.0400732 -0.0410896 0.0209515 0.168204 0.0650242 0.041351 0.0395061 -0.151767 0.000592856 0.00838722 0.131908 -0.142 -0.0719199 0.0395745 -0.184554 -0.0250021 -0.198738 0.0684292 0.263178 -0.0656063 0.0484113 0.0458251 -0.0680324 -0.0794969 -0.152704 -0.268228 -0.0541548 0.0979939 0.0332113 0.0555813 -0.0646763 0.123616 0.0384617 -0.0108514 0.0022887 0.0935333 0.0135968 -0.0363662 0.0228089 -0.0972982 -0.00635634 0.0473843 -0.00854424 -0.102456 0.0739232 0.0147517 -0.0933605 0.0835008 -0.0672001 -0.169616 0.0189342 0.101833 0.0754477 -0.00148052 0.0352587 0.0566156 -0.0726182 -0.135245 -0.00846282 0.0336913 0.121338 -0.0907251 0.0220011 -0.0774578 0.0114241 0.0320582 -0.0125848 -0.0635984 -0.0516791 0.000967039 -0.0921212 -0.0676284 -0.0196725 0.00690523 -0.0231649 -0.0539271 0.0245135 0.188695 0.0269789 -0.0501774 -0.030799 -0.0084595 -0.132523 0.158401 0.0823386 -0.0142939 -0.0302533 0.0147533 0.126592 -0.206168 -0.0667364 0.00202502 -0.160504 0.0311838 -0.0912158 0.0728783 0.0058895 0.0763738 0.111906 -0.0500364 -0.0913993 0.125413 0.0453702 -0.0146478 -0.100298 0.165951 -0.0939206 -0.0353541 -0.082009 0.0335505 -0.146154 -0.0529373 0.0416145 0.197061 -0.0708434 0.0229925 -0.0290836 0.11927 0.0147858 0.0159861 0.0422699 0.0817247 -0.0458413 -0.000861026 -0.0477035 0.00362992 
0.094127 -0.0369018 -0.026785 0.00691204 0.0140841 0.207263 0.0943313 0.0163476 0.0241168 -0.12593 -0.00768275 0.0193382 0.112566 -0.160742 -0.0364708 0.0233903 -0.174117 0.0143164 -0.147996 0.0372509 0.239099 -0.0319419 0.0352898 0.0737094 -0.0654105 -0.102667 -0.180599 -0.303831 -0.0711552 0.137182 0.0275032 0.0785156 -0.0723 0.121399 0.076412 -0.0123901 0.0352066 0.0354098 0.0218975 -0.0345417 0.0312755 -0.108746 0.00687718 0.0220729 -0.0402394 -0.103967 0.0917361 -0.00267483 -0.0814514 0.0824439 -0.00183384 -0.174356 0.0442571 0.108035 0.0884228 0.0211606 0.0694239 0.035903 -0.0494896 -0.0976857 -0.0139424 0.0451011 0.0879843 -0.15781 0.0597903 -0.096055 0.0286279 -0.0330813 -0.0497047 -0.0400115 -0.0606833 0.0192038 -0.098486 -0.0529667 -0.041267 0.0179692 -0.0148233 -0.0460876 0.0254317 0.173289 0.0345674 -0.0420993 -0.0273865 0.00558082 -0.0973372 0.151794 0.0712207 -0.0582761 -0.0696859 0.039232 0.108168 -0.191435 -0.0588142 -0.0115404 -0.177281 0.0360828 -0.0789682 0.0780254 0.0264352 0.107817 0.132207 -0.0115075 -0.0769881 0.113792 0.0632047 -0.034569 -0.0648858 0.127144 -0.123186 0.0242727 -0.0956344 -0.00616709 -0.106138 -0.108855 0.0216475 0.192517 -0.0271178 0.019495 -0.0569412 0.117015 0.0488623 -0.0213046 0.0482638 0.0597854 -0.0237188 0.0217673 -0.0263236 0.0133353 
0.094127 -0.0369018 -0.026785 0.00691204 0.0140841 0.207263 0.0943313 0.0163476 0.0241168 -0.12593 -0.00768275 0.0193382 0.112566 -0.160742 -0.0364708 0.0233903 -0.174117 0.0143164 -0.147996 0.0372509 0.239099 -0.0319419 0.0352898 0.0737094 -0.0654105 -0.102667 -0.180599 -0.303831 -0.0711552 0.137182 0.0275032 0.0785156 -0.0723 0.121399 0.076412 -0.0123901 0.0352066 0.0354098 0.0218975 -0.0345417 0.0312755 -0.108746 0.00687718 0.0220729 -0.0402394 -0.103967 0.0917361 -0.00267483 -0.0814514 0.0824439 -0.00183384 -0.174356 0.0442571 0.108035 0.0884228 0.0211606 0.0694239 0.035903 -0.0494896 -0.0976857 -0.0139424 0.0451011 0.0879843 -0.15781 0.0597903 -0.096055 0.0286279 -0.0330813 -0.0497047 -0.0400115 -0.0606833 0.0192038 -0.098486 -0.0529667 -0.041267 0.0179692 -0.0148233 -0.0460876 0.0254317 0.173289 0.0345674 -0.0420993 -0.0273865 0.00558082 -0.0973372 0.151794 0.0712207 -0.0582761 -0.0696859 0.039232 0.108168 -0.191435 -0.0588142 -0.0115404 -0.177281 0.0360828 -0.0789682 0.0780254 0.0264352 0.107817 0.132207 -0.0115075 -0.0769881 0.113792 0.0632047 -0.034569 -0.0648858 0.127144 -0.123186 0.0242727 -0.0956344 -0.00616709 -0.106138 -0.108855 0.0216475 0.192517 -0.0271178 0.019495 -0.0569412 0.117015 0.0488623 -0.0213046 0.0482638 0.0597854 -0.0237188 0.0217673 -0.0263236 0.0133353 
0.0860984 -0.0328057 -0.0312857 0.00653266 0.0178331 0.194933 0.0988834 -0.0011696 0.0138083 -0.135035 0.00655227 0.0379132 0.104295 -0.169245 -0.0644868 0.0280759 -0.195289 0.0186351 -0.159623 0.0528038 0.234791 -0.0421216 0.0301593 0.069385 -0.0740578 -0.0857887 -0.167751 -0.290756 -0.0622486 0.132618 -0.00154379 0.0758408 -0.0764047 0.123949 0.0645035 -0.018139 0.021558 0.0343245 0.0158676 -0.0286226 0.045928 -0.112369 0.0196766 0.0323663 -0.0495097 -0.0972459 0.109036 -0.00911608 -0.10045 0.0871528 -0.0142597 -0.181632 0.0200339 0.112248 0.0929534 0.0208974 0.0510827 0.0493142 -0.066263 -0.0799196 -0.00740238 0.0486901 0.117733 -0.136035 0.0678072 -0.0895886 0.0169424 -0.0456145 -0.0506424 -0.0323223 -0.0656088 0.0164586 -0.0824121 -0.0261286 -0.0269778 0.0146275 -0.0119129 -0.0407792 0.0127288 0.14358 0.0362647 -0.0339623 -0.0320482 0.00132244 -0.123712 0.164813 0.074022 -0.0579811 -0.0751514 0.0462061 0.125192 -0.200024 -0.067203 -0.0215312 -0.169168 0.0344894 -0.0860434 0.0757635 0.04519 0.101308 0.113214 -0.0229297 -0.0703089 0.115701 0.0667757 -0.0192414 -0.0608787 0.160772 -0.136701 0.0102548 -0.0851543 0.00470737 -0.0967393 -0.099933 0.0178599 0.17891 -0.0263376 0.0245488 -0.0392957 0.114939 0.0433606 -0.015428 0.0440071 0.0612064 -0.0328311 0.0323838 -0.037373 0.00488272 
0.0801611 -0.0536777 -0.0513305 -0.00419369 0.018276 0.181927 0.0821998 -0.00435229 0.000735702 -0.134948 0.000390706 0.0468665 0.10979 -0.152861 -0.0844287 0.0274671 -0.194416 0.023361 -0.152407 0.0554126 0.235525 -0.0523688 0.0470481 0.0778029 -0.0799389 -0.0646965 -0.1347 -0.299541 -0.0682071 0.128337 -0.0246596 0.0768175 -0.0709662 0.116189 0.0459253 -0.0187049 0.0018979 0.0447111 -0.00278581 -0.025354 0.0440976 -0.108252 0.00458518 0.0518829 -0.0589561 -0.0765506 0.11931 -0.00894871 -0.110978 0.0727184 -0.0103862 -0.183486 0.0289028 0.107315 0.0981365 0.0209667 0.0728758 0.0589354 -0.0497887 -0.0918347 0.00997548 0.055238 0.127048 -0.102027 0.0644021 -0.0970588 0.00620082 -0.0184264 -0.021215 -0.0199914 -0.0752953 0.006572 -0.0814815 -0.0423166 -0.0204383 0.0220403 -0.0264673 -0.032456 0.00592808 0.132353 0.0263483 -0.0239335 -0.0423695 -0.0168605 -0.143549 0.166689 0.085114 -0.0521276 -0.0834651 0.0350946 0.119781 -0.187751 -0.0670101 -0.0296225 -0.169131 0.0411175 -0.0859891 0.0845481 0.0667625 0.0834154 0.120367 -0.0293977 -0.0591442 0.122756 0.0599215 -0.0362841 -0.0895716 0.169461 -0.153457 -0.00902284 -0.0712066 0.0248956 -0.0908287 -0.112692 0.013473 0.186524 -0.0500186 0.00169962 -0.0325604 0.110252 0.0374086 -0.0110586 0.0353151 0.049105 -0.0514217 0.0388395 -0.0625197 0.00325176 
0.0874455 -0.0399673 -0.0458174 0.00886425 0.0225343 0.188937 0.104333 -0.00656181 0.0159547 -0.124351 0.00657856 0.0411623 0.119538 -0.136566 -0.0651481 0.0253453 -0.159239 0.0454902 -0.165888 0.040058 0.232772 -0.0480639 0.0294822 0.100492 -0.0690309 -0.0953108 -0.154929 -0.287801 -0.0740864 0.149257 -0.00908552 0.0912885 -0.0715244 0.126081 0.0494156 -0.0193035 0.013504 0.0333469 -0.00566332 -0.0257777 0.0428446 -0.0968161 0.0209614 0.038124 -0.0499679 -0.0924715 0.106553 -0.00954339 -0.102109 0.065522 0.0132892 -0.196272 0.0353777 0.0956902 0.0908435 0.0409215 0.0528913 0.0673635 -0.0317091 -0.0914961 -0.00757848 0.0576827 0.0998384 -0.139425 0.0572582 -0.0802283 0.00958624 -0.0279085 -0.0574071 -0.0329588 -0.0600586 0.00529911 -0.0848579 -0.0602686 -0.0342715 0.0374418 -0.013859 -0.0426668 0.0027201 0.124149 0.0264514 -0.020518 -0.0401092 -0.017374 -0.13355 0.170454 0.079206 -0.0798471 -0.0892089 0.0434748 0.0988998 -0.202555 -0.0606568 -0.0320022 -0.165281 0.0564823 -0.0956376 0.0724232 0.0537572 0.096991 0.125453 -0.0223032 -0.0555513 0.135014 0.0447872 -0.0394646 -0.0945734 0.141603 -0.158175 -0.00133086 -0.0782955 0.0107998 -0.0912995 -0.106435 0.00587386 0.182471 -0.0517346 0.0130984 -0.0473119 0.111824 0.0431953 -0.0165945 0.0231144 0.05986 -0.0409767 0.0360914 -0.0691285 -0.00788868 
0.0879117 -0.0203566 -0.0294894 0.0187666 0.0202193 0.205675 0.111052 -0.0137429 0.0246625 -0.123653 0.00123201 0.0325337 0.0974442 -0.160056 -0.0449004 0.0301649 -0.172506 0.0337867 -0.147156 0.0208374 0.230577 -0.0265139 0.0244958 0.0860429 -0.0601723 -0.0950186 -0.170452 -0.295879 -0.061133 0.147686 0.0135111 0.0983414 -0.0722414 0.130048 0.0777171 -0.0229264 0.0473497 0.0261035 0.024666 -0.0278655 0.0549487 -0.107073 0.0328753 0.0183112 -0.0476721 -0.0963994 0.110242 -0.0130426 -0.0922448 0.0631296 0.0105739 -0.175199 0.045124 0.108085 0.097458 0.0412781 0.0715144 0.0470393 -0.0507163 -0.0861245 -0.0191285 0.0460971 0.0951189 -0.164089 0.0704222 -0.0731484 0.0229468 -0.0510097 -0.0600049 -0.0190865 -0.071561 0.0149264 -0.0979779 -0.0330994 -0.0262612 0.0204569 -0.0135736 -0.0368865 0.00523762 0.130448 0.0340087 -0.00944686 -0.0234631 -0.00053562 -0.106546 0.155905 0.0724723 -0.0722594 -0.0942037 0.0532448 0.114602 -0.196941 -0.0622157 -0.0318202 -0.166779 0.0448081 -0.0831536 0.0829847 0.0548991 0.108433 0.125135 -0.0173331 -0.060334 0.130056 0.0612335 -0.040054 -0.0628774 0.135259 -0.143877 0.0197178 -0.0886378 -0.00286367 -0.094668 -0.115077 0.0220666 0.175243 -0.0305921 0.0099826 -0.0460508 0.11242 0.0712387 -0.0147809 0.0426328 0.0549114 -0.0327835 0.0354146 -0.0370922 0.00507996 
0.0555481 -0.0518174 -0.00421461 0.0123456 0.00959267 0.172768 0.0911936 -0.0219215 0.0142255 -0.127653 -0.0156219 0.0693246 0.0871888 -0.144801 -0.0551165 0.0128008 -0.239278 0.000259615 -0.145489 0.0525766 0.203164 -0.0383505 0.0298363 0.076175 -0.0805856 -0.0504381 -0.146706 -0.286907 -0.0918493 0.141255 -0.0313409 0.0856645 -0.0638618 0.124054 0.0427695 0.000478921 0.0119637 0.0372334 -0.0201725 -0.00708279 0.0667377 -0.120828 0.0184556 0.0217906 -0.0632198 -0.0671947 0.123549 -0.0296173 -0.0898872 0.0795246 0.0113062 -0.179817 0.031373 0.121908 0.15163 0.0375401 0.0496711 0.0577662 -0.062605 -0.0654885 -0.00438019 0.0470383 0.101121 -0.103176 0.0877678 -0.0785882 0.0158167 -0.0398841 -0.0439234 -0.00591944 -0.066348 0.0252738 -0.0721484 -0.0118641 0.0114 0.0459551 -0.0258369 -0.0518174 0.0131817 0.126078 0.0436512 -0.0286145 -0.0223702 0.00758668 -0.138151 0.142339 0.0936917 -0.0381241 -0.0854522 0.0654533 0.0981431 -0.190128 -0.0418787 -0.0224191 -0.203851 0.0488407 -0.0830073 0.0617276 0.110565 0.0957785 0.112032 -0.0184072 -0.0625483 0.0973934 0.0548903 -0.0265455 -0.0981404 0.151328 -0.167469 0.00578751 -0.068486 0.0234616 -0.0986989 -0.129819 0.00785071 0.1884 -0.0195507 0.0139157 -0.0445499 0.121218 0.0741844 -0.012831 0.0428478 0.0344632 -0.0319208 0.0714855 -0.0315934 0.0204771 
0.0579335 -0.0467341 -0.00419806 0.00823333 0.00668588 0.166203 0.104872 -0.0140468 0.0139284 -0.12331 -0.0130538 0.0667141 0.0950244 -0.141243 -0.058559 0.0129588 -0.228611 0.00858587 -0.154872 0.040818 0.205009 -0.0366948 0.0224315 0.0838642 -0.0855336 -0.0611951 -0.143766 -0.278614 -0.0833544 0.148992 -0.0379699 0.0866364 -0.0651072 0.125079 0.0369463 -0.0144572 0.0121492 0.034322 -0.0214522 0.00159666 0.0639901 -0.118653 0.0225298 0.0241215 -0.0589054 -0.0705612 0.115953 -0.0308511 -0.0912725 0.0704404 0.0191434 -0.183457 0.0302273 0.118733 0.136509 0.0433705 0.0502721 0.0614047 -0.0582083 -0.0592832 -0.00173013 0.0468338 0.0915426 -0.10063 0.0785978 -0.0802793 0.0148409 -0.0465972 -0.051212 -0.0192358 -0.0681647 0.0154573 -0.0730393 -0.0172709 0.00779374 0.0521462 -0.0202 -0.0528471 0.00993881 0.120769 0.0444443 -0.0352521 -0.0220348 0.00934204 -0.138275 0.149005 0.0942967 -0.0538346 -0.092895 0.0635779 0.0884582 -0.195154 -0.0436269 -0.0249254 -0.201755 0.0560585 -0.0882027 0.0574816 0.111974 0.103196 0.114273 -0.01678 -0.0594695 0.115124 0.0548657 -0.0390401 -0.101393 0.155869 -0.171296 -0.00272441 -0.0683744 0.0191025 -0.0993105 -0.126574 -0.00176188 0.192112 -0.0217932 0.0234402 -0.0480287 0.118887 0.0661802 -0.0165757 0.0290755 0.0350253 -0.0324869 0.0684992 -0.0516822 0.0106163 
0.0642582 -0.0139494 -0.0422241 0.00166641 0.011483 0.200213 0.0782795 -0.0229584 0.00197108 -0.126848 0.00125801 0.0619618 0.0975803 -0.158659 -0.0875585 0.0330594 -0.200521 0.0199349 -0.148923 0.0373879 0.232618 -0.0444114 0.0243671 0.0737757 -0.0603274 -0.0512382 -0.134479 -0.282795 -0.0620261 0.151531 -0.0173553 0.0810201 -0.0632706 0.117026 0.0503061 -0.0182037 0.00593445 0.0322585 0.0134051 -0.0205225 0.046787 -0.116407 0.0418559 0.0480639 -0.0462683 -0.0851069 0.143065 -0.0295138 -0.125759 0.0656078 0.0203296 -0.167515 0.0296751 0.107562 0.118532 0.0415599 0.0516663 0.0687855 -0.0535336 -0.106238 -0.011054 0.0435891 0.134875 -0.123633 0.0755528 -0.0780714 0.00223281 -0.0334988 -0.0569784 -0.00826626 -0.067085 0.00932706 -0.0921183 -0.0417462 -0.00229915 0.0358387 -0.0240876 -0.0434217 -0.000756432 0.134735 0.0260538 -0.0158445 -0.0105754 0.00649109 -0.142798 0.150284 0.0814011 -0.056041 -0.0695976 0.0546995 0.0854997 -0.206516 -0.0722312 -0.0106966 -0.169487 0.0477879 -0.0775421 0.091399 0.0645121 0.0872658 0.10935 -0.0102116 -0.0636869 0.132257 0.0369131 -0.0188018 -0.0915654 0.163789 -0.165645 -0.017945 -0.065248 0.0161604 -0.106003 -0.104488 0.0219933 0.173062 -0.0511989 0.0100538 -0.0210213 0.118211 0.0652909 -0.0229348 0.0502475 0.0210949 -0.0295252 0.057887 -0.0319903 0.00840226 
0.0567294 -0.00516757 -0.0322971 0.00509566 0.0122679 0.21071 0.0785328 -0.0326411 0.0129527 -0.109806 0.016624 0.0521626 0.100797 -0.143326 -0.07451 0.041745 -0.196314 0.0391248 -0.147904 0.0198947 0.240003 -0.0500022 0.0209725 0.0837574 -0.0449363 -0.0594361 -0.144896 -0.272293 -0.0537486 0.152707 0.00489621 0.0886164 -0.065902 0.119721 0.0563458 -0.00644195 0.0108531 0.0191137 0.0342883 -0.0205201 0.0511105 -0.120491 0.0484713 0.0376081 -0.0406674 -0.110524 0.137067 -0.019257 -0.119168 0.0513335 0.0170923 -0.165221 0.0271111 0.106042 0.112468 0.0574184 0.053492 0.0722824 -0.055114 -0.107404 -0.0237373 0.0456679 0.133088 -0.138505 0.0737647 -0.0485538 0.00236989 -0.0328669 -0.0644741 0.00567988 -0.0660472 0.0215253 -0.0986077 -0.0436838 -8.31903e-05 0.025746 -0.0183745 -0.0384806 -0.00380334 0.119214 0.0251009 -0.00323391 -0.00185346 0.00709472 -0.149989 0.159201 0.0804133 -0.0565347 -0.0679259 0.0545814 0.0915754 -0.20749 -0.0624531 -0.01151 -0.165466 0.0448068 -0.0974144 0.100266 0.0583323 0.0937368 0.116949 -0.0192882 -0.0664721 0.131179 0.058291 -0.00485551 -0.0857997 0.145778 -0.155511 -0.0186015 -0.0854546 0.01346 -0.0996921 -0.0998958 0.0323347 0.16773 -0.0425591 0.0186821 -0.0191086 0.1212 0.0806944 -0.0349226 0.0462656 0.0249416 -0.0476249 0.0677147 -0.0319547 0.0232009 
0.0567294 -0.00516757 -0.0322971 0.00509566 0.0122679 0.21071 0.0785328 -0.0326411 0.0129527 -0.109806 0.016624 0.0521626 0.100797 -0.143326 -0.07451 0.041745 -0.196314 0.0391248 -0.147904 0.0198947 0.240003 -0.0500022 0.0209725 0.0837574 -0.0449363 -0.0594361 -0.144896 -0.272293 -0.0537486 0.152707 0.00489621 0.0886164 -0.065902 0.119721 0.0563458 -0.00644195 0.0108531 0.0191137 0.0342883 -0.0205201 0.0511105 -0.120491 0.0484713 0.0376081 -0.0406674 -0.110524 0.137067 -0.019257 -0.119168 0.0513335 0.0170923 -0.165221 0.0271111 0.106042 0.112468 0.0574184 0.053492 0.0722824 -0.055114 -0.107404 -0.0237373 0.0456679 0.133088 -0.138505 0.0737647 -0.0485538 0.00236989 -0.0328669 -0.0644741 0.00567988 -0.0660472 0.0215253 -0.0986077 -0.0436838 -8.31903e-05 0.025746 -0.0183745 -0.0384806 -0.00380334 0.119214 0.0251009 -0.00323391 -0.00185346 0.00709472 -0.149989 0.159201 0.0804133 -0.0565347 -0.0679259 0.0545814 0.0915754 -0.20749 -0.0624531 -0.01151 -0.165466 0.0448068 -0.0974144 0.100266 0.0583323 0.0937368 0.116949 -0.0192882 -0.0664721 0.131179 0.058291 -0.00485551 -0.0857997 0.145778 -0.155511 -0.0186015 -0.0854546 0.01346 -0.0996921 -0.0998958 0.0323347 0.16773 -0.0425591 0.0186821 -0.0191086 0.1212 0.0806944 -0.0349226 0.0462656 0.0249416 -0.0476249 0.0677147 -0.0319547 0.0232009 
