-0.00162287 0.0504768 -0.0820341 -0.128148 -0.00953547 0.111075 -0.0686333 0.0283457 -0.0750946 0.102104 0.104765 0.0565598 0.129505 -0.0487927 -0.01616 0.0245811 -0.0858687 0.00301536 -0.0383848 0.137029 0.0903731 -0.0691311 0.0647622 0.109045 -0.0284807 0.156677 0.130502 -0.161908 0.097718 0.0183269 -0.00965147 -0.0301171 0.0289687 0.0525006 -0.0769937 0.0406174 -0.063603 0.20994 -0.0107704 0.0195325 -0.0396249 -0.119856 -0.0666156 0.181867 -0.11591 -0.0765074 0.157472 0.0133664 -0.16752 0.00158749 0.0331476 -0.0167411 -0.125059 0.0129851 0.0868564 0.0547129 -0.0666125 0.160817 -0.00861972 -0.161536 -0.10107 -0.147125 0.261996 -0.0123559 0.0763513 -0.0495218 -0.0227377 0.0792587 -0.00559661 0.0729837 -0.0431389 0.0424568 -0.0810128 -0.0327952 0.0977061 -0.0820703 -0.0590332 0.13896 0.0325863 0.0670565 -0.0637763 0.0163181 0.015899 -0.0394896 -0.0988707 -0.0554348 0.116518 0.0739527 0.147837 0.0109416 -0.0066825 -0.125763 -0.0593755 0.0463469 -0.0240902 -0.0876587 -0.0106102 0.0811316 0.0572342 -0.0981721 -0.0414411 0.00316588 -0.0604526 0.0701267 -0.0881737 0.076478 -0.119209 0.0494224 0.0685073 -0.193431 -0.00118346 0.210087 -0.0760666 0.0341894 0.107259 0.029275 -0.0957341 -0.164741 0.0277689 0.10962 0.0624311 -0.0362491 0.020923 0.0389421 -0.057553 0.0717326 0.0325448 0.0425781 
0.0517927 0.0543891 -0.092649 -0.0968673 0.0227299 0.114035 -0.0635185 -0.00132524 -0.0735802 0.0247589 0.117517 0.0919548 0.114756 -0.0271729 -0.0763092 0.0554256 -0.0738053 0.0320102 -0.108287 0.155251 0.129294 -0.0207894 0.0833841 0.0996353 -0.0407564 0.112172 0.113107 -0.124082 0.0687385 0.0730543 -0.0687632 0.00066006 0.0226808 0.0824813 -0.0951679 0.0253096 -0.0844177 0.203534 -0.0251107 0.0348728 -0.0765555 -0.0635422 -0.036604 0.153669 -0.115992 -0.073742 0.162821 -0.0105262 -0.168978 0.0833143 0.0726913 0.00677071 -0.14981 0.0561581 0.111882 0.017911 -0.0370775 0.154844 -0.00935914 -0.145018 -0.0994298 -0.119274 0.273141 -0.028789 0.0359689 -0.0873901 -0.040879 0.100675 -0.0318 0.117979 0.00789694 0.0430757 -0.0472425 -0.00862533 0.0668899 -0.0584399 -0.0402628 0.0766733 -0.0146454 0.0518113 -0.0125431 0.0424077 0.0280172 -0.0535558 -0.122199 -0.0171217 0.0935546 0.0457374 0.122988 0.0425862 0.00392722 -0.172558 -0.105642 0.0548601 0.000351594 -0.0598963 -0.0318767 0.0927254 0.0470353 -0.0871815 -0.0299935 0.0237158 -0.0530496 0.115363 -0.106252 0.0741553 -0.144579 0.0651871 0.051114 -0.204764 0.0142348 0.209271 -0.0745827 0.078872 0.0970653 0.0416142 -0.0706632 -0.129598 0.0352356 0.123476 0.0516156 -0.00402631 0.0560108 0.0232577 -0.0354923 0.064968 0.0747518 0.0255147 
0.0629382 0.0609617 -0.111819 -0.0701291 0.0395523 0.121412 -0.0319815 -0.0148227 -0.0803251 -0.0243974 0.0736602 0.114122 0.0906691 -0.0820754 -0.129341 0.0358193 -0.0796747 0.0352285 -0.141155 0.168824 0.120135 -0.0338755 0.0834811 0.118247 -0.0637039 0.077705 0.0759247 -0.128165 0.0373882 0.0720204 -0.0955527 0.0120312 -0.014108 0.109402 -0.0990878 -0.00657141 -0.0805834 0.175946 -0.0656307 0.0259778 -0.0530395 -0.0625795 -0.00780787 0.15219 -0.111268 -0.0563029 0.188377 -0.001433 -0.181593 0.145676 0.0800323 -0.0285086 -0.143156 0.0539266 0.130648 -0.00198276 -0.0311616 0.165867 0.00229947 -0.151393 -0.0661898 -0.0496425 0.27073 -0.0360567 0.0320334 -0.111118 -0.0444745 0.0604269 -0.0644802 0.120411 -0.0129407 0.0317673 -0.0179364 0.0549718 0.0434111 -0.0468094 -0.021401 0.0651903 -0.00857386 0.0258266 -0.0111953 0.0613217 0.0021105 -0.0724152 -0.129291 -0.00115408 0.0716726 0.0352858 0.103739 0.0620001 0.0363162 -0.18417 -0.104747 0.0103986 0.0157113 -0.0290781 -0.0163873 0.086538 0.0341665 -0.0712791 -0.0274193 0.0264139 -0.0457887 0.148923 -0.116562 0.054789 -0.163678 0.10188 -0.00984209 -0.162896 0.0595058 0.218768 -0.0528756 0.0747881 0.0520689 0.0340699 -0.0621812 -0.119117 0.0520961 0.122876 0.0279851 0.0252497 0.0605027 0.0175274 -0.0486445 0.0455726 0.0343564 -0.0372442 
0.0428776 0.100538 -0.102377 -0.0508151 0.0306266 0.0994024 -0.0586541 -0.0229737 -0.0111026 -0.107772 0.0532139 0.0963577 0.0444626 -0.11723 -0.162938 -0.00641783 -0.095243 -0.00328529 -0.17996 0.194914 0.0819605 -0.0193374 0.0910296 0.0307311 -0.0699738 0.0461722 0.0652677 -0.0941367 -0.0290107 0.0269843 -0.0670257 -0.0405025 0.0249925 0.110357 -0.0674259 0.000377259 -0.0344462 0.210486 -0.120837 0.00778207 -0.029548 -0.0416393 -0.00459518 0.155275 -0.122973 -0.0185888 0.170227 -0.0170338 -0.153651 0.207706 0.02976 -0.0117776 -0.150837 0.0809271 0.137679 -0.0466201 -0.0597932 0.0806229 -0.0117835 -0.173343 -0.0755568 -0.0615476 0.24344 -0.0369736 0.0459699 -0.169029 -0.0158136 0.0578796 -0.054129 0.131808 0.0399119 -0.00382246 0.0326 0.0658233 0.0442984 -0.0327439 -0.052693 0.0571409 -0.0309432 0.0327349 -0.0302896 0.0655187 -9.11545e-05 -0.0367466 -0.107254 -0.000345987 0.0415608 0.063571 0.111845 0.0789754 0.0278883 -0.212797 -0.0904079 -0.0353368 0.0172789 -0.0615667 0.00511167 0.0606173 -0.0085574 -0.0874843 -0.0721919 0.0514588 -0.0359392 0.112654 -0.115527 0.0421408 -0.132434 0.126194 -0.0178829 -0.110596 0.0768187 0.185965 -0.0740339 0.12346 0.0110781 -0.00948523 -0.0669862 -0.125192 0.0602342 0.09736 0.00676331 0.102424 0.0680235 0.0444761 0.046972 -0.0226251 0.0865855 -0.0392113 
0.0398368 0.190054 -0.07663 -0.0453591 0.00570046 0.097929 -0.0552867 -0.0398561 -0.0618712 -0.0392516 0.0563526 0.0507365 0.0448426 -0.123851 -0.110453 0.0453275 -0.0541791 0.0112384 -0.121658 0.154249 0.0966412 0.00491335 0.0739863 0.0321644 -0.0420017 0.0587332 0.0472345 -0.104827 0.0570802 0.0801784 -0.0678124 0.0186972 0.0403721 0.107602 -0.0366337 -0.0245628 0.0367239 0.218474 -0.0280819 0.0257208 -0.0576732 -0.0720029 0.0558458 0.117911 -0.0900374 0.017 0.230827 -0.0455194 -0.202563 0.155179 0.0865841 0.0405674 -0.143632 0.097676 0.122541 -0.0314057 0.00517242 0.0381419 0.00134346 -0.180176 -0.0754323 -0.100288 0.200329 -0.0861357 0.0567445 -0.14868 -0.00654655 0.00794828 -0.069016 0.114284 0.00233718 -0.00448757 -0.0292149 0.0783114 0.0795965 -0.0609458 -0.0416272 0.106465 -0.0199908 0.0332152 -0.0203735 0.0934113 0.0134343 -0.00952901 -0.0485949 0.00183286 -0.000275786 0.0226909 0.108784 0.0825411 -0.0014892 -0.198215 -0.109474 -0.0170378 0.0178859 -0.0577281 0.0255593 0.130163 -0.000463879 -0.0732555 -0.0806926 0.0678183 -0.0291233 0.191646 -0.118331 0.0320232 -0.103434 0.145939 0.0318348 -0.136355 0.027372 0.162967 -0.110221 0.0978614 0.0289995 -0.0241119 -0.0608876 -0.172469 0.0434852 0.0908756 0.0476866 0.0988058 0.0960892 0.0434386 0.0466409 -0.0261103 0.114783 -0.0395798 
