{
  "descriptor": [
    -0.06604205071926117,
    0.03159692510962486,
    0.14174458384513855,
    -0.06720080971717834,
    -0.18587400019168854,
    0.01385841891169548,
    0.008156360127031803,
    -0.03732718527317047,
    0.1984865516424179,
    -0.11920233815908432,
    0.09095843136310577,
    -0.039665259420871735,
    -0.24467933177947998,
    0.047153621912002563,
    0.010692835785448551,
    0.128231480717659,
    -0.08131462335586548,
    -0.20832638442516327,
    -0.17817065119743347,
    -0.03793420270085335,
    -0.08895168453454971,
    -0.026690149679780006,
    0.05553784966468811,
    0.009437731467187405,
    -0.16498862206935883,
    -0.39744725823402405,
    -0.06004814803600311,
    -0.04011065140366554,
    -0.014938823878765106,
    -0.01275906153023243,
    -0.027743976563215256,
    0.168002650141716,
    -0.12320327758789062,
    -0.046136580407619476,
    0.03813030570745468,
    0.0858142226934433,
    -0.09833212941884995,
    -0.08336229622364044,
    0.23822279274463654,
    -0.024499692022800446,
    -0.2674400508403778,
    0.04749827831983566,
    0.029015954583883286,
    0.24614956974983215,
    0.27923986315727234,
    0.04131220653653145,
    0.04489300400018692,
    -0.04265739396214485,
    0.16667602956295013,
    -0.32224810123443604,
    -0.013471406884491444,
    0.18132686614990234,
    0.07902828603982925,
    0.10131938755512238,
    0.049961157143116,
    -0.15657714009284973,
    0.0321873314678669,
    0.10184115916490555,
    -0.19730569422245026,
    -0.018175415694713593,
    0.0017918715020641685,
    -0.14533863961696625,
    -0.00900251790881157,
    -0.11592039465904236,
    0.2641662657260895,
    0.13460932672023773,
    -0.15763859450817108,
    -0.1393425017595291,
    0.20205335319042206,
    -0.11968055367469788,
    0.014525179751217365,
    0.06124984100461006,
    -0.16418296098709106,
    -0.12318599969148636,
    -0.1988917887210846,
    0.017513921484351158,
    0.4342583119869232,
    0.11302109807729721,
    -0.16148215532302856,
    -0.019123500213027,
    -0.17380882799625397,
    -0.0031788740307092667,
    -0.11078520864248276,
    0.07071553170681,
    -0.09211688488721848,
    -0.09897030144929886,
    -0.07787337899208069,
    -0.027792738750576973,
    0.21485871076583862,
    -0.0739692747592926,
    -0.025341864675283432,
    0.1658259481191635,
    0.08212102949619293,
    0.02299465239048004,
    -0.0040680826641619205,
    0.06925030797719955,
    -0.20560938119888306,
    0.02717512845993042,
    -0.18104447424411774,
    -0.001336398534476757,
    -0.013663850724697113,
    -0.045197777450084686,
    0.0487709604203701,
    0.09956284612417221,
    -0.16877882182598114,
    0.28752484917640686,
    -0.0398976169526577,
    0.012379849329590797,
    0.001808477216400206,
    0.0047352672554552555,
    -0.04497644305229187,
    -0.03996840864419937,
    0.14414319396018982,
    -0.26764607429504395,
    0.1444956213235855,
    0.1579788327217102,
    0.040877815335989,
    0.18086880445480347,
    0.07080839574337006,
    0.06498855352401733,
    -0.018665987998247147,
    0.0743495300412178,
    -0.13412520289421082,
    -0.1011291965842247,
    0.058468323200941086,
    -0.004136670380830765,
    0.02641257829964161,
    0.1109120324254036
  ]
}