{
  "descriptor": [
    -0.09057875722646713,
    0.12277746200561523,
    0.09310074150562286,
    -0.02922063320875168,
    -0.14796903729438782,
    0.10035232454538345,
    -0.06616576015949249,
    -0.07128605246543884,
    0.1177964061498642,
    -0.09323035925626755,
    0.15261083841323853,
    -0.036422085016965866,
    -0.2817460596561432,
    0.00034490690450184047,
    -0.06409379094839096,
    0.08701872080564499,
    -0.09430301934480667,
    -0.09504874795675278,
    -0.11457622796297073,
    -0.09883161634206772,
    0.016269011422991753,
    0.1017938107252121,
    -0.002131353598088026,
    -0.03423931822180748,
    -0.05648112669587135,
    -0.3124430179595947,
    -0.02226419188082218,
    -0.09140381217002869,
    0.12508967518806458,
    -0.08929198980331421,
    0.025561116635799408,
    0.04402255639433861,
    -0.14599668979644775,
    0.0049316417425870895,
    -0.0014011376770213246,
    0.08301237225532532,
    -0.05782562866806984,
    -0.07388383150100708,
    0.24507197737693787,
    -0.09731663763523102,
    -0.12929365038871765,
    -0.01731172390282154,
    0.04320826008915901,
    0.21983183920383453,
    0.10158839076757431,
    -0.05562986433506012,
    0.03639352694153786,
    0.01263169851154089,
    0.10491495579481125,
    -0.3048391044139862,
    0.11465713381767273,
    0.16582593321800232,
    0.1573074609041214,
    0.15295597910881042,
    0.06919584423303604,
    -0.16533544659614563,
    0.021988144144415855,
    0.19368574023246765,
    -0.1637013703584671,
    0.18103496730327606,
    0.08254113793373108,
    -0.1157812774181366,
    -0.06798547506332397,
    -0.018063334748148918,
    0.1993354856967926,
    0.1330416053533554,
    -0.11258002370595932,
    -0.20963457226753235,
    0.09878725558519363,
    -0.16807250678539276,
    -0.018751176074147224,
    0.12789203226566315,
    -0.08493012189865112,
    -0.0996064767241478,
    -0.18010377883911133,
    0.08466538041830063,
    0.3826148808002472,
    0.12674249708652496,
    -0.20766223967075348,
    -0.036051828414201736,
    -0.054378435015678406,
    -0.05144969001412392,
    0.0613769106566906,
    0.044084563851356506,
    -0.04095476493239403,
    -0.11120704561471939,
    -0.0491643100976944,
    0.02285710535943508,
    0.20876480638980865,
    -0.018690692260861397,
    -0.05415727198123932,
    0.24903516471385956,
    0.06363800913095474,
    -0.002856829669326544,
    -0.015496677719056606,
    0.061757735908031464,
    -0.02468685805797577,
    -0.0553751140832901,
    0.0015524739865213633,
    0.07836195081472397,
    0.044184450060129166,
    -0.1676565259695053,
    -0.039690591394901276,
    0.05481400713324547,
    -0.1684730499982834,
    0.22533300518989563,
    -0.053142767399549484,
    0.05872221663594246,
    0.07773739844560623,
    -0.02905336581170559,
    -0.07764127850532532,
    0.01956859603524208,
    0.2616173326969147,
    -0.2855638861656189,
    0.24917638301849365,
    0.13881012797355652,
    0.0033269503619521856,
    0.1549096256494522,
    0.024613425135612488,
    0.11324268579483032,
    0.08865693211555481,
    -0.032405685633420944,
    -0.14263203740119934,
    -0.1519102156162262,
    0.01850392110645771,
    -0.08863809704780579,
    -0.07397104054689407,
    0.062198422849178314
  ]
}