-0.0135533 -0.0707952 0.00379995 -0.0452872 0.0178554 0.0444877 -0.0744677 0.0115825 0.137771 -0.137855 -0.00919957 0.0811007 0.0358318 -0.135602 -0.154364 0.0193526 -0.200518 0.00455772 -0.199852 0.0898026 0.228492 -0.0393176 0.0752239 0.137469 -0.048942 0.0393559 0.0385023 -0.23707 -0.0462389 0.0493778 0.0239527 -0.00348919 0.0283226 0.0830921 -0.0243805 -0.0242563 -0.100387 0.191292 -0.0973492 -0.0173278 -0.0158671 -0.0637594 -0.129012 0.120965 0.0318881 -0.0655514 0.0559576 0.00184513 -0.0621365 0.0430204 -0.0244916 -0.0502831 0.0665075 0.000694107 0.112688 0.0151825 0.0454018 0.0604858 -0.0461655 -0.207713 0.0182195 -0.0671844 0.147164 0.109406 -0.00952901 -0.159363 -0.00272716 0.104681 0.0667823 0.0649114 -0.0461033 -0.0522914 -0.0702316 -0.0995945 -0.00918057 -0.0154232 -0.100765 0.0164684 -0.0196745 0.171789 -0.0320035 0.0817625 -0.0275176 -0.0569631 -0.0799903 -0.00203505 0.109882 0.103328 0.0109388 0.0072415 0.0396104 -0.114008 -0.0517743 0.0320235 -0.102474 0.043588 -0.0937068 0.0116982 0.0862553 -0.0516283 0.130138 -0.0672728 -0.107403 0.074574 0.00952714 -0.086885 -0.141122 0.031268 -0.0265924 -0.102493 0.0105443 0.171118 -0.158362 -0.0225138 0.0748317 0.173174 -0.173244 -0.097884 0.00360405 0.0877909 0.0264764 0.140476 -0.0174178 -0.00457595 -0.0340233 0.0567561 0.00341467 -0.0176885 
-0.0149567 -0.0526121 -0.0056009 -0.0622652 0.0214622 0.0447364 -0.0877998 0.0203636 0.118535 -0.120976 0.00386549 0.0610024 0.0582656 -0.116169 -0.144942 0.0398444 -0.174226 0.0137378 -0.190195 0.082259 0.249077 -0.0422444 0.0645977 0.148224 -0.029834 0.0369953 0.0542854 -0.224184 -0.0165737 0.0642874 0.0342777 -0.0117654 0.0287693 0.0759033 -0.0276193 -0.019855 -0.104548 0.170727 -0.0811129 -0.017687 -0.0268028 -0.0658021 -0.105318 0.147056 0.0459838 -0.0661757 0.0707145 0.0106133 -0.0823107 0.0119038 -0.0210908 -0.055596 0.057052 -0.0153322 0.0938898 0.0292956 0.0296072 0.0727997 -0.0250733 -0.222215 0.0155322 -0.0741537 0.147783 0.114284 -0.0222575 -0.148449 -0.0140016 0.108571 0.0740739 0.047228 -0.0480532 -0.0513439 -0.0840936 -0.140967 -0.00599608 -0.0194431 -0.0982089 0.0440946 -0.0203265 0.177582 -0.0251159 0.0807373 -0.022605 -0.0541188 -0.0876878 0.012124 0.105127 0.0893382 0.0163188 0.002315 0.0286327 -0.11073 -0.0736572 0.0386555 -0.0977263 0.050043 -0.104257 0.0336706 0.0717395 -0.0675139 0.124019 -0.0692665 -0.0969209 0.0855084 -0.0127569 -0.0749125 -0.153058 0.0395252 -0.0169205 -0.123733 0.00628256 0.162112 -0.173596 -0.0161271 0.0754902 0.167343 -0.188192 -0.103586 -0.00371974 0.0857261 0.0237728 0.129544 -0.0248521 0.00278237 -0.057436 0.054824 -0.0128371 -0.0161666 
-0.0101977 -0.0700665 -0.00301343 -0.059507 0.00952807 0.066001 -0.0832849 0.0208626 0.121153 -0.138285 -0.00303613 0.0615305 0.0435116 -0.129927 -0.148041 0.0298158 -0.206932 0.00323397 -0.179246 0.070669 0.249385 -0.0325194 0.0655358 0.137368 -0.0437057 0.0401406 0.045035 -0.243297 -0.0349355 0.055034 0.0282049 -0.0251599 0.0165118 0.0751223 -0.0137678 -0.0126365 -0.101393 0.158857 -0.075677 -0.0106542 -0.024711 -0.0691937 -0.117568 0.134227 0.0424668 -0.0708585 0.0682261 0.00547581 -0.0761074 0.0303784 -0.0294566 -0.0574946 0.0684623 0.00683106 0.103985 0.0227025 0.0534158 0.0675495 -0.0425225 -0.216714 0.0235051 -0.0559965 0.159279 0.10681 -0.0158297 -0.155 0.00109669 0.100121 0.0859489 0.0600146 -0.0536138 -0.0465338 -0.0833581 -0.122537 -0.0051376 -0.0215113 -0.103913 0.0271893 -0.0174022 0.181011 -0.0164727 0.0793011 -0.0205582 -0.0540309 -0.0918005 0.0208693 0.107591 0.0923117 0.00686288 0.00633163 0.0497531 -0.110064 -0.0641692 0.0349116 -0.108738 0.0466318 -0.100318 0.0328437 0.0792921 -0.0465553 0.13406 -0.0660435 -0.104567 0.0670579 0.00930983 -0.0757155 -0.142858 0.0354645 -0.0446959 -0.102991 0.00643346 0.15396 -0.158155 -0.0362006 0.0770284 0.186596 -0.16879 -0.0949238 -0.00275567 0.0802622 0.0300132 0.115334 -0.00443189 -0.0102684 -0.0553516 0.061552 -0.00352661 -0.000918593 
-0.00599901 -0.0484343 -0.000317615 -0.068985 0.0233965 0.0634246 -0.0844337 0.0251598 0.129356 -0.126834 0.00822113 0.0626424 0.0401319 -0.129602 -0.132708 0.0276845 -0.193033 -0.00304803 -0.191021 0.0774021 0.233425 -0.00594181 0.0545508 0.150083 -0.0353496 0.0459409 0.0622428 -0.21679 -0.0110666 0.0531518 0.0361222 -0.0254741 0.0144442 0.0811585 -0.028136 -0.00740212 -0.102147 0.160756 -0.0843978 0.00480208 -0.0119759 -0.0646271 -0.121098 0.152243 0.0370983 -0.0617311 0.0671411 0.0196122 -0.0728753 0.0304493 -0.0201021 -0.024942 0.0391718 -0.0105862 0.106576 0.0213659 0.0227134 0.0774912 -0.0402535 -0.213157 0.000734525 -0.0795392 0.163213 0.118348 -0.0339561 -0.165912 0.00436678 0.10686 0.0855323 0.0765407 -0.0374314 -0.0373076 -0.0758958 -0.109571 0.0053704 -0.0314495 -0.111519 0.0486622 -0.0222618 0.182429 -0.00503188 0.0993007 -0.00446535 -0.0508715 -0.0739931 -0.00103106 0.115001 0.0982859 0.0149188 0.0154504 0.046243 -0.107872 -0.0814771 0.0400316 -0.100465 0.0336901 -0.0943987 0.0156932 0.0757277 -0.0716317 0.118743 -0.0560891 -0.0954411 0.067101 -0.0275138 -0.0690075 -0.156004 0.0299956 -0.0143163 -0.109871 0.0344691 0.172056 -0.176602 -0.0133733 0.0803934 0.163329 -0.170186 -0.117467 0.000252727 0.0876583 0.0468701 0.131723 -0.00773129 0.005367 -0.0559131 0.053235 0.0132048 -0.00176909 
9.73376e-05 -0.0649634 -0.00905554 -0.0563277 0.0248481 0.0630943 -0.0675992 0.00594954 0.136312 -0.169641 -0.00401849 0.0767197 0.0308252 -0.132039 -0.149684 0.00723916 -0.214053 -0.0177512 -0.187113 0.070522 0.234717 -0.00221281 0.0373893 0.13806 -0.0284427 0.030084 0.0550309 -0.219885 -0.0375132 0.0770916 0.0253251 -0.0371839 0.0100081 0.0742332 -0.00869093 -0.0162517 -0.0970233 0.127939 -0.0839248 -0.0104076 0.00334855 -0.0635555 -0.0990087 0.1593 0.0343696 -0.0541881 0.0661153 0.00864958 -0.0596235 0.0286965 -0.0338487 -0.0483014 0.0720277 -0.00273912 0.11921 0.0210041 0.00374605 0.0850044 -0.0588172 -0.202217 0.0163653 -0.0609 0.16611 0.122844 -0.0312662 -0.163316 0.0124563 0.0869617 0.08123 0.0465242 -0.037899 -0.0493358 -0.0679429 -0.130172 0.00127186 -0.0030404 -0.108803 0.00987038 -0.0260259 0.203035 0.00850072 0.0888025 -0.00917093 -0.0424681 -0.0781107 0.0126151 0.110815 0.0847809 -0.0147913 0.0211858 0.0551214 -0.121952 -0.0802022 0.0358478 -0.126608 0.034456 -0.0944709 0.000118681 0.0960977 -0.0621605 0.122768 -0.0523237 -0.0871599 0.0544114 -0.034796 -0.0716459 -0.147653 0.0574614 -0.0635045 -0.0863987 0.0537994 0.131233 -0.182597 -0.0236614 0.0520117 0.1816 -0.178394 -0.0808521 -0.00470702 0.0823612 0.0353636 0.121459 -0.0176255 -0.00852619 -0.0420805 0.05907 0.000131053 -0.00999456 
0.00246607 -0.0497705 -0.0275977 -0.0617543 0.0224377 0.0761664 -0.076131 0.0143725 0.114304 -0.158004 -0.0125989 0.0532688 0.0333038 -0.128135 -0.135302 0.0247323 -0.203278 -0.014847 -0.161282 0.0666042 0.247161 -0.0247953 0.0697701 0.119909 -0.0210681 0.0336485 0.058289 -0.245107 -0.0341418 0.0699283 0.0326845 -0.0250015 0.0194822 0.0828275 -0.000289947 -0.0156334 -0.0719899 0.152679 -0.0679167 -0.027597 -0.0102186 -0.0727367 -0.0834994 0.152624 0.0269643 -0.0432544 0.0932302 0.00243045 -0.0874439 0.0314483 -0.0379757 -0.0561486 0.0754939 0.0136518 0.120672 0.0256308 0.0426651 0.0765917 -0.044027 -0.232377 0.016855 -0.060957 0.172623 0.083986 -0.00921784 -0.142844 -0.000583185 0.09438 0.0849014 0.0643888 -0.0605296 -0.0442534 -0.0943534 -0.128771 0.00543121 -0.023101 -0.101029 0.0268414 -0.0208639 0.187283 -0.0178969 0.0926809 -0.0204331 -0.0550185 -0.0819108 0.0147706 0.0930822 0.0854362 0.00691464 0.0207626 0.0699846 -0.123902 -0.0861139 0.0176997 -0.102432 0.0394303 -0.0851498 0.0537079 0.0846059 -0.059964 0.115659 -0.0627592 -0.0840249 0.0697383 -0.0302907 -0.069184 -0.149356 0.05632 -0.0568028 -0.100785 0.0289479 0.144883 -0.175239 -0.0360326 0.0765026 0.172952 -0.16581 -0.114721 0.0132002 0.0868447 0.0513195 0.126033 0.00705339 0.00288082 -0.0494035 0.0423169 0.0140589 -0.00449651 
0.0243178 -0.0423639 -0.0393424 -0.0514406 0.00593764 0.090866 -0.0608186 -0.00728084 0.11799 -0.162349 -0.00999366 0.0565017 0.0446485 -0.123774 -0.158985 0.0295413 -0.205175 -3.97124e-05 -0.179543 0.0783464 0.245496 -0.0111685 0.0762679 0.114879 -0.070745 0.0195075 0.0269072 -0.252954 -0.0452864 0.0986323 -0.0109267 -0.00295582 0.021907 0.0837747 0.0155333 -0.0140291 -0.0511813 0.177307 -0.0766742 -0.0226525 -0.0493314 -0.065269 -0.0926199 0.114995 0.0199763 -0.0346888 0.0962154 -0.00119706 -0.0963137 0.0732454 -0.0256596 -0.0423342 0.0751761 0.052844 0.136154 0.0140852 0.0801499 0.0565506 -0.0561794 -0.219997 0.0177848 -0.0381129 0.181666 0.0474812 -0.000674413 -0.159393 0.0109794 0.0875449 0.0625652 0.0691734 -0.0501143 -0.0615387 -0.0900141 -0.0996193 -0.00350225 -0.0096048 -0.0898076 0.000279873 -0.0154998 0.161562 0.00866163 0.090957 -0.0439171 -0.0605381 -0.0801443 0.0388071 0.0657381 0.0620749 0.00368006 0.0503244 0.0761943 -0.15122 -0.076032 0.0209001 -0.104367 0.0421219 -0.0843876 0.0593043 0.100195 -0.0295216 0.149861 -0.042848 -0.0958324 0.0741629 -0.0181462 -0.0721599 -0.140555 0.0455247 -0.0742773 -0.076089 0.0192874 0.138157 -0.145973 -0.0440044 0.0623446 0.194819 -0.14547 -0.10012 0.000257163 0.0839834 0.0413857 0.105678 0.0411032 -0.00346534 -0.030882 0.0546471 0.026498 -0.0127073 
0.0308282 -0.022609 -0.0243578 -0.0835352 0.0163138 0.133142 -0.0701305 0.00975027 0.0773472 -0.174175 -0.0313731 0.0342122 0.0369685 -0.0938722 -0.11073 0.034144 -0.189252 -0.0161356 -0.161174 0.0563721 0.240251 0.0115623 0.0685831 0.119915 -0.0590394 0.0206845 0.0221279 -0.241955 -0.0438899 0.0786067 0.00995817 -0.0132071 -0.00234333 0.100116 0.00949069 0.0202296 -0.0421872 0.14697 -0.0715569 0.00234256 -0.0416637 -0.0512516 -0.0594043 0.110458 0.0386945 0.000557199 0.130785 -0.0053802 -0.147545 0.0784394 -0.0265101 -0.0722691 0.063091 0.0554586 0.139902 0.034462 0.0658915 0.107488 -0.0323058 -0.230377 0.0154424 0.00823327 0.176594 0.00620468 0.00785062 -0.132002 0.00836993 0.097436 0.0517228 0.0988029 -0.0419023 -0.0426868 -0.097546 -0.097802 0.0135175 -0.0126268 -0.0916801 0.0103519 -0.00197832 0.129955 0.0144435 0.112962 -0.0436279 -0.0730818 -0.0984103 0.0408177 0.0622667 0.0413261 -0.00587035 0.0784887 0.09816 -0.158866 -0.0881129 0.00741747 -0.0767682 0.0863337 -0.065188 0.0835587 0.0763683 -0.0112498 0.109443 -0.0439989 -0.0993828 0.0760247 -0.071888 -0.0451242 -0.187259 0.0253379 -0.111606 -0.0953023 0.0438854 0.140914 -0.145369 -0.0553094 0.0758063 0.183759 -0.137978 -0.129924 -0.00104787 0.0856295 0.0734774 0.0943307 0.0701023 0.00525207 -0.0470323 0.0407899 0.0235451 -0.0229638 
0.0319882 0.0204321 -0.0770715 -0.0791147 0.0315856 0.137917 -0.0663615 -0.0114132 0.0353222 -0.147841 -0.0493777 0.0617668 0.0180531 -0.137458 -0.142925 0.0374705 -0.156656 -0.00337949 -0.147075 0.0791092 0.186587 0.0191889 0.0627981 0.109048 -0.0747732 0.0427912 0.0475626 -0.232791 -0.0467267 0.073671 -0.0287428 -0.00595424 -0.0115281 0.095194 0.00843684 -0.000829916 -0.0260373 0.135159 -0.0903902 0.00605312 -0.0377867 -0.049645 -0.0155882 0.142701 0.0106328 0.037148 0.18473 -0.00727374 -0.180081 0.112967 0.0171869 -0.0889349 0.0237243 0.0486157 0.150012 0.0188395 0.046458 0.108754 0.000227494 -0.22854 0.0181157 0.0106576 0.196528 -0.010708 0.0340017 -0.173058 -0.00875842 0.0740424 0.0303408 0.100685 -0.0436614 -0.0376699 -0.0641722 -0.054705 0.00457442 -0.00763662 -0.0861452 0.050372 -0.0117419 0.073219 0.016639 0.138327 -0.062467 -0.0718982 -0.103988 0.0236205 0.0432873 0.0319142 0.0101503 0.0893947 0.0686119 -0.157044 -0.112707 -0.0244475 -0.03264 0.0973889 -0.0216524 0.0839757 0.059076 -0.0230123 0.0623678 -0.0265832 -0.0801847 0.0948785 -0.112803 -0.0577913 -0.199034 0.0509827 -0.141167 -0.0723387 0.0845537 0.15485 -0.104782 -0.0371749 0.0350757 0.125904 -0.14164 -0.157029 0.0022757 0.0670364 0.061808 0.106717 0.0993066 -0.00203644 -0.0312691 0.0164506 0.00280923 -0.0744157 
0.0317885 0.00505196 -0.0822299 -0.0968153 0.0560503 0.148873 -0.0587853 -0.00284194 0.0389226 -0.149157 -0.0591459 0.0798749 0.0143562 -0.128793 -0.130204 0.0194885 -0.156917 -0.0014259 -0.142715 0.0688164 0.177702 0.0422946 0.0515601 0.124375 -0.0703747 0.0295198 0.0641241 -0.216822 -0.046393 0.0831085 -0.0210079 -0.022143 -0.0169887 0.0889509 0.0129595 0.00529546 -0.0377328 0.0919382 -0.104431 0.00641354 -0.0227518 -0.0397856 -0.0170356 0.160506 -2.39071e-06 0.0363342 0.170096 0.0100235 -0.171775 0.113016 0.0113425 -0.102816 0.0292648 0.0223582 0.149112 0.030489 0.0100683 0.140517 -0.0138887 -0.212124 0.00979813 0.0190807 0.206049 -0.00419952 0.0288012 -0.173952 -0.0196873 0.0752637 0.013949 0.0981465 -0.0360459 -0.0331367 -0.0620379 -0.0781838 -0.00810798 0.0125008 -0.0845872 0.0368038 -0.00585684 0.0710809 0.0307616 0.139328 -0.06114 -0.0647351 -0.0980807 0.00146971 0.0507297 0.0316892 0.00678798 0.109578 0.0749907 -0.14929 -0.125653 -0.0121438 -0.025898 0.10564 -0.0309373 0.0600412 0.0567018 -0.0251957 0.071795 -0.0294899 -0.0831333 0.0635824 -0.143863 -0.0487042 -0.212852 0.0241334 -0.157394 -0.0579988 0.121286 0.145624 -0.0992917 -0.0339899 0.0243762 0.131363 -0.140317 -0.139838 0.00207472 0.0784177 0.0701648 0.0883246 0.0845376 -0.00871518 -0.0429144 0.024288 -0.00849266 -0.0863703 
0.0478353 0.0314326 -0.0956601 -0.0913134 0.0379539 0.172577 -0.0494154 -0.000644342 0.013524 -0.157703 -0.0345757 0.075186 0.0014374 -0.155167 -0.133996 0.0173917 -0.163076 -0.018527 -0.138005 0.0649396 0.161599 0.0502328 0.040805 0.091664 -0.0704399 0.0432248 0.0665423 -0.213217 -0.040393 0.0582504 -0.0292384 -0.02844 -0.0322786 0.0917275 0.000405975 0.00182111 -0.0361197 0.0874383 -0.0890444 0.0306624 -0.00669587 -0.0505283 -0.0133098 0.173008 -0.0194654 0.0395153 0.185501 -0.0114121 -0.195511 0.118469 0.0166579 -0.0796843 -0.00918986 0.0414086 0.135546 0.0153662 0.00802873 0.141708 -0.0134415 -0.196852 -0.00641319 0.0164237 0.230524 -0.0198001 0.0374752 -0.178506 -0.00465835 0.0566949 0.0212472 0.117066 -0.0275665 -0.022892 -0.045221 -0.0384551 0.0153582 -0.00726813 -0.0961127 0.0459693 -0.0271798 0.0724196 0.0243231 0.129221 -0.0403976 -0.0662126 -0.115401 0.0272445 0.0608062 0.0151369 -0.00714405 0.0959486 0.0829373 -0.166298 -0.141731 -0.026245 -0.0185727 0.0814149 -0.00112003 0.0604263 0.0461476 -0.0213763 0.026634 -0.0102732 -0.0685464 0.0824649 -0.139965 -0.0351375 -0.195935 0.0720877 -0.163875 -0.0754338 0.124528 0.140912 -0.0950373 -0.0306239 0.0321358 0.105674 -0.133608 -0.145109 0.0294478 0.0721365 0.0742052 0.074386 0.101668 -0.000107894 -0.013806 0.00968866 0.0127377 -0.0675861 
0.033024 -0.0205373 -0.0700407 -0.111106 0.0384014 0.137246 -0.054552 0.0310833 0.0559931 -0.170812 -0.0686451 0.0653109 0.0179753 -0.134551 -0.100381 -0.00786332 -0.182511 -0.0366309 -0.164141 0.0922339 0.149612 0.0460558 0.0654608 0.0870796 -0.103402 0.0296186 0.0409405 -0.219313 -0.0788921 0.0262413 -0.0124385 -0.0282099 -0.011243 0.0968496 0.00470193 0.0239103 -0.0248223 0.122448 -0.137769 0.0151672 0.00425217 -0.0392019 -0.0472771 0.161836 -0.0270611 0.0458749 0.148553 0.0151827 -0.153751 0.147677 -0.0314253 -0.117388 0.00603664 0.0474825 0.147321 0.00651808 0.000188676 0.11618 -0.0203955 -0.203823 0.00147353 0.02927 0.182507 0.00645953 0.022816 -0.18528 0.00800338 0.0841433 0.0438339 0.0904399 -0.0165272 -0.0359764 -0.0334741 -0.0444343 0.00197802 0.00108044 -0.11149 0.0224908 0.00539382 0.0746984 0.0290174 0.122634 -0.0723307 -0.0692532 -0.0978442 0.0239682 0.064763 0.0473861 0.00591341 0.099017 0.103554 -0.154452 -0.1101 -0.0432919 -0.0444827 0.085209 -0.0222168 0.0473755 0.0409339 -0.0286511 0.0464671 -0.0410122 -0.0747804 0.0431817 -0.132715 -0.0481107 -0.218185 0.0452881 -0.153026 -0.0441079 0.115021 0.14985 -0.10658 -0.0407429 0.012782 0.11765 -0.11781 -0.162472 0.00866329 0.0747939 0.0726723 0.103297 0.0941284 0.0368765 -0.0288082 -0.0213291 0.000658918 -0.0666781 
0.0310136 -0.0234871 -0.0817156 -0.0939959 0.02008 0.136599 -0.0656737 0.0578406 0.0612277 -0.157803 -0.0326938 0.0689751 0.0127959 -0.180932 -0.127352 -0.0133388 -0.216138 -0.0218399 -0.161878 0.113671 0.148012 0.0179304 0.0937621 0.0817154 -0.110805 0.0165454 0.0627526 -0.22891 -0.0767434 0.0017904 -0.0233376 -0.0642664 0.0159182 0.0993769 -0.0160301 0.010898 -0.0362884 0.110529 -0.15684 0.0149034 0.00850658 -0.077652 -0.0677958 0.180816 -0.0618735 0.00449064 0.144148 0.0139182 -0.145624 0.184638 -0.0438055 -0.099301 -0.0165791 0.0630298 0.127998 -7.49397e-05 0.0266261 0.0621821 -0.0264285 -0.191942 -0.0121446 0.0115545 0.198948 0.0300457 0.0117243 -0.204091 0.00211092 0.0526386 0.0523504 0.103061 -0.0389405 -0.0472842 -0.0324605 -0.0223743 0.0191352 -0.0186924 -0.111638 0.0407679 -0.00767095 0.0823929 -0.000910146 0.0908212 -0.0639073 -0.0496759 -0.0975347 0.0745677 0.0578517 0.0556618 0.0201591 0.0901928 0.113743 -0.151122 -0.122351 -0.0532708 -0.0456176 0.0421941 -0.0497429 0.0608391 0.0373661 -0.0418286 0.0537233 -0.0428997 -0.0552077 0.0214695 -0.0701962 -0.0424045 -0.175475 0.0756748 -0.13648 -0.0464051 0.0848002 0.152911 -0.0708539 -0.0497598 0.0124203 0.114046 -0.0798117 -0.152585 0.0471723 0.0913007 0.0680506 0.0805649 0.0748344 0.039428 -0.0331816 -0.0205807 0.0306335 -0.018808 
0.0415474 -0.0233479 -0.0761681 -0.0926308 0.014569 0.131532 -0.0792687 0.0338057 0.0467217 -0.160833 -0.0412456 0.0705605 0.0043638 -0.172989 -0.120283 -0.0152916 -0.206014 -0.019197 -0.148134 0.122388 0.127795 0.0441874 0.111268 0.0786343 -0.125587 0.0319727 0.0727203 -0.228263 -0.0844728 0.00565351 -0.0360334 -0.0601469 0.0200472 0.0972597 0.00207552 0.00910423 -0.0260332 0.132753 -0.150545 0.0150817 -0.0218816 -0.069798 -0.0786807 0.173555 -0.0700836 0.0241359 0.14525 0.0169136 -0.143832 0.210065 -0.0247748 -0.0837066 -0.00408245 0.0724394 0.132519 -0.0195304 0.0462174 0.0574658 -0.0261418 -0.189497 -0.00852614 0.0137617 0.196068 0.022556 0.016588 -0.220104 0.00890835 0.0515814 0.0406993 0.113699 -0.0405787 -0.0563796 -0.0298698 -0.00657251 0.00728505 -0.0343397 -0.11425 0.0210431 0.00467814 0.093295 0.0198553 0.0914795 -0.076746 -0.063721 -0.0805593 0.037753 0.0368595 0.0490643 0.0227303 0.104936 0.112527 -0.14221 -0.111179 -0.0432618 -0.0407721 0.0450479 -0.0368552 0.0682177 0.0448577 -0.0453375 0.0593409 -0.0221759 -0.065196 0.0215822 -0.0687469 -0.0550723 -0.164763 0.0566661 -0.120861 -0.0309113 0.0991588 0.164312 -0.0595844 -0.0386484 0.00249626 0.113548 -0.0707531 -0.161048 0.0396821 0.0858085 0.0702862 0.0811746 0.0875354 0.025462 -0.0170782 -0.0278877 0.0515439 -0.0301695 
0.0466254 -0.00283585 -0.0640165 -0.102225 0.02116 0.13953 -0.0576552 0.0487564 0.0588602 -0.161817 -0.0324959 0.0719521 0.00944042 -0.173795 -0.103918 -0.0298253 -0.219307 -0.0374408 -0.169485 0.115637 0.12497 0.0635994 0.091365 0.0661128 -0.12198 0.0106064 0.0709934 -0.201668 -0.0739573 0.0135995 -0.0447229 -0.0763497 0.0232782 0.102849 0.00134551 0.00704852 -0.0116194 0.114761 -0.161329 0.0196718 0.00284168 -0.0757558 -0.065174 0.175692 -0.0868875 0.029632 0.138139 0.0163762 -0.146515 0.209783 -0.0311025 -0.0736548 -0.0243389 0.0789911 0.140018 -0.0146789 0.0107503 0.0514184 -0.0458254 -0.179452 -0.0253351 0.00125385 0.19426 0.0248789 0.0152228 -0.212006 0.0102175 0.0513351 0.0310265 0.107225 -0.0212157 -0.0581311 -0.0233537 -0.0199083 0.0285218 -0.00739713 -0.117117 0.0160026 0.00368466 0.093097 0.0321284 0.083692 -0.0562528 -0.037066 -0.0714987 0.0506155 0.0483201 0.0494407 0.0178053 0.130242 0.11315 -0.167655 -0.132101 -0.0375505 -0.0664476 0.0262834 -0.0399933 0.0482852 0.0506887 -0.0477123 0.0573142 -0.0158317 -0.0534303 0.00610579 -0.0916477 -0.0413142 -0.168375 0.078709 -0.126107 -0.0359305 0.112957 0.146505 -0.0753408 -0.0296141 0.000684541 0.108586 -0.0774295 -0.138562 0.0346559 0.0934642 0.0805581 0.0723203 0.0854798 0.04223 0.00593357 -0.025647 0.0693809 -0.0243242 
0.0506236 -0.00195203 -0.0672578 -0.0886477 0.011583 0.146472 -0.0591702 0.0375897 0.0514696 -0.168095 -0.0180432 0.0862694 0.00898544 -0.177148 -0.122867 -0.034308 -0.210176 -0.0224359 -0.169321 0.114538 0.128611 0.064848 0.0815465 0.0662169 -0.122758 0.0208752 0.0751824 -0.203266 -0.0829296 0.0215594 -0.0526988 -0.0733514 0.0214229 0.101432 0.0040041 -0.00313936 -0.0190835 0.113811 -0.152751 0.0205958 -0.000766149 -0.0715127 -0.0652805 0.185728 -0.0893891 0.0120779 0.142261 0.00230445 -0.148475 0.200435 -0.00689227 -0.0719939 -0.0284995 0.080661 0.137134 -0.0146711 0.00733713 0.0565925 -0.0399366 -0.185567 -0.0228703 -0.00772763 0.203977 0.0229042 0.0192584 -0.219255 0.0151428 0.0417808 0.0239303 0.111072 -0.0162965 -0.064605 -0.0117072 -0.0249758 0.0180251 -0.0141298 -0.122269 0.00891575 -0.00646386 0.102255 0.0273701 0.0865017 -0.045183 -0.0422292 -0.0779156 0.0450577 0.0580652 0.0397768 0.0137722 0.123262 0.093724 -0.178279 -0.130172 -0.0326015 -0.069752 0.0185824 -0.0322385 0.0439598 0.0438001 -0.048412 0.0529945 0.00384549 -0.0534766 0.0210669 -0.0837121 -0.0444655 -0.156629 0.0832173 -0.137006 -0.0388332 0.111071 0.13755 -0.0777728 -0.0223788 -0.00407183 0.10019 -0.0884005 -0.136654 0.0370326 0.0832167 0.073285 0.0661905 0.0816706 0.0264215 0.0278065 -0.0221347 0.0742385 -0.0234245 
0.0365508 -0.0109327 -0.0913131 -0.0861622 0.0227001 0.10895 -0.0829938 0.0419791 0.0533769 -0.146914 -0.043207 0.0753072 -0.00123059 -0.164717 -0.131329 0.0178936 -0.172799 -0.0294979 -0.14647 0.127538 0.132797 0.0324688 0.107749 0.0766306 -0.114473 0.0432392 0.088384 -0.215741 -0.0738403 0.0106927 -0.0524297 -0.0356779 0.0390954 0.101281 -0.023111 0.00302943 -0.0138323 0.156567 -0.157997 0.0126546 -0.0286606 -0.0589449 -0.0538501 0.152786 -0.0489501 0.0381865 0.159293 -0.00676381 -0.150743 0.196862 -0.0123128 -0.0836262 -0.0139536 0.0707149 0.148456 -0.0124769 0.0477326 0.04662 -0.0185744 -0.195346 -0.00499853 -0.00994072 0.18565 0.0107238 0.0257963 -0.210988 -0.0122882 0.0673801 0.0463484 0.112411 -0.0429889 -0.0543256 -0.0414203 -0.0098623 0.0190458 -0.0196106 -0.0882569 0.0512885 -0.0137636 0.0594373 0.00561206 0.11195 -0.0750062 -0.0658917 -0.076843 0.0366366 0.0301555 0.0597714 0.0393215 0.102617 0.0873654 -0.145458 -0.131888 -0.0380642 -0.00975148 0.0716864 -0.0230638 0.0651547 0.0483119 -0.0481511 0.0433208 -0.0441639 -0.062958 0.0403159 -0.0953002 -0.0585888 -0.17941 0.0434079 -0.123222 -0.0609967 0.084437 0.179713 -0.0570586 -0.0355105 0.0236695 0.0927231 -0.0804395 -0.180756 0.0353512 0.0820091 0.0640198 0.115803 0.107485 0.0317738 -0.00912527 -0.0215113 0.0539986 -0.0493738 
0.0290907 0.000832452 -0.0562581 -0.0966307 0.0218516 0.12735 -0.0654931 0.0199381 0.0217336 -0.140184 -0.0287886 0.0824616 0.0250866 -0.163962 -0.116619 0.00175644 -0.220504 -0.0191915 -0.160682 0.132537 0.149622 0.0270612 0.0956558 0.0658032 -0.113795 0.0560939 0.0509702 -0.225387 -0.0575782 0.0291834 -0.0603187 -0.042515 0.00966003 0.095031 -0.00415453 0.00443981 -0.0359533 0.157551 -0.123998 0.019169 -0.0134983 -0.0750599 -0.0587817 0.161038 -0.0765736 0.0260399 0.168219 -0.00104387 -0.165144 0.171858 -0.00486594 -0.0829545 -0.0413634 0.0807632 0.153232 -0.0128076 0.0271012 0.0768525 -0.0450624 -0.187396 -0.00380887 -0.012171 0.211 0.0268242 0.0482013 -0.202618 -0.00640545 0.0623172 0.0289403 0.102943 -0.020607 -0.0297099 -0.0251452 -0.0107659 0.0301182 -0.0152063 -0.114264 0.0271206 0.00810133 0.0937283 0.0247947 0.0921707 -0.0500611 -0.0413809 -0.102958 0.0328489 0.0675232 0.0661476 0.0331324 0.0997436 0.0850708 -0.16413 -0.113381 -0.0200107 -0.0750253 0.0230518 -0.0299179 0.0688514 0.0604338 -0.0479767 0.0426945 -0.0196938 -0.0741928 0.0478165 -0.0817171 -0.0302747 -0.171176 0.0941158 -0.105784 -0.0643103 0.0821112 0.161119 -0.0929319 -0.0224251 0.0195868 0.1128 -0.102387 -0.142865 0.0183636 0.089399 0.0634478 0.0853302 0.086836 0.0212003 -0.00586195 0.00854811 0.0453531 -0.0318827 
0.0704722 0.0121513 -0.0530879 -0.0771185 0.0360091 0.171185 -0.0131657 0.0668745 0.0228946 -0.127837 -0.00925433 0.0893295 0.0153521 -0.254985 -0.120959 0.0212486 -0.185721 -0.00457974 -0.187989 0.10435 0.173505 0.0608281 0.0622364 0.0870273 -0.116207 0.00446497 0.0301045 -0.249209 -0.0257745 0.0404879 -0.0609238 -0.0398054 -0.0072752 0.114615 0.00495829 -0.0560675 -0.0203764 0.0986665 -0.106683 0.0138605 -0.00025818 -0.0904446 -0.0469614 0.159471 -0.0686042 -0.00848886 0.144548 -0.0130265 -0.183826 0.168078 0.0371436 -0.079899 -0.0469448 0.056708 0.107989 -0.0222651 0.0255257 0.0523138 -0.065255 -0.149377 -0.010891 -0.0252404 0.192638 -0.0102843 0.0491841 -0.239903 -0.0195784 0.0174457 -0.00265384 0.0736726 -0.0375633 -0.0369893 -0.0504378 -0.0200477 -0.00118933 -0.0092302 -0.0886094 0.0556537 -0.00144927 0.115363 0.0311084 0.0682056 -0.0272621 -0.0199021 -0.060461 0.0571441 0.065327 0.033487 -0.00344881 0.113685 0.0818627 -0.174225 -0.188403 0.018065 -0.0749227 0.0456881 -0.0208668 0.0270092 0.0155161 -0.010846 0.0721846 -0.0114878 -0.0879402 0.068979 -0.0598429 -0.0600779 -0.125246 0.104485 -0.112438 -0.0536893 0.0724716 0.136124 -0.0710241 -0.034259 0.0339839 0.105154 -0.120517 -0.103567 0.0115265 0.102408 0.0498188 0.0746557 0.083506 0.0249493 0.0441236 0.000173425 0.0492512 -0.0699256 
0.068371 0.0177806 -0.0649165 -0.119507 -0.000307808 0.168102 -0.0461983 0.0772505 0.00400463 -0.144201 -0.0129002 0.0487789 0.0230529 -0.177811 -0.115603 0.00979755 -0.167275 -0.00170856 -0.167492 0.0934806 0.157858 0.0622872 0.075251 0.0315678 -0.13807 0.0420683 0.0546206 -0.20715 -0.0395401 -0.00128756 -0.0620121 -0.0344563 0.00523635 0.115295 0.0102788 -0.0244272 0.000527234 0.146793 -0.0956723 0.0121132 -0.0273558 -0.0690481 -0.0495985 0.152866 -0.0653723 0.00397971 0.151072 -0.0174058 -0.214245 0.180979 -0.00975164 -0.0803051 -0.0514796 0.105031 0.095017 -0.0191653 0.0441757 0.0589335 -0.0530771 -0.204288 -0.0100676 -0.00459785 0.214278 -0.0225748 0.034273 -0.179731 -0.0068075 0.0507763 0.0143536 0.101178 -0.0283869 -0.0723727 -0.0330628 -0.0111651 0.00681814 -0.0465544 -0.0939505 0.019721 0.00500386 0.0514057 0.0114316 0.0898071 -0.045408 -0.0663545 -0.0833365 0.0479238 0.051084 0.0346839 0.0437513 0.122665 0.116298 -0.191644 -0.156495 -0.0114854 -0.0278916 0.0542595 -0.00981395 0.0812174 -0.00497627 -0.00677373 0.0413064 -0.0042077 -0.0872273 0.0767125 -0.0689725 -0.0314395 -0.144782 0.0748933 -0.126975 -0.0908244 0.0782448 0.144646 -0.0750084 -0.0143373 0.0508717 0.0766838 -0.0923832 -0.154467 0.0533994 0.0623446 0.0641842 0.0566714 0.131019 0.0321748 0.0518119 -0.0387463 0.0758162 -0.0584031 
0.0526221 0.0437292 -0.0633929 -0.129506 0.00103497 0.153186 -0.0556002 0.0626981 0.00484343 -0.132756 -0.0140988 0.038359 0.0321279 -0.150052 -0.100428 0.0242969 -0.157791 -0.0232133 -0.171848 0.097559 0.150714 0.0629957 0.0644368 0.0455144 -0.132558 0.0584522 0.0497394 -0.19732 -0.0254285 0.00123736 -0.0492428 -0.0312267 -0.00641296 0.106416 -0.0127593 0.00595132 -0.00728965 0.166205 -0.0981442 0.0566845 -0.028926 -0.053356 -0.0555029 0.148442 -0.0388459 0.0391092 0.164987 -0.0193101 -0.211464 0.153464 -0.00785544 -0.0662203 -0.0757492 0.095048 0.10275 -0.00936869 0.0296934 0.0865397 -0.0305347 -0.199192 -0.0147909 -0.00465855 0.209253 -0.0256038 0.0329607 -0.191429 0.0110161 0.0732716 0.0319457 0.102025 -0.00451788 -0.0444344 -0.0289792 -0.00668968 0.0301552 -0.0377029 -0.108243 0.0571843 -0.00166813 0.0472041 0.0152524 0.112829 -0.0431538 -0.0596348 -0.102162 0.0486989 0.0642569 0.029641 0.0339052 0.100343 0.0905566 -0.191985 -0.137398 -0.0185374 -0.0243629 0.0530644 0.00152655 0.0713611 0.00624957 -0.01344 0.00772441 -0.0107588 -0.0929572 0.101498 -0.109536 -0.0227572 -0.179278 0.0757117 -0.120606 -0.103845 0.0807499 0.151538 -0.0994814 -0.00553371 0.0428001 0.0817003 -0.115021 -0.178975 0.0236428 0.0571367 0.0607107 0.079785 0.124814 0.0510088 0.0231056 -0.0279177 0.0380073 -0.0549051 
0.040599 0.0242803 -0.053722 -0.106479 0.00413282 0.121303 -0.0652361 0.0637698 0.0123422 -0.134262 -0.0216434 0.07064 0.00974763 -0.152111 -0.116615 0.0162101 -0.149638 -0.0299955 -0.160247 0.110868 0.142111 0.0568655 0.0610468 0.0575031 -0.119712 0.0753628 0.0654374 -0.196988 -0.0472163 0.00108876 -0.0639553 -0.0261148 0.00839862 0.110438 -0.0363276 -0.003129 -0.0182358 0.180457 -0.116624 0.0607313 -0.0225606 -0.0412749 -0.0581453 0.138771 -0.0326542 0.0383534 0.168565 -0.0508364 -0.19071 0.154712 0.0134462 -0.0628677 -0.0732823 0.0918868 0.129739 -0.0118022 0.0269786 0.0790953 -0.0268235 -0.193445 -0.000584645 -0.0259005 0.188561 -0.0115813 0.0391111 -0.209409 0.0130183 0.0714962 0.04169 0.11183 -0.00143273 -0.039718 -0.01886 0.00552172 0.0293987 -0.0278655 -0.102493 0.06197 -0.0114267 0.0445132 -0.00935838 0.130453 -0.0339185 -0.0612708 -0.0958843 0.0262468 0.075694 0.0496842 0.0409853 0.0840023 0.0593641 -0.179606 -0.125069 -0.0171133 -0.0173909 0.0571595 0.0118446 0.0464878 0.0189898 -0.0253291 -0.00829536 -0.0140549 -0.088654 0.106632 -0.113378 -0.0365525 -0.185158 0.0591589 -0.127449 -0.111145 0.0824501 0.16505 -0.101899 -0.00508576 0.0416876 0.0704534 -0.112251 -0.202233 0.0194358 0.0527877 0.0519649 0.117028 0.116382 0.0353306 0.0366826 -0.0200396 0.0463014 -0.0608521 
0.0554906 0.0263346 -0.0310092 -0.0963056 -0.00419505 0.162256 -0.0549825 0.0585176 0.0238693 -0.150043 -0.0356111 0.0550513 -0.00489446 -0.173668 -0.0901662 -0.0039407 -0.180734 -0.0417055 -0.159993 0.0812723 0.138249 0.0856916 0.0641178 0.0850228 -0.112162 0.0411743 0.0529039 -0.215355 -0.052984 0.00900306 -0.0449037 -0.0488836 -0.0139669 0.11091 -0.0136099 -0.00293223 -0.0158049 0.145996 -0.122467 0.069268 -0.0186313 -0.0518031 -0.0801682 0.135165 -0.0359828 0.0406865 0.154988 -0.0373416 -0.176148 0.174204 0.0310683 -0.0391574 -0.0360275 0.0825437 0.131141 -0.0124937 0.0492696 0.0780919 -0.0162733 -0.196561 -0.00937006 -0.00277613 0.175254 -0.0211917 0.0236906 -0.221856 0.0388822 0.056305 0.0334164 0.132422 -0.00581234 -0.0315027 -0.0276271 0.00392047 0.0302342 -0.0272118 -0.121867 0.0422296 0.00102907 0.0925126 0.0219979 0.11949 -0.024048 -0.0595645 -0.068393 0.021172 0.066447 0.0317513 0.00934559 0.104733 0.0714141 -0.171257 -0.123786 -0.0173886 -0.0524604 0.0540607 0.0146762 0.0400707 0.0339005 -0.0172856 0.0285778 0.00849816 -0.0843827 0.081996 -0.115356 -0.0552884 -0.17886 0.0453166 -0.132847 -0.0765826 0.10663 0.163132 -0.0941002 -0.0325576 0.034188 0.104204 -0.111297 -0.179377 0.0100041 0.0630385 0.0745407 0.0912187 0.114958 0.0207589 0.0402756 -0.0122281 0.0650505 -0.0465338 
0.0517217 0.0392394 -0.0370963 -0.102668 -0.00593219 0.174349 -0.0658835 0.0638488 0.0148522 -0.143703 -0.0253452 0.0407577 -0.00445415 -0.184449 -0.0889028 -0.00292632 -0.19989 -0.0376632 -0.148651 0.0773204 0.147565 0.0655129 0.0756628 0.0736899 -0.0943373 0.0366916 0.0600206 -0.214366 -0.0360331 -0.00217027 -0.0239131 -0.0656766 -0.0221121 0.108386 -0.0116239 -6.4796e-05 -0.0291801 0.132109 -0.106134 0.0629434 -0.0154217 -0.0716733 -0.078778 0.15756 -0.0422615 0.0238086 0.159341 -0.0246434 -0.185792 0.177233 0.0129365 -0.029698 -0.0489556 0.0768616 0.109825 -0.0139848 0.0531396 0.0774252 -0.0157124 -0.206978 -0.013891 -0.00183712 0.198002 -0.0109366 0.0189561 -0.214104 0.0334445 0.0490059 0.0356022 0.145255 -0.0191005 -0.0182519 -0.035657 0.00802462 0.0323757 -0.0531205 -0.12352 0.0483998 -0.000536622 0.106573 0.0116064 0.102416 -0.0166046 -0.0542854 -0.0749038 0.029978 0.0621892 0.0367821 0.0249774 0.0947693 0.0895197 -0.164284 -0.129477 -0.0227221 -0.0429862 0.0329625 0.00419092 0.0675696 0.022708 -0.0274984 0.0215592 0.00423257 -0.078888 0.0793466 -0.100296 -0.0381825 -0.169265 0.06856 -0.109835 -0.0824567 0.0982734 0.164018 -0.0986976 -0.0261506 0.0483601 0.101483 -0.093714 -0.172064 0.0379171 0.0755933 0.0805544 0.0787516 0.110925 0.0243185 0.0179411 -0.0235036 0.0752269 -0.0196381 
0.0493161 0.0230072 -0.0375455 -0.0948503 -0.0047955 0.16208 -0.05042 0.0490803 0.00507938 -0.130642 -0.0440387 0.0514797 0.000652763 -0.176412 -0.0836406 0.00244622 -0.198022 -0.0543937 -0.132741 0.0760508 0.143891 0.0587503 0.0811085 0.0875273 -0.0960847 0.0483336 0.0543224 -0.23807 -0.0486479 0.0224852 -0.0427715 -0.0470482 -0.0131518 0.106979 -0.00983843 -0.0116965 -0.0244813 0.153026 -0.113375 0.0556011 -0.0230588 -0.0790511 -0.0805468 0.132652 -0.0384275 0.055489 0.159584 -0.0293968 -0.181421 0.15965 0.0397987 -0.0348619 -0.0116465 0.0706111 0.14121 -0.00527281 0.0690655 0.0859216 -0.0125964 -0.193763 -0.0012795 -0.00696689 0.178937 -0.0175126 0.0416568 -0.209896 0.0212911 0.0619951 0.0318893 0.132043 -0.0314506 -0.0220967 -0.0569825 -0.00460615 0.0385866 -0.0199057 -0.111937 0.0397391 0.0138916 0.120592 0.0119632 0.0864078 -0.0218305 -0.0537605 -0.077017 0.00273521 0.0677177 0.0334729 0.0127438 0.097826 0.0656458 -0.156997 -0.112974 -0.0123461 -0.0694578 0.054681 0.0192944 0.0557861 0.0635667 -0.023458 0.04988 0.0127928 -0.0874798 0.0803744 -0.107377 -0.0641698 -0.179664 0.0564616 -0.122102 -0.0813604 0.102842 0.16971 -0.0944454 -0.055583 0.0491365 0.128384 -0.110456 -0.166198 0.0141411 0.0890985 0.0815098 0.0765913 0.103284 0.00821926 0.0257501 0.0102807 0.0640911 -0.0388187 
0.0412728 0.0392498 -0.0171057 -0.0953079 0.00387667 0.182196 -0.0403346 0.0249244 0.0262882 -0.157372 -0.0687799 0.0146232 -0.0109416 -0.164546 -0.0618396 -0.0488796 -0.225854 -0.0640038 -0.120447 0.0637899 0.145932 0.0395779 0.0796963 0.0748421 -0.0759037 0.0144612 0.00253003 -0.241817 -0.0400392 0.0185265 0.00541573 -0.0767439 -0.038926 0.0901069 0.0386598 0.018457 -0.0256469 0.14537 -0.115877 0.0176191 -0.0110504 -0.076519 -0.101424 0.132466 -0.0395206 0.0856095 0.13791 0.00375044 -0.167286 0.153461 -0.0231264 0.0029781 0.0229906 0.0508263 0.142125 -0.00670075 0.0657541 0.0926234 -0.0196721 -0.214362 0.000616548 0.0327543 0.184664 -0.0193433 0.0428855 -0.195429 0.0410625 0.0602295 0.0348914 0.156196 -0.0163934 -0.0144779 -0.0597013 -0.0123181 0.025157 -0.024871 -0.135463 0.024766 0.0443633 0.14015 -0.00324894 0.0890986 -0.0362684 -0.0477305 -0.0530696 -0.0183061 0.0551368 0.0486736 0.0111273 0.106158 0.114323 -0.141587 -0.07038 -0.0387609 -0.0858816 0.00893892 0.0254677 0.0673593 0.0671138 -0.0214599 0.0716723 0.0371788 -0.0828228 0.035576 -0.115918 -0.0457016 -0.155603 0.0558972 -0.0881361 -0.0356298 0.126073 0.145408 -0.120812 -0.0641871 0.0544489 0.155454 -0.105581 -0.163423 0.0216722 0.0962527 0.0841751 0.0655599 0.0800289 0.0168645 0.00605501 0.00611153 0.0832794 -0.0241705 
0.0309647 0.00506494 -0.0224601 -0.0718815 0.0752176 0.184994 -0.0310004 -0.0037412 -0.0143214 -0.100543 -0.031004 0.0578672 0.0495952 -0.150695 -0.0613181 -0.00182944 -0.167902 0.0422369 -0.126769 0.0988392 0.225962 -0.0283694 0.0950245 0.13888 -0.0235359 0.00970992 -0.0357343 -0.278411 0.0266002 0.0685919 0.0395976 -0.000291111 -0.0435043 0.0841757 0.0424431 0.0187847 -0.0856453 0.131749 -0.0638959 -0.0382606 0.0122533 -0.0661119 -0.0833559 0.152757 -0.07192 0.00418808 0.155026 0.0254962 -0.170458 0.0599831 0.000304763 -0.0454082 0.00934713 -0.0079701 0.118751 0.0238012 0.0448106 0.143052 -0.0278416 -0.208451 -0.0112469 0.0125984 0.203012 -0.0242005 0.0828278 -0.161632 -0.0141142 0.05488 -0.0145266 0.135744 -0.0337591 0.0345592 -0.0905192 -0.0607179 -0.0166526 -0.0349583 -0.111049 0.0652028 0.0487401 0.13467 -0.0432446 0.0939024 -0.0279228 -0.0522261 -0.0730983 -0.0219377 0.0911605 0.0745947 0.0130835 0.0644403 0.102035 -0.121738 -0.0834091 -0.00578383 -0.0797212 -0.00863396 -0.0272114 0.11191 0.0299187 -0.0303375 0.0915719 0.00413583 -0.0896085 0.0853741 -0.0813262 -0.0103123 -0.140595 0.0656515 -0.0003676 -0.0692 0.0436148 0.156798 -0.150658 -0.0410707 0.0939865 0.144046 -0.143086 -0.159606 0.0178032 0.145449 0.0687261 0.0507072 0.0120898 0.0118163 -0.0631684 0.0508215 0.0226766 -0.0266358 
0.0096604 0.0610397 -0.00667937 -0.105067 0.0737094 0.206632 -0.0181266 0.0118921 -0.0687528 -0.023616 -0.00701949 0.0228338 0.0711248 -0.167516 -0.0138853 0.0227829 -0.172627 0.0404565 -0.124757 0.0835611 0.203673 -0.0427499 0.0736858 0.0960991 -0.0130058 0.0360562 -0.0651911 -0.257936 0.0934733 0.0288434 0.0590297 0.000180877 -0.0723128 0.0740433 0.0384609 0.0235612 -0.0940096 0.121291 -0.010585 -0.0151248 0.0352807 -0.0969427 -0.0712889 0.158203 -0.0790004 -0.000805956 0.167355 0.0474152 -0.220419 0.00892636 -0.0123264 -0.0400618 -0.0492892 -0.0286858 0.0677148 0.0278993 0.0120525 0.15249 -0.039842 -0.193513 -0.0396529 0.00916615 0.214652 -0.0242188 0.103975 -0.106832 -0.0220436 0.0543092 -0.0196768 0.108472 -0.0278304 0.074467 -0.0799964 -0.0364865 0.0145843 -0.0584273 -0.129084 0.0939766 0.0656637 0.121761 -0.0410797 0.0741112 -0.00770917 -0.0256094 -0.096089 -0.0141492 0.10861 0.080342 0.0341295 0.0476407 0.101338 -0.101607 -0.0890235 0.00998898 -0.0851198 -0.0357761 -0.0161652 0.119895 -0.00716904 -0.0336452 0.0534418 -0.0037256 -0.0939675 0.0915286 -0.0780963 0.0337664 -0.11854 0.110566 0.0527878 -0.0876756 0.0351251 0.162204 -0.1553 -0.0212007 0.11519 0.104471 -0.171847 -0.13899 0.0198134 0.13521 0.0723551 0.0149529 0.0112755 0.036488 -0.0771904 0.0510544 -0.000410207 -0.0201425 
0.0350416 0.0295318 0.0386403 -0.0816478 0.110703 0.205979 0.0301868 -0.00336702 0.0120247 -0.0963231 0.0031596 0.0354474 0.0693536 -0.102816 -0.0120672 -0.0210421 -0.178716 0.0622255 -0.17451 0.048651 0.252138 -0.0112515 0.0669245 0.102814 0.0129955 -0.0409708 -0.100731 -0.221914 0.0929726 0.075702 0.0793109 -0.00299947 -0.0739995 0.0683008 0.0646905 0.0138948 -0.102617 0.124697 -0.0124469 -0.0351843 0.0450364 -0.0350456 -0.0976297 0.123589 -0.0985501 -0.0394295 0.0897394 0.0311546 -0.1479 0.000612835 -0.0487065 0.00118522 -0.0155136 -0.0184279 0.0690356 0.0276288 0.00511342 0.175353 -0.103837 -0.175592 -0.0539988 0.00344472 0.207983 -0.0324689 0.0764293 -0.0815625 -0.000336141 0.0731881 -0.0442716 0.135428 0.0294694 0.082085 -0.0771281 -0.072807 -0.0148955 -0.0234413 -0.130345 0.000896898 0.0498859 0.138443 -0.0313233 0.0956147 0.0162812 -0.02253 -0.0542959 -0.0229301 0.111964 0.0879212 -0.00443437 0.0570172 0.136792 -0.137469 -0.0820354 0.0189456 -0.0968944 -0.0783421 -0.0615703 0.0923023 0.0115925 0.00102058 0.0902781 -0.00289825 -0.0836397 0.0692972 -0.0851124 0.0428655 -0.0961454 0.0796234 0.0837817 -0.0863621 0.03647 0.123161 -0.193493 0.00121809 0.134408 0.153943 -0.163568 -0.0831566 0.0171601 0.163438 0.0678653 0.0195353 -0.0344867 0.0295209 -0.0520125 0.067304 0.0324716 0.00575272 
0.0145509 -0.0582887 0.017655 -0.116112 0.102776 0.147968 -0.00849201 0.0152963 0.0337765 -0.0731914 -0.00651066 0.0861449 0.0708049 -0.106896 -0.0339586 -0.0416097 -0.163318 0.0579911 -0.133949 0.0946623 0.212453 0.0022435 0.0585387 0.0976764 -0.0602094 0.0692953 -0.0526038 -0.25144 0.033605 0.0237794 0.0525648 -0.0201739 -0.0489382 0.0517483 0.0747422 0.0290722 -0.0777318 0.185395 -0.0214334 -0.03714 0.0476839 0.00593082 -0.14839 0.136921 -0.116509 -0.0502365 0.0698126 0.0351339 -0.0899869 0.00915421 -0.0724675 -0.0456211 -0.031671 0.0136033 0.0989607 0.00765681 0.0141569 0.143796 -0.124507 -0.179768 -0.010454 -0.0444011 0.21589 0.0181377 0.0829181 -0.15524 0.0225242 0.118974 0.0446496 0.0984479 0.0383614 0.05927 -0.0498156 -0.0709252 -0.0412086 -0.0217609 -0.170573 0.0501163 0.0728251 0.106648 -0.060524 0.14122 0.0126731 -0.0190775 -0.0581384 -0.0756248 0.170235 0.152492 0.0415038 0.00668235 0.112718 -0.101315 -0.0217136 0.0154387 -0.0994044 -0.103751 -0.0352312 0.0515232 0.00262405 -0.0344071 0.0791292 -0.0204965 -0.104704 0.0418142 -0.0513486 0.00107002 -0.101231 0.0218708 0.0459079 -0.0476808 0.0338796 0.132662 -0.173504 0.00467253 0.113298 0.137213 -0.171301 -0.169085 -0.042633 0.0981036 0.0550758 0.0639182 -0.0170039 0.0340201 -0.062567 0.0472174 -0.00936082 0.0121012 
