-0.0442889 0.101419 -0.00594056 -0.0669138 0.0808684 0.141774 0.0822736 0.0299052 -0.102879 0.0988775 0.014879 0.0569674 0.0455298 -0.114356 0.0619636 -0.0105767 -0.0901081 0.0423498 -0.00964311 -0.0143832 0.111467 -0.040831 -0.0624433 0.0613266 0.0403233 0.0938696 -0.0585323 -0.18759 0.139548 0.0610992 0.0449466 0.0793325 -0.0604168 0.0509586 0.0219531 0.0348253 -0.0407891 0.0453627 0.0202295 -0.0116345 0.134007 -0.0947735 0.0132905 0.158666 -0.104001 0.0317196 0.191789 -0.0354165 -0.211736 -0.16721 0.00217536 -0.0237604 -0.0941302 -0.066464 0.0972148 0.132126 -0.0947365 0.19441 -0.0489257 -0.0740734 -0.0771506 -0.0923043 0.177582 -0.0660439 0.173628 -0.0185985 -0.0154454 -0.0174157 -0.0275786 0.112897 -0.0277719 0.110625 -0.0803789 -0.0172026 0.0456992 -0.0106518 -0.0962074 0.169495 0.0154261 -0.0408659 -0.115612 0.114139 0.0228795 0.00708687 -0.0980206 -0.0568526 0.159833 0.0339244 0.0138849 0.0215521 0.063978 -0.0748393 -0.101219 -0.0470563 -0.0218267 -0.0196948 0.0379822 0.0492414 0.0530024 -0.00309123 -0.0861337 0.00118521 -0.0254836 0.0856774 -0.137342 0.0702443 -0.106255 0.104284 0.0309689 -0.113441 0.0138229 0.0772233 -0.181002 -0.0827578 0.164695 0.00448512 -0.0812123 -0.23082 0.0681863 0.111725 0.140343 -0.00970749 -0.00458511 0.0696643 -0.0520511 0.0687445 0.00133199 -0.00760387 
0.00915276 0.0851737 -0.0799749 -0.0424431 0.1236 0.105745 0.110135 0.00499513 -0.111518 0.0770743 0.0188339 0.0941301 0.0617939 -0.084699 0.0129561 -0.0098233 -0.0594926 0.0631143 -0.0107734 0.0577579 0.14079 -0.0746676 -0.00448059 0.0620959 0.0383898 0.0399683 -0.0635388 -0.20598 0.119467 0.135829 -0.0153144 0.0828144 -0.0292145 0.0430158 0.00638776 0.000333397 -0.0510372 0.0827832 -0.00642177 -0.0377413 0.0811998 -0.057489 0.0183727 0.16308 -0.161789 0.0678507 0.197806 -0.0419994 -0.179772 -0.0943451 0.0217019 0.0103044 -0.109974 -0.0478028 0.129063 0.0891422 -0.0447133 0.184315 -0.0497818 -0.0505591 -0.0560539 -0.106058 0.196497 -0.0732267 0.160607 -0.0930064 -0.0530683 0.0114392 -0.0367416 0.114209 0.0112943 0.129898 -0.0887299 -0.022919 0.0146845 0.0321697 -0.064983 0.155068 0.00567514 -0.0281877 -0.134212 0.100377 0.00199588 0.0246521 -0.0842919 -0.0346115 0.123951 0.0329837 0.0336475 0.00712918 0.0457257 -0.0930405 -0.122889 -0.0613375 -0.0132492 -0.0778226 0.0295695 0.0773378 0.0671895 -0.0377239 -0.052406 0.0220832 0.0143584 0.108587 -0.167689 0.055455 -0.116053 0.142674 0.062164 -0.106724 0.0176326 0.0754071 -0.171122 -0.0643237 0.139053 0.0437401 -0.0526409 -0.222323 0.0584911 0.161737 0.0892289 0.027619 -0.0195027 0.0865018 -0.0714512 0.0655217 0.0184949 -0.00132508 
0.0562766 0.0303105 -0.0810599 -0.0365661 0.120219 0.173708 0.128567 0.023283 -0.100565 0.00529186 0.00181111 0.100648 0.106285 -0.0916454 0.00205365 -0.00759116 -0.11724 0.029729 -0.104765 0.0665166 0.191904 -0.0890036 0.0128033 0.0844704 0.0240285 -0.0297177 -0.127279 -0.228705 0.0341473 0.143287 -0.0130513 0.0964257 -0.0905093 0.0818389 -0.0255451 -0.00361511 -0.106756 0.0437812 -0.0328444 -0.0255896 0.0839375 -0.0725704 -0.000494295 0.117641 -0.131631 0.0212567 0.154701 -0.0239954 -0.168698 -0.0316633 0.0346266 -0.0464607 -0.071584 -0.0236111 0.129067 0.063967 -0.0438263 0.206869 -0.0327759 -0.0682271 -0.0493222 -0.0104756 0.177889 -0.0907464 0.10586 -0.0556615 -0.0446741 0.0621999 -0.0654922 0.060959 0.0212436 0.144824 -0.0821595 -0.0417205 0.0019853 0.0848728 -0.0537543 0.0318125 0.00994222 0.0712179 -0.0776097 0.0194296 0.0117998 -0.00100935 -0.142627 0.042933 0.147045 -0.000910931 0.00224074 0.0205869 0.0523544 -0.147252 -0.11534 -0.0218555 -0.107957 -0.0301067 -0.00756787 0.039732 0.0588865 -0.00663769 0.0224412 0.0105347 -0.0128084 0.126345 -0.16404 0.0569095 -0.173239 0.175934 -0.0186766 -0.0932878 0.0304897 0.0928732 -0.171785 -0.0829032 0.115983 0.121052 -0.0968295 -0.0961022 0.0400506 0.193315 0.0698196 -0.00820931 -0.00727091 0.0768323 -0.0626044 0.0829576 -0.0192398 -0.0155303 
