{
  "descriptor": [
    -0.06295720487833023,
    0.05438830703496933,
    0.12165611237287521,
    -0.03279291093349457,
    -0.12882089614868164,
    0.05912572890520096,
    -0.08254802972078323,
    -0.03832041099667549,
    0.164463073015213,
    -0.14304372668266296,
    0.16928653419017792,
    0.013357213698327541,
    -0.2333989441394806,
    0.10275857895612717,
    -0.07124105840921402,
    0.15380951762199402,
    -0.17561642825603485,
    -0.19680309295654297,
    -0.027187539264559746,
    -0.041990917176008224,
    -0.004264621064066887,
    0.07267806679010391,
    0.038723286241292953,
    0.07785384356975555,
    -0.14843948185443878,
    -0.3691600263118744,
    -0.081853948533535,
    -0.060648493468761444,
    0.04502519592642784,
    -0.12462227791547775,
    -0.07858853042125702,
    0.039015308022499084,
    -0.12603652477264404,
    0.0402640774846077,
    0.10548705607652664,
    0.05137147754430771,
    -0.07579582184553146,
    -0.16368824243545532,
    0.29516634345054626,
    0.09351518005132675,
    -0.26550573110580444,
    -0.028354139998555183,
    0.09238690137863159,
    0.26872915029525757,
    0.18618826568126678,
    -0.02912318892776966,
    0.03296106308698654,
    -0.05891239643096924,
    0.16834941506385803,
    -0.291095495223999,
    0.0406263992190361,
    0.23496928811073303,
    0.0792078897356987,
    0.0997614786028862,
    0.03796110674738884,
    -0.14607083797454834,
    -0.015700243413448334,
    0.13660480082035065,
    -0.09912234544754028,
    0.0601673424243927,
    0.04947377368807793,
    -0.08714385330677032,
    0.006674233358353376,
    -0.03522335737943649,
    0.15381623804569244,
    0.09681104123592377,
    -0.13050168752670288,
    -0.16711336374282837,
    0.1944398581981659,
    -0.14483502507209778,
    -0.08102665841579437,
    0.06790480762720108,
    -0.1419084668159485,
    -0.19320189952850342,
    -0.1575847566127777,
    0.009547876194119453,
    0.4037245213985443,
    0.1151583269238472,
    -0.11207547038793564,
    0.0690457746386528,
    -0.012645645998418331,
    -0.05688600242137909,
    -0.04143330454826355,
    0.20457397401332855,
    -0.09795292466878891,
    0.04226750507950783,
    -0.009289485402405262,
    0.04616578295826912,
    0.2534353733062744,
    0.025111129507422447,
    0.0021456261165440083,
    0.19654040038585663,
    0.007489795796573162,
    0.04700709134340286,
    0.11694729328155518,
    0.10785749554634094,
    -0.117337167263031,
    -0.048705246299505234,
    -0.19435064494609833,
    -0.01607772894203663,
    -0.06018981710076332,
    -0.04681248217821121,
    -0.007831723429262638,
    0.13548199832439423,
    -0.21174678206443787,
    0.17496684193611145,
    -0.046246834099292755,
    -0.09660712629556656,
    -0.010784049518406391,
    0.034722667187452316,
    -0.0661797821521759,
    -0.03444771096110344,
    0.11953288316726685,
    -0.23485636711120605,
    0.12215031683444977,
    0.17660772800445557,
    0.09488019347190857,
    0.146285742521286,
    0.08628372102975845,
    0.03374302759766579,
    0.058293893933296204,
    -0.030218176543712616,
    -0.1456543654203415,
    -0.11466941237449646,
    0.02858889102935791,
    -0.036361441016197205,
    -0.023580286651849747,
    -0.029213974252343178
  ]
}