{
  "descriptor": [
    -0.08981439471244812,
    0.04557738080620766,
    0.08362763375043869,
    -0.09128446877002716,
    -0.18053890764713287,
    0.04463860020041466,
    -0.10362422466278076,
    -0.04002545773983002,
    0.1863519251346588,
    -0.1583990454673767,
    0.16386649012565613,
    -0.03714646399021149,
    -0.19988690316677094,
    0.09531538188457489,
    -0.06106144189834595,
    0.15145979821681976,
    -0.12128838896751404,
    -0.19104446470737457,
    0.004442794248461723,
    -0.0491010881960392,
    -0.025361591950058937,
    0.09792201220989227,
    0.00880950316786766,
    0.08572535961866379,
    -0.1470663994550705,
    -0.37715446949005127,
    -0.07534459233283997,
    -0.06609537452459335,
    0.041147682815790176,
    -0.09735865145921707,
    -0.077409528195858,
    0.09060854464769363,
    -0.16219672560691833,
    0.03458061069250107,
    0.0801914632320404,
    0.11034481972455978,
    -0.04228115454316139,
    -0.13237504661083221,
    0.24341192841529846,
    0.10059289634227753,
    -0.2760084271430969,
    -0.0066976179368793964,
    0.07688669860363007,
    0.23953700065612793,
    0.15232186019420624,
    -0.021015459671616554,
    0.0491064190864563,
    -0.08581621944904327,
    0.16875331103801727,
    -0.23964570462703705,
    0.033517397940158844,
    0.20407013595104218,
    0.05422406271100044,
    0.04914027452468872,
    0.05829441547393799,
    -0.11559771746397018,
    -0.00014564640878234059,
    0.10435955971479416,
    -0.12131066620349884,
    0.023622650653123856,
    0.08741549402475357,
    -0.012978163547813892,
    -0.002517023356631398,
    -0.09217388927936554,
    0.19692163169384003,
    0.0928124412894249,
    -0.09028882533311844,
    -0.1578148901462555,
    0.22467871010303497,
    -0.14786869287490845,
    -0.0955333486199379,
    0.10729096084833145,
    -0.11393272876739502,
    -0.17628885805606842,
    -0.1517757773399353,
    0.04524625837802887,
    0.38765668869018555,
    0.1523655354976654,
    -0.0874677523970604,
    0.10621356964111328,
    0.006824429612606764,
    -0.07386709004640579,
    -0.023069089278578758,
    0.1589304357767105,
    -0.08084079623222351,
    0.06641938537359238,
    -0.00015997598529793322,
    0.0487842820584774,
    0.2877291738986969,
    0.03898231312632561,
    0.0420469306409359,
    0.20027536153793335,
    0.02156916633248329,
    0.06977808475494385,
    0.0873154029250145,
    0.08709819614887238,
    -0.11681153625249863,
    -0.03874461352825165,
    -0.1714249700307846,
    -0.01191610936075449,
    -0.028297483921051025,
    -0.036315422505140305,
    -0.006315183825790882,
    0.14341355860233307,
    -0.22615684568881989,
    0.18457508087158203,
    -0.07498480379581451,
    -0.10580307990312576,
    -0.03897489234805107,
    0.056289494037628174,
    -0.017714036628603935,
    -0.010852281004190445,
    0.11419998854398727,
    -0.2288404405117035,
    0.10495314747095108,
    0.11158433556556702,
    0.08963286131620407,
    0.1468605250120163,
    0.08901643753051758,
    0.03802339732646942,
    0.04250200092792511,
    -0.05744044855237007,
    -0.16961194574832916,
    -0.13603220880031586,
    0.05175173655152321,
    -0.07147829979658127,
    -0.002281883964315057,
    0.015145442448556423
  ]
}