0.0245105 0.0997494 0.014084 -0.0019298 0.0413063 0.230258 -0.0180414 -0.100684 -0.146782 -0.0681777 -0.0271646 0.0103803 0.0222873 -0.059935 0.015655 -0.0584145 -0.0758291 0.05748 -0.0185498 0.0961275 0.0433919 -0.0151918 0.0793062 0.0803517 -0.0113898 0.0492931 -0.107044 -0.152282 0.0703827 -0.0154549 0.0658204 0.0860546 -0.0949023 0.0604497 0.0791358 0.097093 -0.0182504 0.125501 0.000231246 -0.0637887 0.0654776 -0.0600419 -0.0254027 0.0279991 -0.147381 0.0365706 0.205768 0.0500873 -0.212307 0.0572931 -0.0397905 0.0299196 0.0277375 0.0232266 0.104591 0.0162106 0.0413945 0.160437 -0.000684465 -0.175879 -0.0989126 0.141784 0.226108 -0.169598 0.122106 0.0540363 0.0615202 -0.0370413 -0.13001 0.190913 -0.033689 0.0486939 -0.0420296 0.139923 0.0595766 -0.0929469 -0.0755919 0.00704252 0.0830827 -0.00565164 -0.0405029 0.114927 -0.0179119 -0.101824 -0.0236574 -0.0701326 0.0106224 0.0460757 -0.00105906 0.0960761 0.197227 -0.0672321 0.0453383 -0.0377337 -0.00150819 -0.0717642 0.0749615 0.201202 0.0224643 -0.0333583 -0.0197514 0.0938136 -0.0557753 0.0937349 -0.0947841 0.118755 -0.026175 0.046842 0.0546178 -0.0251172 0.0468604 0.156828 -0.0649061 -0.0148721 0.0702251 -0.00740888 -0.04933 -0.178038 0.0820235 0.113694 0.0933245 -0.0775957 0.0663565 -0.0215356 -0.0635027 0.0787972 0.0737313 -0.0114385 
0.0529621 0.0810239 -0.0465109 -0.0355308 0.0635719 0.187846 0.00936007 -0.0526122 -0.166353 -0.0701189 -0.0216914 0.0133931 0.0402935 -0.0729039 -0.00848539 -0.035711 -0.0543658 -0.00750522 -0.0386414 0.131135 0.036238 -0.0247142 0.0999562 0.00715973 -0.0379205 0.0879765 -0.0836029 -0.149724 0.0970582 -0.0498892 0.0418579 0.104678 -0.114674 0.0741721 0.0204904 0.058898 -0.0118867 0.201673 0.0165495 -0.0446786 0.0635387 -0.0456473 -0.0496518 0.0455484 -0.158135 0.0445102 0.176756 0.055317 -0.18027 0.0649355 -0.0637879 0.0464228 -0.0461277 0.0351389 0.0819749 -0.04323 0.04147 0.174355 -0.0242338 -0.147841 -0.0851932 0.0859798 0.248126 -0.143758 0.115384 0.011369 0.0489483 0.0102969 -0.0676237 0.141558 -0.0394697 0.0719305 -0.0215952 0.191935 0.0451242 -0.118043 -0.0507351 0.0340698 0.0679321 0.00714418 -0.0444809 0.0729414 -0.00687297 -0.102516 -0.0255057 -0.0959157 0.0353848 0.0864898 0.0327471 0.0359622 0.202525 -0.0778343 0.00992858 -0.043273 0.024725 -0.0966213 0.113714 0.165322 0.00163877 -0.035612 -0.0726411 0.0771089 -0.0648163 0.155691 -0.105273 0.0905621 -0.0441461 0.115857 0.0904442 -0.052058 0.0566938 0.193067 -0.0921174 0.0534308 0.0828705 -0.0274038 -0.0448266 -0.182763 0.0889869 0.104314 0.0404815 -0.00842046 0.0920852 0.0238692 -0.0506344 0.0107364 0.0288665 -0.0357543 
0.0278217 0.109916 -0.0437958 -0.0278132 0.0436299 0.170463 0.0157157 -0.0860427 -0.165489 -0.0485485 -0.0128032 0.0406932 0.0509651 -0.0704599 -0.0495108 -0.0301316 -0.0631248 0.0165333 -0.0300788 0.127847 0.0535762 -0.0378519 0.0696369 0.0242701 -0.0528538 0.108607 -0.086913 -0.155234 0.121046 0.00392154 0.00971638 0.129628 -0.103147 0.0594412 0.024618 0.0442059 -0.014071 0.202025 0.0267321 -0.0370976 0.04915 -0.0576842 -0.0353963 0.0429488 -0.141606 0.0457588 0.207402 0.0264535 -0.207932 0.0369837 -0.045593 0.0562377 -0.0461458 0.0401314 0.0916491 -0.0185496 0.0460863 0.169505 -0.0347184 -0.138307 -0.0685361 0.0748005 0.261635 -0.136791 0.126553 0.00399635 0.0459804 -0.0209912 -0.0814969 0.138338 -0.0464245 0.0529505 -0.0320522 0.191602 0.0520677 -0.103763 -0.0438173 0.0419027 0.0606719 -0.0143371 -0.0525566 0.093754 -0.0135384 -0.0851161 -0.0329338 -0.0890348 0.0355786 0.0656701 0.0329308 0.0384254 0.175468 -0.0872003 0.0158607 -0.0294567 0.0183338 -0.0975979 0.107569 0.177489 0.0307721 -0.0258553 -0.0591042 0.0787284 -0.0708359 0.173911 -0.100656 0.0955785 -0.0348097 0.127981 0.0745651 -0.0588594 0.0379582 0.168699 -0.103529 0.036066 0.0700079 -0.0211174 -0.0486053 -0.189729 0.0871299 0.10182 0.0382893 -0.0155109 0.0770939 -0.00165733 -0.0651988 0.047929 0.0207254 -0.0379393 
-0.0292927 0.120305 -0.0984701 -0.0351305 -0.00411252 0.145596 -0.0218178 -0.0803033 -0.174459 0.0517516 -0.0092489 0.0296845 0.0653092 0.0289558 0.00840848 -0.0317399 -0.0193522 0.00989423 0.138465 0.0661296 0.0192296 -0.0572311 0.0394956 0.0542166 -0.0121356 0.139078 -0.0585041 -0.176857 0.140354 0.0573817 0.0216931 0.114827 -0.0454856 -0.0568899 -0.00694101 0.0863598 -0.0301166 0.152858 0.0405685 0.0308464 0.0044411 -0.0206016 -0.0574734 0.0384752 -0.129077 0.0747856 0.238099 -0.0398568 -0.176897 -0.0796854 -0.0183692 0.0767523 0.0140881 0.0037412 0.071885 0.0754639 0.0829451 0.197323 0.0189501 -0.112044 -0.0786696 0.0653158 0.233489 -0.159425 0.1145 0.0407957 0.0937679 -0.0290133 -0.0322878 0.105836 -0.0284558 0.094355 -0.0805047 0.135856 0.106411 -0.0480141 -0.0910908 0.0617289 0.0422708 -0.0278034 -0.0966657 0.126676 -0.0274557 -0.0602289 -0.00867228 -0.0509189 0.0356471 -0.00820713 0.0238164 -0.0567398 0.0669136 -0.0191101 0.0578138 -0.0386663 0.0653195 -0.119809 0.116392 0.194552 0.0643442 -0.0248852 -0.0774449 0.0596919 -0.00650725 0.113289 -0.193443 0.127564 -0.034129 0.0388184 0.0533822 -0.0561284 0.0287364 0.0962931 -0.0686461 -0.0925866 0.0440038 0.0114953 -0.0501546 -0.245396 0.0796657 0.072085 0.0656987 -0.0841711 0.028009 -0.03633 -0.129875 0.115829 -0.0208122 0.0495218 
-0.0432874 0.151263 -0.114501 0.0331717 0.0188782 0.17126 0.0648527 -0.125365 -0.062876 0.0104996 0.000462884 0.0106608 0.0292627 0.00523119 0.0496427 -0.0786356 -0.0808825 -0.0250559 0.082504 -0.0324613 0.00909253 -0.0776542 -0.049818 0.00075815 0.0783824 0.0209639 -0.163845 -0.153372 0.0874535 0.103367 0.116212 0.160328 -0.0779425 -0.0741162 0.0215205 0.107479 -0.0555391 -0.00454804 0.030965 0.00304229 0.117899 -0.0500429 -0.0241481 0.0664332 -0.111082 0.0840858 0.168824 -0.034516 -0.127894 -0.160938 -0.0767326 0.073736 0.0666288 -0.0639728 0.0500033 0.114981 -0.052067 0.197401 0.00401355 -0.0580834 -0.133733 0.0803035 0.193319 -0.158462 0.0986551 0.118684 0.120633 -0.0569329 -0.0554209 0.0733912 0.024499 0.119236 -0.0473229 0.0790058 0.0992418 0.0206469 -0.115677 -0.0356829 -0.0438353 0.0196765 -0.0812422 0.100947 -0.0310415 -0.0311673 -0.0359714 0.0265809 0.0491022 -0.0923118 -0.0615799 -0.0458901 0.090555 -0.0458813 0.0107687 -0.0925302 0.00555256 -0.0970559 0.0715436 0.0854431 0.0762958 0.0151596 -0.0716322 0.0321188 0.0619442 0.0331553 -0.236783 0.162789 -0.0282176 0.117238 0.00702065 0.0105298 0.06326 0.00580203 -0.138142 -0.161409 0.0462593 0.0055824 -0.0656933 -0.156914 0.155214 0.0879813 0.120945 -0.0997304 -0.0117959 0.0305337 -0.073605 0.0988997 -0.00147678 0.0729668 
0.0445147 0.128781 -0.128658 -0.0208123 0.0786738 0.231895 0.0500985 -0.0887067 -0.0959843 -0.016226 0.0488892 0.0403271 0.0522825 -0.0832392 -0.0355017 -0.06004 -0.135631 0.0389584 -0.0403301 0.0746945 0.079684 -0.0762417 0.0788003 0.0557298 0.0349327 -0.0234438 -0.0703848 -0.159022 0.0965307 0.0657283 0.0566726 0.0254422 -0.124076 0.0142235 0.0101693 0.055228 -0.119159 0.0569781 0.0065497 -0.00231245 0.0464424 -0.0798979 -0.0758946 0.13956 -0.188987 -0.0027256 0.152853 0.0627543 -0.148593 0.0460352 -0.030098 0.0891739 -0.0616314 -0.0324928 0.0407179 0.0179466 -0.00706532 0.221077 -0.0246969 -0.0968058 -0.116996 0.0554815 0.320136 -0.128197 0.0737334 -0.0322872 0.0289725 -0.00135047 -0.0948198 0.179873 0.0106874 0.148856 -0.0454412 0.102886 0.0268408 -0.0623864 -0.0786819 0.010633 0.000120753 0.0650832 -0.0664325 0.0404777 0.0012418 -0.0404512 -0.085698 -0.00701918 0.0411544 -0.00174421 0.0255078 0.00745046 0.144363 -0.108059 -0.034649 -0.0649663 0.0100057 -0.15929 0.017612 0.126901 0.0345713 -0.0461771 -0.0184169 0.0683015 -0.0150139 0.0856175 -0.127847 0.131592 -0.0553404 0.153818 0.071136 -0.0286213 0.079944 0.133742 -0.0776716 0.0106309 0.0570031 0.0546003 -0.0331499 -0.080357 0.134964 0.170029 0.0605097 -0.0895278 -0.00122054 0.0422492 -0.103841 0.0621464 0.020496 0.0487546 
0.00142 0.1804 -0.156973 -0.0360258 0.00418773 0.198675 0.0338792 -0.126418 -0.120313 0.0283719 0.0430995 0.0239754 0.0315012 -0.0298968 -0.0498891 -0.0880594 -0.127633 0.00155792 0.0858348 0.0135639 0.0060657 -0.0433969 -0.000976478 0.010903 0.0237683 0.0544245 -0.0192832 -0.112613 0.130987 0.106902 0.0191988 0.00728801 -0.109178 -0.0777629 0.0311528 0.0574722 -0.113848 0.0105205 0.0391666 0.0272427 0.00487392 -0.0872148 -0.0674373 0.166854 -0.155655 0.073249 0.16684 0.0408574 -0.161582 -0.0375989 -0.018048 0.169936 -0.0156815 -0.0457916 0.0347399 0.0500733 -0.0256902 0.221813 -0.0149323 -0.0684693 -0.101757 0.0451213 0.336595 -0.0940314 0.0685223 -0.0190039 0.0680897 -0.0482321 -0.0643163 0.152313 0.00374316 0.111958 -0.0402355 0.0955395 0.0490643 -0.0478946 -0.0911691 0.00643783 -0.0071059 0.0592993 -0.0365893 0.0382208 -0.00706109 -0.0238937 -0.0594556 -0.0567084 0.0161863 -0.0545026 0.0372724 -0.000580949 0.0914433 -0.0601899 -0.00927762 -0.0452466 0.0262171 -0.170123 0.0801786 0.111128 0.086216 -0.0588263 -0.0280157 0.134957 0.0128402 0.0317205 -0.189123 0.143285 -0.0129068 0.132347 0.0441671 -0.00226188 0.140066 0.0621245 -0.0791952 -0.0413051 0.0228606 0.0384624 -0.0150794 -0.100154 0.149882 0.102833 0.0658397 -0.158874 0.00169997 -0.0229025 -0.0948772 0.0998839 0.0317198 0.0660319 
0.095787 0.0268312 -0.128443 -0.0265531 0.0982227 0.163971 0.0437822 -0.0445249 -0.119865 -0.099867 0.00398489 0.0910271 0.0683545 -0.0601105 -0.091218 -0.0914045 -0.101644 -0.00516488 -0.0950835 0.160579 0.0753234 -0.0711757 0.107538 0.0685464 -0.00324912 -0.0149049 -0.0274245 -0.142856 0.0179257 0.0344185 -0.0100898 -0.0161633 -0.12913 0.0405944 -0.0516142 0.013735 -0.152004 0.120912 -0.0796555 -0.0116479 0.0248404 -0.0203424 -0.0920015 0.173288 -0.198474 0.0223725 0.12975 0.0573034 -0.100846 0.126483 -0.000625746 0.0367813 -0.0757395 -0.011093 0.0868081 -0.0630836 -0.0206817 0.222518 0.0359089 -0.125694 -0.0616895 0.0572152 0.266926 -0.0357455 0.0183315 -0.122464 0.0272087 0.0518868 -0.0409736 0.135958 0.0363979 0.126739 0.0231766 0.0922351 -0.0167946 -0.0312632 -0.0837597 -0.00927581 0.0228041 0.125206 -0.0452241 0.00960071 -0.00384783 -0.0719336 -0.0662764 -0.0547291 0.0737797 0.0536922 0.030579 -0.0190959 0.117986 -0.102215 -0.0331279 -0.0699755 -0.0272793 -0.147032 0.0459897 0.0822058 0.0325295 -0.0962035 -0.0291672 0.0993044 0.00709273 0.120116 -0.172032 0.0594578 -0.130669 0.182613 0.0563879 -0.0445238 0.147913 0.180859 -0.103379 0.0602745 0.00503737 0.075588 -0.0592344 -0.0863872 0.0705244 0.146552 -0.0280178 0.000274574 -0.0195846 0.0357801 -0.0906452 0.00891673 -0.00874218 0.000217046 
0.088637 0.0409985 -0.145076 -0.0236857 0.0979006 0.175547 0.0391288 -0.074321 -0.125207 -0.0775012 0.0234788 0.101716 0.0655067 -0.0572297 -0.0985807 -0.0641497 -0.11312 0.0154287 -0.0707282 0.143168 0.0888496 -0.0645664 0.0974769 0.0661889 0.00178409 0.0135971 -0.0141605 -0.16346 0.0307906 0.0683784 -0.0217007 -0.0032339 -0.122215 0.0253974 -0.034603 0.0200978 -0.150805 0.104394 -0.0482601 -0.00360599 0.0112796 -0.0239941 -0.0823305 0.180188 -0.197413 0.0264632 0.159468 0.0394409 -0.124069 0.0958107 0.0108639 0.0403172 -0.0794619 -0.0102144 0.0913371 -0.0383493 -0.0149324 0.236992 0.0174862 -0.107912 -0.063588 0.0359277 0.303143 -0.0530925 0.0477599 -0.119029 0.0131645 0.0494298 -0.0436712 0.15212 0.0347869 0.136362 0.00640777 0.0733038 -0.0141381 -0.0275244 -0.0847143 0.00273241 0.00178815 0.103677 -0.0404403 0.0286403 -0.00552837 -0.063872 -0.0943839 -0.0485287 0.074078 0.0313068 0.0233824 -0.0159367 0.104978 -0.108023 -0.0518854 -0.0584293 -0.0166766 -0.139831 0.0402368 0.0953402 0.0518754 -0.0835256 -0.0318371 0.0911679 0.00073321 0.112158 -0.170543 0.0739051 -0.118525 0.174952 0.0393938 -0.0512704 0.134726 0.164041 -0.0900049 0.0419961 0.0239473 0.0811638 -0.064279 -0.0909327 0.0713408 0.144788 -0.00619422 -0.0175954 -0.00424367 0.0237812 -0.0899859 0.0413068 -0.0021108 0.0111463 
0.0622769 0.0499162 -0.147248 -0.0245864 0.101475 0.180648 0.04308 -0.0963746 -0.129016 -0.0502392 0.0211111 0.0985717 0.0598407 -0.0422506 -0.0927872 -0.0632664 -0.123207 0.0413295 -0.0240515 0.125101 0.093507 -0.073687 0.0786912 0.0612999 0.0051576 0.0303456 -0.0302681 -0.1784 0.0556119 0.0923854 -0.0154434 -0.000398134 -0.125012 -0.0132825 0.0049127 0.0378023 -0.154749 0.0808495 -0.026121 -0.0205943 0.00632685 -0.0227107 -0.0806313 0.18584 -0.19876 0.0389562 0.172514 0.0387551 -0.138291 0.047329 -0.0134936 0.0435284 -0.0603839 -0.0266195 0.0905725 -0.00861198 -0.0167852 0.256093 -0.00505146 -0.0930191 -0.0564965 0.0409853 0.332345 -0.0651877 0.0827976 -0.101333 0.00746759 0.0312389 -0.0464399 0.154161 0.0337353 0.146859 -0.00495529 0.0520774 -0.0267292 -0.0234648 -0.086257 0.0129034 0.0111239 0.0708296 -0.0465422 0.047952 -0.0219686 -0.0554988 -0.0999275 -0.059934 0.0668324 0.0288827 0.0307271 -0.011973 0.112854 -0.0885992 -0.0443965 -0.05296 -0.00566773 -0.148476 0.0401193 0.111079 0.0643032 -0.0690195 -0.0231456 0.0884484 -0.00662158 0.0736237 -0.171065 0.101093 -0.0853137 0.149985 0.040666 -0.0298727 0.127897 0.132474 -0.0843736 0.0135806 0.033209 0.0856656 -0.0604063 -0.0983514 0.0704869 0.133867 8.21172e-05 -0.0495604 -0.00972902 0.0115529 -0.109473 0.0771754 -0.0064781 0.0166028 
0.024729 0.12668 -0.144706 -0.0174946 0.0619453 0.187711 0.0477071 -0.127224 -0.139867 0.0101501 0.0281086 0.0655084 0.0389184 -0.0554729 -0.0651513 -0.0630571 -0.110473 0.0461884 0.0543971 0.071517 0.0541034 -0.0669769 0.0291035 0.0405566 0.0206778 0.0668666 -0.0440463 -0.16708 0.111623 0.112769 0.00401283 0.0340223 -0.111391 -0.0481331 0.0442142 0.0426351 -0.121132 0.0486381 0.0247086 -0.0243419 0.0109767 -0.0656354 -0.0508333 0.177246 -0.180731 0.0669758 0.195439 0.0354597 -0.173503 -0.0210151 -0.00938831 0.0994978 -0.0276358 -0.0494877 0.0738981 0.0311142 -0.0176286 0.233366 -0.0169347 -0.0813716 -0.0746454 0.0323154 0.33802 -0.0952397 0.108 -0.0562981 0.0250138 -0.0301075 -0.0695153 0.152495 0.00416803 0.127361 -0.039401 0.0716906 0.00192135 -0.0443574 -0.0848233 0.0348671 0.011616 0.0485965 -0.055996 0.0646105 -0.0218428 -0.0386436 -0.0692378 -0.0803139 0.0353022 -0.01032 0.0388121 0.00394035 0.104251 -0.0550784 -0.032102 -0.050786 0.0171087 -0.154143 0.0758029 0.131465 0.0740882 -0.0694243 -0.0263514 0.1141 0.00217999 0.0514925 -0.176835 0.121383 -0.0241703 0.140348 0.0622577 -0.00929082 0.117161 0.0916765 -0.0901723 -0.032789 0.0481996 0.0438398 -0.0427047 -0.129524 0.107481 0.120468 0.0435015 -0.101091 0.00108423 -0.00723082 -0.10442 0.099257 0.0261108 0.031291 
-0.00499731 0.146388 -0.147128 -0.0102912 0.0140152 0.177436 0.0552136 -0.140718 -0.10673 0.0215403 0.0406075 0.0605929 0.0358022 -0.0359087 -0.0744439 -0.078269 -0.129215 0.0199589 0.0750802 0.0365937 0.0412626 -0.0724356 -0.0206213 0.045582 0.0179908 0.0754583 -0.0513265 -0.152254 0.127664 0.139737 0.0116599 0.0480842 -0.109286 -0.0746675 0.0373526 0.0525406 -0.119729 0.0335519 0.0382501 0.000763679 0.0123424 -0.0798818 -0.0642532 0.160472 -0.142453 0.0593381 0.182146 0.0183929 -0.161171 -0.0661568 -0.0243843 0.133861 -0.00022441 -0.0510111 0.0724899 0.0665863 -0.0323926 0.238985 -0.0305608 -0.0676439 -0.0829547 0.0335865 0.338572 -0.0954564 0.0897043 -0.0181467 0.0632121 -0.05922 -0.0701267 0.13018 -0.00261628 0.109917 -0.0473863 0.0873751 0.0303232 -0.0382791 -0.0801925 0.0147608 0.000393138 0.0522384 -0.0537257 0.0612383 -0.0236894 -0.0349436 -0.0627494 -0.0667504 0.0350641 -0.0447833 0.034419 -0.0106921 0.0893584 -0.0631369 -0.00323995 -0.0382996 0.0152056 -0.154731 0.0748634 0.0998879 0.106897 -0.0466874 -0.0189831 0.112593 0.000238037 0.0446259 -0.183443 0.140004 -0.00853801 0.126051 0.0390034 -0.00479386 0.113945 0.0642621 -0.100799 -0.0666157 0.0397752 0.054764 -0.0297476 -0.122532 0.13305 0.10444 0.054204 -0.131195 -0.00890801 -0.0227588 -0.109672 0.129026 0.0182174 0.0481794 
-0.00458305 0.151613 -0.14141 -0.00701611 0.0164134 0.171688 0.0567636 -0.149419 -0.110743 0.0215409 0.0366599 0.0573252 0.0303341 -0.03382 -0.0660934 -0.0790334 -0.124353 0.0189746 0.0843136 0.0360239 0.0330247 -0.0660646 -0.0226118 0.0335168 0.0196165 0.0814887 -0.0592577 -0.150825 0.13073 0.140776 0.0113469 0.0592626 -0.10655 -0.0777946 0.0474565 0.0514221 -0.108411 0.0370462 0.0498118 -0.00592486 0.0142622 -0.0781475 -0.0591784 0.151148 -0.144633 0.0728548 0.184462 0.0168205 -0.161701 -0.0714909 -0.0287154 0.141213 0.00704928 -0.0485361 0.0735182 0.0621843 -0.0276381 0.231369 -0.0363482 -0.0645592 -0.0816303 0.0337265 0.333017 -0.097411 0.0935207 -0.0107457 0.066243 -0.0615288 -0.0690891 0.127581 -0.0016785 0.106814 -0.0481519 0.0938208 0.031406 -0.0401982 -0.0821448 0.00968564 0.00400227 0.0503101 -0.0512486 0.0690727 -0.0256415 -0.0338484 -0.051493 -0.0744955 0.0290826 -0.0436171 0.0316765 -0.00734208 0.0952453 -0.0558131 0.000241228 -0.0363502 0.0144434 -0.158607 0.0822001 0.103763 0.108171 -0.0501107 -0.0226048 0.11529 0.00319977 0.0431399 -0.185033 0.14052 0.00207585 0.126995 0.0484819 0.00265122 0.115083 0.0584727 -0.106199 -0.0680116 0.0409115 0.046515 -0.029951 -0.130079 0.132167 0.0989388 0.0588874 -0.127118 -0.00529046 -0.0229118 -0.104011 0.12549 0.0276213 0.0457089 
0.0179288 0.148801 -0.130329 -0.0139654 0.0273269 0.183583 0.0507463 -0.138046 -0.1331 0.00322131 0.0326223 0.0582325 0.0195121 -0.0549347 -0.0627118 -0.0823123 -0.12036 0.0101681 0.0822058 0.0463728 0.0311121 -0.0486697 -0.009988 0.022977 0.0220777 0.0891209 -0.0455826 -0.145705 0.125308 0.117107 0.00834722 0.0390725 -0.115216 -0.0568981 0.0498226 0.038849 -0.0997935 0.0404123 0.0635345 -0.009419 0.0194927 -0.0780359 -0.0522184 0.151243 -0.156623 0.0710236 0.186412 0.0193054 -0.167781 -0.039654 -0.0233325 0.144051 -0.00430911 -0.0327093 0.0726586 0.033259 -0.0169722 0.225343 -0.0424468 -0.075936 -0.0777561 0.0340609 0.339804 -0.0974295 0.0890213 -0.0232177 0.062396 -0.0563589 -0.0656231 0.135499 -0.00652003 0.108992 -0.0452192 0.108099 0.03082 -0.054606 -0.0821364 0.0101907 0.0128451 0.0693234 -0.0493115 0.0661333 -0.00379476 -0.035282 -0.0418318 -0.0909007 0.0304463 -0.0250182 0.0364473 -0.000369745 0.11128 -0.0560515 -0.00598448 -0.029581 0.011713 -0.168583 0.0943359 0.112429 0.0900371 -0.0650826 -0.0350322 0.12748 -0.00319984 0.0570888 -0.17829 0.132692 0.00670193 0.141914 0.0526325 -0.00067301 0.129781 0.069722 -0.105522 -0.0408097 0.0461339 0.0362444 -0.0307918 -0.12949 0.127787 0.0994727 0.059594 -0.11591 0.00941389 -0.0268058 -0.0924658 0.104543 0.0464009 0.0405422 
0.00826856 0.153583 -0.128859 -0.0153291 0.00248396 0.191732 0.054356 -0.130569 -0.113655 0.0293925 0.0472079 0.0483593 0.0329709 -0.0598428 -0.0698528 -0.0920809 -0.1403 0.00905288 0.0709989 0.0377645 0.0324092 -0.0677037 -0.0288745 0.0538711 0.0178443 0.0733541 -0.0482074 -0.140267 0.13189 0.11876 0.00964149 0.0176959 -0.133881 -0.0667239 0.0402126 0.0406468 -0.120076 0.0267257 0.0531169 0.00399065 0.0152044 -0.0965052 -0.0750414 0.154341 -0.137215 0.0409081 0.169444 0.0394523 -0.155995 -0.0459348 -0.0168241 0.151668 -0.00370502 -0.043964 0.0654913 0.0457294 -0.0324456 0.228053 -0.031158 -0.0860448 -0.0799249 0.0398801 0.340118 -0.0842409 0.063271 -0.0102083 0.0766325 -0.0654899 -0.0682755 0.119405 -0.0125404 0.113345 -0.0404923 0.107587 0.0401965 -0.059107 -0.0832575 0.0135296 0.0236695 0.0858888 -0.038192 0.0481009 -0.00426531 -0.0380351 -0.0463497 -0.0755608 0.0336633 -0.0312042 0.051988 -0.00901096 0.0975184 -0.0561872 0.0137881 -0.0242497 -0.00849162 -0.177981 0.0819333 0.0894268 0.0992181 -0.0618986 -0.00591269 0.126646 -0.00506768 0.0435228 -0.171566 0.141248 0.00363917 0.131693 0.0457928 0.00720556 0.133607 0.0772983 -0.0936361 -0.0516993 0.0348182 0.0544234 -0.0369552 -0.0973933 0.123218 0.0924782 0.0470509 -0.145805 -0.0042584 -0.0302033 -0.111004 0.125605 0.0231782 0.0493808 
-0.0132254 0.150251 -0.126319 -0.0194458 0.00110387 0.186974 0.0732522 -0.114113 -0.104294 0.0500747 0.0320222 0.0245536 0.0229731 -0.0357375 -0.0193079 -0.106668 -0.143176 -0.0131141 0.101415 0.00028691 0.0080513 -0.0792892 -0.0508311 0.0551625 0.0435257 0.0484523 -0.0567401 -0.129313 0.121843 0.107878 0.0365304 -0.00984333 -0.13224 -0.0908613 0.0411074 0.0672099 -0.127022 -0.0199888 0.0312489 0.00695426 0.0275084 -0.0901733 -0.0651041 0.161199 -0.120383 0.0639636 0.156633 0.0416601 -0.14459 -0.0792637 -0.0391791 0.122959 0.01468 -0.0785301 0.0684152 0.0780094 -0.0780625 0.255372 -0.0202804 -0.0690709 -0.0895523 0.0534259 0.315497 -0.0859736 0.0704196 0.0342029 0.0772477 -0.0682499 -0.0698282 0.0958005 0.00212817 0.136535 -0.039708 0.0840532 0.0535979 -0.0328035 -0.0864287 0.0112117 0.0301408 0.0694642 -0.036847 0.0333258 -0.0279074 -0.0395261 -0.0570809 -0.0654438 0.029493 -0.0509732 0.0458541 -0.00842793 0.0912612 -0.0359242 0.0158694 -0.047689 0.00107922 -0.149405 0.0812064 0.0588108 0.106762 -0.0458372 -0.0213809 0.105161 0.0166343 -0.018727 -0.216446 0.162764 -0.0133595 0.101708 0.0302752 0.0167704 0.155444 0.0611398 -0.0794535 -0.0948295 0.0387304 0.0588992 -0.0279521 -0.0819762 0.124492 0.0866695 0.0603146 -0.169997 -0.016138 -0.0082508 -0.12101 0.134345 0.00822029 0.0479856 
0.00129544 0.150796 -0.125431 -0.0255954 -0.00571165 0.188739 0.0651079 -0.0955974 -0.112636 0.0479923 0.0493876 0.0217165 0.0261962 -0.0505626 -0.0308221 -0.0974443 -0.147724 -0.018814 0.0938955 0.00520241 0.0255035 -0.0821297 -0.0414433 0.0569327 0.0470419 0.0552772 -0.0317422 -0.130592 0.13389 0.0971645 0.0299534 -0.0260247 -0.134776 -0.0786489 0.0270337 0.0519354 -0.131601 -0.00481421 0.0400641 0.0124016 0.0207855 -0.0994424 -0.0705522 0.171501 -0.120419 0.0434713 0.157408 0.0383226 -0.151418 -0.0701553 -0.0305569 0.135117 -0.00397531 -0.0665399 0.0621991 0.0671854 -0.0646348 0.249475 -0.0190973 -0.0848311 -0.0887767 0.0340932 0.326714 -0.0746061 0.0592775 0.0258981 0.0753696 -0.0678311 -0.0564873 0.0993999 -0.0110605 0.134281 -0.0434695 0.087445 0.0602784 -0.0536425 -0.0819706 0.0244135 0.0268096 0.0906642 -0.0412482 0.0224096 -0.0097364 -0.0429246 -0.0565464 -0.0634468 0.0352832 -0.0395321 0.057001 -0.0164351 0.0936838 -0.0416856 0.00184045 -0.0394497 -0.00167633 -0.160721 0.0804486 0.0676109 0.101821 -0.0548012 -0.0242265 0.10698 0.0149727 0.00159086 -0.202142 0.157421 -0.0111903 0.118483 0.0424686 -0.0100323 0.150511 0.076801 -0.0839314 -0.0776184 0.0519179 0.0605163 -0.0294362 -0.0815338 0.129314 0.0881756 0.0531374 -0.163297 -0.0131074 -0.0107535 -0.117513 0.12679 0.0189276 0.0565522 
-0.0139748 0.14347 -0.143795 -0.0182004 0.0131351 0.182304 0.077063 -0.115836 -0.101814 0.0670516 0.0238388 0.004538 0.0401048 -0.0263472 -0.00195118 -0.0867341 -0.133054 -0.00546929 0.099445 0.00143623 0.0200442 -0.0948549 -0.048316 0.0718427 0.0545053 0.031335 -0.0707799 -0.139988 0.124043 0.119899 0.042862 -0.00049069 -0.131827 -0.0930035 0.0427828 0.0766391 -0.121015 -0.0372917 0.014058 -0.0185419 0.0277179 -0.090926 -0.0393044 0.179724 -0.114345 0.0628674 0.163079 0.0671865 -0.132322 -0.0888721 -0.037809 0.0843161 0.021062 -0.0938244 0.0834296 0.0874516 -0.0880359 0.253999 0.0181137 -0.08546 -0.0880123 0.0574169 0.295879 -0.0768466 0.0644278 0.0485996 0.0617519 -0.0699126 -0.0598823 0.0698982 -0.0105946 0.143409 -0.0392338 0.0529122 0.0495871 -0.0287964 -0.0811424 0.0307031 0.0346578 0.0614776 -0.00802452 0.0315233 -0.0498019 -0.0461977 -0.0545055 -0.0494843 0.0178928 -0.0516149 0.0466225 -0.000183392 0.091102 -0.0204939 -0.00282047 -0.0717697 -0.0101072 -0.125882 0.0663482 0.0737673 0.107988 -0.0467923 -0.000980385 0.0922113 0.0425933 -0.04091 -0.23585 0.159367 -0.0356256 0.0948705 0.0346483 0.0307363 0.156208 0.0672482 -0.0747849 -0.113283 0.0327382 0.0659766 -0.0254633 -0.0780106 0.0995715 0.0822543 0.0588708 -0.168465 -0.0103834 0.00562743 -0.155983 0.132725 -0.0143977 0.0441164 
-0.0127294 0.140197 -0.13248 -0.023601 0.00766578 0.177362 0.0779627 -0.101599 -0.117035 0.0427984 0.0169311 0.0078163 0.0387324 -0.0107419 -0.00636834 -0.0968672 -0.141184 -0.0306749 0.100806 0.00544928 0.0210685 -0.105503 -0.0290524 0.036033 0.0573304 0.039298 -0.0717323 -0.132883 0.119379 0.0981364 0.0441586 -0.00106344 -0.132602 -0.0924993 0.0290422 0.0671823 -0.127193 0.000621707 0.0253564 -0.0128565 0.0267862 -0.0807532 -0.0487186 0.158335 -0.121048 0.0622754 0.15823 0.039431 -0.141068 -0.0800647 -0.061234 0.0946103 0.0180319 -0.0707728 0.0741161 0.0710342 -0.0735138 0.263957 -0.00252605 -0.0909886 -0.0879216 0.0622313 0.30523 -0.0845102 0.0697951 0.0714661 0.0672369 -0.0539694 -0.0586481 0.0739695 -0.00465649 0.14836 -0.0379218 0.0791942 0.060665 -0.0297755 -0.078992 -0.00498001 0.0370271 0.0707014 -0.0383803 0.0154104 -0.0381157 -0.0497926 -0.0594458 -0.0616313 0.0244277 -0.0393156 0.0530908 -0.021231 0.10273 -0.0305612 0.0105705 -0.0660018 0.000608446 -0.140452 0.0802591 0.0874805 0.100651 -0.040375 -0.0314756 0.0869348 0.0312716 -0.0178038 -0.235286 0.169935 -0.0313648 0.115947 0.0448186 -0.00221601 0.150278 0.0726582 -0.0868299 -0.0987947 0.0507874 0.0645795 -0.0224007 -0.0752246 0.124104 0.0903621 0.0508096 -0.160023 -0.0115527 0.00205345 -0.138208 0.122617 0.00166005 0.0522364 
-0.0186728 0.13256 -0.191579 -0.00755257 0.0180357 0.17117 0.0736616 -0.101298 -0.087688 0.0310531 0.029703 0.0179795 0.0588144 0.0357447 -0.0500328 -0.0670709 -0.123699 -0.0113216 0.0844794 -0.00547891 0.0659762 -0.152814 -0.0228668 0.000792136 0.0756188 0.0183943 -0.0753612 -0.135061 0.0876179 0.135447 0.0392604 0.0394873 -0.0966329 -0.0961084 -0.00404626 0.0773944 -0.134097 -0.00329694 0.015867 -0.0299465 0.02368 -0.061354 -0.00525718 0.163672 -0.11432 0.0277571 0.164551 -0.00130178 -0.136231 -0.104272 -0.0680288 0.063114 0.00658685 -0.0516921 0.078013 0.101606 -0.0717058 0.257564 0.0118748 -0.0965033 -0.0880799 0.0432401 0.309141 -0.105587 0.0796488 0.0886257 0.0361765 -0.0234827 -0.0423478 0.0812502 0.0173073 0.144112 -0.0430975 0.0237893 0.0473648 0.00865552 -0.0591974 -0.0174667 -0.0244934 0.0181737 -0.0795506 0.0263027 -0.0386008 -0.0361722 -0.109661 0.00483603 0.0292591 -0.0570593 0.0569932 -0.042082 0.0729921 -0.0776481 -0.0236618 -0.0918477 0.0296276 -0.117513 0.0485285 0.110153 0.0892048 -0.00593227 -0.0393342 0.0583238 0.0585748 -0.00303127 -0.232814 0.179869 -0.0622978 0.126631 -0.00115569 -0.0385286 0.0946134 0.0366588 -0.0916652 -0.10486 0.0673803 0.060675 -0.0104053 -0.080005 0.153711 0.094815 0.0553505 -0.145693 -0.000188273 0.00618811 -0.127099 0.120243 0.00118066 0.080015 
-0.0382977 0.127303 -0.200201 -0.00872037 0.0115502 0.137388 0.056421 -0.0814028 -0.093511 0.0548668 0.0298306 0.0136029 0.0842513 0.060128 -0.0469384 -0.0419809 -0.0843699 -0.0153841 0.0895671 0.0119999 0.0680143 -0.179095 -0.00569297 -0.00853415 0.0727593 0.0426878 -0.0717266 -0.14967 0.101641 0.125617 0.0500662 0.0760804 -0.0680655 -0.106373 -0.0345508 0.0811857 -0.124171 0.0552113 0.00735269 -0.0255402 0.0118529 -0.0456142 -0.0115916 0.154246 -0.109158 0.0193552 0.176796 -0.0250412 -0.133177 -0.142921 -0.0671 0.0448557 -0.000233006 -0.0574378 0.0681709 0.112035 -0.0593165 0.250434 0.0397138 -0.107742 -0.0918071 0.0162963 0.283913 -0.113757 0.099758 0.0942166 0.038896 -0.00896389 -0.0215329 0.0605155 0.00975835 0.143434 -0.0462155 0.0150477 0.0519238 0.00346362 -0.0561373 0.0116169 -0.0330133 -0.00252591 -0.110428 0.0273593 -0.0519617 -0.0423051 -0.10128 -0.00155464 0.0389508 -0.0430817 0.0665401 -0.0859579 0.0414366 -0.0679921 -0.0179015 -0.094786 0.0522676 -0.109324 0.0597825 0.127841 0.0821189 0.00269114 -0.0709319 0.0340813 0.0594119 0.0253831 -0.240317 0.170164 -0.0746968 0.116658 0.0265239 -0.0723427 0.0506626 0.0500579 -0.102648 -0.106648 0.0763214 0.0400987 -0.0294349 -0.1181 0.146103 0.0861683 0.0369664 -0.111591 -0.00865911 0.0141832 -0.125425 0.113167 -0.0275487 0.0790068 
-0.0264311 0.120257 -0.221499 0.0131379 0.022687 0.136105 0.0637227 -0.135688 -0.0815307 0.062352 0.0256539 0.0156803 0.0635776 0.0481037 -0.037364 -0.041594 -0.0962932 -0.00352474 0.124203 0.0181132 0.0437909 -0.158222 0.00897315 0.00589819 0.0666504 0.0308972 -0.0733198 -0.175201 0.0875772 0.156904 0.0290339 0.0526229 -0.0555536 -0.136921 0.00756912 0.0858166 -0.120097 0.0306417 -0.00385333 -0.0336873 -0.0111887 -0.0356579 -0.0304275 0.156762 -0.132228 0.078233 0.176205 -0.00452014 -0.107494 -0.122535 -0.0526668 0.0618779 0.0340153 -0.0723186 0.0869988 0.0997392 -0.0286265 0.233971 0.0381536 -0.0746796 -0.0854848 0.0267769 0.289044 -0.108951 0.114059 0.0539225 0.0280251 -0.0127428 -0.0255882 0.0629724 0.0267189 0.153302 -0.0489603 -0.000439533 0.0462153 0.0287904 -0.0752673 0.0129925 -0.0290439 0.0106344 -0.0736588 0.0303916 -0.0771638 -0.0312598 -0.0884075 0.00327981 0.0064416 -0.0610896 0.0383809 -0.0704136 0.0351916 -0.0352494 -0.013564 -0.10265 0.0341397 -0.124316 0.0599231 0.123328 0.114886 -0.0162411 -0.0179962 0.0508289 0.0770718 -0.0292987 -0.246625 0.155736 -0.0476224 0.0964905 0.0287129 -0.00549196 0.0795319 0.035405 -0.0593624 -0.13894 0.0447215 0.0777809 -0.0349769 -0.0944695 0.106675 0.0895879 0.0320539 -0.131763 -0.00984171 0.00815257 -0.140847 0.142276 -0.0216752 0.0875753 
-0.0545309 0.128552 -0.199326 -0.0281287 0.0086109 0.13252 0.00659856 -0.123189 -0.0769233 0.0583189 0.0328993 -0.000786477 0.0307544 0.0074526 0.0137506 -0.042906 -0.111974 -0.0280724 0.172281 -0.00227677 -0.000686398 -0.0773026 0.020269 -0.0112425 0.0421632 0.0851678 -0.0058585 -0.200001 0.0939765 0.104018 0.0611575 -0.00633491 -0.0181935 -0.138642 0.0470015 0.109741 -0.0603414 0.0189496 0.0154564 0.021948 0.00594688 -0.0381856 -0.0549111 0.190518 -0.148725 0.122642 0.206932 -0.00856095 -0.115273 -0.126308 -0.0804927 0.0440301 0.0355355 -0.0654549 0.0542712 0.112865 -0.0147091 0.205931 0.0217076 -0.052539 -0.100941 0.00179531 0.286869 -0.0939496 0.134656 -0.0063123 0.0653575 -0.0313454 0.0343065 0.0801811 0.00989097 0.123983 -0.0557863 -0.00957954 0.0797483 -0.00842839 -0.139072 0.0745673 -0.0376198 0.0129463 -0.0651764 0.0669926 -0.0797439 -0.00534924 -0.074338 -0.00152102 0.0178672 -0.0652894 -0.00592282 -0.0715351 0.0570081 -0.0110319 -0.0177929 -0.107038 0.0483552 -0.124945 0.0558615 0.128351 0.109417 -0.0242446 -0.0796692 0.0390437 0.065603 -0.0624602 -0.225058 0.128976 -0.0273686 0.0722543 0.0122742 0.0183758 0.0846432 0.0167865 -0.0474144 -0.15172 0.0219775 0.0618448 -0.0428128 -0.164402 0.0971164 0.0582381 0.0789827 -0.11323 -0.0138716 0.0231272 -0.125619 0.106216 -0.0212242 0.110192 
-0.0234529 0.112722 -0.143015 -0.0165857 0.027036 0.227487 0.0455187 -0.14965 -0.0875961 0.0305583 0.0185984 0.029173 0.0267794 -0.0467967 0.00241116 -0.0714783 -0.152493 0.0185498 0.0966273 -0.01171 0.021154 -0.0551497 -0.0389821 0.0778952 0.0384637 0.046232 -0.0764512 -0.185708 0.0673557 0.111857 0.0503979 0.0237731 -0.120316 -0.0826206 0.0623067 0.105025 -0.103624 -0.0823994 0.0251261 0.00482331 0.0665 -0.0852987 -0.033778 0.142418 -0.118032 0.0713784 0.183455 0.0366307 -0.156046 -0.0848942 -0.0437972 0.0113255 0.0558053 -0.0717405 0.0687696 0.111958 -0.0577559 0.242353 0.0023122 -0.0597146 -0.0831562 0.106401 0.287749 -0.112676 0.0947761 0.0433016 0.0660676 -0.0567725 -0.0486566 0.0846794 -0.0034189 0.126009 -0.049851 0.0273406 0.0632848 0.00570043 -0.113699 0.0119526 0.00119654 0.0288029 -0.0113218 0.0815978 -0.0562173 -0.0341397 -0.0987352 0.019724 0.0376385 -0.0826769 -0.0330856 0.00688183 0.103716 -0.0381868 0.00124478 -0.0635654 -0.0225843 -0.081208 0.0379356 0.0835186 0.108247 -0.0117086 0.00167354 0.0494947 0.0233409 -0.0420492 -0.195407 0.143988 -0.0397544 0.080918 -0.0716126 0.0580151 0.12702 0.0322325 -0.0368114 -0.154158 0.0128225 0.0705077 -0.0755117 -0.0858485 0.0873669 0.0760374 0.100293 -0.17526 0.00508748 -0.00769645 -0.145781 0.149891 -0.0460988 0.0519704 
-0.0688009 0.0713884 -0.147049 0.0487567 0.0505111 0.139972 0.0142946 -0.179064 -0.0644719 0.0263354 0.0278271 0.0664951 0.0356356 -0.0349572 -0.0657575 -0.0110703 -0.138567 0.0674001 0.108989 0.0645169 0.0947243 -0.146713 0.0201961 0.0577163 0.0497415 0.0567418 -0.103192 -0.247103 0.0683922 0.152451 0.0508308 0.0505755 -0.0264298 -0.115485 0.080235 0.104874 -0.113283 -0.00473669 0.00198913 -0.0709877 0.02659 -0.0592207 -0.0154547 0.153264 -0.139957 0.0560714 0.222411 -0.00956145 -0.125736 -0.112888 -0.0658951 -0.0172544 0.066544 -0.0695791 0.109014 0.10954 0.000925551 0.173686 -0.00187751 -0.0646147 -0.0629476 0.0434008 0.274723 -0.0865052 0.163319 -0.00435793 0.00613394 -0.0604232 -0.0333392 0.073251 0.00668817 0.122144 -0.0595146 -0.0324944 0.0322248 0.0208791 -0.10544 0.0619397 -0.018434 0.0180285 -0.0770198 0.0856338 -0.0820976 0.00272067 -0.103476 0.0313677 0.0179988 -0.0230662 -0.0195932 -0.0430087 0.0603395 -0.00639393 -0.0142786 -0.0741839 -0.0174392 -0.0999295 0.000256105 0.153204 0.0985292 -0.0202923 0.0188216 0.0129522 0.0320749 -0.0617969 -0.131431 0.142164 0.00711762 0.0877576 0.0090698 0.0492961 0.00653669 0.011161 -0.0459875 -0.16799 0.0329067 0.0886932 -0.0703152 -0.109867 0.0576568 0.100746 0.0444786 -0.108106 -0.0318695 -0.0192707 -0.165768 0.187885 -0.0194285 0.0913608 
-0.0707682 0.0639652 -0.162281 0.0574197 0.0408414 0.106937 -0.0136488 -0.197392 -0.0518754 0.0396415 0.045007 0.0843632 0.0505531 -0.0138969 -0.0812644 0.00630896 -0.104263 0.0705868 0.113834 0.0890676 0.0894403 -0.141907 0.0285359 0.0809439 0.038031 0.0886356 -0.0681628 -0.253682 0.0691484 0.175522 0.0458705 0.0701619 0.000330681 -0.121 0.0684562 0.113989 -0.104172 0.0366491 0.00015455 -0.0579277 -0.00690436 -0.0439013 -0.0404246 0.159932 -0.133141 0.057171 0.230252 -0.0151792 -0.104104 -0.128037 -0.037208 -6.65447e-05 0.0636152 -0.0723146 0.11689 0.112165 0.00419976 0.169167 0.0144585 -0.0618249 -0.0688469 -0.00182134 0.274202 -0.0846656 0.166002 -0.0427937 0.0133398 -0.0460744 -0.0241716 0.0771002 0.00684109 0.111342 -0.0670986 -0.0489257 0.0250604 0.0162171 -0.104471 0.0921684 -0.0300254 0.0261393 -0.0761334 0.0893949 -0.088639 -0.00761574 -0.0974638 0.00798036 0.0211983 -0.0249232 -0.0159531 -0.0648948 0.018851 -0.00582704 -0.00437676 -0.0585079 -0.00705409 -0.101944 0.00531531 0.141198 0.115161 -0.0338276 0.0150416 0.0217584 0.0238515 -0.0380206 -0.130683 0.123848 -0.00149759 0.0631695 0.028859 0.0373127 -0.0139062 0.0227901 -0.0526088 -0.152606 0.0253318 0.0904332 -0.0802756 -0.138592 0.0381273 0.097479 0.0328825 -0.0858809 -0.0369081 -0.0202108 -0.156654 0.188667 -0.0277401 0.0910013 
-0.0502403 0.0735956 -0.128423 0.0674282 0.0591233 0.102142 0.0251744 -0.18892 -0.0765177 0.0633923 0.00875562 0.0595475 0.068918 -0.0366999 -0.0421172 0.0133506 -0.0911459 0.0771473 0.0736812 0.105434 0.0966109 -0.169759 0.0605754 0.0585547 0.0384976 0.0841049 -0.137763 -0.274197 0.0697383 0.149218 0.0378825 0.146122 -0.0306049 -0.077264 0.0897054 0.0785006 -0.0695004 0.121259 0.0149508 -0.113025 0.00889053 -0.0647689 -0.020882 0.117994 -0.147349 0.0690424 0.227463 0.0120515 -0.11944 -0.109573 -0.0197823 -0.000714139 0.0510123 -0.0565078 0.140347 0.0634714 0.0385049 0.131064 0.0244254 -0.108856 -0.0517465 -0.00368576 0.225521 -0.0996311 0.18301 -0.0104966 0.00163874 -0.017197 -0.0303233 0.0742946 -0.0139939 0.128891 -0.0697472 -0.000963745 0.0115088 -0.0128564 -0.103225 0.0893004 0.0174111 0.035899 -0.0854039 0.0853427 -0.0918539 -0.0325767 -0.076012 -0.0354706 0.024334 0.017768 0.0152245 -0.0530298 0.0403182 0.00326401 0.0154849 -0.0855746 -0.0458466 -0.115346 0.0410258 0.174963 0.102821 -0.0557045 0.0333022 0.0272815 0.0236653 0.0149438 -0.107024 0.0838172 -0.0102741 0.108204 0.0988585 0.0402818 -0.037749 0.0758636 -0.0890697 -0.138708 0.0647183 0.0637864 -0.0936672 -0.162826 0.0250077 0.107749 0.0399937 -0.0354188 -0.0083233 0.0116488 -0.139321 0.14276 -0.00872773 0.0597009 
-0.0385894 0.0773962 -0.14891 0.0537513 0.0824816 0.059845 0.0339094 -0.207175 -0.0871938 0.0680333 0.00294017 0.0790959 0.0849981 -0.00269737 -0.0500268 0.00937192 -0.0565333 0.0718843 0.0839523 0.120862 0.0891411 -0.13019 0.023513 0.0406514 0.0269094 0.104991 -0.144159 -0.248877 0.0732194 0.20447 -0.00357127 0.150848 -0.0255986 -0.0967559 0.0974212 0.0665279 -0.0478133 0.120567 0.032987 -0.104538 -0.00675087 -0.0214288 0.00158222 0.120288 -0.145407 0.116185 0.235393 -2.45065e-05 -0.0941459 -0.130506 0.00503536 0.0171459 0.0360998 -0.046586 0.158023 0.0505808 0.023637 0.129091 0.024397 -0.0835669 -0.0287141 -0.0330661 0.20475 -0.0752671 0.164427 -0.0608013 0.00839247 0.00516479 0.000197906 0.0286038 0.0322218 0.126338 -0.053422 -0.0298191 -0.00267612 0.0355284 -0.115896 0.0927728 0.016348 0.0359271 -0.0517751 0.109688 -0.0802261 0.00237062 -0.0548507 -0.0442982 0.0351868 0.0101314 0.0171994 -0.0665895 -0.00332715 0.0031679 0.01418 -0.0745363 -0.0673478 -0.135575 0.0576919 0.15162 0.109901 -0.0720791 0.026573 0.0582466 0.049822 0.0295301 -0.160914 0.0713871 -0.0252454 0.122406 0.0891931 0.0662265 -0.0107088 0.0259437 -0.130212 -0.11811 0.0242771 0.070749 -0.109812 -0.174528 -0.0309393 0.0760139 0.0170175 -0.00465307 -0.00564004 0.00822107 -0.132291 0.135131 -0.0288687 0.0462742 
-0.0775282 0.0901032 -0.153896 0.0588597 0.0492596 0.0757435 -0.00653534 -0.214832 -0.0561604 0.028822 0.0255291 0.0597255 0.0749297 0.00149173 -0.105504 0.0203849 -0.0827601 0.0736947 0.092259 0.0944716 0.132968 -0.158709 -0.0103818 0.0165157 0.0454045 0.101035 -0.150013 -0.233413 0.0918597 0.206464 0.0330507 0.134805 -0.0145093 -0.126963 0.0967189 0.0884808 -0.0705419 0.0689127 0.055506 -0.114051 -0.00900454 -0.0304349 0.0196126 0.123755 -0.0887012 0.0609699 0.244035 -0.020475 -0.112333 -0.170307 -0.0580155 0.00781238 0.0697932 -0.0494335 0.119185 0.0854122 0.00965365 0.121001 0.000801404 -0.107739 -0.0282681 0.00313602 0.237948 -0.0645041 0.149759 -0.00221228 0.0155681 -0.0347194 0.00470285 0.0139063 0.0171409 0.087373 -0.0541976 -0.0542984 0.00794076 0.0210155 -0.105697 0.0681453 -0.0130004 0.0290856 -0.0647619 0.119604 -0.081346 0.0110062 -0.0685287 0.00957093 0.0149835 -0.000316412 0.00926747 -0.0758926 0.0195054 -0.00401988 0.00361352 -0.0442551 -0.0375705 -0.118793 0.0159738 0.17223 0.0783157 -0.0338881 0.0247746 0.0251244 0.0321315 -0.000431212 -0.131873 0.130952 0.020924 0.113396 0.0579688 0.0488437 -0.0392259 -0.0219065 -0.129482 -0.128899 0.0297265 0.0705379 -0.110337 -0.141638 0.0148231 0.0545367 0.00412448 -0.037705 -0.0118857 -0.0312483 -0.152347 0.164431 -0.0214805 0.0693732 
-0.0441993 0.0742526 -0.152155 0.0480618 0.0479941 0.0642283 0.0217452 -0.193014 -0.102295 0.0396348 0.0202056 0.083107 0.101283 0.00650617 -0.0986813 -0.00484829 -0.071102 0.0548597 0.0721435 0.142646 0.107713 -0.173629 0.000294358 0.0482461 0.0248944 0.118099 -0.123995 -0.233283 0.0744693 0.19693 -0.0234295 0.146814 -0.0353353 -0.087291 0.0612715 0.0636118 -0.0610222 0.120705 0.033882 -0.117879 0.000699403 -0.0572123 0.0150216 0.119999 -0.123766 0.0813589 0.249634 -0.0116802 -0.131731 -0.130058 -0.0200242 -0.000907097 0.0339802 -0.0258157 0.160561 0.059134 -0.0132519 0.145041 0.01398 -0.118298 -0.0144701 -0.0131886 0.236615 -0.0656958 0.146391 -0.0061224 0.0111989 -0.0207146 -0.00717321 0.00609128 -0.00343047 0.0877721 -0.0484777 -0.0202638 0.0240449 0.0223291 -0.0807196 0.0816072 0.023904 0.043407 -0.0677131 0.0863487 -0.0784807 -0.0244138 -0.0679988 -0.0223841 0.0360517 0.0184378 0.0378786 -0.0610818 0.0200413 -0.0314467 0.0225943 -0.0498024 -0.0736468 -0.13127 0.0495497 0.151109 0.114766 -0.0692545 0.015802 0.0497817 0.0312835 0.0519979 -0.146185 0.111179 -0.0207283 0.155515 0.0454447 0.0132717 -0.0180623 0.0385025 -0.137896 -0.105495 0.023562 0.0569673 -0.118331 -0.157564 0.00675278 0.071915 -0.0120986 -0.0260432 -0.00753592 -0.0065664 -0.133995 0.151381 -0.0321792 0.0303568 
-0.0830275 0.0671534 -0.159127 0.0555114 0.0593622 0.0639868 0.0101443 -0.213438 -0.0257126 0.0317293 0.0156991 0.066318 0.0770249 0.0156348 -0.0990388 0.0138609 -0.11382 0.049666 0.0711772 0.118979 0.120476 -0.184095 0.00662255 0.0163409 0.04168 0.0843883 -0.144978 -0.227783 0.069132 0.195805 0.0215618 0.108269 -0.00242139 -0.123832 0.0944395 0.106385 -0.0768666 0.0898141 0.0115855 -0.13853 -0.0065271 -0.0327075 0.0118907 0.120345 -0.10675 0.0743064 0.220313 -0.00101807 -0.0921732 -0.142605 -0.0885154 -0.0149779 0.0653017 -0.0532226 0.156953 0.0809633 -0.0244669 0.13006 -0.0134902 -0.105276 -0.0355252 -0.00174894 0.248035 -0.0586128 0.164578 0.0185636 -0.0145305 -0.00466053 -0.00629479 0.0125304 0.0311917 0.101001 -0.0476061 -0.068433 0.0166258 0.0509604 -0.0964146 0.0559461 0.00733306 0.0160269 -0.0586208 0.090914 -0.0974235 0.00748658 -0.0871655 0.00261657 0.0118554 0.0320323 0.0334532 -0.0517387 0.0301016 -0.0193876 0.0138598 -0.0525678 -0.0526374 -0.121209 0.00452645 0.147478 0.107406 -0.044008 0.0461685 0.00839483 0.0295825 -0.0549493 -0.142667 0.141579 0.00411073 0.100864 0.0558508 0.0551117 -0.0274898 -0.000293766 -0.106267 -0.124632 0.0392614 0.0880903 -0.109771 -0.105576 0.00236598 0.0738006 -0.00315461 -0.0408001 -0.011653 -0.00526475 -0.155407 0.180838 -0.0147705 0.0641441 
-0.0687678 0.0676872 -0.134234 0.0556653 0.0458025 0.0618155 0.0204551 -0.190841 -0.100254 0.063887 0.00444607 0.0766216 0.0809711 0.0271225 -0.0505537 -0.00739958 -0.0659016 0.0536753 0.11195 0.115339 0.0742785 -0.165866 0.00692544 0.0449472 0.0332017 0.124105 -0.137911 -0.234307 0.0718566 0.1778 0.000501601 0.143007 -0.0216462 -0.110846 0.0696091 0.0937578 -0.0658223 0.109488 0.0148939 -0.108267 0.00397098 -0.0327007 0.00398285 0.109044 -0.132996 0.0956307 0.243261 -0.0195352 -0.112956 -0.150352 -0.0270696 -0.00508528 0.0538326 -0.0475972 0.165228 0.0794491 -0.00673959 0.156155 0.0244913 -0.0993796 -0.0348145 -0.000418339 0.215755 -0.0790916 0.167654 0.01772 0.0160164 -0.0207236 -0.0107234 0.0232132 0.0125777 0.115104 -0.0467129 -0.015096 0.0300839 0.0319508 -0.100309 0.0761798 0.0268335 0.0109658 -0.0705427 0.0971992 -0.0876899 -0.0249597 -0.0613885 -0.0370223 0.0344856 0.0157841 0.0273658 -0.0643412 0.0146591 0.00264579 0.0375691 -0.0684839 -0.051064 -0.119548 0.0585042 0.151404 0.116749 -0.0568005 0.00339362 0.0425836 0.041558 -3.97027e-05 -0.167893 0.120629 -0.0166998 0.101835 0.0622217 0.0333857 -0.0139608 0.0333542 -0.111197 -0.143778 0.0344492 0.0557758 -0.098216 -0.171221 0.00266974 0.068045 0.0122004 -0.0428387 -0.0118805 -0.00618858 -0.143058 0.168208 -0.0251315 0.05156 
-0.0422549 0.0772626 -0.148919 0.0475881 0.069251 0.0815694 0.0427891 -0.196447 -0.0820471 0.0494117 0.00816811 0.0865213 0.0799858 -0.0126261 -0.0753307 -0.0180514 -0.0894148 0.0626756 0.0768205 0.111101 0.0961722 -0.141806 -0.00642461 0.0652524 0.0335176 0.0994979 -0.137461 -0.232745 0.0833083 0.203716 -0.00684438 0.121711 -0.0530243 -0.10235 0.0813688 0.0611308 -0.0793886 0.0831922 0.0256026 -0.0994953 0.0145585 -0.0370084 0.00390499 0.141187 -0.140138 0.0798469 0.230635 0.0034057 -0.0965308 -0.125434 -0.00976972 0.013983 0.0406756 -0.0513301 0.160575 0.0629726 -0.00848393 0.164339 0.0173069 -0.104567 -0.0298978 -0.0087443 0.240068 -0.0566872 0.133367 -0.0330861 0.0214817 -0.0247518 -0.00567934 0.0225141 0.0204718 0.125281 -0.041438 -0.0153703 0.0103531 0.0298411 -0.113018 0.0742729 0.0217044 0.0466667 -0.0443073 0.109243 -0.0656955 -0.00542566 -0.0551967 -0.0361579 0.0456886 0.0121885 0.0299321 -0.0633303 0.0170267 -0.0111271 0.0133813 -0.0730048 -0.0722216 -0.143769 0.0517314 0.136541 0.115498 -0.0703365 0.0290911 0.0580523 0.0544945 0.0209312 -0.177995 0.098519 -0.0266923 0.134036 0.0548618 0.0577091 0.0260816 0.0322278 -0.133568 -0.119547 0.0162055 0.0767515 -0.104557 -0.149106 -0.00628751 0.070764 0.0106738 -0.0352708 -0.0157703 -0.00875461 -0.156034 0.154033 -0.0394074 0.0504114 
-0.0278322 0.0658092 -0.129887 0.0441198 0.033417 0.109746 0.0309257 -0.196508 -0.100187 0.00255451 0.0257543 0.0761203 0.0749811 0.0155091 -0.0638804 -0.0364954 -0.103098 0.0360715 0.0887075 0.101248 0.0879513 -0.129619 -0.00208148 0.0535636 0.0241967 0.117981 -0.119078 -0.231025 0.0663548 0.178763 -0.00975985 0.123335 -0.0545943 -0.0828551 0.0740943 0.0884552 -0.0740951 0.0970943 0.0272705 -0.092722 0.019718 -0.0514905 -0.0157595 0.119636 -0.140245 0.0878176 0.233055 -0.0150462 -0.140598 -0.114954 -0.0425832 0.0145724 0.0575536 -0.0193723 0.167048 0.0729518 -0.0172193 0.186703 -0.00816215 -0.103351 -0.039889 0.02111 0.271209 -0.0819145 0.146991 0.0183517 0.0402486 -0.0296368 -0.0201755 0.0506368 0.00274037 0.0906469 -0.0485233 0.00703387 0.0361788 0.0106631 -0.0995505 0.0304076 0.0181021 0.0438571 -0.0485237 0.0902459 -0.0757249 -0.0544947 -0.0750507 -0.029579 0.042266 -0.0107447 0.00600197 -0.0315042 0.0712491 -0.0419545 0.0252844 -0.0583893 -0.0641342 -0.124688 0.0580107 0.135106 0.139767 -0.0491432 0.00761666 0.0633162 0.0270583 0.0162907 -0.169123 0.128626 -0.0171678 0.128654 0.0248811 0.0151597 0.0300663 0.0423194 -0.123219 -0.134687 0.0407653 0.0700475 -0.0940915 -0.160261 0.0368171 0.0770367 0.0269597 -0.0696435 0.000899588 -0.00697555 -0.122168 0.162843 0.00453463 0.0510101 
-0.0184323 0.091174 -0.147473 0.0188704 0.0345649 0.123497 0.0408678 -0.187987 -0.0964582 0.0113342 0.0381828 0.0828335 0.0898287 0.00021927 -0.0765774 -0.0387069 -0.105093 0.035584 0.0534943 0.0974472 0.0899161 -0.112303 -0.017006 0.0558175 0.0102263 0.109501 -0.0964461 -0.219058 0.0755685 0.194941 -0.0267668 0.12423 -0.0559242 -0.0631102 0.0605707 0.0717713 -0.0656883 0.0929564 0.024378 -0.0716087 0.0246041 -0.0728686 -0.00970247 0.136584 -0.141429 0.0932625 0.232265 -0.00652548 -0.164829 -0.108845 -0.0226622 0.0260204 0.029076 -0.0166475 0.157383 0.0775329 -0.0361155 0.189531 -0.0158494 -0.0998581 -0.0463763 0.00403429 0.283556 -0.0809228 0.134879 -0.00642884 0.0350246 -0.0196161 -0.0291524 0.0529433 0.000898993 0.0732447 -0.0534154 -0.00148181 0.0413352 0.0203886 -0.0949977 0.0415701 0.00694651 0.0410319 -0.0429266 0.0897174 -0.0666169 -0.0432819 -0.0891635 -0.0163876 0.0521385 -0.026145 0.00797524 -0.00880703 0.061027 -0.0805449 0.00430333 -0.0523236 -0.0730577 -0.120367 0.0520375 0.11569 0.146441 -0.0537931 0.0133286 0.0728396 0.0238141 0.0479444 -0.176536 0.115989 -0.044138 0.154181 0.00153162 -0.000908199 0.0435794 0.0463691 -0.137229 -0.111648 0.0288124 0.0648606 -0.106633 -0.159334 0.0466439 0.0869659 0.0373681 -0.0694057 0.00317634 0.00622896 -0.10745 0.148236 -0.00816814 0.0318069 
0.0267681 -0.0458889 -0.130239 -0.00104886 0.103364 0.0778635 0.0261396 -0.0541124 -0.0353003 -0.140046 -0.0201861 0.126377 0.0818606 -0.0691009 -0.162233 -0.0553828 -0.134585 0.0115927 -0.14893 0.192974 0.143374 -0.156771 0.0943199 0.076177 -0.00813609 -0.00627457 -0.0406187 -0.197264 -0.0467498 0.052796 -0.0100322 0.031869 -0.075002 0.0429146 -0.0599656 0.0112323 -0.143296 0.142252 -0.129273 -0.0671247 0.0647766 -0.0248168 -0.0529884 0.177326 -0.15057 0.00978751 0.142079 0.00784769 -0.0770064 0.0693997 -0.047119 -0.093975 -0.0368759 -0.0113821 0.123622 -0.0246951 -0.044501 0.173501 0.0294056 -0.152677 -0.0021628 0.0305023 0.21594 0.0277299 0.0475413 -0.122652 -0.00682587 0.0659937 0.00961111 0.06052 0.0168241 0.0721347 0.0274069 -0.0117056 -0.0175468 0.0346298 -0.0828684 0.0196777 -0.0134087 0.0907514 -0.0849166 0.0347003 -0.0507294 -0.060657 -0.130038 0.0169501 0.104621 0.0834222 -0.00249023 -0.0550201 0.0801834 -0.126843 -0.0340442 -0.0975419 -0.0718226 -0.0745908 -0.0130978 0.0644924 0.0605745 -0.074796 -0.0141026 -0.00879192 0.0059319 0.126173 -0.116293 0.0223823 -0.166193 0.212251 -0.0356811 -0.0629084 0.0637942 0.154141 -0.137527 0.0194159 -0.00592433 0.0886435 -0.128681 -0.0899899 0.0446111 0.129144 -0.0572489 0.0867744 -0.0500111 0.0470193 -0.0928609 0.0240041 -0.0850804 -0.0263886 
-0.0100047 0.0475986 -0.143632 0.0298717 0.0372996 0.130021 0.0684228 -0.145269 -0.0606576 -0.0454259 0.0303509 0.104251 0.0827422 -0.0246108 -0.116519 -0.061881 -0.154016 0.00252686 -0.00345693 0.104035 0.125253 -0.167439 -0.0148525 0.0523516 0.0368484 0.0771472 -0.100587 -0.212829 0.0415672 0.157881 0.00707742 0.10145 -0.0912312 -0.037584 0.0142421 0.0523623 -0.120114 0.0878801 0.0125543 -0.0772669 0.0622906 -0.0798525 -0.0237483 0.145237 -0.136071 0.011531 0.185319 -0.0232417 -0.126732 -0.0777955 -0.0554261 0.000285679 0.0187414 -0.0163421 0.146152 0.0577009 -0.0675697 0.219412 -0.0347717 -0.125074 -0.0467236 0.00508585 0.299944 -0.0608625 0.0975605 0.0169455 0.0369313 -0.0127584 -0.0319874 0.0454141 0.000322864 0.100996 -0.0405395 0.0134439 0.0311692 0.0169884 -0.0771421 -0.0080744 -0.00496043 0.0965245 -0.084393 0.0470097 -0.0300717 -0.0480681 -0.110404 -0.0142654 0.0885075 0.00758632 0.0248134 -0.0524186 0.0763787 -0.108463 -0.0010177 -0.055138 -0.0816857 -0.128045 0.0322835 0.0869614 0.122998 -0.0456955 -0.00728477 0.0351816 0.0133728 0.0718205 -0.158194 0.124953 -0.0630512 0.196097 -0.0188673 -0.0383933 0.0398472 0.0724979 -0.166234 -0.0823685 0.0560626 0.0791943 -0.0966952 -0.104349 0.0919293 0.116839 0.0180591 -0.0524599 -0.0155111 0.0117162 -0.104854 0.128694 -0.0108784 0.0433529 
0.0119692 0.0315036 -0.0889904 0.0376354 0.0382668 0.151809 0.101706 -0.104488 -0.0827813 -0.080607 -0.0237487 0.0692354 0.071285 -0.0915229 -0.0879849 -0.097515 -0.197317 -0.0055499 -0.0455884 0.128785 0.117759 -0.173764 0.00493795 0.0502178 0.0179375 0.018635 -0.170166 -0.224263 -0.000262654 0.0962086 0.00956942 0.0718778 -0.142497 0.00732361 0.0460608 0.0302364 -0.114236 0.0785052 -0.0295815 -0.115978 0.0927103 -0.107755 -0.0122702 0.138499 -0.144816 0.00839568 0.17175 0.0154373 -0.132102 0.0132626 -0.0746731 -0.0539419 0.0248696 -0.00346474 0.147962 0.0084812 -0.0634221 0.178695 -0.00855721 -0.157142 -0.019748 0.0681414 0.248958 -0.0525089 0.0835399 0.0122112 0.0421532 -0.0474168 -0.0517146 0.0180789 -0.01947 0.100295 -0.00465116 0.0601989 0.00417044 -0.00461055 -0.0772095 -0.0385367 0.056056 0.132524 -0.0601271 0.00191623 -0.0500043 -0.0611931 -0.0932464 -0.00986454 0.0750096 0.0316003 0.0315464 -0.0160112 0.13705 -0.0934206 0.0132761 -0.0935277 -0.136032 -0.11242 0.0421259 0.0975318 0.0899736 -0.0426394 0.0146607 0.0523779 0.0125476 0.0598146 -0.129631 0.0978571 -0.0578741 0.235167 -0.0201755 0.0156238 0.0659518 0.096309 -0.165527 -0.0913256 0.0320946 0.0817305 -0.0703717 -0.0730904 0.0717808 0.116824 -0.00164794 -0.044503 -0.00463814 0.0347341 -0.0994902 0.0753655 -0.00317478 0.01162 
