0.05718 -0.115841 -0.0357574 -0.00507318 0.0303006 0.115844 -0.0118883 -0.0272296 -0.0396969 -0.129353 -0.111404 0.145191 -0.0257419 -0.120529 -0.120966 -0.0740486 -0.180018 0.0226092 -0.00788878 0.0928932 0.108819 0.0330495 0.152356 0.0930062 -0.112647 0.0413246 0.0393311 -0.254531 -0.122287 0.0793587 -0.115548 -0.0550981 0.00483965 0.05584 0.0794057 -0.0574223 -0.0414851 0.138175 -0.125833 -0.0705159 -0.0700939 -0.0154019 -0.0905863 0.103362 -0.143631 0.0114345 0.117678 -0.0265427 -0.0634715 0.203738 0.0761747 -0.055547 0.0915231 0.0840201 0.206544 -0.045178 0.142078 0.07177 -0.0470146 -0.141015 0.0588258 0.0227243 0.16289 0.00780316 0.111206 -0.211142 -0.0284007 0.00679284 -0.0230093 0.140159 -0.0609617 -0.0156774 -0.0319808 0.0237575 -0.0883623 0.00853878 -0.0620251 -0.0700709 0.0769718 0.109612 -0.00192504 0.0208601 -0.0453965 -0.0674624 -0.00585573 -0.150872 0.033701 0.0796324 0.0330177 0.0951136 0.072804 -0.0603074 -0.0252038 0.00649457 -0.0749905 0.00270299 0.0324725 0.0910468 0.0961493 0.00163035 0.13796 0.086466 -0.0664809 -0.0200915 -0.0172952 -0.10953 -0.0759222 -0.0160051 -0.0801306 0.0307475 0.100779 0.133234 0.0027594 -0.0741164 0.0270471 0.159878 0.00949449 -0.0967797 -0.00340917 0.0978975 0.0213314 0.0251871 0.0493657 -0.115443 0.0127051 0.0627656 0.10686 -0.0328908 
0.0451977 -0.108857 -0.0233689 -0.0143083 0.0242344 0.118044 -0.0309016 -0.0329425 -0.0486474 -0.124186 -0.125126 0.139221 -0.0322969 -0.10931 -0.103394 -0.0667808 -0.187009 -0.00552117 0.0101919 0.0859056 0.0943772 0.0417223 0.155819 0.0911285 -0.104393 0.0592602 0.0491244 -0.245848 -0.120568 0.069916 -0.106277 -0.0592387 0.00164598 0.0529809 0.0749374 -0.0438103 -0.0410558 0.136183 -0.121044 -0.0567815 -0.0714593 -0.0205073 -0.0870607 0.0913802 -0.127771 0.0275727 0.125739 -0.024351 -0.0686506 0.200124 0.083957 -0.0513222 0.0976618 0.0797711 0.217975 -0.0424955 0.142056 0.0810222 -0.0402577 -0.142789 0.0589251 0.0314246 0.156151 0.00743986 0.118411 -0.198252 -0.0265198 0.0164244 -0.0207029 0.146853 -0.0660135 -0.00363493 -0.0366115 0.0291283 -0.0699911 0.00970837 -0.064993 -0.0696648 0.0841742 0.116852 0.00900683 0.0181391 -0.0373071 -0.0659594 -0.0103484 -0.171107 0.0328686 0.0850015 0.0331359 0.0973735 0.064857 -0.0496973 -0.0159516 0.0191308 -0.0771556 0.0152112 0.0453271 0.0933197 0.10398 -0.00256904 0.131276 0.0842329 -0.0784365 -0.0269162 -0.032824 -0.104661 -0.0890259 -0.0295878 -0.0831354 0.0252105 0.111029 0.14346 0.00390069 -0.0764619 0.0294952 0.159016 0.00135892 -0.0930078 -0.0128298 0.0993679 0.0327809 0.024279 0.0602037 -0.127561 0.0069788 0.0738418 0.107374 -0.0309676 
0.0553982 -0.106124 -0.0350912 -0.0132641 0.0395566 0.130483 -0.017321 -0.0250702 -0.0438592 -0.131322 -0.11682 0.135437 -0.026924 -0.140212 -0.11557 -0.0591169 -0.196815 0.0194143 -0.018438 0.0839063 0.116884 0.0389147 0.15658 0.0901286 -0.104025 0.0328884 0.0389006 -0.262797 -0.114836 0.0749865 -0.105729 -0.0548184 -0.00852936 0.0574082 0.0846499 -0.0575366 -0.0447657 0.116826 -0.118833 -0.0642543 -0.0609273 -0.028434 -0.0833952 0.110081 -0.139137 0.0182232 0.127247 -0.0185766 -0.0800425 0.201485 0.075841 -0.0672718 0.0892972 0.0741228 0.194228 -0.0453369 0.142477 0.073209 -0.0469834 -0.138876 0.0606321 0.0315943 0.164439 0.0103491 0.114868 -0.212482 -0.0350054 0.00636065 -0.020385 0.138677 -0.0720105 -0.00441879 -0.0345773 0.0153044 -0.0847979 0.00763059 -0.0670952 -0.0635915 0.072367 0.116887 0.0126585 0.0201206 -0.0485302 -0.0605519 -0.018603 -0.136903 0.0320981 0.0770613 0.0158811 0.0986908 0.080079 -0.0578945 -0.0454827 0.00703678 -0.0813239 0.0167106 0.0248958 0.0968491 0.0935078 0.00391163 0.139237 0.070977 -0.070895 -0.0206726 -0.0159804 -0.111162 -0.0839804 -0.000780575 -0.085917 0.0328427 0.104354 0.135412 0.00223834 -0.0773506 0.0265654 0.16209 -0.00875765 -0.0809016 -0.00756208 0.102749 0.0280197 0.0257248 0.0541189 -0.114457 0.00775974 0.0614665 0.0920532 -0.0389448 
0.0542095 -0.100344 -0.0375502 -0.00929457 0.0356407 0.132762 -0.0142737 -0.0411399 -0.038776 -0.150443 -0.111859 0.137598 -0.0289927 -0.131182 -0.126688 -0.0742509 -0.194416 0.0121433 -0.0158579 0.0897398 0.118643 0.0240926 0.140671 0.0927511 -0.0976077 0.0372293 0.0305193 -0.261158 -0.120473 0.0801528 -0.0983094 -0.0615842 -0.0141706 0.0556397 0.0887326 -0.0446451 -0.0454402 0.123347 -0.11545 -0.0712093 -0.0541984 -0.0258152 -0.07955 0.110202 -0.130711 0.0254174 0.133943 -0.0242344 -0.086798 0.189635 0.0568884 -0.0635447 0.0932092 0.0757485 0.205566 -0.0390106 0.11935 0.0964876 -0.0542486 -0.145899 0.0580659 0.0387114 0.184372 -0.00257818 0.120853 -0.202472 -0.0262163 0.00469168 -0.027461 0.13903 -0.0608706 -0.00831147 -0.0338248 0.0128128 -0.0767908 0.0106588 -0.066785 -0.0649922 0.073515 0.115659 -0.00370463 0.0272657 -0.0471232 -0.0692743 -0.0303116 -0.136474 0.0357604 0.0771741 0.0142244 0.0972024 0.0881534 -0.0753752 -0.0261334 0.00257742 -0.0796555 0.00596372 0.0331228 0.088823 0.101005 0.00519846 0.122026 0.0806298 -0.0746905 -0.0144675 -0.0292638 -0.0906604 -0.0812743 0.00476787 -0.0978113 0.0278278 0.110699 0.124656 -0.0111497 -0.0750179 0.0281491 0.163546 -0.0199524 -0.0892574 0.000200967 0.101853 0.0224511 0.0228592 0.0486396 -0.109706 0.013662 0.0706034 0.0917229 -0.044768 
0.0646064 -0.0909016 -0.0283157 -0.010271 0.0262878 0.146423 -0.0139239 -0.031583 -0.0203763 -0.161577 -0.100052 0.129644 -0.0312169 -0.142833 -0.121156 -0.0718865 -0.200578 0.00458848 -0.0402585 0.0804984 0.121083 0.0400493 0.142617 0.0880648 -0.104119 0.0297359 0.0308059 -0.259727 -0.122305 0.0679428 -0.086918 -0.0603282 -0.00809411 0.072544 0.0827455 -0.0454602 -0.0348254 0.131151 -0.117662 -0.058132 -0.0510184 -0.0321877 -0.088993 0.104631 -0.126648 0.0129991 0.123601 -0.0279892 -0.0901843 0.204958 0.0553127 -0.0537549 0.087318 0.0848459 0.19506 -0.0405091 0.122243 0.0870357 -0.0582611 -0.145895 0.040212 0.0321417 0.180921 -0.0133939 0.110116 -0.201736 -0.0176332 0.00595477 -0.0314014 0.152368 -0.0613585 -0.0196373 -0.0365049 0.0231471 -0.0694797 -0.000430517 -0.0696088 -0.0737122 0.0627994 0.122233 -0.000446162 0.0248102 -0.0424048 -0.0703326 -0.0256013 -0.124978 0.0355803 0.0664066 0.00627206 0.106446 0.0966487 -0.0927006 -0.0350195 0.00130397 -0.0766543 0.0112178 0.0268851 0.0820167 0.0948064 0.0138648 0.121149 0.0806551 -0.0778117 -0.0106053 -0.0213673 -0.0952797 -0.0809627 0.00220806 -0.0951712 0.0181637 0.106452 0.130564 -0.0126457 -0.0707503 0.0379559 0.161406 -0.0125842 -0.0891424 0.0122786 0.108041 0.0393867 0.0256812 0.0559485 -0.0981515 0.0327973 0.056803 0.113697 -0.0358145 
0.0537469 -0.105675 -0.0462395 -0.00980995 0.0478536 0.129778 -0.0152612 -0.0272703 -0.0313166 -0.136953 -0.102469 0.143149 -0.0277388 -0.145537 -0.130923 -0.0568946 -0.190777 0.0352678 -0.0314576 0.0908374 0.127015 0.021688 0.149368 0.104637 -0.0996459 0.0275957 0.0470032 -0.270009 -0.120234 0.0757109 -0.107029 -0.0578093 -0.000303022 0.0657746 0.080588 -0.0517274 -0.0425533 0.11217 -0.125431 -0.0742251 -0.0472836 -0.0344138 -0.074933 0.115144 -0.137702 0.0209788 0.134792 -0.0244997 -0.0953409 0.188879 0.0628712 -0.0845399 0.0831711 0.0699752 0.19527 -0.0284321 0.124888 0.0841601 -0.0552969 -0.134482 0.0588523 0.027922 0.177246 0.00217426 0.123717 -0.210114 -0.0504139 0.00882329 -0.0247838 0.142491 -0.0715451 -0.0156844 -0.041493 -0.00574455 -0.0763328 0.0165538 -0.0591171 -0.0407801 0.0609237 0.0914521 -0.010762 0.0346038 -0.0548369 -0.0645337 -0.039461 -0.109927 0.0372315 0.0745165 0.00611794 0.105294 0.0867703 -0.0793863 -0.0498954 -0.00107746 -0.0742552 0.0258823 0.0105606 0.0865804 0.100571 0.00487842 0.131341 0.0579024 -0.0717996 -0.0143876 -0.00918311 -0.102918 -0.0886517 0.00352502 -0.109104 0.018829 0.0957357 0.131085 0.00809451 -0.0788016 0.0302117 0.156999 -0.0254654 -0.0921677 0.001823 0.108291 0.0284479 0.0298185 0.0433398 -0.0985452 0.012502 0.0706624 0.0799822 -0.0525297 
0.0627111 -0.105058 -0.0514084 -0.0122028 0.0602535 0.139529 -0.000814116 -0.0348485 -0.0121986 -0.140319 -0.0949024 0.147048 -0.0233133 -0.157559 -0.137784 -0.0546202 -0.191778 0.0388731 -0.0550706 0.0872855 0.133596 0.0329053 0.133522 0.113422 -0.102601 0.0223032 0.0423697 -0.27215 -0.110472 0.0854696 -0.102693 -0.0461389 -0.0122424 0.0694247 0.0833343 -0.0563592 -0.0419021 0.103601 -0.119301 -0.0728233 -0.0351588 -0.0356409 -0.0798598 0.118178 -0.132999 0.013607 0.124113 -0.011965 -0.0919304 0.174909 0.0591871 -0.0885899 0.083089 0.0585988 0.187605 -0.0262104 0.108011 0.0948375 -0.0671207 -0.128114 0.0547589 0.0248064 0.188425 0.00153889 0.116378 -0.211788 -0.045232 0.00961579 -0.025421 0.13219 -0.0728455 -0.0161747 -0.0404096 -0.0134245 -0.0825816 0.0195181 -0.0581468 -0.0404406 0.0536177 0.0943076 0.00484343 0.0468474 -0.0558042 -0.0630613 -0.0356587 -0.106495 0.0457551 0.0715332 -0.00694247 0.10897 0.0948096 -0.0888243 -0.0587166 0.00579379 -0.0806636 0.0270951 0.00243664 0.064316 0.106363 0.00878284 0.142006 0.0493878 -0.0765772 -0.00995968 -0.0154288 -0.106022 -0.0913299 0.00501385 -0.114938 0.0268124 0.106467 0.130296 -0.000198958 -0.0734698 0.0268521 0.160685 -0.048108 -0.0793805 -0.00803566 0.104455 0.0309925 0.0337888 0.0398799 -0.0909394 0.0119626 0.0734214 0.0592567 -0.0661934 
0.0563999 -0.0665408 -0.053177 -0.0418486 0.0788729 0.166905 0.00321148 -0.0500824 -0.0390397 -0.0815865 -0.062587 0.133551 0.0081997 -0.143149 -0.1158 -0.0405891 -0.170883 0.0942954 -0.0482264 0.0646936 0.152598 0.041769 0.113299 0.154879 -0.083549 0.0235973 0.0529662 -0.266973 -0.051851 0.113568 -0.0943609 -0.0517371 -0.0240802 0.0627351 0.10908 -0.0528084 -0.043309 0.0677681 -0.0868586 -0.0806739 -0.0299873 -0.0498429 -0.0531775 0.14898 -0.148288 0.014207 0.147792 0.0230756 -0.131509 0.124966 0.0720017 -0.090326 0.0673589 0.0315162 0.171582 0.00841102 0.0963666 0.124131 -0.0598607 -0.137559 0.0406184 0.0175896 0.214769 -0.00358425 0.116232 -0.189186 -0.0682407 0.0144071 -0.0381779 0.141712 -0.0748148 -0.00442779 -0.0661585 -0.0582801 -0.0761125 0.0147593 -0.0678479 0.00869837 0.0663917 0.0612361 0.0149221 0.0770606 -0.0476821 -0.0529473 -0.0502435 -0.097928 0.0515707 0.0567577 0.000856399 0.134091 0.098601 -0.0865836 -0.0753314 0.00167762 -0.0841267 0.0164351 -0.0271658 0.0960704 0.107889 -0.0142729 0.163275 0.0543976 -0.0620182 -0.00490254 -0.0297608 -0.0861257 -0.0983597 0.00269868 -0.0965538 0.0176439 0.112724 0.128653 -0.00143767 -0.0725069 0.0334777 0.15606 -0.0719431 -0.0920228 -0.0209193 0.109838 0.0593828 -0.00560563 0.0253005 -0.0819074 -0.0395573 0.0962156 0.0329056 -0.0621381 
0.0435255 -0.079141 -0.0413026 -0.0578383 0.0785665 0.168943 0.00511558 -0.0600825 -0.0441881 -0.0701502 -0.0722523 0.122146 0.0242998 -0.105869 -0.0810622 -0.0535622 -0.173715 0.0817434 -0.0288259 0.0616849 0.13981 0.0376863 0.0912372 0.17769 -0.0780568 0.0387669 0.0379556 -0.259404 -0.0502338 0.112438 -0.0780163 -0.0536355 -0.0432738 0.0568288 0.116018 -0.0196952 -0.0376943 0.0531491 -0.082472 -0.0888274 -0.013965 -0.0450263 -0.0421751 0.142707 -0.136345 0.0206731 0.149911 0.0494344 -0.117761 0.106194 0.0485129 -0.118921 0.08185 0.0275323 0.197722 0.0235607 0.0706761 0.14994 -0.0490181 -0.152336 0.0429408 0.0448134 0.208908 -0.00197796 0.104423 -0.145548 -0.0548633 0.0240114 -0.0272647 0.118309 -0.0746795 0.0103628 -0.0657507 -0.0645687 -0.0610375 0.0188043 -0.0758195 0.00949947 0.0975118 0.0517404 0.0357316 0.0907183 -0.0533221 -0.0612166 -0.0521575 -0.106921 0.0624283 0.0680562 0.00868905 0.137768 0.115009 -0.0687037 -0.0400094 -0.0061535 -0.104226 0.0204605 -0.0301857 0.0988243 0.121897 -0.0219988 0.165546 0.0467231 -0.0573566 -0.0270848 -0.0562456 -0.0663351 -0.120836 -0.0200875 -0.111017 0.0375517 0.125054 0.130534 -0.00916147 -0.088045 0.0238015 0.165356 -0.0717784 -0.100845 -0.0491321 0.095341 0.07055 -0.0231636 0.0287439 -0.0731077 -0.0923161 0.109084 0.00261314 -0.0561825 
0.0438654 -0.0595526 -0.03143 -0.0695796 0.0820293 0.172914 0.00624761 -0.068098 -0.0627895 -0.0557642 -0.0763548 0.113321 0.0209153 -0.106412 -0.0615736 -0.0512134 -0.170032 0.0865242 -0.00866963 0.0442908 0.13973 0.0595453 0.0827262 0.15467 -0.0703202 0.0524073 0.0279132 -0.261321 -0.0300466 0.125308 -0.0759844 -0.0498801 -0.0469614 0.040549 0.141678 -0.0271807 -0.0359871 0.0465149 -0.0540371 -0.091309 -0.0220453 -0.0445462 -0.0362085 0.148428 -0.137222 0.0453633 0.158194 0.0461202 -0.136412 0.0855113 0.0575212 -0.0996423 0.0843121 0.019591 0.18614 0.0231085 0.0743357 0.152061 -0.0583377 -0.144385 0.0462245 0.0358464 0.209457 -0.00115382 0.119083 -0.150755 -0.057383 0.0230559 -0.0279959 0.118437 -0.0634212 0.014915 -0.0712792 -0.076862 -0.0712113 0.0157947 -0.0883139 0.0034412 0.103442 0.0579628 0.0451759 0.0969553 -0.0509972 -0.0493811 -0.0414957 -0.12916 0.0570162 0.0604662 0.0104052 0.145717 0.108262 -0.0545787 -0.05574 0.00506482 -0.106531 0.014784 -0.014184 0.108942 0.115311 -0.0222186 0.164316 0.0598168 -0.0551991 -0.0354985 -0.071575 -0.0621154 -0.10699 -0.0186996 -0.0900626 0.0427585 0.138182 0.113673 -0.026191 -0.0923429 0.032116 0.159907 -0.0805553 -0.106531 -0.0531499 0.0880981 0.0768972 -0.0309332 0.0362996 -0.0825205 -0.0766954 0.107813 0.0201817 -0.056708 
0.0495511 -0.0901441 -0.029226 -0.0470173 0.0692416 0.14135 0.00109308 -0.0451448 -0.0620458 -0.0656163 -0.0978054 0.12674 0.00444068 -0.113121 -0.0635806 -0.0562058 -0.159954 0.0548992 0.00360983 0.0776429 0.119574 0.0440047 0.102937 0.146533 -0.0821381 0.0671116 0.0342557 -0.275264 -0.0651625 0.102967 -0.0922216 -0.0420497 -0.0312206 0.0501357 0.118808 -0.0334748 -0.031691 0.0993799 -0.0854423 -0.0955541 -0.0349299 -0.0350097 -0.0584127 0.128977 -0.132385 0.0548757 0.152331 0.0223393 -0.118816 0.114467 0.0682069 -0.100232 0.0897571 0.0299597 0.213574 0.00185417 0.0837562 0.132424 -0.0469538 -0.144898 0.0573788 0.0197781 0.184573 -0.00511044 0.132786 -0.172498 -0.0514217 0.0283431 -0.0221842 0.113102 -0.0698723 0.00977048 -0.0649586 -0.048524 -0.077995 0.0116892 -0.0743115 0.0021149 0.107945 0.0744833 0.0210509 0.0742733 -0.0601033 -0.0719658 -0.0248848 -0.162417 0.0568849 0.0778149 0.0283509 0.128116 0.0905135 -0.0472064 -0.0452247 0.0106211 -0.0981646 0.0285415 0.0220706 0.0848564 0.117841 -0.0233058 0.144007 0.0615725 -0.0676502 -0.0310163 -0.0757191 -0.0845004 -0.109912 -0.0315384 -0.0847922 0.0352262 0.130929 0.139397 -0.0220705 -0.0988889 0.0405937 0.151599 -0.0690054 -0.128332 -0.053091 0.0877042 0.0549526 0.00795729 0.0486532 -0.0777117 -0.0401369 0.0930568 0.0438939 -0.0729653 
0.0574684 -0.122725 -0.0239544 -0.0370571 0.0306743 0.110665 0.00217319 0.000630585 -0.0436554 -0.0978894 -0.129042 0.119269 -0.00235301 -0.126068 -0.0641674 -0.0486364 -0.194236 -0.00770723 -0.029003 0.0763715 0.0934407 0.0689512 0.11565 0.0969074 -0.120059 0.0509467 0.0359475 -0.266038 -0.121346 0.0893927 -0.130273 -0.0194299 -0.0115125 0.0693849 0.07782 -0.0508542 -0.0239118 0.114509 -0.128181 -0.0622165 -0.0517796 -0.0507438 -0.0687332 0.0998196 -0.101555 0.0665082 0.115617 -0.00165216 -0.0942346 0.168332 0.0847143 -0.114174 0.10287 0.0660083 0.212074 -0.0252736 0.103055 0.0686753 -0.0436243 -0.117764 0.0721195 0.0229389 0.119839 0.023199 0.106551 -0.192268 -0.0385888 0.0297445 -0.00520406 0.0704065 -0.0822451 -0.0246331 -0.0446087 -0.0224986 -0.0725378 0.0349411 -0.061737 -0.0650076 0.0891334 0.114019 0.060041 0.00944188 -0.0757366 -0.069756 -0.0252628 -0.131651 0.0455274 0.0538819 0.00937832 0.135764 0.0686876 -0.0581591 -0.0609265 0.0261825 -0.127437 0.0871221 0.0292212 0.0432699 0.133441 0.00549173 0.152577 0.0533154 -0.0771151 -0.0334017 -0.058566 -0.137575 -0.13071 -0.0122643 -0.122871 0.0385721 0.123942 0.138876 -0.0219635 -0.117827 0.0165258 0.169584 -0.0358228 -0.0859328 -0.0485504 0.0825282 0.0454416 0.0238105 0.0779559 -0.0764486 0.01576 0.055546 0.0557138 -0.0815774 
0.0594963 -0.118503 -0.032373 -0.0385972 0.0316433 0.10353 0.00304728 -0.0213469 -0.0514763 -0.0916784 -0.113929 0.117238 0.0102515 -0.112887 -0.0824173 -0.0488287 -0.183282 0.0187985 -0.0272869 0.0845694 0.106887 0.0516937 0.11265 0.107767 -0.119657 0.0663405 0.0339654 -0.267408 -0.109005 0.0989193 -0.138478 -0.0194903 -0.0199556 0.0639502 0.0915339 -0.0549644 -0.0267721 0.136252 -0.107919 -0.0785324 -0.0633309 -0.0410747 -0.0677215 0.107581 -0.106988 0.054638 0.125506 0.00680233 -0.0991234 0.154402 0.0737679 -0.114359 0.0961265 0.0724293 0.214502 -0.0293266 0.104449 0.0860213 -0.0461192 -0.138236 0.0799456 0.0183467 0.149186 0.0259506 0.105663 -0.180218 -0.0375998 0.034589 -0.00111485 0.0662304 -0.0796164 -0.0224417 -0.0413104 -0.0217764 -0.0795419 0.0187355 -0.0630606 -0.0571723 0.0966442 0.100492 0.0548503 0.029035 -0.0799914 -0.0868249 -0.0337011 -0.138712 0.0453749 0.0633484 0.027788 0.124059 0.0790463 -0.0598993 -0.0447093 0.0164384 -0.121432 0.0648712 0.0244937 0.0596458 0.1359 -0.00481742 0.1512 0.0567294 -0.0732988 -0.0180408 -0.053145 -0.126654 -0.121606 -0.00706254 -0.108995 0.035375 0.125002 0.14491 -0.0241116 -0.102186 0.0191695 0.168428 -0.0461688 -0.0974057 -0.0527191 0.0663728 0.0323099 0.0245461 0.0773221 -0.0769974 -0.00345944 0.0615934 0.041687 -0.0848273 
0.060723 -0.100459 -0.0299302 -0.0328826 0.0237683 0.113481 -0.00474385 -0.0151286 -0.0779283 -0.0793741 -0.117709 0.110505 0.000143011 -0.117424 -0.0589532 -0.0410041 -0.176242 0.00565726 -0.000515991 0.0920052 0.0923306 0.0489248 0.130656 0.0972683 -0.108792 0.0711091 0.0358193 -0.271784 -0.101461 0.0848182 -0.132339 -0.0169923 -0.0126218 0.0690653 0.0865299 -0.0458524 -0.0174679 0.138586 -0.109908 -0.076644 -0.0636322 -0.0540411 -0.055186 0.105935 -0.119893 0.0731295 0.148452 -0.00155243 -0.117651 0.17253 0.0870926 -0.0962085 0.0856159 0.0770573 0.223164 -0.0327791 0.119151 0.0750496 -0.0295218 -0.136591 0.0671613 0.0176004 0.142017 0.00363652 0.122922 -0.180109 -0.0472038 0.0230807 -0.0118591 0.0933668 -0.0882763 -0.01066 -0.0529809 0.00297672 -0.0651582 0.00373992 -0.0581218 -0.0375859 0.099297 0.100791 0.0435086 0.0147867 -0.0748143 -0.085388 -0.0266677 -0.1432 0.0323109 0.0584213 0.0332653 0.129678 0.078872 -0.0522333 -0.056437 0.00819176 -0.108055 0.0636185 0.044402 0.0866355 0.127009 -0.0126831 0.132913 0.0700142 -0.0653691 -0.0184179 -0.0609079 -0.118377 -0.117123 0.000623519 -0.0884462 0.0238958 0.112868 0.153741 -0.0165892 -0.113773 0.0320669 0.148458 -0.0163232 -0.119204 -0.0341788 0.0878231 0.0494434 0.021401 0.0908255 -0.0725936 -0.00027542 0.0524518 0.0817279 -0.0688833 
0.056457 -0.0835714 -0.0465783 -0.0283473 0.0212662 0.109276 -0.0219919 -0.0258215 -0.0769271 -0.0637383 -0.0858966 0.108708 0.00154443 -0.115953 -0.0819159 -0.0311795 -0.162307 0.0384678 0.00965416 0.0993318 0.103936 0.0210304 0.16159 0.100166 -0.106059 0.0734499 0.062119 -0.277176 -0.0855083 0.0764856 -0.129911 -0.0281573 0.0120705 0.062699 0.0844631 -0.0496999 -0.0181635 0.160659 -0.103364 -0.084037 -0.0807389 -0.0583743 -0.0709613 0.115512 -0.145126 0.0590809 0.157042 -0.00433927 -0.128734 0.170464 0.0819803 -0.0690608 0.0729101 0.0776675 0.202053 -0.0305822 0.150339 0.0653975 -0.0235811 -0.145305 0.0562411 -0.00315485 0.169221 -0.00190843 0.13212 -0.183962 -0.0619948 0.0249053 -0.0104005 0.131891 -0.095027 -0.0175059 -0.0653926 8.2681e-05 -0.0623627 -0.0185574 -0.0587227 -0.00380239 0.0835623 0.0808159 0.00413246 0.0222783 -0.07554 -0.0901573 -0.0300406 -0.132887 0.0202293 0.0633106 0.0446706 0.116394 0.080364 -0.0509778 -0.0521971 -0.00665385 -0.0766149 0.0303563 0.0273921 0.121799 0.123808 -0.0308613 0.134575 0.0682817 -0.0572334 -0.00758642 -0.0238834 -0.110525 -0.0905225 0.00218346 -0.0561383 2.53683e-05 0.0824816 0.165366 0.00884479 -0.102069 0.0475739 0.136126 -0.0124343 -0.139835 -0.00720245 0.0973233 0.0466089 0.0194542 0.0726049 -0.0692258 -0.00642313 0.0570532 0.0983078 -0.0452239 
0.0603299 -0.0881768 -0.0602399 -0.0175014 0.00764068 0.104071 -0.0114133 -0.0186428 -0.0800851 -0.0753112 -0.0809454 0.126559 -0.00165036 -0.124616 -0.112942 -0.0437505 -0.157694 0.0309399 -0.0147076 0.119322 0.0774913 0.0105992 0.153709 0.115653 -0.12576 0.0769135 0.0715133 -0.258318 -0.0990359 0.0539294 -0.147996 -0.0322697 -0.00219759 0.0712934 0.0433744 -0.0580167 -0.0329197 0.174331 -0.128902 -0.0554688 -0.073386 -0.0450406 -0.0768412 0.117342 -0.145209 0.0307042 0.157839 -0.0150837 -0.124006 0.202654 0.0872572 -0.0809031 0.0469491 0.0892836 0.204788 -0.0403553 0.131102 0.0872511 -0.00961102 -0.147838 0.0500177 0.0105623 0.184863 -0.00141004 0.110029 -0.181532 -0.041797 0.0118325 -0.0171496 0.127956 -0.0869173 -0.0151188 -0.0298964 0.0573211 -0.0512967 -0.0254302 -0.0512088 -0.0118664 0.0753073 0.0641588 0.00287686 0.0229374 -0.0738045 -0.114679 -0.0422044 -0.119367 0.0271751 0.0600735 0.054228 0.0970439 0.0773267 -0.0723134 -0.0393587 -0.0221981 -0.0525171 0.0301197 0.0398618 0.0978206 0.116407 -0.0261142 0.0991269 0.0676883 -0.0520366 0.019172 -0.0345799 -0.10379 -0.103904 0.0119385 -0.0819825 -0.0121148 0.100113 0.194869 0.0295066 -0.0809438 0.0291726 0.119761 -0.00273617 -0.133469 0.00808077 0.0820471 0.0239666 0.0243178 0.0799043 -0.0714156 -0.00769741 0.0486818 0.0731889 -0.0603557 
0.0703681 -0.0757115 -0.0920988 -0.0169289 0.0139613 0.105021 -0.0192566 -0.0328993 -0.0599389 -0.0742641 -0.0547731 0.124532 0.00608645 -0.133847 -0.135816 -0.0304538 -0.140548 0.0507114 -0.0356592 0.125436 0.0811932 0.0110298 0.151019 0.129973 -0.129401 0.0760447 0.0883535 -0.266245 -0.0943401 0.0598943 -0.143629 -0.0239033 0.000859899 0.0696359 0.0406246 -0.0576266 -0.0276035 0.174334 -0.125395 -0.0480724 -0.0737923 -0.043028 -0.0857436 0.134155 -0.147764 0.0277962 0.161782 -0.00518474 -0.125243 0.192164 0.0862841 -0.0802786 0.0418512 0.0812268 0.186187 -0.038142 0.12898 0.0836927 0.000640759 -0.154465 0.0388663 -0.00302268 0.199744 -0.00501184 0.0943293 -0.197881 -0.0358225 0.0187669 -0.00529356 0.120963 -0.0854538 -0.0269706 -0.0277703 0.0363313 -0.0482398 -0.031549 -0.0615899 0.011731 0.0520863 0.0605696 0.00729473 0.0481153 -0.0839245 -0.122161 -0.049931 -0.0879127 0.0258695 0.0485078 0.0394583 0.0874677 0.0721292 -0.0816818 -0.0531784 -0.032336 -0.0448293 0.0268888 0.0260544 0.0941389 0.112249 -0.0386369 0.100685 0.0555876 -0.0426857 0.0381302 -0.033014 -0.108749 -0.107098 0.0203948 -0.0868919 -0.00759784 0.101994 0.199026 0.0337058 -0.0697888 0.011763 0.11495 -0.0376137 -0.146317 0.00643801 0.0697612 0.0213055 0.0322493 0.0774545 -0.0565199 -0.00887626 0.0411409 0.0465533 -0.0651581 
0.0889722 -0.0522671 -0.0897704 -0.0346652 0.0211901 0.131446 -0.00821936 -0.0289696 -0.102631 -0.0334593 -0.0159494 0.117615 0.0371564 -0.133123 -0.130489 -0.0185316 -0.123364 0.0841287 -0.04286 0.106542 0.109557 0.0136323 0.126681 0.175465 -0.10612 0.0838452 0.0883373 -0.254203 -0.0285643 0.0761255 -0.137353 -0.0178377 -0.044833 0.0702651 0.0191622 -0.0739815 -0.0736107 0.144079 -0.0790057 -0.0239546 -0.074613 -0.050205 -0.0911201 0.162571 -0.143859 -0.0137098 0.16608 0.0131104 -0.148929 0.155044 0.117103 -0.0547196 0.00609706 0.0549145 0.148727 -0.0255808 0.126733 0.130662 0.0196914 -0.158954 0.0362965 -0.00120279 0.230918 0.0104323 0.0561803 -0.181823 -0.0306589 0.0114051 -0.00951105 0.12735 -0.0932587 0.00727043 -0.036393 0.047599 -0.051479 -0.0651034 -0.0604763 0.0299484 0.054206 0.0669884 0.0171424 0.0616127 -0.0548132 -0.129883 -0.0561343 -0.0900213 0.0493887 0.0303116 0.0526736 0.0665412 0.0748349 -0.0703749 -0.0701007 -0.0191529 -0.0402102 0.00593604 0.0158502 0.109611 0.0996011 -0.0492202 0.100322 0.06305 -0.0337639 0.0843098 -0.0512624 -0.0886886 -0.11605 0.0378899 -0.0500869 -0.0397994 0.118498 0.219718 0.0170275 -0.0505841 0.0236635 0.112624 -0.0478874 -0.140403 0.00641716 0.067526 0.0228958 0.0025808 0.0626817 -0.0670091 -0.0642624 0.0552555 0.0133305 -0.0539823 
0.0837149 -0.0391529 -0.0777244 -0.0263608 0.00495986 0.153874 -0.00807747 -0.016933 -0.0931372 -0.0762697 -0.0369538 0.100841 0.0387792 -0.145966 -0.115635 -0.0188799 -0.138572 0.0471609 -0.0534503 0.100286 0.129222 0.00849021 0.121033 0.15429 -0.088485 0.0570004 0.0657566 -0.26999 -0.0540324 0.0856897 -0.108672 -0.0163976 -0.0255376 0.0929385 0.0284731 -0.0653711 -0.0486479 0.134236 -0.0927339 -0.0433098 -0.0690994 -0.0759101 -0.0513551 0.162828 -0.118553 -0.000493021 0.184485 -0.0103005 -0.176806 0.163121 0.106809 -0.0886776 0.0369726 0.0619852 0.160212 -0.0122589 0.0967409 0.116772 0.0219515 -0.181387 0.0307255 0.00945291 0.207659 -0.0217475 0.0733747 -0.169742 -0.0298905 0.000351009 -0.0337012 0.109119 -0.100863 -0.0198671 -0.0609713 0.013376 -0.0397967 -0.0424169 -0.0508922 0.00554711 0.0518624 0.104363 0.00848829 0.029429 -0.060637 -0.11988 -0.061165 -0.0706136 0.0351932 0.00259891 0.0303867 0.0939408 0.0754405 -0.105223 -0.0863692 -0.0144093 -0.0638098 0.0448013 0.0162329 0.11572 0.0924225 -0.0313519 0.0916691 0.0663973 -0.0465017 0.0824865 -0.0699185 -0.0849425 -0.125856 0.0592317 -0.0852213 -0.0507167 0.102467 0.191695 -0.0143424 -0.0755022 0.0322869 0.121142 -0.0500625 -0.134599 0.0152924 0.0975481 0.039733 0.00534765 0.0722411 -0.0551928 -0.0216377 0.0412851 0.049383 -0.065111 
0.0889328 -0.0204202 -0.0299243 -0.0431965 0.0124661 0.180072 -0.0226241 -0.0201393 -0.111111 -0.072117 -0.0310243 0.0535995 0.0446632 -0.102981 -0.0344608 -0.0479211 -0.118248 0.0507927 -0.0281121 0.101799 0.114117 0.0337487 0.130703 0.18358 -0.0594004 0.02945 0.053205 -0.237931 -0.021236 0.0595217 -0.0570691 -0.0565878 -0.0328246 0.0920869 0.0683522 -0.0173324 -0.0298174 0.122093 -0.0988875 -0.0716771 -0.0625782 -0.0723447 -0.0522601 0.166545 -0.14079 0.0101142 0.175773 0.0434061 -0.181154 0.174842 0.0787728 -0.0741485 0.0481088 0.0440476 0.168257 -0.011406 0.0631771 0.132293 0.0321513 -0.212312 -0.00367911 0.0386511 0.202637 -0.0417145 0.0663109 -0.1211 -0.00812734 -0.007813 -0.0624223 0.138924 -0.0916794 -0.00672729 -0.0632759 0.00825488 -0.0257495 -0.0761041 -0.0628964 0.00943341 0.109803 0.114696 0.0294239 0.0326173 -0.0611058 -0.138568 -0.0183761 -0.110121 0.0149074 0.0182191 0.0449646 0.138449 0.128336 -0.0857109 -0.0585167 -0.0229551 -0.0685969 0.00902468 0.0133992 0.143314 0.0719689 -0.0573479 0.100031 0.0956315 -0.0377377 0.0244956 -0.0991129 -0.0400604 -0.112839 0.0136201 -0.0232387 -0.0356833 0.127625 0.201252 -0.0203134 -0.0618515 0.0444288 0.109392 -0.0332634 -0.151285 0.00640748 0.111177 0.0607799 -0.0294059 0.0595031 -0.0317165 -0.0442072 0.0394028 0.0929918 -0.0483617 
0.0644395 0.0266567 0.0256591 -0.066116 -0.000486575 0.152845 -0.0465836 -0.0458216 -0.14617 0.0213394 -0.00635664 -0.00572084 0.0129228 -0.0625005 0.07418 -0.0375282 -0.0902704 0.0437536 0.0877684 0.0467615 0.0510835 0.0818066 0.132977 0.138328 -0.0249536 0.0817364 0.0967671 -0.193236 0.0539706 0.0311998 -0.0480443 -0.0840095 0.00413337 0.0511076 0.125419 0.00607224 0.0104561 0.109743 -0.0301012 -0.0827866 -0.0765948 -0.101671 -0.0586495 0.141152 -0.159589 0.102095 0.162992 0.0693081 -0.206689 0.105736 0.0735257 0.022977 0.0546938 0.0221363 0.144188 -0.0034344 0.090146 0.0953276 0.00139004 -0.148368 -0.018439 0.00179478 0.182631 -0.0291286 0.110389 -0.0722346 -0.0297077 -0.00369749 -0.0444012 0.185621 -0.104488 -0.000594403 -0.106403 -0.00186716 0.0094519 -0.108695 -0.0707224 0.0617369 0.13527 0.0828411 0.0364461 0.0287316 -0.0509517 -0.114412 0.027128 -0.175625 -0.0198826 0.020011 0.0391414 0.171788 0.140688 -0.00628165 -0.047503 0.00571736 -0.0545808 -0.0284845 0.0347686 0.168985 0.110327 -0.0968785 0.100936 0.122816 -0.0218029 -0.0497729 -0.0751424 -0.0215671 -0.0423426 -0.0305837 0.0831311 -0.0389142 0.129887 0.177829 0.00835061 -0.0809156 0.0939715 0.0710658 -0.00566874 -0.176833 0.00411848 0.110683 0.111627 -0.0742789 0.0499028 -0.0278895 -0.0381518 0.060999 0.165428 -0.00735803 
0.0699343 -0.00828794 -0.015444 -0.0588297 -0.0349194 0.151092 -0.0521354 -0.0408227 -0.16646 0.0254287 0.00388269 0.0355299 0.0381341 -0.0254931 0.0136727 -0.0482244 -0.0764367 0.0519656 0.0998014 0.0730665 0.044075 0.0407258 0.112372 0.161418 -0.0565971 0.122812 0.121081 -0.195516 0.0083358 0.0412041 -0.0879069 -0.0747554 -0.0101863 0.0347791 0.0750371 0.0120997 -0.0230283 0.130259 -0.0520077 -0.0593065 -0.10151 -0.0780367 -0.0676373 0.148474 -0.145433 0.0507748 0.178042 0.0368783 -0.202751 0.101035 0.103555 -0.0163919 0.0394099 0.0446401 0.169787 0.0167817 0.0720951 0.136913 0.0477856 -0.174255 -0.000720046 0.00536754 0.211141 -0.0404982 0.105086 -0.069003 -0.0020081 -0.000742746 -0.0370242 0.171859 -0.0970677 -0.00175446 -0.0710734 0.00770085 0.000964298 -0.102756 -0.0609691 0.0528151 0.128071 0.0557115 0.0156014 0.0322728 -0.0614108 -0.153489 -0.0118472 -0.171009 0.00378264 0.01283 0.0789434 0.139902 0.0980671 -0.0283893 -0.021378 0.00285825 -0.0393309 -0.012449 0.0613315 0.150466 0.118615 -0.0798372 0.0767925 0.135776 -0.0253439 -0.0272827 -0.0957807 -0.0111249 -0.0750731 -0.0546293 0.00873861 -0.0593662 0.123831 0.192832 0.0304775 -0.0859114 0.0729631 0.0684671 -0.00997372 -0.193541 -0.00106022 0.0620621 0.0774775 -0.0953788 0.0743972 -0.0563721 -0.0350905 0.0812958 0.123649 -0.0137324 
0.0661088 -0.0738868 -0.0225301 -0.0288788 9.8715e-06 0.140923 -0.00755152 0.00722457 -0.147023 -0.0141201 -0.00838956 0.089229 0.0748089 -0.116684 -0.0744933 -0.0492457 -0.130647 0.0712463 -0.0105949 0.142428 0.129438 -0.0450079 0.117948 0.212707 -0.0885778 0.057474 0.0477952 -0.25804 -0.018489 0.0507035 -0.116761 -0.056811 -0.040895 0.0713952 0.0256018 -0.0314268 -0.077573 0.124855 -0.114513 -0.0782666 -0.0524356 -0.0997352 -0.0843358 0.152158 -0.147961 -0.0202687 0.171312 0.0262397 -0.180412 0.131064 0.0869293 -0.10664 0.0146049 0.0422329 0.171156 0.00405132 0.0663178 0.121341 0.0324034 -0.165413 0.0435404 0.0291791 0.190249 -0.00608429 0.0990811 -0.127227 -0.0283095 -0.0204815 -0.0417841 0.0998215 -0.119903 0.000562789 -0.0524405 0.00863578 -0.0220804 -0.0547636 -0.036688 0.0622653 0.124759 0.0931357 -0.0173441 -0.0145825 -0.0643245 -0.131072 -0.0497279 -0.0847423 0.0563604 0.0442503 0.0580417 0.100552 0.10279 -0.0615415 -0.0355545 -0.000741871 -0.10419 -0.00288433 0.00549198 0.11603 0.100391 -0.0515202 0.120207 0.0807737 -0.051542 0.0214881 -0.030002 -0.0365104 -0.0898637 0.0395544 -0.0459019 -0.0561868 0.0695639 0.207609 0.0175138 -0.0973712 0.0414324 0.118841 -0.0458152 -0.135349 -0.0195946 0.102037 0.000241166 -0.0533037 0.0229165 -0.0388137 -0.066213 0.102838 0.0260586 -0.0459163 
0.0584482 -0.00574896 -0.05462 -0.0753426 0.0198034 0.132664 -0.0344179 -0.0403876 -0.138887 0.014463 -0.0045898 0.0990172 0.065717 -0.0811307 -0.0736635 -0.0346007 -0.0568824 0.0647546 0.0164598 0.128771 0.0862448 0.0185157 0.0546752 0.175042 -0.0840424 0.166039 0.082457 -0.22293 0.0226446 0.0576587 -0.0997512 -0.0225712 -0.0540527 0.0492115 0.0371351 -0.0132225 -0.0274563 0.177925 -0.0317802 -0.0352574 -0.0502672 -0.0411453 -0.057533 0.151464 -0.121119 0.0186967 0.205289 0.00890049 -0.193777 0.071482 0.0979495 -0.0620477 -0.0257598 0.0439102 0.178352 0.00730478 0.0391348 0.167871 0.0174011 -0.185511 0.0350743 -0.0260186 0.23643 -0.03963 0.108682 -0.150223 0.00387929 0.0273706 -0.00391614 0.116935 -0.0621015 0.0210441 -0.0440881 0.0214135 -0.020914 -0.0669647 -0.0751502 0.119033 0.104024 0.0199368 -0.0213553 0.122092 -0.0255932 -0.108908 -0.0381586 -0.153407 0.0892458 0.0662384 0.0928913 0.0610659 0.0509529 -0.07146 -0.0203661 0.0109351 -0.0338379 -0.0286368 0.0791718 0.098678 0.0712304 -0.0733171 0.0297676 0.091518 -0.0678055 0.0899508 -0.111449 -0.0188252 -0.112732 -0.00740502 -0.045556 -0.0600116 0.109503 0.193074 -0.0337547 -0.0214963 0.0418891 0.052111 -0.109647 -0.229511 -0.0619313 0.03133 0.025233 0.00959833 0.0754449 -0.0481657 -0.0589054 0.0709808 0.00287408 -0.0668956 
0.0792028 0.101832 -0.101513 -0.0825903 0.0105161 0.085753 0.00929548 -0.0501743 -0.198454 0.180596 0.0323079 -0.0129962 0.0894688 0.0367693 0.0437856 0.0201028 0.108838 0.0781934 0.133217 0.037726 0.020254 0.0561613 -0.00658768 0.0927235 -0.0499232 0.154362 0.0603427 -0.148322 0.131509 0.141622 -0.123678 0.0689631 -0.0487466 -0.0220946 0.0580504 -0.00638471 0.017063 0.125987 0.0552917 -0.0232475 -0.14033 -0.0414745 -0.063114 0.0994772 -0.0651297 0.191425 0.165223 0.0371072 -0.213283 -0.0955194 0.161247 0.105857 -0.0347635 -0.0297133 0.0830462 0.0340495 0.0475278 0.124907 0.0547607 -0.0579854 0.0424343 -0.0812963 0.146686 -0.0830231 0.1166 -0.1307 0.00176982 0.0666452 0.00435624 0.0912335 -0.0320183 0.0383211 -0.101057 -0.0630694 -0.0501509 -0.0375406 -0.0259903 0.172433 0.0832632 -0.0297757 0.00148444 0.0824155 -0.0704929 -0.0851914 0.0109059 -0.173572 0.0190323 -0.0511766 0.0754822 0.0622568 -0.0342612 -0.00212151 -0.0395162 0.0453399 0.00404038 -0.0359295 0.155423 0.0595936 0.0965562 -0.0801972 0.0554107 0.167168 -0.0338644 0.0796758 -0.166236 -0.0174797 -0.0739824 -0.0371314 0.0570408 -0.0431807 0.100135 0.0890519 -0.0533162 -0.057884 0.0643627 0.0180674 -0.106957 -0.246337 -0.0754352 0.00587625 0.0122189 -0.045226 0.0717112 0.00473796 0.00105503 0.0674834 0.00437595 -0.0903726 
0.04433 0.159432 -0.0186523 -0.0592132 -0.000320669 0.0381152 0.00535888 -0.0646599 -0.165783 0.151568 0.00954541 -0.0241199 0.0467288 -0.0521356 0.0535205 0.0090091 0.00414549 -0.0186619 0.0987032 0.0767955 0.0265147 -0.00666006 0.00274845 0.0919999 0.00136682 0.110545 0.0196088 -0.163904 0.135302 0.132832 -0.120513 0.0383794 -0.0140764 0.00871744 0.0368846 -0.0215982 0.0315816 0.14028 0.0696948 -0.0286325 -0.105067 -0.132461 -0.0482771 0.0191438 -0.0310627 0.28199 0.179961 0.0148966 -0.261679 -0.082286 0.101179 0.164003 0.00720124 -0.0260739 0.114369 0.0079488 0.0724179 0.0466648 -0.00916184 -0.0550371 0.0648161 -0.0613586 0.103996 -0.0359941 0.0920541 -0.084589 -0.015376 0.0823694 0.0119514 0.0501737 -0.0590909 0.0226168 -0.14866 -0.0413861 0.0733156 0.00558106 -0.0329711 0.180265 0.112123 0.0767015 -0.0386191 0.0715399 -0.0616122 -0.0268994 0.027395 -0.0963688 -0.00785498 -0.0142576 0.0433498 0.0891467 -0.00975571 -0.0071488 -0.0137349 0.100044 -0.10501 -0.072213 0.119715 0.0314 0.172879 -0.136983 0.0666612 0.0994753 -0.0579564 0.0758038 -0.1464 -0.00222631 -0.0518104 0.0790182 0.08143 -0.0495657 0.105785 0.116365 -0.0908779 -0.0879866 0.0663455 0.0524037 -0.188634 -0.210563 -0.061454 0.0603244 0.0197637 0.0235671 0.0224386 0.0402731 -0.00464321 0.107436 0.0439296 -0.103561 
0.0843005 0.126579 0.0126439 -0.033833 -0.000828177 0.024373 -0.0732427 -0.0806625 -0.194376 0.0657799 0.049768 -0.0053931 0.0117897 0.00210288 0.0642836 0.0656667 -0.0496889 0.0165326 0.105887 0.0835696 0.0524511 0.105301 0.11339 0.0172658 0.0118862 0.0931828 0.10284 -0.0996863 0.11356 0.152116 -0.176496 0.0256492 0.0889698 0.0477878 0.051169 -0.0360433 0.0508451 0.114696 0.0934396 -0.0278096 -0.153002 -0.117994 0.0393467 0.0314237 -0.117188 0.183244 0.194557 -0.0199602 -0.216142 0.0680212 0.146157 0.169933 -0.00203208 0.0909009 0.12007 -0.0367491 0.162318 -0.0348612 -0.0408764 -0.0422823 0.0015495 -0.0908777 0.109427 0.000967733 0.058733 -0.0453524 -0.073679 0.0223696 -0.0242189 0.107692 -0.0654859 -0.0152903 -0.122847 -0.00570226 0.0878884 -0.0454685 -0.0136905 0.0292777 0.0595684 0.100635 0.0882194 0.0233032 -0.0133021 -0.0145295 0.0443653 -0.0577298 -0.0849975 -0.0184071 0.0409338 0.167455 0.0292386 -0.0285968 -0.125409 0.119583 -0.084523 -0.0593959 0.0141896 0.170025 0.15612 -0.127956 0.0688135 0.113836 0.013778 0.0453179 -0.0677957 0.0146764 -0.0102783 0.0842888 0.139249 -0.101459 0.0703325 0.110486 -0.0486627 -0.0251059 0.0558846 0.0375331 -0.00844337 -0.129821 -0.00353532 0.0925338 0.0949593 -0.021108 0.087459 -0.0252622 0.0292618 0.0706437 0.237352 0.00746806 
0.09959 0.0466523 0.0233165 -0.0217506 0.0184365 0.0563577 -0.0189612 -0.0427535 -0.196591 -0.0283539 -0.0115257 0.0825347 0.0264259 -0.0434098 -0.0372324 0.0135476 -0.100363 0.0467032 0.00133892 0.137208 0.109395 0.0880052 0.124468 0.064988 -0.0490443 0.0710373 0.0440106 -0.121352 0.0267852 0.143882 -0.197692 -0.0240846 0.0211032 0.0771745 0.0546799 -0.0950011 -0.0106802 0.16877 -0.0201738 -0.0457227 -0.14463 -0.0290469 0.0514399 0.105201 -0.15048 0.0509911 0.207073 -0.0361141 -0.17558 0.203299 0.172609 0.0273684 -0.0428905 0.123255 0.192669 -0.0749922 0.112085 0.0435589 -0.00148549 -0.137216 0.029792 -0.0495171 0.146254 0.0113459 0.0664929 -0.123133 -0.0572375 -0.0222228 -0.0656996 0.105832 -0.0258538 0.00945581 -0.0138598 0.0637002 -0.0142195 -0.0472706 -0.0260434 -0.0403276 0.0953798 0.0912681 0.103341 0.0220127 -0.0117662 -0.0590416 0.0250824 -0.127542 -0.0385482 0.0246386 0.109523 0.151831 0.0369267 -0.0797274 -0.117279 0.0369188 -0.0731306 -0.0470102 0.0300166 0.176193 0.0813917 -0.0818213 0.0602713 0.141983 0.0180012 0.0563768 -0.108718 -0.0233132 -0.0598324 0.0749141 0.0773927 -0.0829636 0.117339 0.156813 -0.0556806 0.0268667 0.0247427 0.0639293 0.0357207 -0.0941366 -0.0369661 0.0690266 0.0278951 0.029809 0.10227 -0.0702393 0.0159533 0.0390937 0.211753 -0.0283487 
0.0620341 0.0565318 0.00372094 -0.0156251 0.0081489 0.0799144 -0.0486414 -0.0428823 -0.201393 -0.0137479 -0.0366224 0.0928501 -0.0106626 -0.0710983 -0.0495907 -0.00528517 -0.113089 0.0478416 0.0667473 0.118136 0.0901989 0.061836 0.131842 0.063235 -0.0326427 0.082623 0.0686194 -0.161834 0.0102964 0.123235 -0.183537 -0.0636935 0.0350626 0.0414086 0.0592012 -0.0757368 -0.0132813 0.13694 -0.0262769 -0.0316837 -0.131852 -0.0355274 0.0399087 0.111236 -0.155973 0.0795976 0.246739 -0.0697772 -0.194992 0.185204 0.173939 0.0329537 -0.0182613 0.109943 0.196258 -0.0483509 0.147379 0.0363873 0.00409982 -0.142539 0.0409249 -0.0325171 0.159251 -0.00936098 0.10528 -0.153104 -0.0548764 -0.0316263 -0.0508756 0.144626 -0.0295138 0.0299226 -0.0343868 0.0548389 0.00630672 -0.0266625 -0.0545292 0.00929621 0.0880466 0.0742268 0.0356177 0.0483759 -0.00400215 -0.0319324 0.0134827 -0.118169 -0.0366227 0.0346994 0.0961305 0.122963 0.00941336 -0.0569288 -0.0989534 0.0269759 -0.0537693 -0.0530678 0.0576224 0.192009 0.0832874 -0.07662 0.0360541 0.135909 0.00867955 0.0402443 -0.10758 -0.0198052 -0.0534094 0.0617497 0.0285218 -0.0659726 0.107176 0.1386 -0.019826 -0.0230151 0.0225718 0.0639526 0.0182906 -0.131512 -0.0173771 0.0758946 0.0379758 0.0156564 0.0918258 -0.106512 0.0144858 0.0655448 0.200371 -0.00866274 
0.065054 0.0526397 -0.0396168 -0.0421904 0.0380749 0.0332284 -0.0673223 -0.0348387 -0.131404 0.070002 -0.00761501 0.0395467 0.0387508 -0.0153435 0.00590651 0.0438107 -0.0081927 0.0351821 0.0565919 0.112684 0.0948906 0.0800978 0.113522 0.136171 -0.0100012 0.0863359 0.114137 -0.173148 0.0500905 0.141715 -0.135164 -0.0605395 0.0443784 0.0187972 0.0521236 -0.0410098 -0.00188994 0.176127 -0.0439639 -0.0278805 -0.170447 -0.0049741 -0.0281374 0.13656 -0.108703 0.13784 0.185967 -0.00533021 -0.127742 0.0808346 0.204077 0.0555777 -0.00850667 0.0203715 0.183241 -0.0304731 0.109818 0.0409437 0.0706512 -0.152318 0.0267078 -0.119379 0.102466 0.0149951 0.0737405 -0.205792 -0.0423139 0.0752656 0.0254226 0.108472 -0.00441527 0.0453335 -0.0657459 -0.086526 -0.00965075 -0.0115485 -0.0766346 0.124279 0.0839013 0.109381 0.0602343 0.0780099 -0.0189741 -0.0444012 0.0443444 -0.161499 -0.0111228 0.0441092 0.08782 0.0878184 -0.0701087 -0.0136254 -0.0994489 0.0419661 -0.0674939 -0.044158 0.0623923 0.117261 0.0946848 -0.131213 0.086337 0.1232 0.00402338 0.0300469 -0.16356 -0.0772573 -0.101594 -0.0232923 0.0963343 -0.0561048 0.112264 0.167918 -0.0504409 -0.0128976 0.0304171 0.0896307 -0.0996455 -0.183291 -0.130271 0.0564531 0.0135361 0.0657051 0.0575767 -0.0357342 -0.00371086 0.0628174 0.116264 -0.0328816 
0.0309241 0.125597 0.00468628 -0.0648717 0.0120027 0.0473435 -0.0345206 0.0435956 -0.066261 0.132567 0.0123296 -0.0281933 0.0118126 -0.0785379 0.0088607 0.0149513 -0.035726 0.0404986 0.0174465 0.0552223 0.0920031 0.0795649 0.0362678 0.0899831 -0.0294233 0.0437993 0.0678 -0.147784 0.089576 0.0886759 -0.113 -0.127793 -0.00762875 -0.0166265 0.0719241 -0.0399937 0.002996 0.140031 -0.0586025 0.026031 -0.150189 -0.0020279 -0.106706 0.132822 -0.0594776 0.160056 0.133171 -0.00918624 -0.123177 0.0328502 0.174906 0.146405 -0.100748 0.00747057 0.118237 -0.0353874 0.101213 -0.036728 0.053914 -0.134079 0.0686627 -0.152131 0.0637836 0.032156 0.0552121 -0.29123 0.0144736 0.092995 0.105943 0.138987 0.0569703 0.0807554 -0.027681 -0.0999871 -0.0341178 -0.00419788 -0.128905 0.242927 0.0714954 0.0532571 0.0195917 0.11792 -0.00333352 0.0246908 0.0615826 -0.113962 0.0224652 0.0601417 0.102798 0.0527625 -0.10099 -0.00810786 -0.0907935 0.00826482 -0.0868578 -0.114713 0.0930849 0.0229172 0.0648888 -0.102285 0.0828199 0.133882 -0.0152489 -0.00925703 -0.122356 -0.0864818 -0.0741179 -0.0239003 0.0863849 -0.00220599 0.101407 0.113651 -0.0768743 -0.0203157 0.0423688 0.082362 -0.130803 -0.204187 -0.152369 -0.0162067 -0.021267 0.100345 0.0492919 0.022557 0.0477076 0.0327551 0.0860823 -0.0160799 
0.0690917 0.0953439 0.01885 -0.0481685 0.0448649 0.0446472 0.00226588 0.024385 -0.128967 0.115128 -0.0254752 -0.0149226 0.0122262 -0.0137973 0.0524871 0.0201586 0.0217876 0.0304622 0.0673347 0.0673859 0.0838854 0.0793825 0.0463111 0.104821 -0.0087342 0.0554782 0.0427733 -0.142932 0.0915364 0.108863 -0.141521 -0.0805382 -0.0140379 0.001411 0.0669809 -0.0376015 0.0220102 0.156804 -0.0419423 -0.0142625 -0.13762 0.0167706 -0.0557402 0.0692668 -0.0762701 0.21019 0.142393 -0.0284217 -0.139036 0.0293118 0.177866 0.121555 -0.0597239 0.0225712 0.173431 -0.0304184 0.12297 0.00637342 0.0647493 -0.11335 0.0816204 -0.113072 0.0412806 -0.0165498 0.0845382 -0.224862 -0.00623552 0.0955426 0.070872 0.138422 0.0390643 0.0952532 -0.0583606 -0.0815877 -0.0193985 0.0212562 -0.0808123 0.214813 0.101244 0.0201546 0.0176919 0.123908 -0.000278532 -0.00192184 0.0806051 -0.148567 0.0124541 0.0595529 0.0882063 0.0800827 -0.0657248 0.0023274 -0.0775743 0.0137235 -0.0785162 -0.0796786 0.126367 0.0575774 0.0975845 -0.101225 0.0766428 0.143539 -0.000635274 0.0181204 -0.178001 -0.0807185 -0.090461 -0.037833 0.0881179 -0.0252867 0.113928 0.118079 -0.0664994 -0.0464277 0.0683368 0.0825507 -0.111365 -0.223857 -0.172316 0.00982547 -0.0118766 0.0941387 0.0642804 0.0124743 0.0220863 0.0609987 0.0959144 -0.0413918 
0.0972956 0.0412399 -0.0651656 -0.0441666 0.0166367 0.0894748 0.0323643 0.00142448 -0.126658 0.0766613 -0.0281418 0.042422 0.061526 -0.0888173 -0.0119843 -0.0234216 -0.0617049 0.0134587 -0.00844403 0.127962 0.0588424 0.00928225 0.0943431 0.0705263 -0.0819026 0.0787227 0.0194895 -0.218644 0.00924674 0.0922244 -0.149005 0.0109565 -0.0304764 0.0437222 0.0444855 -0.0570474 -0.0179043 0.231356 -0.0808111 -0.0605365 -0.126472 -0.0636197 -0.100721 0.118627 -0.13078 0.141397 0.142148 0.0187581 -0.178352 0.116701 0.138209 0.0530812 -0.0347904 0.0381697 0.172583 -0.0579579 0.0704249 0.0452085 0.0392783 -0.149547 0.0413309 -0.0850844 0.143752 -0.02822 0.103092 -0.200821 -0.0104501 0.0875792 0.00258844 0.0957926 -0.0197437 0.03934 -0.0457891 0.00294661 -0.062623 -0.0266312 -0.0621645 0.0742922 0.102447 0.0903882 0.0074249 0.0225858 -0.0774413 -0.0899909 0.0192629 -0.170875 0.0235078 0.0317878 0.124614 0.0991121 -0.00159599 -0.0573522 -0.069205 0.000596716 -0.0925466 -0.0483551 0.117227 0.0464008 0.113137 -0.0957677 0.0947287 0.128688 -0.030703 0.0440134 -0.149368 -0.0860679 -0.11496 0.0457831 0.0559563 -0.0189787 0.124667 0.199325 -0.0668566 -0.0554954 0.0661767 0.0749319 -0.0902355 -0.192155 -0.0511089 0.0566809 0.000689111 0.0539183 0.0981065 0.0372084 0.0519197 0.0115382 0.104797 -0.0839537 
0.0951346 0.0324376 -0.0785324 -0.0551365 -0.0023285 0.152179 0.0287932 -0.0536154 -0.152028 0.0948902 -0.00475569 0.0470691 0.0736722 -0.0610751 0.0208945 -0.0775358 -0.0335524 0.0807758 0.0587541 0.102975 0.00108967 0.0470853 0.073352 0.147471 -0.0991849 0.0553713 0.0560322 -0.179191 0.00835023 0.118145 -0.129007 -0.0116366 -0.0189945 0.0334382 0.0965274 -0.0208332 0.0064414 0.106357 -0.0816811 -0.0956286 -0.108366 -0.10164 -0.0607113 0.142195 -0.177567 0.0956037 0.145676 0.0975315 -0.189102 0.120084 0.138418 0.00711481 0.0333606 0.0094236 0.158322 0.00418948 0.0180781 0.0944434 0.0411925 -0.134698 -0.0168109 -0.00070749 0.183968 -0.0762066 0.0983638 -0.107926 -0.0147028 -0.00333306 -0.106243 0.102649 -0.0715678 -0.0196604 -0.0637172 -0.00710788 -0.052069 -0.0392586 -0.0290214 0.0314609 0.145603 0.0457693 0.047025 -0.000648688 -0.0973923 -0.120867 0.0289417 -0.166064 -0.0223958 -0.0204691 0.108066 0.197981 0.0633033 -0.0499338 -0.0346931 0.0185133 -0.0771796 -0.0288947 0.0693311 0.0824353 0.118196 -0.0936609 0.152976 0.169339 -0.0153107 -0.0284477 -0.132954 -0.0290475 -0.0727801 -0.0282374 0.00344142 0.0287082 0.153249 0.170249 0.0247295 -0.0841018 0.0140142 0.0483019 -0.0259473 -0.15267 -0.0161196 0.078648 0.0576772 -0.114919 0.076852 -0.00447329 0.00174063 0.0594992 0.0973388 -0.0901969 
0.0621413 0.0599637 -0.0481883 -0.020951 -0.0648293 0.147189 -2.44507e-05 -0.0344504 -0.170275 0.152416 0.0314326 -0.0157168 0.0610864 -0.00146902 0.0890367 -0.0941303 0.0134813 0.0883974 0.169874 0.0536767 -0.0320938 0.00188472 0.0702168 0.164323 -0.0431276 0.0495131 0.0649943 -0.14816 0.0496149 0.0849708 -0.08332 -0.0382719 0.00852884 -0.0115436 0.0830968 0.0143311 -0.00488893 0.0816649 -0.0554911 -0.0847279 -0.121496 -0.111642 -0.0957866 0.100966 -0.159249 0.0750365 0.126135 0.0845284 -0.174291 0.0479879 0.137444 0.0788436 0.0718196 -0.0152143 0.121107 0.0467899 0.0517268 0.0729542 0.0772332 -0.133979 -0.0510179 0.00643144 0.154743 -0.107517 0.0900633 -0.00752721 0.025356 -0.0426957 -0.11933 0.120255 -0.0840782 -0.00844523 -0.101685 -0.0020833 0.000122552 -0.0764277 -0.0194791 0.0458567 0.157011 0.0498 -0.0135623 -0.0286167 -0.0770583 -0.132579 0.0666907 -0.158062 -0.0508908 -0.0439989 0.120854 0.157091 0.0401569 0.00824874 0.0220383 0.0193537 -0.0442742 -0.0751674 0.0841773 0.112952 0.108692 -0.0968066 0.14067 0.189589 0.00690404 -0.0674843 -0.113667 0.0275025 -0.00200489 -0.0948756 0.0642955 0.00342937 0.110803 0.141638 0.062481 -0.131669 0.0431286 0.0313327 0.0139511 -0.161052 0.0267848 0.0704872 0.0607722 -0.198517 0.0404978 -0.0330016 -0.00664019 0.10733 0.134693 -0.017706 
0.0753601 0.0842243 -0.0709962 -0.0448594 -0.0319642 0.156809 0.0298799 -0.0539655 -0.168972 0.140274 0.0163889 0.0052102 0.0573215 -0.0263055 0.0505914 -0.118402 -0.0250893 0.129095 0.100115 0.057326 -0.0452349 0.0424102 0.0668203 0.138242 -0.0767523 0.018343 0.0590703 -0.12467 0.00562806 0.10075 -0.142515 -0.0467287 -0.0329727 0.0153652 0.0984 -0.0213135 -0.00735867 0.046836 -0.0856696 -0.0648033 -0.106043 -0.101081 -0.0601667 0.151749 -0.198817 0.0876307 0.129489 0.108068 -0.186351 0.122747 0.171374 0.0456601 -0.00120907 0.00449857 0.120734 0.0211975 0.0196004 0.0806141 0.0924411 -0.122888 -0.0165642 0.0159403 0.16613 -0.0803013 0.0790765 -0.0927548 0.00572589 -0.036839 -0.113319 0.152399 -0.0522926 -4.7248e-05 -0.0326989 0.014462 -0.0588421 -0.0656958 -0.0364545 0.0347924 0.138598 -0.000448437 0.0303261 -0.00281401 -0.0881749 -0.117127 0.0284383 -0.144824 -0.0392597 -0.0646473 0.127846 0.19057 0.0409579 -0.0432124 -0.00314091 -0.0412359 -0.0590185 -0.069939 0.0652161 0.0943058 0.103652 -0.0937264 0.13567 0.217243 0.0367747 -0.0485937 -0.116356 -0.0140568 -0.0526258 -0.0337833 -0.00717947 0.048812 0.162141 0.13907 0.0562955 -0.08181 -0.0162459 0.00430714 0.0353557 -0.146959 0.0240587 0.0443921 0.0662021 -0.164411 0.056798 -0.00776211 0.0074205 0.0425499 0.102499 -0.05407 
0.0271298 0.108495 -0.0961166 -0.0480883 -0.0406477 0.108023 -0.0407603 -0.0439314 -0.152404 0.159559 0.0196364 0.00894546 0.025087 -0.00875181 0.0246869 -0.0934413 0.0278106 0.119348 0.181034 0.0672659 -0.0562333 0.0341295 0.066754 0.112573 -0.0711908 0.0857987 0.119924 -0.120251 0.0554369 0.0756155 -0.119612 -0.0661451 0.0345484 -0.0465803 0.0897013 0.00557786 0.021182 0.0713914 -0.0713062 -0.0394216 -0.112899 -0.0632004 -0.0668302 0.160332 -0.186122 0.118016 0.168563 0.048181 -0.168979 0.0600637 0.147019 0.10278 -0.0109098 -0.00101767 0.10717 0.0463882 0.0595798 0.042339 0.0916468 -0.118287 -0.0193495 -0.0387553 0.170299 -0.0715375 0.0995777 -0.14207 0.0206929 -0.056325 -0.0493422 0.175395 -0.0421607 -0.0105523 -0.0506352 -0.000856505 -0.0271224 -0.0634807 -0.0636762 0.140807 0.10055 -0.0524413 -0.0433982 0.0626864 -0.0715639 -0.0649166 0.0729105 -0.150126 -0.0445317 -0.032451 0.133859 0.123791 -0.00983559 -0.00491351 -0.00286202 -0.0449272 0.0272554 -0.114179 0.102132 0.13002 0.0879003 -0.115809 0.0698334 0.207787 0.0402094 -0.0450803 -0.124687 0.000944222 -0.00585363 -0.0766416 0.0271256 0.0295373 0.116901 0.0896257 0.0597255 -0.0805051 -0.0115127 -0.0298277 0.0289483 -0.248352 0.0289597 0.0182511 0.0622429 -0.119444 0.0374478 -0.0383131 -0.00877163 0.0609136 0.114376 0.00150895 
0.110906 0.0785847 -0.030005 -0.0919479 0.0244003 0.13826 0.0278063 -0.00512376 -0.157307 0.108868 -0.0013856 0.0255899 0.095366 -0.0462319 0.0322351 -0.036172 0.0561001 0.0624679 0.00625744 0.0894734 0.0292631 0.106803 -0.0202099 0.155642 -0.0894811 0.074714 0.0678543 -0.105163 0.0675376 0.124052 -0.153774 0.0184656 -0.0295919 0.0831619 0.0738459 -0.0345814 0.0773939 0.0820503 -0.0409152 -0.0939599 -0.0746547 -0.107807 0.0145629 0.098944 -0.0956751 0.12542 0.150452 0.0885622 -0.225386 0.0534743 0.168379 -0.00363401 -0.010136 0.0176267 0.162252 0.0128879 -0.033779 0.0655904 0.0385819 -0.141976 0.020733 -0.0435279 0.111743 -0.0730059 0.0705123 -0.0987847 -0.00966542 0.0254344 -0.0825741 0.0531453 -0.0734725 -0.0505772 -0.0705373 -0.0790688 -0.0261219 -0.00310692 0.00407265 0.11872 0.147426 0.00325825 0.074151 0.0664668 -0.0494749 -0.0847138 0.0593629 -0.153244 0.00566422 -0.00470372 0.10082 0.234096 0.0294461 -0.0838236 -0.0736228 0.0734783 -0.105245 0.0209803 0.0894686 0.0307042 0.0890729 -0.100509 0.138539 0.168934 -0.0366197 0.0398388 -0.169202 -0.0297802 -0.112224 -0.0298731 -0.0388695 -0.0226305 0.155391 0.142951 -0.0340143 -0.0332487 0.0223207 0.00601708 -0.118679 -0.17797 -0.105123 0.0272251 0.0510363 -0.0544854 0.107843 0.0118207 0.0457 0.0510028 0.0571582 -0.154012 
