{
  "descriptor": [
    -0.1375260204076767,
    0.019475072622299194,
    0.002963207196444273,
    -0.06879830360412598,
    -0.07476137578487396,
    -0.05906832963228226,
    0.021563488990068436,
    -0.10038862377405167,
    0.09049349278211594,
    0.023396629840135574,
    0.15269911289215088,
    -0.047353848814964294,
    -0.3094809353351593,
    -0.09625887125730515,
    -0.00376479746773839,
    0.0925586149096489,
    -0.13495171070098877,
    -0.10128529369831085,
    -0.160496786236763,
    -0.155527263879776,
    0.07077803462743759,
    0.08124516159296036,
    0.06030016019940376,
    0.011263088323175907,
    -0.16080982983112335,
    -0.33139562606811523,
    -0.10382766276597977,
    -0.14252716302871704,
    -0.011480608955025673,
    -0.08350294083356857,
    0.035903893411159515,
    -0.015585235320031643,
    -0.17907334864139557,
    -0.10854361951351166,
    0.029143650084733963,
    0.011559094302356243,
    -0.07687640190124512,
    -0.07115184515714645,
    0.15356062352657318,
    0.02705361135303974,
    -0.15503041446208954,
    -0.052692823112010956,
    0.10101217776536942,
    0.25598788261413574,
    0.160398930311203,
    0.0815858244895935,
    0.03377508744597435,
    -0.04751158878207207,
    0.050318874418735504,
    -0.24858024716377258,
    0.10673055052757263,
    0.1703455150127411,
    0.11997976899147034,
    0.01951725222170353,
    0.17314544320106506,
    -0.0900421068072319,
    0.04541037231683731,
    0.14389637112617493,
    -0.1900930255651474,
    0.09078981727361679,
    0.10874693840742111,
    -0.0062019494362175465,
    -0.03673391789197922,
    -0.05551443621516228,
    0.1473228633403778,
    0.05232720449566841,
    -0.12383124232292175,
    -0.04716138914227486,
    0.09385199844837189,
    -0.1615699976682663,
    -0.0361514575779438,
    0.05999719724059105,
    -0.1204138696193695,
    -0.22824722528457642,
    -0.30764642357826233,
    0.05740780010819435,
    0.4024321138858795,
    0.10913700610399246,
    -0.1820581704378128,
    -0.0696893036365509,
    -0.039946299046278,
    0.009795891121029854,
    0.14932727813720703,
    0.010726239532232285,
    -0.11848197877407074,
    -0.043906234204769135,
    -0.12808693945407867,
    0.020386172458529472,
    0.14538632333278656,
    -0.03154095262289047,
    -0.027986612170934677,
    0.20923791825771332,
    0.012859177775681019,
    -0.0642128735780716,
    0.0619424544274807,
    0.10483705252408981,
    -0.14714185893535614,
    -0.023957133293151855,
    -0.04811764135956764,
    0.029386373236775398,
    0.1131478101015091,
    -0.13096441328525543,
    -0.008052409626543522,
    0.09149595350027084,
    -0.09595698118209839,
    0.09053351730108261,
    -0.0228718388825655,
    -0.0777205303311348,
    -0.05527672544121742,
    -0.07507507503032684,
    -0.11434630304574966,
    -0.08263102173805237,
    0.1353141963481903,
    -0.18141783773899078,
    0.11475720256567001,
    0.2156870812177658,
    -0.09034527838230133,
    0.1136019304394722,
    0.003086202312260866,
    0.0745488628745079,
    -0.06975496560335159,
    0.025505712255835533,
    -0.14004260301589966,
    -0.08304353058338165,
    0.054782308638095856,
    -0.021072853356599808,
    0.017962057143449783,
    -0.03027397207915783
  ]
}