0.0966613 -0.0504367 -0.123081 0.0104974 0.132673 0.167446 0.0449882 -0.062051 -0.029979 -0.107009 0.0213931 0.1397 0.0828257 -0.12479 -0.136536 0.0190867 -0.0957062 0.0907508 -0.162107 0.133333 0.20623 -0.0643893 0.0792016 0.18743 -0.0178404 -0.042479 -0.0350142 -0.261099 -0.00599255 0.117926 -0.020038 0.0560484 -0.0976259 0.0699709 -0.0171158 -0.00178937 -0.116452 0.0448059 -0.0640077 -0.033054 0.0383505 -0.019111 -0.059752 0.136198 -0.120312 -0.0342759 0.144409 0.0242422 -0.108947 0.0477859 0.035929 -0.0986788 -0.0182391 -0.0217316 0.105186 0.0081359 0.0215298 0.191073 -0.000652675 -0.102574 -0.0129011 0.0402149 0.223084 -0.0533839 0.0497921 -0.152497 -0.0262148 0.0549879 -0.0365213 0.0812677 -0.0181131 0.0806974 -0.0429646 -0.0553367 -0.0440708 0.0328751 -0.0572801 0.0589778 -0.0224991 0.0912041 -0.0170769 0.080729 -0.0362921 -0.0672341 -0.127077 0.0711646 0.101295 0.0186015 -0.0799835 0.00100435 0.0921181 -0.129352 -0.101729 -0.017252 -0.0691455 -0.0169194 -0.0569459 0.0557698 0.0534998 -0.0253404 0.0751854 -0.0258238 -0.0352611 0.136842 -0.0718911 -0.00369387 -0.140615 0.130043 -0.0604466 -0.0397084 0.0405428 0.13402 -0.061477 -0.0227472 0.0201632 0.140645 -0.167782 -0.0614799 -0.0167101 0.142331 -0.0078149 0.0344642 -0.0284518 0.0198343 -0.103826 0.086299 -0.102541 -0.054498 
0.10855 -0.0310321 -0.111309 0.0103013 0.120313 0.202757 0.0592184 -0.07016 -0.0710125 -0.0771198 0.040748 0.142204 0.101353 -0.100772 -0.101447 -0.0205326 -0.0751694 0.10253 -0.117651 0.130967 0.188876 -0.0429106 0.0666988 0.216746 -0.0146116 -0.0381933 -0.0495585 -0.251244 0.0224979 0.140262 -0.0214892 0.0365278 -0.109461 0.0608923 -0.00435935 0.00605771 -0.118047 0.0374796 -0.0478629 -0.0202833 0.0303679 -0.0202441 -0.0776946 0.133637 -0.1586 -0.0530782 0.152204 0.0250511 -0.108861 0.0496226 0.0594034 -0.0649251 -0.0233923 -0.0182267 0.108118 0.0230196 0.0119765 0.228026 -0.00325977 -0.0908126 -0.0431973 0.0477452 0.245357 -0.0968704 0.0569105 -0.138181 0.000315132 0.0174761 -0.0827587 0.0837234 -0.00695385 0.0978959 -0.0471389 -0.0281365 -0.0358413 0.0234031 -0.0580387 0.0385878 0.0133681 0.10508 -0.0199105 0.063519 -0.00711886 -0.0646174 -0.0998581 0.0341539 0.104762 -0.00344869 -0.0626911 0.00398012 0.0893604 -0.128327 -0.0692172 -0.00238757 -0.0726772 -0.0651697 -0.0396684 0.0691051 0.0525905 -0.0192455 0.0745257 0.0333254 -0.0272338 0.136253 -0.10062 0.0312507 -0.116438 0.102525 -0.0395633 -0.0301422 0.0620157 0.122419 -0.057315 -0.0275781 0.0159163 0.144921 -0.131378 -0.0668862 -0.0210054 0.158255 -0.0027037 -0.0359316 -0.0420035 0.00136884 -0.110079 0.118589 -0.0788119 -0.0295128 
0.103114 -0.0173847 -0.111055 0.0138187 0.113069 0.213172 0.0685244 -0.0561237 -0.0240451 -0.103588 0.0360055 0.117881 0.0874804 -0.12926 -0.100485 0.00567712 -0.107059 0.0760741 -0.140963 0.0904208 0.213656 -0.039921 0.0572703 0.207053 -0.0030548 -0.0790296 -0.0495904 -0.25984 0.00770781 0.143994 -0.0015166 0.024746 -0.0980224 0.0778021 0.00507606 0.00192701 -0.0909791 0.00226158 -0.0532446 -0.0168416 0.0480045 -0.0412914 -0.0389954 0.128904 -0.121109 -0.0450127 0.146968 0.0197063 -0.112119 0.0471823 0.0460727 -0.0853296 -0.00809432 -0.011104 0.108978 0.0399313 0.00859952 0.200927 -0.0118616 -0.0916743 -0.0421684 0.0473062 0.224413 -0.105237 0.0518768 -0.130569 -0.013203 0.0178113 -0.0676979 0.0832336 -0.0222045 0.0841202 -0.0725329 -0.0620746 -0.0193983 0.0453522 -0.0480279 0.0489913 -0.014269 0.109116 -0.0065627 0.0568236 -0.0093601 -0.0478539 -0.119315 0.0904757 0.0981732 -0.0250929 -0.0953434 0.0286164 0.09733 -0.160931 -0.100147 -0.0149045 -0.0852881 -0.0279241 -0.0645452 0.0578227 0.063651 0.000483485 0.0888643 0.000905148 -0.0281683 0.123244 -0.0835055 0.0137638 -0.122932 0.122526 -0.0846517 -0.0318792 0.0388557 0.0969554 -0.0586238 -0.0498245 0.0265277 0.161279 -0.137303 -0.0374733 -0.0132165 0.167379 0.0244102 -0.0177345 -0.0323973 0.0246469 -0.100044 0.108271 -0.07363 -0.0265238 
0.095414 -0.0482061 -0.101804 0.021177 0.107302 0.161805 0.0529867 -0.0426433 -0.00493082 -0.128302 0.0343079 0.127102 0.075999 -0.147048 -0.125427 0.0125602 -0.148611 0.0581089 -0.168418 0.141921 0.216228 -0.0738353 0.0943354 0.167808 -0.0224304 -0.0549045 -0.0386862 -0.267332 -0.0135273 0.109554 -0.0302394 0.0394716 -0.071627 0.0935983 -0.0165021 -0.00936168 -0.0934712 0.0754104 -0.0798481 -0.0393464 0.0481618 -0.0514969 -0.0588599 0.124205 -0.131146 -0.0438169 0.141573 0.00824247 -0.105014 0.0817745 0.0119539 -0.091957 -0.0235027 0.0141918 0.12855 0.00259847 0.0219307 0.152989 -0.031984 -0.105634 -0.020449 0.0154574 0.227137 -0.0479852 0.0545489 -0.131886 -0.0242413 0.0361602 -0.0312016 0.0866565 -0.0324133 0.0681486 -0.0519663 -0.0292941 -0.0113544 0.0204646 -0.0510035 0.0417779 -0.0208451 0.109862 -0.0203911 0.0550648 -0.0304876 -0.0663059 -0.120369 0.094302 0.0955668 0.0264358 -0.0697825 0.0227288 0.12138 -0.161294 -0.109858 -0.0259892 -0.0935122 -0.0379165 -0.0718473 0.056515 0.0836899 -0.0222279 0.0794784 -0.0356252 -0.0297931 0.11721 -0.0478627 0.00304665 -0.120339 0.155882 -0.0566149 -0.0547422 0.0194187 0.138462 -0.0693997 -0.0402273 0.0473233 0.149026 -0.130201 -0.0535277 0.0112402 0.162077 0.00961843 0.0423974 -0.0189766 0.0429038 -0.0778572 0.0847918 -0.0404809 -0.0250827 
0.0743339 -0.0292388 -0.112902 0.00965955 0.0859162 0.141503 0.0221721 -0.0566629 0.0106768 -0.112085 0.0549199 0.138226 0.0661672 -0.164896 -0.169344 0.0237444 -0.163349 0.0492504 -0.17341 0.156568 0.204794 -0.0798565 0.089077 0.113984 -0.0400608 0.00835705 -0.00120062 -0.254693 -0.00936176 0.0937498 -0.0449761 0.0459662 -0.0483584 0.0825357 -0.015618 -0.0189338 -0.0917873 0.130898 -0.0598018 -0.0458999 0.029287 -0.0716132 -0.0783939 0.136168 -0.120808 -0.0434009 0.14072 0.00170079 -0.123017 0.0723907 0.00360845 -0.0452378 -0.0435619 0.0247105 0.128044 -0.0134103 0.0213967 0.123813 -0.0598661 -0.120192 -0.0177992 -0.0378824 0.268684 -0.0134751 0.0711534 -0.145494 -0.0319469 0.0629908 -0.00906879 0.101911 -0.0316742 0.0391796 -0.0463661 -0.0220677 -0.00590616 -0.00200704 -0.0607733 0.0532915 -0.0383405 0.108592 -0.0379859 0.0596273 -0.0219088 -0.0600395 -0.13167 0.0628576 0.100369 0.0575281 -0.0261422 0.0182151 0.0998341 -0.165983 -0.110721 -0.00108833 -0.0831298 -0.0557681 -0.0555196 0.0464899 0.0847986 -0.0455581 0.0722605 -0.0274687 -0.0551473 0.114906 -0.0178601 0.00216061 -0.0999791 0.16538 -0.0373162 -0.0741073 0.0116836 0.155196 -0.0801505 -0.00748926 0.0702857 0.119107 -0.152387 -0.0698949 0.0393861 0.139163 0.00646677 0.0601106 0.00336846 0.0303359 -0.0361323 0.0799158 -0.00425576 -0.0213605 
0.0986023 -0.0687408 -0.103189 0.00948232 0.109551 0.162062 0.0439159 -0.0347621 -0.00819103 -0.119429 0.0391332 0.146264 0.0701052 -0.141452 -0.137482 0.00944258 -0.133828 0.0499797 -0.162754 0.137789 0.204999 -0.065531 0.0839431 0.176994 -0.0247615 -0.0155244 -0.00732359 -0.260622 -0.0059118 0.0898364 -0.0317602 0.0402297 -0.0765902 0.0866015 -0.0381444 -0.0135939 -0.121631 0.0887926 -0.0783808 -0.0295762 0.0436725 -0.042937 -0.0939762 0.129352 -0.115869 -0.0465828 0.124897 0.00751294 -0.110046 0.062695 0.015278 -0.0724874 -0.0200986 -0.00492493 0.119317 0.00344858 0.0157142 0.180223 -0.0379659 -0.100833 -0.0180631 0.00784603 0.245562 -0.0283123 0.0490024 -0.133698 -0.0234758 0.0600655 -0.0207363 0.0948462 -0.0350944 0.0635726 -0.0544007 -0.0279005 -0.0154072 0.0163879 -0.0548843 0.0407666 -0.0234032 0.113199 -0.0334503 0.0619514 -0.0238737 -0.0815559 -0.12013 0.05749 0.117486 0.0392864 -0.064653 0.00759242 0.111384 -0.141876 -0.10523 0.000460009 -0.0744086 -0.0296599 -0.0527791 0.0298582 0.0864317 -0.0305785 0.0779844 -0.0353515 -0.0496576 0.115563 -0.0578568 -0.00269039 -0.128142 0.130106 -0.0535689 -0.0763555 0.0400727 0.161815 -0.0637479 -0.0342322 0.065133 0.14521 -0.157077 -0.0648051 0.0188459 0.155891 0.00284367 0.0387228 -0.0221616 0.0258863 -0.0747664 0.0978313 -0.0484855 -0.0341372 
0.113359 -0.0539651 -0.106672 -0.00841629 0.113931 0.189943 0.0464426 -0.0456482 -0.0693664 -0.118471 0.0274346 0.133245 0.0990913 -0.107534 -0.124697 -0.00986969 -0.0996826 0.0721914 -0.13714 0.130397 0.206605 -0.0498877 0.0794823 0.185285 -0.0214368 -0.0238526 -0.0286213 -0.247582 0.00963426 0.113952 -0.0375397 0.0298914 -0.10342 0.0754743 -0.0211302 -0.0155287 -0.125943 0.0639534 -0.0542442 -0.0288086 0.028072 -0.0258026 -0.0726466 0.134942 -0.133928 -0.0450969 0.142114 0.0159672 -0.122172 0.0636713 0.0328969 -0.0820399 -0.0103275 0.000775131 0.105386 0.00140473 0.0245502 0.212892 -0.0156973 -0.117488 -0.0177773 0.05174 0.244157 -0.053061 0.0406352 -0.123535 -0.0129254 0.0417881 -0.0488149 0.0690452 -0.0263411 0.070584 -0.0471047 -0.0339568 -0.0273642 0.0223072 -0.0570958 0.00958186 0.0087936 0.120197 -0.0164085 0.0531257 -0.0126514 -0.0784711 -0.111876 0.0458419 0.108488 0.0151616 -0.0631655 0.00582831 0.109117 -0.137613 -0.0852339 0.00227971 -0.0794644 -0.0408945 -0.040876 0.0704708 0.0578445 -0.0231208 0.0787882 0.00917697 -0.0379952 0.141915 -0.0893132 0.0131969 -0.133845 0.132279 -0.0561221 -0.0640045 0.0667528 0.137714 -0.0709506 -0.0234507 0.0301099 0.155159 -0.151757 -0.0560534 -0.00306622 0.150906 -0.014451 -0.00793169 -0.026524 -3.0483e-06 -0.0990371 0.0989837 -0.0755321 -0.0387521 
0.08554 -0.0993867 -0.100839 -0.00902837 0.0887806 0.155989 0.0286156 -0.0516465 -0.0661649 -0.125524 0.0124992 0.13683 0.101891 -0.0576194 -0.152952 -0.0484922 -0.126174 0.0647161 -0.0959918 0.130019 0.211769 -0.087643 0.0717037 0.185707 -0.0202795 -0.000185508 -0.0147096 -0.23888 -0.0177524 0.120033 -0.0541139 -0.00903212 -0.0996015 0.043319 -0.0162017 -0.00785008 -0.157452 0.0729603 -0.0675353 -0.0568183 -9.78586e-05 -0.0121008 -0.0996521 0.133367 -0.117166 -0.0535879 0.12549 0.0103284 -0.0957691 0.0497433 -0.00112353 -0.0858651 0.0365916 0.00478708 0.127447 0.00959284 0.0252557 0.223354 -0.0232999 -0.140094 0.0222652 0.0617525 0.256908 -0.00305002 0.0335878 -0.0947404 -0.00691281 0.0513739 -0.0184387 0.0543506 -0.0272366 0.0567925 -0.0371407 -0.0566887 -0.0379987 0.0326672 -0.0556946 -0.0247884 0.0301118 0.123448 -0.037717 0.0389106 -0.0277561 -0.0920839 -0.116645 0.0150762 0.111688 0.0407776 -0.0261207 -0.0152136 0.110533 -0.11388 -0.028965 0.0100202 -0.0903678 -0.0535065 -0.0474349 0.0678907 0.0943243 -0.0257446 0.101265 0.0146836 -0.0411665 0.0932132 -0.0820972 0.0247398 -0.123442 0.0997931 -0.0744132 -0.0586164 0.0816389 0.130722 -0.0713396 -0.0430268 0.0265993 0.190901 -0.141455 -0.0432996 -0.00440558 0.125893 -0.0487293 -0.0249901 -0.0445366 -0.0322734 -0.121546 0.138373 -0.08004 -0.0229346 
0.0706103 -0.0603891 -0.0852643 0.000125143 0.11707 0.161652 0.00595896 -0.100739 -0.062929 -0.107806 0.0260138 0.141061 0.0923723 -0.032586 -0.117205 -0.0046029 -0.115053 0.0787674 -0.086295 0.133923 0.216935 -0.0726345 0.0891475 0.196132 0.0146395 0.00576925 -0.0252087 -0.23589 0.0110855 0.145797 -0.0219204 0.0129282 -0.0785882 0.0389245 -0.000788215 0.0315025 -0.134944 0.0746046 -0.0326267 -0.0464333 -0.00356347 0.00248992 -0.0631903 0.113681 -0.125427 -0.0437536 0.164613 0.00644922 -0.097404 0.0310492 0.0131065 -0.0745329 0.0222532 -0.00147494 0.15216 0.0266952 0.0293855 0.234736 -0.0286318 -0.129132 -0.0115386 0.0460274 0.259709 -0.0404189 0.0664022 -0.0756514 -0.0197502 0.0652884 -0.042889 0.0967771 -0.0039731 0.0987115 -0.0565439 -0.060963 -0.00940661 0.032959 -0.0631152 0.00452004 0.020772 0.101859 -0.0193848 0.0851219 -0.0150386 -0.0721312 -0.120164 0.0149887 0.0952039 0.0506174 -0.0357164 -0.00104689 0.0970047 -0.114321 -0.0389109 0.0211923 -0.076484 -0.0592567 -0.0636254 0.0997318 0.092784 -0.032826 0.0787586 -0.0042738 -0.0426777 0.0913985 -0.0990792 0.0572517 -0.123766 0.0774244 -0.0311792 -0.0637569 0.0521543 0.135397 -0.070296 -0.0236834 0.0432164 0.176398 -0.149056 -0.0530632 -0.0249776 0.146681 -0.00792456 -0.00944689 -0.0333058 -0.0313047 -0.138699 0.160776 -0.0550266 -0.00665129 
0.0986831 -0.0467897 -0.112628 0.0355556 0.131925 0.180639 0.0666987 -0.0802626 0.00257869 -0.123894 0.05389 0.144065 0.0682996 -0.12099 -0.126212 -0.0109498 -0.1337 0.0905147 -0.149817 0.123871 0.212216 -0.0650224 0.0784456 0.185756 0.00417791 -0.0702242 -0.0425844 -0.252087 -0.00716027 0.138366 -0.0084015 0.0369452 -0.0878859 0.0747233 -0.00164624 0.00712987 -0.111531 0.0299059 -0.0561008 -0.0385116 0.0554597 -0.0276757 -0.0615674 0.127122 -0.146859 -0.0627408 0.130998 0.016101 -0.0764664 0.0616159 0.0102423 -0.0693206 -0.0175755 -0.0074632 0.121745 0.0202201 0.00929799 0.189905 -0.0426406 -0.077979 -0.0336284 0.02382 0.249207 -0.0656501 0.0459236 -0.123475 -0.0149488 0.0282293 -0.0475415 0.115337 -0.00981877 0.0961117 -0.0501111 -0.0305926 -0.0326913 0.0200269 -0.0528407 0.0297379 -0.0319551 0.0963321 -0.0283146 0.0821104 -0.0198764 -0.0591277 -0.114575 0.0817227 0.0957394 0.0147361 -0.0791071 0.0140732 0.129126 -0.152164 -0.0930708 -0.0271341 -0.0706205 -0.0639765 -0.0873345 0.0496311 0.0847274 -0.0210265 0.0759888 -0.0211711 -0.0179251 0.104212 -0.0551229 0.0235184 -0.105413 0.129508 -0.0479816 -0.0270703 0.0303184 0.117978 -0.0631604 -0.0313327 0.0407559 0.152673 -0.113906 -0.0479333 0.0158376 0.168609 0.0240122 0.0197917 -0.0429953 0.0317933 -0.106565 0.10294 -0.0449696 -0.00660557 
0.0954824 -0.0394159 -0.113652 0.0472016 0.114464 0.199223 0.0790519 -0.0678499 0.0191403 -0.119381 0.0793938 0.135508 0.0532598 -0.125505 -0.0999543 -0.04607 -0.12942 0.0802998 -0.121909 0.126157 0.184934 -0.0561783 0.0378807 0.219384 0.0131998 -0.0797976 -0.0490131 -0.227349 0.012947 0.120616 0.0217741 0.0123318 -0.10029 0.0739233 -0.000644152 0.0405133 -0.101471 -0.0182197 -0.0670178 -0.0370795 0.093874 -0.0361671 -0.0689104 0.140875 -0.158135 -0.0915868 0.128573 0.0329513 -0.0641092 0.0661397 -0.0215908 -0.0553359 -0.0270428 -0.0167496 0.126602 0.0452165 -0.0455034 0.206593 -0.0503255 -0.072847 -0.0724364 0.037832 0.272369 -0.0909593 0.0217309 -0.0877979 0.0173655 -0.0267079 -0.0642636 0.114945 -0.0122784 0.10007 -0.0445605 0.0064361 -0.013385 -0.00743384 -0.0454848 0.0462618 -0.0181668 0.0817879 -0.0334806 0.0926113 -0.0144516 -0.0714546 -0.0865542 0.0898561 0.089867 0.00438983 -0.0702733 0.0250983 0.169089 -0.149996 -0.0863727 -0.0386977 -0.0543802 -0.0903405 -0.0851845 0.0268675 0.0738973 -0.0289292 0.0580825 -0.0140595 -0.00235078 0.066753 -0.0812848 0.0772937 -0.0763321 0.106137 -0.0555185 -0.00188891 0.0517297 0.108197 -0.0522446 -0.0425627 0.0348059 0.122554 -0.0635265 -0.0706185 0.0394198 0.166218 0.0415464 -0.0175141 -0.0464799 0.0566651 -0.132837 0.108175 -0.0230137 0.0128867 
0.110863 -0.077254 -0.116882 0.0487076 0.127209 0.165239 0.0878641 -0.0274824 0.0126755 -0.136304 0.069153 0.168434 0.0570215 -0.146348 -0.159163 -0.01126 -0.0854786 0.0766422 -0.16439 0.142744 0.213562 -0.0748642 0.01828 0.209281 -0.00752407 -0.0546537 -0.0327913 -0.224983 0.00807924 0.107882 -0.0179 0.0609618 -0.0937274 0.0918932 -0.0494319 -0.00900604 -0.115492 0.0126993 -0.0717403 -0.0481532 0.0956139 -0.0261558 -0.0625808 0.120288 -0.109146 -0.0946491 0.11423 -0.00494435 -0.0892725 0.0358399 -0.00767623 -0.0792908 -0.0298784 -0.021165 0.111006 0.0335557 -0.0460784 0.195204 -0.0602036 -0.0671451 -0.0316911 0.0234689 0.250109 -0.066271 0.0227074 -0.0983739 -0.0161257 0.000216747 -0.0518503 0.0724609 -0.031657 0.0625922 -0.0459473 -0.0147259 -0.0334912 0.0211751 -0.00621763 0.0589629 -0.0430122 0.0690078 -0.0606635 0.0844308 -0.0142262 -0.083961 -0.0984043 0.0934055 0.115586 0.0185442 -0.0786652 0.00430569 0.141739 -0.160905 -0.118928 0.004299 -0.0406526 -0.0316239 -0.0641317 -0.0109252 0.0608684 -0.0164442 0.0589316 -0.0426894 -0.0367381 0.122089 -0.0665495 0.0430577 -0.0909282 0.124724 -0.0830932 -0.0601791 0.0316167 0.117888 -0.0630039 -0.029594 0.0587558 0.107154 -0.123642 -0.0629183 0.0362151 0.150416 -0.00771917 0.0319536 -0.0441678 0.0438576 -0.088576 0.10664 -0.0599634 -0.051621 
0.0857212 -0.0454039 -0.103326 0.0157151 0.107782 0.148096 0.0477086 -0.0601048 -0.0140707 -0.129698 0.0358125 0.14206 0.0534212 -0.143483 -0.158138 0.0113058 -0.165205 0.0460103 -0.141409 0.147695 0.220357 -0.089099 0.0923636 0.116376 -0.0133184 0.00249041 -0.0219504 -0.250584 0.0102669 0.10232 -0.0418293 0.0409677 -0.0716279 0.0745734 -0.00311549 -0.0249043 -0.105392 0.126003 -0.0368484 -0.0683002 0.0330379 -0.044358 -0.0603356 0.121708 -0.129967 -0.0537672 0.142946 -0.0104725 -0.108996 0.071096 -0.0183297 -0.0475382 -0.0252195 0.0251339 0.14418 -0.0135152 0.0343082 0.16357 -0.0769928 -0.123627 -0.00974116 -0.0183231 0.284757 -0.0272041 0.0747252 -0.103752 -0.039375 0.0473705 -0.018979 0.104232 -0.0343461 0.0745819 -0.0528244 0.00483736 -0.0185248 -0.00902207 -0.0446601 0.0229902 -0.0182572 0.101136 -0.044412 0.0663115 -0.0153079 -0.0718284 -0.110022 0.0322875 0.0925264 0.0755044 -0.0128059 0.00985406 0.137949 -0.150481 -0.102902 -0.00319989 -0.0609977 -0.0678362 -0.0427235 0.0720414 0.0897746 -0.0328734 0.0610184 -0.029532 -0.0505175 0.111728 -0.0443532 0.0220007 -0.0842259 0.157024 -0.0144793 -0.0721763 0.0217247 0.15425 -0.0858615 -0.011098 0.0947461 0.132577 -0.117864 -0.060507 0.045604 0.147485 0.00187313 0.0553972 0.00580294 0.0165584 -0.0718913 0.0901067 0.00727799 -0.0171457 
0.0595185 -0.0429037 -0.0889069 0.0194887 0.0900885 0.12496 0.0471069 -0.0620152 0.00898311 -0.0940875 0.0525602 0.148404 0.0721383 -0.154115 -0.172902 0.0173964 -0.181941 0.0568394 -0.156166 0.157338 0.22734 -0.113327 0.0825232 0.108239 -0.0278204 0.0201845 -0.0413203 -0.252139 0.0199041 0.104979 -0.0422651 0.0620369 -0.0585404 0.072656 -0.00749035 -0.0297054 -0.104071 0.147153 -0.0254876 -0.0714325 0.0330064 -0.0691654 -0.073313 0.111049 -0.123071 -0.0927609 0.130338 -0.00671262 -0.0901342 0.0501316 -0.0171469 -0.0413729 -0.0434848 0.0308353 0.141977 -0.00859265 0.032142 0.130413 -0.0894905 -0.119712 -0.0071532 -0.0486148 0.276361 -0.00717436 0.0798707 -0.108747 -0.0336428 0.0413728 -0.0123219 0.0904985 -0.0422239 0.0700652 -0.0531044 0.0108111 -0.0163889 -0.0181285 -0.0435118 0.0377018 -0.0184815 0.101087 -0.0528195 0.057194 -0.00482284 -0.0475346 -0.110429 0.0338737 0.109581 0.094094 0.0126644 -0.00619216 0.115735 -0.149901 -0.0841313 0.00960079 -0.0856827 -0.0875934 -0.0594002 0.062668 0.0908085 -0.0281593 0.076217 -0.0353896 -0.0602905 0.112315 0.00517076 0.0218659 -0.0632689 0.161039 0.00613984 -0.0689214 -0.0219126 0.152085 -0.0992645 -0.00753689 0.0985614 0.127867 -0.112041 -0.0542861 0.042144 0.140166 -0.000723421 0.0583641 -0.00336089 0.0160806 -0.0722239 0.0985217 1.41125e-05 0.00286222 
0.0586581 -0.0354943 -0.0961784 0.00633303 0.100434 0.135173 0.0372741 -0.0664336 0.0110163 -0.112571 0.0358939 0.126135 0.0569709 -0.162517 -0.174719 0.0392374 -0.200091 0.0417225 -0.157846 0.131723 0.236739 -0.0959164 0.091925 0.0980814 -0.0190676 0.000733115 -0.0376319 -0.258854 0.027654 0.105239 -0.0281245 0.0463866 -0.0739041 0.0553141 0.00424692 -0.0286628 -0.118513 0.121137 -0.0186733 -0.053875 0.0195916 -0.0619671 -0.0770852 0.114446 -0.0937662 -0.0556868 0.126845 0.00720485 -0.101017 0.039892 -0.0295975 -0.029705 -0.0159366 0.0108518 0.116125 -0.015194 0.0522655 0.140394 -0.0876462 -0.111798 -0.00172153 -0.0211205 0.279491 0.00447298 0.0709915 -0.115243 -0.039993 0.0570311 0.00285661 0.0903672 -0.0398228 0.0758832 -0.0599549 -0.0107866 -0.0178272 -0.00619982 -0.0547919 0.029477 -0.0292174 0.123761 -0.0247391 0.0543772 -0.0197127 -0.0445994 -0.123873 0.0525565 0.0935182 0.0822656 -0.0208611 -0.00869581 0.124149 -0.129438 -0.0997853 0.0140259 -0.0803537 -0.0669848 -0.0627491 0.0684643 0.095379 -0.025871 0.0944164 -0.0499268 -0.0702944 0.100747 -0.0033712 0.013073 -0.0703688 0.168443 0.00208058 -0.0625253 -0.00292916 0.146173 -0.0931756 -0.0174827 0.0940447 0.157731 -0.144644 -0.0228487 0.0346995 0.140165 -0.0055069 0.0559647 -0.00229055 0.00678521 -0.0866903 0.107878 -0.0214222 -0.00817381 
0.0653716 -0.0307212 -0.109767 -0.00499708 0.0916768 0.159336 0.0266237 -0.0447786 -0.0339889 -0.0789666 0.0480662 0.10732 0.0875398 -0.118339 -0.138044 0.0398041 -0.162912 0.0560049 -0.123787 0.122091 0.238971 -0.100176 0.0808566 0.165444 0.00610995 -0.0138045 -0.0193538 -0.255104 0.0473488 0.121142 -0.0226413 0.0215012 -0.0818535 0.0536425 -0.0287402 0.000144906 -0.144676 0.0652728 -0.0364338 -0.0293135 0.0114069 -0.0641792 -0.0595116 0.141228 -0.0915701 -0.0600537 0.155729 0.0127088 -0.118008 0.0303827 0.00370916 -0.0539828 -0.0218555 -0.00690062 0.109789 0.0213363 0.0353614 0.181003 -0.0263645 -0.120936 -0.0150614 0.00961904 0.26695 -0.016411 0.0429028 -0.0981903 -0.036617 0.0410945 -0.00981861 0.0831824 -0.0461548 0.0960596 -0.076234 -0.036558 0.0016847 -0.00229788 -0.0468075 0.0574972 -0.0181694 0.118321 -0.0189299 0.0454973 -0.0187871 -0.0590608 -0.134518 0.0809746 0.0906897 0.0377726 -0.0258079 -0.0105894 0.104912 -0.122336 -0.105696 0.00278925 -0.0720211 -0.0448235 -0.0729586 0.0914128 0.0932346 -0.0342453 0.0816439 -0.0422348 -0.0407706 0.106655 -0.0588181 0.038766 -0.11397 0.148738 -0.0192181 -0.0868197 0.00753138 0.148738 -0.0766427 -0.0450199 0.0757282 0.165957 -0.126626 -0.0405252 0.0227626 0.156611 -0.00124671 0.00652154 -0.0149171 0.0106008 -0.143816 0.124475 -0.0544292 0.00700014 
0.0590534 -0.0251234 -0.120222 -4.95075e-05 0.113039 0.166521 0.0206215 -0.077902 -0.0462136 -0.052146 0.0539862 0.10376 0.0892651 -0.0592138 -0.100924 0.0435328 -0.129469 0.0639229 -0.0692134 0.110071 0.229081 -0.0991299 0.0859524 0.182297 0.0435918 -0.00605477 -0.0285655 -0.244632 0.0746918 0.141022 0.00975956 0.0298583 -0.0831109 0.0224986 -0.0249734 0.0405721 -0.147135 0.0444785 -0.00658378 -0.0281131 0.00865795 -0.0320973 -0.0597131 0.129102 -0.109701 -0.0567342 0.165521 0.0167074 -0.0920962 -0.00756799 -0.00125525 -0.0343953 -0.008233 -0.0252467 0.117355 0.0424601 0.0387873 0.221495 -0.0178232 -0.108486 -0.0404468 0.0174372 0.274698 -0.0459489 0.0502762 -0.0589852 -0.0295865 0.050392 -0.0157298 0.100987 -0.0258229 0.142171 -0.0896677 -0.0440369 0.0131275 0.00220533 -0.0484396 0.0628041 -0.0149803 0.100674 -0.0201849 0.0744738 -0.00893264 -0.0560027 -0.119192 0.0592848 0.0851817 0.0406251 -0.0285105 -0.0331777 0.103112 -0.0897738 -0.085958 0.00437906 -0.0503215 -0.0702864 -0.0714159 0.116245 0.0917731 -0.0361964 0.0693753 -0.0433517 -0.0238169 0.085821 -0.094123 0.0791845 -0.109486 0.104266 0.0139266 -0.076124 0.00922931 0.141895 -0.0681946 -0.0490792 0.0824997 0.165073 -0.116256 -0.0528561 0.00997268 0.163125 0.0113836 -0.0186063 -0.0213734 -0.000935756 -0.187883 0.157505 -0.0582777 0.0381464 
0.0757551 -0.0539985 -0.0885841 0.0190366 0.118198 0.160375 0.0444529 -0.0651536 -0.0314019 -0.0818473 0.0460091 0.132563 0.0678029 -0.108475 -0.132049 0.0200396 -0.149801 0.08165 -0.102831 0.116073 0.248829 -0.103843 0.0970295 0.140123 0.0217246 0.00256514 -0.0476292 -0.263015 0.0449068 0.119039 -0.00809344 0.0535219 -0.0826964 0.0460547 0.000518811 -0.0131206 -0.1427 0.100528 0.0044355 -0.0622792 0.0206517 -0.0312279 -0.0866726 0.110677 -0.1259 -0.0870688 0.131604 -0.00838009 -0.0851154 0.0141294 -0.00165979 -0.019425 -0.00790365 -0.000532551 0.115482 0.00955432 0.0712537 0.182079 -0.0632615 -0.114716 -0.0121329 -0.0129078 0.273953 -0.0297687 0.0702331 -0.0831539 -0.0340148 0.0529519 -0.0138191 0.123007 -0.0300581 0.118113 -0.0787981 -0.0166233 -0.0315497 -0.0209808 -0.0525749 0.0233112 -0.0138289 0.114348 -0.0612855 0.0729108 0.00507801 -0.0610452 -0.0978402 0.0166391 0.105688 0.0771769 -0.0124586 -0.0310692 0.120877 -0.102729 -0.0831888 0.0125675 -0.0608283 -0.0897638 -0.0558819 0.105112 0.0800908 -0.0204702 0.0845992 -0.0277224 -0.0470502 0.107576 -0.0277782 0.0390546 -0.0693333 0.119457 0.0364754 -0.0759386 -0.0103793 0.148562 -0.0916769 -0.0320482 0.119292 0.154824 -0.111101 -0.0606798 0.0378826 0.159564 0.0085589 0.0189269 -0.0214843 -0.0127865 -0.117722 0.126952 -0.00499257 0.0297335 
0.0792848 -0.0704274 -0.0966861 0.0068906 0.124772 0.171083 0.0325057 -0.0562707 -0.0283263 -0.0977522 0.0381575 0.12713 0.0660402 -0.0988508 -0.118776 0.00307888 -0.153612 0.0668621 -0.0950992 0.119128 0.236994 -0.0946074 0.102886 0.148276 0.0273445 -0.00464875 -0.0341484 -0.262227 0.0263149 0.101537 0.00836183 0.0162021 -0.0905185 0.0409527 -0.00179459 0.00755515 -0.150504 0.0797702 -0.0153829 -0.0558832 0.0301861 -0.0193138 -0.0944963 0.133112 -0.138898 -0.0840415 0.126742 0.00715358 -0.070306 0.0301077 -0.0147553 -0.0399994 -0.00569017 -0.00633391 0.118933 0.00543007 0.0515838 0.199957 -0.0483904 -0.122851 -0.0173073 0.000905009 0.276615 -0.0257309 0.0606704 -0.0953634 -0.0223779 0.0612538 0.00138987 0.124398 -0.0161584 0.131036 -0.0653177 -0.0316433 -0.0316398 -0.0149231 -0.0691621 0.0263956 -0.00813013 0.12473 -0.0535515 0.0739841 0.00482631 -0.0641744 -0.101218 0.0181957 0.112645 0.0825655 -0.0179595 -0.037006 0.129221 -0.0985485 -0.0802026 -0.00263618 -0.0614409 -0.0945304 -0.0563112 0.096402 0.0708072 -0.0300918 0.0748676 -0.0270164 -0.0359923 0.0830495 -0.0521311 0.0420994 -0.090157 0.108231 0.017166 -0.0623459 0.018453 0.148885 -0.0853157 -0.0313085 0.101098 0.161643 -0.115593 -0.0614491 0.023535 0.154665 0.00584051 0.0146569 -0.0248104 -0.00607496 -0.130368 0.117065 -0.0193667 0.0372934 
0.118228 -0.0559482 -0.120562 0.0394495 0.122864 0.18456 0.0642764 -0.0292055 -0.026759 -0.0826054 0.073504 0.138826 0.0724792 -0.137943 -0.115797 0.0135202 -0.111072 0.0796942 -0.122948 0.125745 0.230066 -0.0829627 0.0885144 0.183761 0.0198452 -0.0518266 -0.0377671 -0.267284 0.0252642 0.119697 -0.0114115 0.0482967 -0.0882502 0.0778731 -0.0423964 -0.0157293 -0.131802 0.044281 -0.0274576 -0.0299632 0.0454137 -0.0392322 -0.0870686 0.118881 -0.141663 -0.0993003 0.12586 -0.00697546 -0.0771867 0.0529104 0.0350948 -0.0338096 -0.0390949 -0.00497882 0.0981642 0.014198 0.0424311 0.176405 -0.0334517 -0.0768699 -0.0378373 -0.0068445 0.246857 -0.0708486 0.030456 -0.121956 -0.0185333 0.0293128 -0.0324008 0.110336 -0.0269294 0.121695 -0.0801758 -0.00886195 -0.0313226 -0.0077339 -0.0335138 0.0466626 -0.0378772 0.124253 -0.0582236 0.0569528 0.008647 -0.063503 -0.0889852 0.0806641 0.108656 0.0217009 -0.0488677 -0.0286992 0.11242 -0.13224 -0.120011 0.000293912 -0.055351 -0.0780345 -0.0670532 0.0587531 0.061136 -0.0191442 0.0675082 -0.0252763 -0.0222213 0.133902 -0.0471594 0.0311796 -0.0905928 0.132329 -0.00884087 -0.0681327 -0.00188573 0.138224 -0.062326 -0.0381382 0.0867191 0.142813 -0.0935811 -0.0635923 0.0375173 0.180772 0.0119546 0.0131136 -0.0313265 0.0293808 -0.102899 0.101283 -0.0209711 0.0204174 
0.102522 -0.0268749 -0.109948 0.0459073 0.0910943 0.174913 0.066935 -0.0381584 -0.0138832 -0.0571136 0.0961721 0.109023 0.0999757 -0.145753 -0.120256 0.0179245 -0.127826 0.0801693 -0.147314 0.122571 0.23393 -0.100479 0.0696217 0.201233 0.0175829 -0.0674721 -0.0534575 -0.255931 0.0465212 0.133876 -0.0034869 0.049748 -0.0969146 0.0768937 -0.0456249 -0.0133192 -0.137385 0.0325958 -0.0289068 -0.0193212 0.033713 -0.077248 -0.092253 0.122353 -0.113697 -0.113597 0.118268 0.0252056 -0.0743971 0.0351742 0.0407445 -0.0233536 -0.0400717 -0.0180927 0.0807785 0.0199385 0.0288004 0.156626 -0.0138622 -0.0851066 -0.0427665 -0.00375271 0.233641 -0.0476098 0.0038621 -0.108544 -0.00463087 0.0138973 -0.0381634 0.0803588 -0.0443228 0.109337 -0.0757081 -0.0141851 -0.014635 -0.0224747 -0.032476 0.0581045 -0.032871 0.152417 -0.0309453 0.028034 0.00224075 -0.0594573 -0.0976581 0.105483 0.100736 0.00390635 -0.0465606 -0.02658 0.102117 -0.126447 -0.104036 0.00394167 -0.0944527 -0.0809082 -0.0908152 0.0514479 0.0744715 -0.0265801 0.0973214 -0.0189284 -0.0160258 0.133015 -0.0255233 0.032089 -0.0834823 0.153944 0.00721373 -0.060574 -0.0122518 0.141639 -0.0744535 -0.0446551 0.0675584 0.15509 -0.0998747 -0.0313486 0.0267221 0.175296 0.00133079 -0.00700923 -0.0456936 0.0394237 -0.122078 0.113509 -0.04235 0.0249568 
0.0344911 -0.00966961 -0.117359 0.0108646 0.11394 0.152248 0.00445324 -0.100732 -0.0182319 -0.0407681 0.0662661 0.128174 0.0889002 -0.0909995 -0.117556 0.0448651 -0.143014 0.0638306 -0.0967515 0.112329 0.215156 -0.0795489 0.0522368 0.19774 0.0462546 0.00337922 -0.00935904 -0.233367 0.0654407 0.163825 0.0203853 0.0319367 -0.0807276 0.0180636 -0.0231086 0.040139 -0.153349 0.00736543 -0.00803662 -0.00585575 0.0224267 -0.050206 -0.0622517 0.155839 -0.0875308 -0.056803 0.165411 0.0320023 -0.0774858 -0.0269739 0.0301398 -0.0279722 -0.0152869 -0.0567579 0.111295 0.0516136 -0.0101071 0.209662 -0.0134292 -0.0913601 -0.0463222 -0.013348 0.263523 -0.0111385 0.0389831 -0.104787 -0.0230595 0.0434844 -0.0188807 0.083096 -0.0209924 0.129351 -0.073659 -0.0743134 0.0085573 0.0169027 -0.0649347 0.0827758 -0.0353774 0.134989 0.00271757 0.0750278 0.00170153 -0.0276279 -0.129476 0.0561588 0.102273 0.0310968 -0.0429918 -0.0320658 0.0525282 -0.0888262 -0.0923373 0.0268181 -0.0830209 -0.0608891 -0.0882802 0.0669067 0.0978648 -0.0536003 0.0734372 -0.0372909 -0.0303138 0.0872941 -0.0852219 0.0634751 -0.117169 0.11556 -0.00125549 -0.0501364 0.0192125 0.130028 -0.0918058 -0.0320307 0.0469653 0.156923 -0.152484 -0.0332477 -0.00755811 0.154908 0.0175282 -0.00591351 -0.0415117 -0.00718049 -0.168419 0.162022 -0.0793444 0.0259957 
0.0614757 -0.0298355 -0.104733 0.0134075 0.107504 0.178722 0.0364888 -0.0728773 -0.00932273 -0.0461085 0.0654511 0.119244 0.0936172 -0.105669 -0.096516 0.0143622 -0.149157 0.0724846 -0.117209 0.10204 0.208521 -0.0648724 0.0518985 0.227483 0.0247949 -0.0361607 -0.0261238 -0.244971 0.0472499 0.15382 0.0197678 0.0235183 -0.0998969 0.0396061 -0.0220771 0.0337675 -0.151971 -0.00877603 -0.0354292 -0.00108779 0.033817 -0.0611046 -0.0922599 0.145072 -0.0996596 -0.0707079 0.134099 0.0490271 -0.0710047 0.0018325 0.0342479 -0.0368502 -0.00756375 -0.0539001 0.104775 0.0508779 -0.00617281 0.208615 -0.00990194 -0.0804782 -0.0499921 0.0134118 0.246601 -0.0271344 0.0189386 -0.110408 -0.00520481 0.0344798 -0.0342236 0.0853947 -0.0260306 0.12402 -0.0721521 -0.0613796 -0.0038564 0.0148747 -0.0622405 0.06606 -0.0195565 0.141032 0.00758874 0.0563364 -0.00562877 -0.0431131 -0.118732 0.0675987 0.108866 0.0115338 -0.059743 -0.0124813 0.078515 -0.0984555 -0.0847092 0.0160613 -0.099366 -0.0551013 -0.0950451 0.0406391 0.100419 -0.0384202 0.102564 -0.0240583 -0.0305694 0.0800176 -0.0757012 0.045692 -0.120825 0.0996312 -0.0192913 -0.0321897 0.0335066 0.133658 -0.0727169 -0.0567958 0.041119 0.177675 -0.133057 -0.0242413 -0.0102158 0.1669 0.0230157 -0.0304427 -0.0484917 0.00933879 -0.162677 0.155184 -0.0825062 0.0203912 
0.0897612 -0.0522945 -0.106281 0.0219494 0.117472 0.179008 0.0623707 -0.0483024 0.00774185 -0.101248 0.0499052 0.132608 0.0679747 -0.153102 -0.115742 -0.0143648 -0.140436 0.0647455 -0.153093 0.128654 0.192829 -0.0534625 0.0478882 0.22189 -0.00898289 -0.0453582 -0.0299077 -0.258345 0.0163902 0.108383 0.00455214 0.0288261 -0.105373 0.0674814 -0.017175 0.0116305 -0.122332 0.0192784 -0.0763667 -0.0220265 0.0734103 -0.047418 -0.0991847 0.14893 -0.120643 -0.0572681 0.129465 0.0391989 -0.0853832 0.0390986 0.0069498 -0.0635826 -0.0116433 -0.0383221 0.11403 0.0281732 -0.0209641 0.195934 -0.0226579 -0.0901496 -0.040775 0.0227247 0.243832 -0.0385548 0.021879 -0.130585 0.00809196 0.0173916 -0.0283408 0.0815997 -0.0297426 0.086844 -0.045567 -0.0251228 -0.0164974 0.00828044 -0.0677482 0.0699303 -0.0157845 0.119289 -0.0109278 0.0785721 -0.0290551 -0.0750063 -0.0961944 0.0713746 0.112203 0.0210702 -0.0780599 0.00523427 0.126323 -0.120212 -0.0988603 -0.0168386 -0.0830619 -0.0474116 -0.066045 0.0115229 0.0869841 -0.0378422 0.0825734 -0.0289621 -0.0257341 0.0901653 -0.0817526 0.0215615 -0.114389 0.11669 -0.0485115 -0.0214222 0.0607548 0.145021 -0.0675672 -0.0549165 0.0370705 0.14742 -0.146667 -0.0644275 0.00274884 0.148276 0.0159107 0.012435 -0.0400089 0.039157 -0.119378 0.109975 -0.0768008 -0.0253241 
0.0901523 -0.0431392 -0.10631 0.00608715 0.106223 0.189701 0.0673487 -0.042766 -0.00310109 -0.125494 0.0279607 0.112355 0.063278 -0.160659 -0.114618 -0.0201087 -0.166735 0.0450748 -0.145895 0.111291 0.193894 -0.0483168 0.0524592 0.193115 -0.0151953 -0.0539582 -0.0327702 -0.260896 0.00730738 0.105093 -0.00671668 0.0139429 -0.108412 0.071744 -0.00156585 -0.00158255 -0.104389 0.0159994 -0.0732204 -0.0280728 0.0768453 -0.0606275 -0.0719246 0.148571 -0.12261 -0.0379086 0.138744 0.0357299 -0.106704 0.0539932 -0.00897244 -0.0780093 0.00650914 -0.0153231 0.117477 0.02165 -0.00570662 0.187339 -0.0310145 -0.107111 -0.0307965 0.0451632 0.244739 -0.0400172 0.0256327 -0.114579 0.00375124 0.0102089 -0.022958 0.0686921 -0.0425309 0.0716033 -0.0504017 -0.0240182 -0.00311231 0.016397 -0.0705745 0.0429061 -0.00617913 0.124149 0.00178776 0.0659719 -0.0321497 -0.0704954 -0.102117 0.0871254 0.0990328 0.0147598 -0.082477 0.0227114 0.147559 -0.133932 -0.104156 -0.0293004 -0.0944167 -0.0392897 -0.0612017 0.0351802 0.0923532 -0.0278632 0.0855518 -0.0271902 -0.0204161 0.088583 -0.084455 0.0161105 -0.116249 0.144183 -0.076843 -0.0199056 0.0770221 0.129931 -0.0699741 -0.0673828 0.0298845 0.157652 -0.142217 -0.0507319 0.0113463 0.143745 0.0232704 0.00317363 -0.0239325 0.0338421 -0.113026 0.0978131 -0.073623 -0.0272476 
0.0754481 -0.0328997 -0.0760948 -0.0131916 0.114463 0.201516 0.0727572 -0.0639249 -0.0052048 -0.131326 -0.00311832 0.0964727 0.0846133 -0.15833 -0.115448 -0.000564616 -0.17949 0.0520677 -0.175008 0.101117 0.211214 -0.041593 0.0473327 0.157939 -0.0412922 -0.0554526 -0.0961075 -0.263308 0.0109229 0.111685 0.0143764 0.0360436 -0.13994 0.0668529 0.039102 0.00324722 -0.0898568 0.0317278 -0.0373955 -0.0295432 0.063638 -0.0453495 -0.0633562 0.111735 -0.093848 -0.0442692 0.124886 0.0533095 -0.106065 0.0455924 -0.0215669 -0.108215 0.0126205 -0.00627632 0.100525 0.0100041 0.00443916 0.187715 -0.0464809 -0.111158 -0.014479 0.0740571 0.232573 -0.0617474 0.058088 -0.118626 0.00614005 0.0202607 -0.0369825 0.0460864 -0.0313067 0.0779009 -0.0399129 -0.0291711 -0.0328513 0.0260378 -0.0710491 0.0206592 0.0144723 0.120615 0.0352189 0.0555119 -0.0347549 -0.0409458 -0.117659 0.0691212 0.10252 0.0262836 -0.0854724 0.0224131 0.149828 -0.136231 -0.0718895 -0.0115882 -0.110336 -0.0225143 -0.0569216 0.0480919 0.0642062 0.0201448 0.103271 -0.0265801 -0.0692692 0.0998928 -0.0499262 0.00950192 -0.102901 0.137847 -0.0706583 0.0109343 0.0474069 0.103517 -0.0868113 -0.043176 0.0226291 0.177779 -0.16684 -0.00150515 -0.0378458 0.126009 0.00701023 0.00442641 -0.0110411 0.0170066 -0.113176 0.0959399 -0.112442 -0.0475508 
0.0603498 -0.0282394 -0.0584191 0.0114562 0.103351 0.200236 0.0725668 -0.064003 0.00492285 -0.1017 0.0248242 0.0632903 0.103187 -0.149195 -0.0943681 0.000468493 -0.17758 0.093177 -0.168573 0.10098 0.2327 -0.0877881 0.0660329 0.174378 -0.0129617 -0.10221 -0.141038 -0.265464 0.0222161 0.102716 0.051746 0.0356692 -0.133104 0.0770518 0.0440932 0.0184776 -0.0924693 0.0143711 -0.020555 -0.0428597 0.0665785 -0.06924 -0.0633075 0.094841 -0.105843 -0.101327 0.110058 0.0693099 -0.0781071 0.0472094 -0.0430238 -0.109561 0.00274302 -0.00251057 0.069693 0.0207459 0.0325836 0.150462 -0.0323946 -0.108578 -0.0270978 0.0830853 0.207078 -0.0753469 0.0395773 -0.0860354 0.0121614 -0.00466547 -0.0469115 0.0512288 -0.040367 0.0990799 -0.0542603 -0.0203532 -0.0314075 -0.0116267 -0.0654012 0.0325843 0.0182351 0.119102 0.0059989 0.0449203 -0.0281613 -0.0307798 -0.118135 0.112862 0.0908509 0.0201959 -0.0753344 -0.00312102 0.166922 -0.120266 -0.0439457 -0.0378289 -0.11472 -0.0587572 -0.106361 0.0882042 0.0414715 0.0236713 0.116861 -0.0387185 -0.0489867 0.0941534 0.0149786 0.0313057 -0.0656529 0.13936 -0.0241368 0.0231222 -0.0178975 0.0889103 -0.077921 -0.0526938 0.0266765 0.179137 -0.114699 0.00144843 -0.0248398 0.1473 0.0104524 -0.0179161 -0.0470955 0.0430985 -0.160862 0.0928347 -0.103588 0.0070235 
0.0693318 -0.0428897 -0.0657079 0.0195172 0.123863 0.220154 0.0710844 -0.0771756 -0.0278815 -0.0678464 0.00701552 0.0804673 0.090334 -0.146847 -0.0601636 0.00371435 -0.164813 0.101718 -0.118787 0.0720718 0.219113 -0.0470619 0.0437356 0.190035 0.0184911 -0.0758241 -0.125962 -0.282018 0.0180619 0.133008 0.0462516 0.0410804 -0.158694 0.0519821 0.0655418 0.0180842 -0.109975 -0.0444569 -0.000902131 -0.0457426 0.0693122 -0.0598621 -0.0521825 0.121049 -0.10975 -0.0838113 0.124143 0.0726208 -0.065052 0.0120509 0.0220503 -0.115066 0.0227595 -0.0359717 0.0872961 0.0282591 0.0189697 0.17107 -0.0043995 -0.0997622 -0.0189494 0.0700464 0.195024 -0.0691836 0.053119 -0.106891 0.00837675 -0.00400148 -0.0380692 0.0475266 -0.0340949 0.135844 -0.0511938 -0.0642203 -0.0583045 0.0104166 -0.0821524 0.0347915 0.0207044 0.145566 0.0440478 0.0566723 -0.0132552 -0.023484 -0.103505 0.0671124 0.109968 0.015724 -0.086488 -0.00264426 0.125873 -0.0793544 -0.0654596 -0.0175841 -0.141093 -0.0446478 -0.0769938 0.0721379 0.0506814 0.0113315 0.129179 -0.0147642 -0.0319971 0.0687249 -0.029251 0.0109342 -0.0797871 0.113438 -0.0387791 0.0560646 0.0199486 0.076415 -0.0785664 -0.0802505 0.0200606 0.178618 -0.13667 0.00441935 -0.06703 0.127941 0.0260974 -0.0337191 -0.0309808 0.0105107 -0.153812 0.112874 -0.10757 0.00161026 
0.0821632 -0.0346083 -0.0942265 -0.00728526 0.110921 0.200069 0.0479154 -0.0216754 -0.011873 -0.0563449 0.0683878 0.106011 0.0900403 -0.150917 -0.107581 -0.0172521 -0.146956 0.0877309 -0.143807 0.109536 0.217233 -0.0682377 0.0455063 0.212385 0.000567357 -0.051636 -0.0410455 -0.24371 0.0543005 0.0973603 0.0225301 -0.00966741 -0.124844 0.053691 -0.0130182 0.0126986 -0.154519 -0.00799596 -0.0470355 -0.0191983 0.0549724 -0.0617117 -0.116976 0.169258 -0.119443 -0.09633 0.111267 0.064864 -0.0882594 0.0286173 0.00431365 -0.038686 -0.0437578 -0.0497316 0.0709034 0.0306999 -0.0110057 0.192287 -0.0183085 -0.0987045 -0.0355822 0.0225971 0.254942 -0.0184214 0.00889473 -0.137079 0.00585209 0.0221639 -0.020693 0.0917167 -0.0241272 0.10835 -0.0514508 -0.0421095 -0.0317908 -0.0156754 -0.0776773 0.0833265 -0.000410636 0.133052 -0.0194059 0.0584001 -0.00407238 -0.0462232 -0.0966259 0.0717168 0.122891 0.0319226 -0.0373132 -0.00822618 0.12279 -0.103256 -0.0952239 -0.00374766 -0.0858698 -0.0859762 -0.0818016 0.0340923 0.0471652 -0.0351453 0.0980034 -0.0112946 -0.0296504 0.0758303 -0.054219 0.0418038 -0.0967681 0.114965 -0.0103425 -0.0244744 0.046671 0.132861 -0.0756461 -0.0391243 0.0516978 0.155289 -0.131104 -0.047685 0.00667261 0.148671 0.0053447 -0.0264205 -0.0539812 0.0319841 -0.14445 0.107495 -0.0775476 0.0124514 
0.0754634 -0.0469067 -0.117609 0.00726011 0.103896 0.189262 0.0511871 -0.050062 -0.0227668 -0.10218 0.0328677 0.108696 0.0743727 -0.14179 -0.123508 -0.0234591 -0.167987 0.0552163 -0.101578 0.0995392 0.209346 -0.0755396 0.040221 0.195024 0.013425 -0.0627798 -0.0295684 -0.254878 0.0116744 0.130328 -0.00205033 -0.0309365 -0.114958 0.035926 0.00969887 0.00647567 -0.142432 -0.0444463 -0.0589442 -0.0443931 0.0492729 -0.067981 -0.0593194 0.170935 -0.109379 -0.0451445 0.137042 0.0460245 -0.0958569 0.0353145 -0.00469852 -0.0770107 0.0180979 -0.0376063 0.105071 0.0310291 -0.0153597 0.193155 -0.0180882 -0.0972167 -0.0119942 0.0513706 0.251129 -0.0208418 0.024361 -0.120402 -0.0112665 0.00143164 -0.0193978 0.052836 -0.0363356 0.090739 -0.0590854 -0.0752457 -0.0209497 0.0337078 -0.0627772 0.0451956 0.00206603 0.149216 -0.00131451 0.0324769 -0.0249804 -0.0420152 -0.116304 0.090994 0.0917109 0.00839454 -0.0664611 0.00654864 0.121031 -0.105084 -0.0966049 -0.0116589 -0.105236 -0.056093 -0.0760046 0.0453572 0.086506 -0.0350971 0.102815 -0.0111065 -0.0138316 0.0496975 -0.0803192 0.0366562 -0.0981474 0.144046 -0.0806141 -0.00528652 0.0723701 0.0903733 -0.0625194 -0.0769408 0.0205992 0.182255 -0.133837 -0.00948845 0.000161524 0.146569 -0.00557305 -0.0373646 -0.0471675 0.00841397 -0.141077 0.126323 -0.0814008 -0.0039457 
0.0832441 -0.0379868 -0.12281 0.00384777 0.127444 0.209005 0.0386294 -0.0691109 -0.0279054 -0.062882 0.0498668 0.104919 0.0739324 -0.0938713 -0.0799278 -0.0169522 -0.122227 0.0732514 -0.0692441 0.0753267 0.203865 -0.0421905 0.00791354 0.225542 0.0566598 -0.0449196 -0.0303422 -0.227955 0.0392878 0.152306 0.0368444 -0.0127034 -0.139152 0.0182683 0.0069705 0.0470682 -0.159789 -0.0954912 -0.0173444 -0.0271247 0.0521209 -0.0335684 -0.0644526 0.17701 -0.0966202 -0.0600747 0.135514 0.059828 -0.0688227 -0.00878273 0.0240811 -0.0497109 0.00797531 -0.0702966 0.100547 0.0529422 -0.0444534 0.236839 0.00324169 -0.0899293 -0.0342424 0.0445784 0.250275 -0.0366744 -0.00147509 -0.100711 0.00791717 0.0211288 -0.0174835 0.0737402 -0.00313355 0.139337 -0.0624965 -0.0942102 -0.0341523 0.0212108 -0.0732784 0.0577451 -0.00666102 0.142084 0.0227897 0.0807825 0.00116042 -0.0463102 -0.0986535 0.0590003 0.104866 -0.00226047 -0.0561455 -0.00669907 0.100557 -0.0760721 -0.101325 0.00760371 -0.0861089 -0.0619341 -0.0702606 0.0318157 0.0636357 -0.0442544 0.0881432 -0.00200297 -0.00101536 0.0376168 -0.13295 0.071936 -0.115963 0.0835472 -0.0579353 0.00966418 0.0936085 0.0852918 -0.0782955 -0.0668169 0.0346019 0.162299 -0.131688 -0.0368908 -0.0178979 0.134896 0.0226469 -0.0528506 -0.0348956 0.00013265 -0.167901 0.138005 -0.0790914 0.0162943 
0.0835007 -0.0192151 -0.120113 0.0117694 0.140753 0.230977 0.0548593 -0.0719391 -0.0366338 -0.0554067 0.0398079 0.0870324 0.0754167 -0.108257 -0.0718211 -0.01291 -0.11774 0.10787 -0.0865212 0.0650202 0.205091 -0.0622467 0.0341273 0.208704 0.0592461 -0.0805804 -0.0715362 -0.24325 0.0347937 0.131441 0.0561928 0.0114164 -0.149791 0.0260608 0.0239865 0.039658 -0.152648 -0.0897385 -0.0138011 -0.0392926 0.0605389 -0.0367451 -0.0550108 0.165507 -0.117504 -0.066726 0.135481 0.0661541 -0.0856841 0.00120272 0.0196384 -0.0641024 0.0031103 -0.0713035 0.0709066 0.0487213 -0.0171778 0.225788 0.0153174 -0.0935787 -0.0402692 0.0710746 0.239982 -0.0744055 0.0207933 -0.0919551 -0.00372148 0.0131692 -0.0420339 0.0951898 -0.00247978 0.149304 -0.0583814 -0.0783005 -0.0514955 0.00873959 -0.0746857 0.0548517 -0.00871295 0.11359 0.000908181 0.0807925 -0.010946 -0.0442658 -0.105679 0.0766097 0.0928059 -0.0113718 -0.0656882 -0.00609389 0.118781 -0.0793423 -0.0964842 -0.0260224 -0.0685071 -0.0605927 -0.0745974 0.0676502 0.0358317 -0.0213021 0.0901856 -0.00618006 0.000278541 0.0570409 -0.0992236 0.0653691 -0.102821 0.095696 -0.0389147 0.0179179 0.0643007 0.0864399 -0.0616347 -0.0655384 0.0396042 0.146481 -0.125196 -0.0347952 -0.000607932 0.145912 0.0306919 -0.056508 -0.0394067 0.0138751 -0.16619 0.114519 -0.0842425 0.0140339 
0.0842163 -0.0288397 -0.0902651 0.0334622 0.143825 0.228492 0.0794106 -0.0823026 -0.0487662 -0.0383057 0.00310518 0.0634509 0.0820219 -0.0857542 -0.0212971 -0.0253543 -0.104458 0.135826 -0.0771366 0.0481482 0.184543 -0.0562759 0.0341213 0.222166 0.0632944 -0.112344 -0.13532 -0.255681 0.00818295 0.135689 0.0669393 0.0463003 -0.175832 0.030526 0.0478027 0.0469455 -0.134864 -0.108054 -0.0193965 -0.0442595 0.0724938 -0.0282295 -0.0427043 0.13512 -0.122962 -0.0598427 0.125398 0.0746689 -0.06367 0.00041634 0.0370961 -0.105283 0.0280195 -0.0692183 0.0694127 0.0489503 0.00145515 0.210747 0.0612665 -0.0893433 -0.0302404 0.110737 0.167759 -0.101663 0.0230335 -0.0774903 0.0131951 -0.00608341 -0.0523968 0.0747402 0.000945789 0.170984 -0.039132 -0.071796 -0.0738391 0.016206 -0.0823024 0.0357725 0.012963 0.100605 0.0205883 0.0844272 -0.0289303 -0.0473986 -0.0904354 0.074759 0.0872829 -0.0334532 -0.0921483 -0.0107302 0.115646 -0.0479926 -0.0611912 -0.064491 -0.0952339 -0.0426546 -0.0730196 0.0820258 0.0340099 -0.000454599 0.10489 -0.00111812 0.0219667 0.057543 -0.0947509 0.0365106 -0.109389 0.0791087 -0.0434016 0.066308 0.0530358 0.0688135 -0.0583539 -0.100632 0.00842409 0.147935 -0.105704 -0.0369512 -0.0433775 0.130475 0.0355226 -0.0576147 -0.0465133 0.0259002 -0.18039 0.100678 -0.111316 0.0116794 
0.0857463 -0.0272668 -0.143016 -0.0181401 0.133109 0.209121 0.0293437 -0.0500369 -0.0801456 -0.0378516 0.0105008 0.076639 0.107967 -0.105785 -0.0795556 -0.0205802 -0.117681 0.0921683 -0.068642 0.10761 0.189189 -0.0679883 0.050541 0.182985 0.0293538 -0.0565894 -0.0637844 -0.253518 0.0251838 0.126052 0.0133118 -0.0115377 -0.137041 0.0101807 0.0293237 0.0274564 -0.156236 -0.0647115 -0.0333366 -0.0659029 0.0262085 -0.0466893 -0.0578038 0.193923 -0.132185 -0.0293752 0.150697 0.0869582 -0.106543 0.0310077 0.0202003 -0.0816422 0.0117303 -0.0603451 0.074148 0.0148284 -0.0120211 0.196007 0.0416945 -0.130577 -0.0158487 0.0732994 0.236358 -0.0395684 0.0159893 -0.120644 -0.0126915 0.028299 -0.0169119 0.0359814 -0.00593465 0.128008 -0.0474386 -0.102977 -0.058859 0.0232046 -0.0903981 0.0469801 0.0319555 0.144747 0.0220042 0.0430328 -0.0311835 -0.0371903 -0.0922713 0.0623207 0.082033 0.00290972 -0.0251925 -0.00631283 0.102103 -0.0560838 -0.100159 -0.0209936 -0.0935438 -0.0642768 -0.0511198 0.0983127 0.0265019 -0.0556959 0.109311 0.0159213 0.0136138 0.040001 -0.130023 0.0498756 -0.118561 0.118879 -0.0371566 0.0324371 0.0928919 0.0863227 -0.0692734 -0.0711876 0.00744819 0.154532 -0.140871 -0.0400157 -0.0298696 0.124466 -0.00819484 -0.0652043 -0.0205859 0.00727954 -0.167002 0.0945832 -0.0917217 0.00530099 
0.0591216 -0.0702572 -0.0798302 -0.0507168 0.0999277 0.140829 0.0386195 -0.0245778 -0.0112527 -0.0919015 -2.99153e-05 0.0744532 0.123233 -0.140958 -0.109284 0.000854708 -0.193899 0.0443625 -0.190122 0.148707 0.196417 -0.0810809 0.0881104 0.126536 -0.0688075 -0.0342744 -0.0802363 -0.265472 0.00460085 0.0612936 0.00243859 0.0262382 -0.11379 0.0583661 0.0110457 0.0088001 -0.128124 0.0849791 -0.0697289 -0.0427044 0.0338088 -0.0668953 -0.119038 0.145517 -0.102658 -0.0393756 0.0894578 0.096039 -0.0979476 0.0634353 -0.0591456 -0.126494 -0.00811699 -0.0147898 0.0635373 -0.0228667 0.00156806 0.148313 -0.028244 -0.120733 0.00399115 0.055846 0.217483 0.0217421 0.0397677 -0.1384 -0.00536942 0.0630159 0.00555865 0.00873716 -0.0393206 0.058098 -0.0205787 -0.048107 -0.0461308 0.000109102 -0.0906385 0.0223224 0.0345197 0.141696 0.0318174 0.0026374 -0.0749422 -0.0534863 -0.130124 0.0647168 0.108594 0.053354 -0.0406217 -0.00811077 0.1483 -0.0989162 -0.0633345 -0.0185054 -0.123799 -0.0282548 -0.0796043 0.0540521 0.0539529 -0.0134204 0.117383 -0.0480227 -0.0654734 0.0668367 -0.0190707 -0.00588386 -0.122378 0.153423 -0.0154483 -0.00685429 0.0324627 0.141884 -0.0941487 -0.0376851 0.0179918 0.182585 -0.165551 -0.00979748 -0.0331088 0.121382 -0.0329725 0.00925942 -0.0279765 0.0554316 -0.130674 0.0577698 -0.12972 -0.0344837 
0.0939048 -0.0155728 -0.146633 -0.0110413 0.123973 0.165547 0.0443584 -0.0623346 -0.0588109 -0.0442748 0.0337176 0.066077 0.13079 -0.139331 -0.121585 0.000687155 -0.116205 0.122922 -0.139608 0.137125 0.198163 -0.0762089 0.0668226 0.165888 -0.0204821 -0.071627 -0.0867716 -0.253055 0.0344842 0.127992 -0.0158695 0.0415159 -0.138663 0.035029 0.0208891 -0.00444688 -0.138475 -0.0185451 -0.0341548 -0.0586771 0.0113338 -0.0610587 -0.0720763 0.179892 -0.128883 -0.0389335 0.130258 0.111133 -0.10109 0.0493821 0.0132266 -0.0801792 -0.0203034 -0.0442115 0.0310545 -0.0186231 0.0183988 0.138022 0.0391794 -0.113784 0.00413745 0.0648839 0.217784 -0.00816598 -0.00945435 -0.163411 -0.00722832 0.0226533 -0.00678877 0.0171286 -0.0288355 0.0889152 -0.026167 -0.0657262 -0.08551 -0.0119445 -0.0823547 0.0567972 0.00930095 0.132872 0.0419187 0.0428653 -0.0656439 -0.0403378 -0.0960852 0.100698 0.0673458 -0.00748714 -0.0365945 -0.0126611 0.117276 -0.065783 -0.104592 -0.0376712 -0.10342 -0.0643344 -0.0812001 0.0933653 0.0255419 -0.0543181 0.12392 0.00308418 0.00521921 0.096698 -0.0576609 0.00888994 -0.103284 0.171221 -0.00831393 0.0428488 0.0557149 0.100339 -0.0768753 -0.041632 -0.0224448 0.150834 -0.135525 -0.0357375 -0.031994 0.10814 -0.041675 -0.0199223 -0.0300884 0.0425817 -0.167716 0.0528156 -0.129805 -0.0221177 
0.0683725 -0.0952628 -0.0759195 -0.0280799 0.124988 0.166705 0.0633455 -0.0237341 -0.0403641 -0.0515089 0.0141965 0.112398 0.131577 -0.101903 -0.0844303 -0.0411933 -0.153754 0.0820711 -0.165801 0.188026 0.160823 -0.113004 0.0873017 0.158513 -0.0560285 -0.0264495 -0.109752 -0.238913 -0.00293909 0.0356879 0.00939663 0.0310776 -0.144884 0.0604081 -0.0146447 0.0382762 -0.148375 0.0891091 -0.0655297 -0.0525984 0.0660612 -0.0371038 -0.141996 0.115016 -0.164525 -0.111378 0.0765863 0.0902221 -0.0547402 0.0768518 -0.0450425 -0.12898 -0.0497662 -0.00860172 0.079383 -0.0187699 -0.0266079 0.199632 -0.0240904 -0.101681 -0.018205 0.0637359 0.235303 -0.0304093 0.0591095 -0.101294 0.00709662 0.0529754 -0.036979 0.0329002 -0.00770988 0.124408 0.00886295 0.012418 -0.0592307 -0.00914007 -0.069595 0.021772 0.0607466 0.0918954 -0.0227211 0.0136788 -0.0326773 -0.0586402 -0.107826 0.0201352 0.137041 0.0913726 0.000277391 -0.0411857 0.149597 -0.0988934 -0.00915898 -0.020707 -0.101472 -0.0890813 -0.0636199 0.0416631 0.0298063 -0.00833409 0.0805914 -0.0243155 -0.0659197 0.0746844 -0.0200695 0.0510541 -0.106121 0.104094 0.000329389 0.00445838 0.0209378 0.15826 -0.0590709 0.000945855 0.0235403 0.137677 -0.121696 -0.0250738 -0.0355083 0.125768 -0.0388012 -0.018349 -0.0417962 0.0487734 -0.145802 0.0821832 -0.128313 -0.0106632 
0.0988952 -0.031855 -0.119535 -0.00876087 0.129358 0.178982 0.0501464 -0.0536704 -0.0708718 -0.0402673 0.0287722 0.0696792 0.130965 -0.115498 -0.07896 -0.066686 -0.112299 0.132255 -0.11754 0.14263 0.153272 -0.0510652 0.0434139 0.190402 -0.0177775 -0.102363 -0.0993823 -0.216645 0.00276777 0.121142 -0.00565896 -0.0180033 -0.158999 0.0225855 0.03391 0.0212757 -0.157863 -0.0821446 -0.0637679 -0.0521371 0.0239424 -0.0467579 -0.0934195 0.192451 -0.155538 -0.0504723 0.102087 0.139314 -0.0635507 0.0823224 0.0169741 -0.0862984 -0.0228185 -0.0576062 0.0271657 -0.0176475 -0.0382877 0.154302 0.0520268 -0.0909544 -0.00478412 0.0956408 0.196846 -0.00423085 -0.0311422 -0.173633 0.0260261 -0.00767275 -0.033438 0.00498667 0.00760035 0.101543 0.0153423 -0.0704638 -0.1063 0.00302038 -0.0919315 0.0262015 0.0465751 0.150519 0.0503134 0.0216442 -0.0571873 -0.0264286 -0.0740483 0.0759129 0.0736297 -0.0160935 -0.0274648 0.00228398 0.115435 -0.0499133 -0.0611261 -0.0371441 -0.132677 -0.100133 -0.0820287 0.0535032 0.00847695 -0.061666 0.126132 0.0492927 0.0180945 0.0359598 -0.0775921 0.0343249 -0.0928679 0.131338 -0.0180164 0.100851 0.104214 0.0688443 -0.0668695 -0.0344093 -0.0756112 0.150532 -0.105152 -0.0127112 -0.0597455 0.100771 -0.053038 -0.0646421 -0.065259 0.0397832 -0.164318 0.0559315 -0.125538 -0.0106753 
