%YAML 1.1
%TAG !u! tag:unity3d.com,2011:
--- !u!114 &11400000
MonoBehaviour:
  m_ObjectHideFlags: 0
  m_CorrespondingSourceObject: {fileID: 0}
  m_PrefabInstance: {fileID: 0}
  m_PrefabAsset: {fileID: 0}
  m_GameObject: {fileID: 0}
  m_Enabled: 1
  m_EditorHideFlags: 0
  m_Script: {fileID: 11500000, guid: b5ce005d0208349bfa1861d0a10ce95f, type: 3}
  m_Name: GlobalScale
  m_EditorClassIdentifier: 
  _changeEvent: {fileID: 11400000, guid: d0c80884a266144c882d126adf62ab68, type: 2}
  _value: 1.4000001
