co/ritual/starhopper/handler/search/suggestion/ui/SearchSuggestionCardBinderTest$1.class
co/ritual/starhopper/handler/list/FetchBrowseListHandlerTest.class
co/ritual/starhopper/handler/order/status/PrePlacingStatusBinderTest.class
co/ritual/starhopper/handler/list/home/ReferralContentBuilderTest$BottomBar.class
co/ritual/starhopper/record/ClientOrderDetailBuilderTest$WithDiscount.class
co/ritual/starhopper/StarhopperMarketingCampaignContextTest.class
co/ritual/starhopper/util/StoreHoursTest$SingleDayOneDurationTests.class
co/ritual/starhopper/popup/tutorial/marketing/DollarCoffeePromoTutorialBuilderTest.class
co/ritual/starhopper/handler/order/orderprogress/ui/OrderProgressSoloTrackerBinderTest$CalculatorExists.class
co/ritual/starhopper/handler/home/tabs/HomeTabsHandlerTest.class
co/ritual/starhopper/record/ClientOrderPointDetailBuilderTest$NoCreditNoPoints.class
co/ritual/starhopper/handler/receiptsv2/ui/PastOrderListUiBinderTest.class
co/ritual/starhopper/handler/homev2/data/LandmarkDataViewTest.class
co/ritual/starhopper/StarhopperResponseTest.class
co/ritual/starhopper/handler/order/orderprogress/ui/ReadyTimeSoloStringResolverTest.class
co/ritual/starhopper/handler/order/orderprogress/ui/HostProgressBarCalculatorTest$Placing.class
co/ritual/starhopper/handler/order/orderprogress/utils/OrderReadyTimeHostCalculatorTest.class
co/ritual/starhopper/handler/order/orderprogress/ui/HostProgressBarCalculatorTest.class
co/ritual/starhopper/handler/order/orderprogress/ui/geoqueue/OrderProgressGeoqueueHostHeaderBinderTest.class
co/ritual/starhopper/handler/search/FetchSearchV2HandlerTest$WithNoPaginationData.class
co/ritual/starhopper/handler/order/orderprogress/ui/OrderProgressSoloTrackerBinderTest$RightMainText.class
co/ritual/starhopper/handler/homev3/card/topcard/FeaturedMerchantCardBinderTest$BuildListOfContent.class
co/ritual/starhopper/handler/list/home/ReferralContentBuilderTest$ReferralScreen.class
co/ritual/starhopper/order/queue/delay/GroupQueuedOrderDelayTest.class
co/ritual/starhopper/risk/RiskEvaluatorTest.class
co/ritual/starhopper/handler/order/orderprogress/ui/DefaultProgressBarCalculatorTest.class
co/ritual/starhopper/handler/receiptsv2/data/OrderReceiptAdapterTest.class
co/ritual/starhopper/handler/search/FetchSearchAutoSuggestionHandlerTest.class
co/ritual/starhopper/handler/cart/ui/cartoption/PiggybackNoTutorialWithDescriptionCartOptionBinderTest.class
co/ritual/starhopper/handler/order/orderprogress/data/OrderProgressGuestStrategyTest.class
co/ritual/starhopper/handler/search/FetchSearchV2HandlerTest.class
co/ritual/starhopper/util/ConcurrentFutureExecutorTest$DoneAnswerQueue.class
co/ritual/starhopper/handler/order/orderprogress/ui/OrderProgressMainUiBinderTest$Header.class
co/ritual/starhopper/handler/order/orderprogress/data/OrderProgressSoloStrategyTest.class
co/ritual/starhopper/assertions/StarhopperAssertions.class
co/ritual/starhopper/StarhopperContextTest$GetEligibleMarketingCampaigns.class
co/ritual/starhopper/analytics/CardWrapperAnalyticLabelModifierTest.class
co/ritual/starhopper/assertions/FancySentenceAssertTest.class
co/ritual/starhopper/assertions/ClientImageAssert.class
co/ritual/starhopper/assertions/ColoredBackgroundTextAssert.class
co/ritual/starhopper/handler/homev3/card/lunchclub/ui/FourLineHorizontalCardBinderTest$1.class
co/ritual/starhopper/handler/tutorial/ui/BasicCarouselCardTypeTemplateTest$BuildContent.class
co/ritual/starhopper/handler/order/orderprogress/ui/OrderProgressSoloTrackerBinderTest$SubRight.class
co/ritual/starhopper/prompt/postorder/latestage/milestones/TimeSavedMilestoneTest.class
co/ritual/starhopper/handler/user/PromoCodeHandlerTest.class
co/ritual/starhopper/order/create/listener/RitualOfferCreateOrderListenerTest.class
co/ritual/internal/SendCommunicationServletTest.class
co/ritual/starhopper/handler/order/orderprogress/ui/guest/OrderProgressGuestBodyBinderTest$BuildBottom.class
co/ritual/starhopper/handler/homev3/card/farfrommetro/HomescreenFarFromMetroCardGroupTest.class
co/ritual/starhopper/handler/list/home/ReferralContentBuilderTest$ActionSheet.class
co/ritual/starhopper/handler/list/menu/ui/MenuUiBuilderV2Test$MerchantIsOpen.class
co/ritual/starhopper/handler/list/rewards/UserPointsListBuilderTest.class
co/ritual/starhopper/record/CartOrderLineItemBuilderTest.class
co/ritual/starhopper/handler/tutorial/ui/TitleCarouselCardTypeTemplateTest.class
co/ritual/starhopper/prompt/postorder/latestage/milestones/MilestoneBuilder$Builder.class
co/ritual/starhopper/handler/search/suggestion/ui/SearchSuggestionCardBinderTest.class
co/ritual/starhopper/popup/question/PromoCreditsRestrictedPopupBuilderTest.class
co/ritual/starhopper/handler/order/orderprogress/ui/growth/OrderProgressNoHostHeaderBinderTest$BuildSimpleAction.class
co/ritual/starhopper/handler/search/suggestion/analytics/LeftImageInfoCardAnalyticProcessorTest.class
co/ritual/starhopper/handler/order/orderprogress/ui/HostProgressBarCalculatorTest$PreparingDurationArgsProvider.class
co/ritual/starhopper/handler/tutorial/ui/TitleCarouselCardTypeTemplateTest$BuildContent.class
co/ritual/starhopper/handler/order/orderprogress/ui/ReadyTimePiggybackStringResolverTest$ReadyTime.class
co/ritual/starhopper/handler/search/suggestion/client/elasticsearch/MerchantResultAdapterTest.class
co/ritual/starhopper/handler/homev3/card/topcard/FeaturedMerchantCardBinderTest$BuildContent.class
co/ritual/starhopper/handler/user/SignupUtilsTest.class
co/ritual/starhopper/handler/order/orderprogress/ui/OrderProgressSoloPiggybackHeaderBinderTest.class
co/ritual/starhopper/cardv2/rewardheadercard/RewardPointsHeaderCardTest.class
co/ritual/starhopper/handler/homev3/card/topcard/HomeTopCardContentSorterTest.class
co/ritual/starhopper/popup/marketing/PromoReferralConstantsTest$getButton.class
co/ritual/starhopper/util/ConcurrentFutureExecutorTest$OptionalAndRequired.class
co/ritual/starhopper/handler/search/suggestion/ui/SearchResultsCardBinderTest.class
co/ritual/starhopper/prompt/postorder/PostOrderPromptManagerTest.class
co/ritual/starhopper/handler/homev3/card/quickaccess/QuickAccessMerchantContentPresenterTest.class
co/ritual/starhopper/handler/homev3/card/topcard/TopCardOrderModels/SecondOrderPolyOrderModelTest.class
co/ritual/starhopper/prompt/postorder/latestage/milestones/GuestOrdersMilestoneTest.class
co/ritual/starhopper/handler/list/menu/MenuHandlerTest.class
co/ritual/starhopper/handler/order/orderprogress/ui/host/OrderProgressHostBodyBinderTest$NoUsers.class
co/ritual/starhopper/StarhopperResponseTest$GetActionableMarketingCampaigns.class
co/ritual/starhopper/handler/receiptsv2/ui/PastOrderEmptyListUiBinderTest.class
co/ritual/starhopper/handler/homev3/card/lunchclub/ui/FourLineCardPresenterTest$BuildContent.class
co/ritual/starhopper/handler/order/orderprogress/ui/HeaderLeaveTimeStringResolverTest.class
co/ritual/starhopper/handler/order/orderprogress/ui/host/OrderProgressHostBodyBinderTest$GuestsOnOrder.class
co/ritual/starhopper/handler/order/orderprogress/ui/ReadyTimePiggybackStringResolverTest.class
co/ritual/starhopper/handler/search/landing/ui/analytics/TwoColumnCategoryCardAnalyticProcessorTest$TwoColumnCategoryCardAnalyticProcessorIndexCounterTest.class
co/ritual/starhopper/popup/question/ParkMismatchQuestionPopupBuilderTest.class
co/ritual/starhopper/popup/question/PaymentCardExpiringExpiredPopupBuilderTest.class
co/ritual/starhopper/handler/search/landing/ui/TwoColumnCategoryCardBinderTest.class
co/ritual/starhopper/StarhopperContextTest.class
co/ritual/starhopper/popup/marketing/MarketingPopupImpressionEvaluatorTest.class
co/ritual/starhopper/handler/order/dropzone/DropzonePayloadBinderTest.class
co/ritual/starhopper/handler/order/ClientHeroStatusHandlerTest.class
co/ritual/starhopper/handler/order/orderprogress/ui/social/OrderProgressSocialGridBinderTest$GetHostReward.class
co/ritual/starhopper/handler/order/orderprogress/ui/geoqueue/OrderProgressGeoqueueSoloBodyUiBinderTest.class
co/ritual/starhopper/prompt/postorder/latestage/milestones/MilestoneBuilder$1.class
co/ritual/starhopper/handler/homev3/card/marketingV2/MarketingCardV2GroupTest.class
co/ritual/starhopper/popup/tutorial/BaseImpressionEvaluatorTest.class
co/ritual/starhopper/order/queue/delay/PiggybackQueuedOrderDelayTest.class
co/ritual/starhopper/handler/tutorial/ui/cards/piggyback/PiggybackTitleCardTest.class
co/ritual/starhopper/handler/search/FetchSearchAutoSuggestionV2HandlerTest$WithPaginationData.class
co/ritual/starhopper/handler/homev3/card/farfrommetro/FarFromMetroContentBuilderTest.class
co/ritual/starhopper/handler/homev3/card/lunchclub/ui/MultiLineLeftRightCardPresenterTest$BuildContent.class
co/ritual/starhopper/handler/list/menu/PiggybackGrowthInviteWidgetTest$InviteAmount.class
co/ritual/starhopper/handler/order/orderprogress/data/user/OrderProgressUserDataModelAdapterTest.class
co/ritual/starhopper/handler/order/orderprogress/ui/OrderProgressMainUiBinderTest.class
co/ritual/starhopper/handler/search/landing/data/SearchLandingTestHelper$SearchLandingTestModel.class
co/ritual/starhopper/record/ClientOrderPointDetailBuilderTest$NoCreditWithEarnedPoints.class
co/ritual/starhopper/handler/tutorial/PiggybackOnboardingTutorialHandlerTest.class
co/ritual/starhopper/record/ClientOrderDetailBuilderTest$NoCreditNoPoints.class
co/ritual/starhopper/handler/homev3/card/topcard/HomeTopCardContentSorterTest$GetHighestPriorityCardInList.class
co/ritual/starhopper/handler/order/OrderProgressHelperTest.class
co/ritual/starhopper/handler/order/orderprogress/ui/HostProgressBarCalculatorTest$PrePlacing.class
co/ritual/starhopper/handler/order/orderprogress/ui/geoqueue/OrderProgressGeoqueueSoloPiggybackBodyBinderTest.class
co/ritual/starhopper/handler/tutorial/PiggybackOnboardingTutorialHandlerTest$BuildPayload.class
co/ritual/starhopper/handler/search/suggestion/analytics/MerchantSearchResultCardAnalyticProcessorTest.class
co/ritual/starhopper/handler/search/FetchSearchV2HandlerTest$WithPaginationData.class
co/ritual/starhopper/handler/init/InitialHandlerTest.class
co/ritual/starhopper/handler/order/orderprogress/ui/HostProgressBarCalculatorTest$Preparing.class
co/ritual/starhopper/handler/homev3/card/lunchclub/ui/FourLineHorizontalCardBinderTest$TestBinder.class
co/ritual/starhopper/handler/menu/MerchantChannelSessionUiUtilsTest$StyleProfileImages.class
co/ritual/starhopper/handler/order/orderprogress/ui/social/HostRewardsCalculatorTest$getPointsEarnedByHost.class
co/ritual/starhopper/analytics/AnalyticLabelAppenderTest.class
co/ritual/starhopper/record/ClientOrderDetailBuilderTest.class
co/ritual/starhopper/handler/order/orderprogress/ui/host/OrderProgressHostBodyBottomBinderTest$Info.class
co/ritual/starhopper/handler/homev3/card/quickaccess/QuickAccessCardPresenterTest.class
co/ritual/starhopper/handler/order/orderprogress/ui/host/OrderProgressHostBodyBinderTest.class
co/ritual/starhopper/handler/search/landing/data/SearchLandingTestHelper.class
co/ritual/starhopper/handler/piggyback/DeferPiggybackTutorialHandlerTest.class
co/ritual/starhopper/handler/homev3/card/topcard/FeaturedMerchantCardBinderTest.class
co/ritual/starhopper/handler/order/status/ReadyStatusFeedbackBinderTest.class
co/ritual/starhopper/task/SetProfileAttributesTaskTest.class
co/ritual/starhopper/nudge/AddCompanyNudgeTest.class
co/ritual/starhopper/risk/sift/SiftOrderRiskResponseCalculatorTest.class
co/ritual/starhopper/handler/order/orderprogress/ui/host/OrderProgressHostBodyBottomBinderTest$Buttons.class
co/ritual/starhopper/handler/search/FetchSearchAutoSuggestionV2HandlerTest.class
co/ritual/starhopper/handler/search/suggestion/client/elasticsearch/ElasticsearchAutoSuggestionClientTest.class
co/ritual/starhopper/handler/list/home/FetchHomeHeaderMessageTest.class
co/ritual/starhopper/handler/order/orderprogress/data/geoqueue/OrderProgressGeoqueueHostStrategyTest.class
co/ritual/starhopper/handler/order/orderprogress/ui/OrderProgressBodyUiBinderTest.class
co/ritual/starhopper/handler/homev3/card/lunchclub/ui/FourLineCardPresenterTest.class
co/ritual/starhopper/StarhopperContextTest$GetViewableMarketingCampaigns.class
co/ritual/starhopper/handler/search/suggestion/client/elasticsearch/ElasticsearchMerchantSearchRequestAdapterTest.class
co/ritual/starhopper/prompt/postorder/latestage/milestones/TotalOrdersMilestoneTest.class
co/ritual/starhopper/handler/order/orderprogress/ui/host/OrderProgressHostBodyBottomBinderTest$ReservedSeating.class
co/ritual/starhopper/handler/order/orderprogress/ui/ReadyTimePiggybackStringResolverTest$SecondaryString.class
co/ritual/starhopper/handler/order/orderprogress/ui/OrderProgressSoloPiggybackBodyBinderTest.class
co/ritual/starhopper/handler/homev3/card/featuredPerks/FeaturedPerksCardGroupTest$FetchData.class
co/ritual/starhopper/handler/order/orderprogress/ui/growth/OrderProgressNoHostOrderBottomBinderTest$BuildButtons.class
co/ritual/starhopper/handler/order/orderprogress/ui/host/OrderProgressHostBodyBottomBinderTest.class
co/ritual/starhopper/StarhopperContextTest$GetActionableMarketingCampaigns.class
co/ritual/starhopper/handler/order/orderprogress/ui/OrderProgressHeaderUiBinderTest.class
co/ritual/starhopper/handler/list/piggyback/section/InviteCtaCardUiTest.class
co/ritual/starhopper/handler/tutorial/ui/BasicCarouselCardTypeTemplateTest.class
co/ritual/starhopper/handler/order/orderprogress/ui/host/OrderProgressHostHeaderBinderTest.class
co/ritual/starhopper/handler/order/orderprogress/ui/snoozed/OrderProgressSnoozedBodyBinderTest$Bottom.class
co/ritual/starhopper/handler/homev3/card/lunchclub/ui/FourLineHorizontalCardBinderTest.class
co/ritual/starhopper/handler/list/home/ReferralContentBuilderTest.class
co/ritual/starhopper/handler/menu/MerchantChannelSessionUiUtilsTest.class
co/ritual/starhopper/popup/tutorial/BaseImpressionEvaluatorTest$FakeImpressionEvaluator.class
co/ritual/starhopper/record/CartOrderLineItemBuilderTest$WithDiscount.class
co/ritual/starhopper/assertions/ClientImageAssertTest.class
co/ritual/starhopper/quickaccess/QuickAccessManagerTest.class
co/ritual/starhopper/handler/order/orderprogress/ui/social/HostRewardsCalculatorTest.class
co/ritual/starhopper/handler/order/orderprogress/ui/growth/OrderProgressNoHostHeaderBinderTest$BuildHeaderInfo.class
co/ritual/starhopper/handler/search/landing/data/SearchLandingPerksClientTest.class
co/ritual/starhopper/popup/question/MerchantChannelLockExistsQuestionPopupBuilderTest.class
co/ritual/storm/search/index/TestIndexEntry.class
co/ritual/dummy/DummyIntegrationTest.class
co/ritual/starhopper/prompt/postorder/latestage/milestones/LateStageReferralMilestoneTest.class
co/ritual/starhopper/handler/order/orderprogress/ui/growth/OrderProgressNoHostOrderBottomBinderTest$BuildInfo.class
co/ritual/starhopper/handler/order/dropzone/OrderProgressDropzoneUtilsTest$getDropzoneType.class
co/ritual/starhopper/handler/search/suggestion/client/elasticsearch/ElasticsearchMultiSearchRequestAdapterTest.class
co/ritual/starhopper/handler/list/menu/ui/MenuUiBuilderTest$HighlightingMarketingCampaign.class
co/ritual/starhopper/handler/list/menu/PiggybackGrowthInviteWidgetTest$PhoneNumber.class
co/ritual/starhopper/handler/order/orderprogress/ui/guest/OrderProgressHostCancelledBodyBinderTest$BuildCenter.class
co/ritual/starhopper/handler/list/menu/ui/MenuUIBuilderFactoryTest.class
co/ritual/starhopper/handler/order/orderprogress/data/OrderProgressHostStrategyTest.class
co/ritual/starhopper/handler/homev3/card/marketingV2/MarketingCardV2GroupTest$BuildCardWrapper.class
co/ritual/starhopper/handler/cart/UpdateOfferNoteHandlerTest$WithoutUserId.class
co/ritual/starhopper/handler/order/orderprogress/ui/OrderProgressSoloTrackerBinderTest$MainLeftText.class
co/ritual/starhopper/util/ConcurrentFutureExecutorTest$OnlyRequired.class
co/ritual/starhopper/handler/homev3/card/lunchclub/ui/LargeImageHeaderCardPresenterTest.class
co/ritual/starhopper/handler/receiptsv2/data/ReceiptPayloadDataProviderTest.class
co/ritual/starhopper/handler/order/orderprogress/ui/OrderProgressSoloBodyBinderTest.class
co/ritual/starhopper/handler/order/orderprogress/ui/OrderProgressSoloTrackerBinderTest$SubLeftText.class
co/ritual/starhopper/handler/receiptsv2/data/ReceiptPayloadDataProviderTest$OrderStatusArgsProvider.class
co/ritual/starhopper/handler/search/landing/data/category/SearchLandingCategoryClientTest$FirstRangeEmpty.class
co/ritual/starhopper/handler/search/FetchSearchAutoSuggestionV2HandlerTest$WithNoPaginationData.class
co/ritual/starhopper/handler/order/orderprogress/ui/guest/OrderProgressGuestBodyBinderTest.class
co/ritual/starhopper/StarhopperContextTest$GetPreferredLocale.class
co/ritual/starhopper/handler/homev3/card/topcard/NearbyEarnPlusAbstractCardBinderTest.class
co/ritual/starhopper/handler/list/menu/ui/MenuUiBuilderTest$HighlightingMarketingCampaign$MenuUiBuilderEligibleForPromo.class
co/ritual/starhopper/handler/list/menu/ui/MenuUiBuilderV2Test.class
co/ritual/starhopper/handler/search/suggestion/client/LegacySearchResultsClientTest.class
co/ritual/starhopper/handler/search/suggestion/client/MarketingCampaignAdapterTest.class
co/ritual/starhopper/handler/order/feedback/ExtendedFeedbackScreenHandlerTest.class
co/ritual/starhopper/cardv2/rewardheadercard/rewardprogresscard/RewardPointsProgressCardTest.class
co/ritual/starhopper/handler/search/suggestion/ui/SearchItemListUiBinderTest.class
co/ritual/starhopper/task/SendOfferNotificationsTaskTest.class
co/ritual/starhopper/handler/list/menu/ui/MenuUiBuilderV2Test$MerchantHasQuickReorder.class
co/ritual/starhopper/handler/search/ui/SearchUiBuilderTest$FeaturedTextArgsProvider.class
co/ritual/starhopper/record/CartOrderLineItemBuilderTest$WithRebate.class
co/ritual/starhopper/handler/order/orderprogress/ui/OrderProgressBodyUiBinderTest$TestOrderProgressBodyUiBinder.class
co/ritual/starhopper/handler/search/suggestion/client/elasticsearch/DealResultAdapterTest.class
co/ritual/starhopper/handler/cart/ui/cartoption/OfferNotePayloadBinderTest$WithoutNote.class
co/ritual/starhopper/handler/order/dropzone/OrderProgressDropzoneUtilsTest$isUserEligableForDropzonePayload.class
co/ritual/starhopper/order/queue/delay/GeoQueuedOrderDelayTest.class
co/ritual/starhopper/handler/homev3/card/quickaccess/QuickAccessMerchantContentPresenterTest$EarnPlusArgumentsProvider.class
co/ritual/starhopper/handler/order/orderprogress/ui/growth/OrderProgressNoHostTrackerBinderTest.class
co/ritual/starhopper/handler/order/orderprogress/ui/OrderProgressMainUiBinderTest$Tracker.class
co/ritual/starhopper/handler/order/dropzone/DropzonePayloadBinderTest$BuildContent.class
co/ritual/starhopper/handler/order/orderprogress/ui/DefaultProgressBarCalculatorTest$PrePlacing.class
co/ritual/starhopper/record/CartOrderLineItemBuilderTest$NoCreditNoPoints.class
co/ritual/starhopper/handler/order/orderprogress/ui/host/OrderProgressHostBodyBinderTest$NoGuestsOnOrderPBClosed.class
co/ritual/starhopper/handler/list/menu/ui/RitualOfferCopyManagerTest.class
co/ritual/starhopper/util/ConcurrentFutureExecutorTest$OnlyOptional.class
co/ritual/starhopper/handler/cart/ui/cartoption/PiggybackNoTutorialCartOptionBinderTest.class
co/ritual/starhopper/handler/receiptsv2/ui/ReceiptUiBinderTest.class
co/ritual/starhopper/order/queue/QueuedOrderCalculatorTest.class
co/ritual/starhopper/handler/homev3/card/topcard/HomescreenTopCardGroupTest.class
co/ritual/starhopper/handler/tutorial/ui/cards/piggyback/PiggybackPickUpOrderCardTest.class
co/ritual/starhopper/handler/order/orderprogress/ui/OrderProgressSoloTrackerBinderTest$RangeEstimateArgsProvider.class
co/ritual/starhopper/handler/menu/MenuItemInfoHelperTest.class
co/ritual/starhopper/handler/user/CommunicationsWidgetHandlerTest.class
co/ritual/starhopper/handler/cart/ui/cartoption/OfferNotePayloadBinderTest$WithNote.class
co/ritual/starhopper/handler/search/suggestion/client/SearchItemResultClientTest.class
co/ritual/starhopper/popup/marketing/FreeCoffeeMonthPopupBuilderTest.class
co/ritual/starhopper/util/StoreHoursTest$MultipleDayMultipleDurationTests.class
co/ritual/starhopper/assertions/LeftRightTextAssertTest.class
co/ritual/starhopper/record/ClientOrderPointDetailBuilderTest$NoCreditWithRewardAndBonusPoints.class
co/ritual/starhopper/partner/ResetPasswordEmailTest.class
co/ritual/starhopper/handler/order/orderprogress/ui/social/OrderProgressSocialGridBinderTest$Bind.class
co/ritual/starhopper/handler/cart/UpdateOfferNoteHandlerTest.class
co/ritual/starhopper/handler/search/suggestion/client/elasticsearch/CategoryResultAdapterTest.class
co/ritual/starhopper/handler/user/PromoCodeHandlerTest$ResultsMessageArgsProvider.class
co/ritual/starhopper/handler/order/orderprogress/ui/OrderProgressMainUiBinderTest$Body.class
co/ritual/starhopper/StarhopperResponseTest$GetViewableMarketingCampaigns.class
co/ritual/starhopper/handler/search/landing/ui/FullRowRewardsCardBinderTest.class
co/ritual/starhopper/handler/homev3/card/topcard/MarketingExperiencesV2CardBinderTest.class
co/ritual/starhopper/handler/order/orderprogress/ui/parked/OrderProgressParkedHeaderBinderTest.class
co/ritual/starhopper/handler/search/landing/data/category/SearchLandingCategoryClientTest.class
co/ritual/starhopper/handler/homev2/section/QuickAccessSectionBuilderTest.class
co/ritual/starhopper/prompt/postorder/latestage/LateStageReferralMilestoneManagerTest.class
co/ritual/starhopper/handler/order/dropzone/OrderProgressDropzoneUtilsTest.class
co/ritual/starhopper/handler/homev3/card/topcard/NearbyNewMerchantCardBinderTest.class
co/ritual/starhopper/assertions/LeftRightTextAssert.class
co/ritual/starhopper/handler/order/orderprogress/ui/social/OrderProgressSocialGridBinderTest$BuildProfile.class
co/ritual/starhopper/handler/homev3/card/quickaccess/QuickAccessCardGroupTest.class
co/ritual/starhopper/order/queue/delay/OrderAheadQueuedOrderDelayTest.class
co/ritual/starhopper/handler/homev3/card/topcard/TopCardUtilsTest.class
co/ritual/starhopper/handler/order/orderprogress/ui/guest/OrderProgressGuestBodyBinderTest$BuildHeader.class
co/ritual/starhopper/handler/search/suggestion/client/elasticsearch/ElasticsearchSearchResultsClientTest.class
co/ritual/starhopper/handler/search/landing/ui/SearchLandingListUiBinderTest.class
co/ritual/starhopper/handler/search/ui/SearchAutoSuggestionUiBuilderV2Test.class
co/ritual/starhopper/analytics/IndexCounterTest.class
co/ritual/starhopper/handler/order/status/ReadyStatusBinderTest.class
co/ritual/starhopper/handler/order/orderprogress/ui/OrderProgressSoloTrackerBinderTest$EstimateArgsProvider.class
co/ritual/starhopper/handler/homev3/card/lunchclub/ui/MultiLineLeftRightCardPresenterTest.class
co/ritual/starhopper/handler/homev3/card/topcard/TopCardOrderModels/ThirdOrderPolyOrderModelTest.class
co/ritual/starhopper/handler/order/orderprogress/ui/growth/OrderProgressNoHostOrderBottomBinderTest.class
co/ritual/starhopper/record/ClientOrderPointDetailBuilderTest.class
co/ritual/starhopper/prompt/postorder/latestage/milestones/MoneySavedMilestoneTest.class
co/ritual/starhopper/handler/order/status/ReadyStatusFeedbackBinderTest$BuildFeedbackSection$NoEligible.class
co/ritual/starhopper/handler/homev3/card/topcard/HomeTopCardContentSorterTest$GetValues.class
co/ritual/starhopper/handler/homev3/card/topcard/MarketingExperiencesCardBinderTest.class
co/ritual/starhopper/confirmation/GroupOrderTimingMismatchTest.class
co/ritual/starhopper/handler/prospectivemerchant/DesiredMerchantScreenHandlerTest.class
co/ritual/starhopper/util/ConcurrentFutureExecutorTest$ExceptionArgsProvider.class
co/ritual/starhopper/handler/order/orderprogress/ui/guest/OrderProgressHostCancelledBodyBottomBinderTest.class
co/ritual/starhopper/handler/order/orderprogress/data/OrderProgressSoloPiggybackStrategyTest.class
co/ritual/starhopper/handler/order/orderprogress/ui/growth/OrderProgressNoHostHeaderBinderTest.class
co/ritual/starhopper/record/ClientOrderDetailBuilderTest$NoCreditWithRewardAndBonusPoints.class
co/ritual/starhopper/handler/search/suggestion/ui/MerchantSuggestionUiBinderTest.class
co/ritual/starhopper/record/ClientOrderDetailBuilderTest$WithPerk.class
co/ritual/starhopper/record/CartOrderLineItemBuilderTest$WithPerk.class
co/ritual/starhopper/handler/receiptsv2/ui/PastOrderCardBinderTest.class
co/ritual/starhopper/handler/tutorial/ui/cards/piggyback/PiggybackViewOffersCardTest.class
co/ritual/starhopper/handler/list/menu/ui/MenuUiBuilderTest.class
co/ritual/starhopper/handler/search/landing/ui/analytics/TwoColumnCategoryCardAnalyticProcessorTest.class
co/ritual/starhopper/StarhopperResponseTest$GetEligibleMarketingCampaigns.class
co/ritual/starhopper/handler/order/orderprogress/ui/parked/OrderProgressParkedBodyBinderTest.class
co/ritual/starhopper/util/StoreHoursTest$SingleDayMultipleDurationTests.class
co/ritual/starhopper/prompt/postorder/latestage/SubjectValueResult.class
co/ritual/starhopper/handler/web/GetWebviewAuthTokenHandlerTest.class
co/ritual/starhopper/handler/receiptsv2/data/PastOrdersDataProviderTest.class
co/ritual/starhopper/handler/list/piggyback/section/MemberCountChallengeCardUiTest.class
co/ritual/starhopper/popup/tutorial/marketing/UnlockFreeCoffeeTutorialBuilderTest.class
co/ritual/starhopper/handler/order/orderprogress/ui/OrderProgressSoloHeaderBinderTest.class
co/ritual/starhopper/handler/order/orderprogress/data/geoqueue/OrderProgressGeoqueueSoloPiggybackStrategyTest.class
co/ritual/starhopper/handler/receiptsv2/data/OrderReceiptAdapterTest$OrderStateArgumentsProvider.class
co/ritual/starhopper/handler/search/suggestion/ui/CategorySuggestionUiBinderTest.class
co/ritual/starhopper/handler/search/landing/data/SearchLandingSequentialDataProviderTest.class
co/ritual/starhopper/handler/order/orderprogress/ui/DefaultProgressBarCalculatorTest$PreparingDurationArgsProvider.class
co/ritual/starhopper/handler/search/ui/SearchUiBuilderTest.class
co/ritual/starhopper/handler/search/suggestion/analytics/MultiLineLeftRightCardAnalyticProcessorTest.class
co/ritual/starhopper/handler/order/orderprogress/ui/donation/OrderProgressDonationHeaderBinderTest.class
co/ritual/starhopper/handler/order/orderprogress/ui/OrderProgressSoloPiggybackBodyBinderTest$Bottom.class
co/ritual/starhopper/handler/tutorial/PiggybackOnboardingTutorialHandlerTest$GetCarouselCards.class
co/ritual/starhopper/assertions/FancySentenceAssert.class
co/ritual/starhopper/handler/order/orderprogress/data/OrderProgressParkedStrategyTest.class
co/ritual/starhopper/handler/order/orderprogress/ui/guest/OrderProgressHostCancelledBodyBinderTest$BuildHeader.class
co/ritual/starhopper/handler/homev3/card/analytics/HomescreenAnalyticsUtilTest.class
co/ritual/starhopper/handler/order/orderprogress/ui/guest/OrderProgressGuestHeaderBinderTest.class
co/ritual/starhopper/handler/list/home/ReferralContentBuilderTest$Chip.class
co/ritual/starhopper/handler/order/orderprogress/ui/social/HostRewardsCalculatorTest$isGroupOrder.class
co/ritual/starhopper/popup/marketing/PromoReferralConstantsTest$getButtonConfirmationOption.class
co/ritual/starhopper/handler/search/suggestion/data/SearchFilterReportChoicesAdapterTest.class
co/ritual/starhopper/handler/order/orderprogress/ui/DefaultProgressBarCalculatorTest$Preparing.class
co/ritual/starhopper/handler/receiptsv2/ui/PastOrderCardBinderTest$OrderStatusArgsProvider.class
co/ritual/starhopper/assertions/FancyTextAssertTest.class
co/ritual/starhopper/handler/settings/entry/SettingsLandingEntriesTest.class
co/ritual/starhopper/handler/cart/UpdateOfferNoteHandlerTest$WithUserId.class
co/ritual/starhopper/handler/cart/ui/cartoption/OfferNotePayloadBinderTest.class
co/ritual/starhopper/handler/order/status/ReadyStatusFeedbackBinderTest$BuildFeedbackSection$mandatoryFeedback.class
co/ritual/starhopper/record/CartOrderLineItemBuilderTest$WithDiscountAndPointsRedeemed.class
co/ritual/starhopper/partner/ExistingUserOnboardingEmailTest.class
co/ritual/starhopper/handler/order/orderprogress/ui/OrderProgressHeaderUiBinderTest$TestOrderProgressHeaderUiBinder.class
co/ritual/starhopper/handler/order/dropzone/ConfirmDropzonePayloadBinderTest.class
co/ritual/starhopper/handler/tutorial/ui/cards/piggyback/PiggybackOfferCardTest.class
co/ritual/starhopper/record/CartOrderLineItemBuilderTest$WithDiscountAndCredits.class
co/ritual/starhopper/handler/interstitial/marketingCampaign/MarketingCampaignInterstitialBinderTest.class
co/ritual/starhopper/prompt/postorder/latestage/milestones/MilestoneBuilder.class
co/ritual/starhopper/handler/cart/ui/cartoption/PiggybackCartOptionBinderTest.class
co/ritual/starhopper/handler/order/orderprogress/data/OrderProgressGuestStrategyTest$GetState.class
co/ritual/starhopper/handler/order/orderprogress/ui/snoozed/OrderProgressSnoozedBodyBinderTest.class
co/ritual/starhopper/handler/list/piggyback/section/PiggybackScreenOrderManagerTest.class
co/ritual/starhopper/handler/order/orderprogress/ui/donation/OrderProgressDonationBodyBinderTest.class
co/ritual/starhopper/handler/homev3/card/topcard/TopCardOrderModels/TopCardPolynomialFunctionOrderingModelFactoryTest.class
co/ritual/starhopper/handler/order/orderprogress/ui/growth/OrderProgressNoHostHeaderBinderTest$BuildHeaderNotice.class
co/ritual/starhopper/handler/homev3/card/HomescreenCardGroupCreatorTest.class
co/ritual/starhopper/assertions/LeftRightSentenceAssert.class
co/ritual/starhopper/handler/tutorial/ui/cards/piggyback/PiggybackEarnPointsCardTest.class
co/ritual/starhopper/handler/homev3/card/topcard/NearbyTopMerchantCardBinderTest.class
co/ritual/starhopper/assertions/ColoredBackgroundTextAssertTest.class
co/ritual/starhopper/handler/order/orderprogress/ui/OrderProgressSoloTrackerBinderTest$CalculatorNull.class
co/ritual/starhopper/util/StoreHoursTest.class
co/ritual/starhopper/nudge/NudgeManagerTest.class
co/ritual/starhopper/handler/order/status/ReadyStatusFeedbackBinderTest$BuildFeedbackSection.class
co/ritual/starhopper/handler/order/orderprogress/ui/growth/OrderProgressNoHostHeaderBinderTest$BuildActionButtonList.class
co/ritual/starhopper/handler/locale/FetchSupportedLocalesHandlerTest.class
co/ritual/starhopper/handler/homev3/card/quickaccess/QuickAccessCardGroupTest$BuildCardWrapper.class
co/ritual/starhopper/handler/search/suggestion/client/LocalUserMarketingCampaignsClientTest.class
co/ritual/starhopper/record/ClientOrderDetailBuilderTest$WithRebate.class
co/ritual/starhopper/handler/order/orderprogress/ui/geoqueue/OrderProgressGeoqueueSoloHeaderBinderTest.class
co/ritual/starhopper/handler/order/orderprogress/ui/guest/OrderProgressHostCancelledBodyBinderTest.class
co/ritual/starhopper/handler/receiptsv2/data/PastOrdersDataProviderTest$1.class
co/ritual/starhopper/partner/AddUserToStoreInviteEmailTest.class
co/ritual/starhopper/handler/order/orderprogress/ui/HeaderLeaveTimeStringResolverTest$LeaveTimeArgsProvider.class
co/ritual/starhopper/handler/search/landing/data/SearchLandingWellnessClientTest.class
co/ritual/starhopper/handler/order/orderprogress/data/OrderProgressDonationStrategyTest.class
co/ritual/starhopper/handler/search/landing/data/SearchLandingConcurrentDataProviderTest.class
co/ritual/starhopper/handler/search/suggestion/data/SearchResultPayloadMarketingDecoratorTest.class
co/ritual/starhopper/handler/homev3/card/lunchclub/ui/FourLineCardPresenterTest$BuildList.class
co/ritual/starhopper/handler/homev3/card/quickaccess/QuickAccessMerchantContentPresenterTest$Metadata.class
co/ritual/starhopper/assertions/LeftRightSentenceAssertTest.class
co/ritual/starhopper/handler/search/suggestion/ui/LandmarkSuggestionUiBinderTest.class
co/ritual/starhopper/handler/homev3/card/topcard/ReOrderCardContentBuilderTest.class
co/ritual/starhopper/handler/order/orderprogress/ui/social/OrderProgressSocialGridBinderTest$GetCondensedName.class
co/ritual/starhopper/handler/search/SearchResultsFilterParamsAdapterTest.class
co/ritual/storm/search/index/TestIndexQueryResults.class
co/ritual/starhopper/popup/question/PromoCreditsRestrictedPopupBuilderTest$ConstraintCheck.class
co/ritual/starhopper/handler/order/orderprogress/ui/social/OrderProgressSocialGridBinderTest.class
co/ritual/starhopper/handler/homev3/card/quickaccess/QuickAccessMerchantContentPresenterTest$NotOpen.class
co/ritual/starhopper/handler/order/orderprogress/ui/DefaultProgressBarCalculatorTest$Placing.class
co/ritual/starhopper/handler/search/landing/data/SearchLandingSequentialAggregateClientTest.class
co/ritual/starhopper/handler/search/suggestion/client/LegacySearchAutoSuggestionClientTest.class
co/ritual/starhopper/handler/search/landing/ui/SearchLandingCategoryCardBinderTest.class
co/ritual/starhopper/record/ClientOrderDetailBuilderTest$NoCreditWithEarnedPoints.class
co/ritual/starhopper/handler/homev3/card/topcard/NearbyEarnPlusAbstractCardBinderTest$Sorting.class
co/ritual/starhopper/handler/order/orderprogress/ui/OrderProgressSoloTrackerBinderTest.class
co/ritual/starhopper/handler/locale/SupportedLocaleBuilderTest.class
co/ritual/starhopper/handler/homev3/card/quickaccess/QuickAccessMerchantContentPresenterTest$Open.class
co/ritual/starhopper/handler/list/menu/PiggybackGrowthInviteWidgetTest.class
co/ritual/starhopper/partner/OnboardingConfirmationTest.class
co/ritual/starhopper/handler/order/dropzone/SelectDropzonePayloadBinderTest.class
co/ritual/starhopper/handler/order/orderprogress/data/geoqueue/OrderProgressGeoqueueSoloStrategyTest.class
co/ritual/starhopper/handler/list/menu/ui/MenuItemGroupListBuilderTest.class
co/ritual/starhopper/handler/homev3/card/featuredPerks/FeaturedPerksCardGroupTest.class
co/ritual/starhopper/prompt/postorder/latestage/milestones/HostOrdersMilestoneTest.class
co/ritual/starhopper/handler/list/piggyback/section/ActivityFeedSectionGroupBuilderTest.class
co/ritual/starhopper/nudge/InviteToOrderNudgeTest.class
co/ritual/starhopper/handler/order/orderprogress/ui/host/OrderProgressHostBodyBinderTest$NoGuestsOnOrderPBOpen.class
co/ritual/starhopper/record/ClientOrderDetailBuilderTest$WithCredits.class
co/ritual/starhopper/handler/list/menu/ui/MenuUiBuilderV2Test$MerchantIsClosed.class
co/ritual/starhopper/handler/list/menu/ui/MenuUiBuilderV2Test$MerchantIsOvercapacity.class
co/ritual/starhopper/util/ConcurrentFutureExecutorTest.class
co/ritual/starhopper/assertions/FancyTextAssert.class
co/ritual/starhopper/popup/marketing/PromoReferralConstantsTest.class
co/ritual/starhopper/handler/homev2/data/DataUtilsTest.class
co/ritual/starhopper/handler/search/landing/ui/SearchLandingRewardsCardBinderTest.class
co/ritual/starhopper/handler/order/orderprogress/ui/social/HostRewardsCalculatorTest$getCreditMicrosEarnedByHost.class
