/Users/sarabjeetsingh/midichlorian/legacy/Frontend-Java/Starhopper/starhopper-main/src/test/java/co/ritual/starhopper/handler/homev3/card/farfrommetro/FarFromMetroContentBuilderTest.java
/Users/sarabjeetsingh/midichlorian/legacy/Frontend-Java/Starhopper/starhopper-main/src/test/java/co/ritual/starhopper/handler/homev3/card/topcard/MarketingExperiencesCardBinderTest.java
/Users/sarabjeetsingh/midichlorian/legacy/Frontend-Java/Starhopper/starhopper-main/src/test/java/co/ritual/starhopper/StarhopperContextTest.java
/Users/sarabjeetsingh/midichlorian/legacy/Frontend-Java/Starhopper/starhopper-main/src/test/java/co/ritual/starhopper/handler/tutorial/ui/TitleCarouselCardTypeTemplateTest.java
/Users/sarabjeetsingh/midichlorian/legacy/Frontend-Java/Starhopper/starhopper-main/src/test/java/co/ritual/starhopper/handler/user/CommunicationsWidgetHandlerTest.java
/Users/sarabjeetsingh/midichlorian/legacy/Frontend-Java/Starhopper/starhopper-main/src/test/java/co/ritual/starhopper/handler/order/orderprogress/data/user/OrderProgressUserDataModelAdapterTest.java
/Users/sarabjeetsingh/midichlorian/legacy/Frontend-Java/Starhopper/starhopper-main/src/test/java/co/ritual/starhopper/handler/homev2/data/DataUtilsTest.java
/Users/sarabjeetsingh/midichlorian/legacy/Frontend-Java/Starhopper/starhopper-main/src/test/java/co/ritual/starhopper/assertions/LeftRightSentenceAssert.java
/Users/sarabjeetsingh/midichlorian/legacy/Frontend-Java/Starhopper/starhopper-main/src/test/java/co/ritual/starhopper/handler/interstitial/marketingCampaign/MarketingCampaignInterstitialBinderTest.java
/Users/sarabjeetsingh/midichlorian/legacy/Frontend-Java/Starhopper/starhopper-main/src/test/java/co/ritual/starhopper/handler/order/orderprogress/ui/guest/OrderProgressHostCancelledBodyBottomBinderTest.java
/Users/sarabjeetsingh/midichlorian/legacy/Frontend-Java/Starhopper/starhopper-main/src/test/java/co/ritual/starhopper/handler/list/rewards/UserPointsListBuilderTest.java
/Users/sarabjeetsingh/midichlorian/legacy/Frontend-Java/Starhopper/starhopper-main/src/test/java/co/ritual/starhopper/handler/tutorial/ui/cards/piggyback/PiggybackPickUpOrderCardTest.java
/Users/sarabjeetsingh/midichlorian/legacy/Frontend-Java/Starhopper/starhopper-main/src/test/java/co/ritual/starhopper/assertions/ClientImageAssert.java
/Users/sarabjeetsingh/midichlorian/legacy/Frontend-Java/Starhopper/starhopper-main/src/test/java/co/ritual/starhopper/handler/tutorial/ui/cards/piggyback/PiggybackViewOffersCardTest.java
/Users/sarabjeetsingh/midichlorian/legacy/Frontend-Java/Starhopper/starhopper-main/src/test/java/co/ritual/starhopper/handler/order/dropzone/DropzonePayloadBinderTest.java
/Users/sarabjeetsingh/midichlorian/legacy/Frontend-Java/Starhopper/starhopper-main/src/test/java/co/ritual/starhopper/handler/search/suggestion/client/LocalUserMarketingCampaignsClientTest.java
/Users/sarabjeetsingh/midichlorian/legacy/Frontend-Java/Starhopper/starhopper-main/src/test/java/co/ritual/starhopper/prompt/postorder/latestage/milestones/GuestOrdersMilestoneTest.java
/Users/sarabjeetsingh/midichlorian/legacy/Frontend-Java/Starhopper/starhopper-main/src/test/java/co/ritual/starhopper/handler/tutorial/ui/BasicCarouselCardTypeTemplateTest.java
/Users/sarabjeetsingh/midichlorian/legacy/Frontend-Java/Starhopper/starhopper-main/src/test/java/co/ritual/starhopper/assertions/FancySentenceAssertTest.java
/Users/sarabjeetsingh/midichlorian/legacy/Frontend-Java/Starhopper/starhopper-main/src/test/java/co/ritual/starhopper/handler/list/menu/ui/RitualOfferCopyManagerTest.java
/Users/sarabjeetsingh/midichlorian/legacy/Frontend-Java/Starhopper/starhopper-main/src/test/java/co/ritual/starhopper/handler/order/orderprogress/data/geoqueue/OrderProgressGeoqueueSoloPiggybackStrategyTest.java
/Users/sarabjeetsingh/midichlorian/legacy/Frontend-Java/Starhopper/starhopper-main/src/test/java/co/ritual/starhopper/handler/cart/ui/cartoption/PiggybackCartOptionBinderTest.java
/Users/sarabjeetsingh/midichlorian/legacy/Frontend-Java/Starhopper/starhopper-main/src/test/java/co/ritual/starhopper/record/ClientOrderPointDetailBuilderTest.java
/Users/sarabjeetsingh/midichlorian/legacy/Frontend-Java/Starhopper/starhopper-main/src/test/java/co/ritual/starhopper/handler/order/orderprogress/ui/HeaderLeaveTimeStringResolverTest.java
/Users/sarabjeetsingh/midichlorian/legacy/Frontend-Java/Starhopper/starhopper-main/src/integration/java/co/ritual/dummy/DummyIntegrationTest.java
/Users/sarabjeetsingh/midichlorian/legacy/Frontend-Java/Starhopper/starhopper-main/src/test/java/co/ritual/starhopper/handler/order/orderprogress/ui/guest/OrderProgressGuestBodyBinderTest.java
/Users/sarabjeetsingh/midichlorian/legacy/Frontend-Java/Starhopper/starhopper-main/src/test/java/co/ritual/starhopper/handler/search/suggestion/client/LegacySearchResultsClientTest.java
/Users/sarabjeetsingh/midichlorian/legacy/Frontend-Java/Starhopper/starhopper-main/src/test/java/co/ritual/starhopper/handler/search/suggestion/client/LegacySearchAutoSuggestionClientTest.java
/Users/sarabjeetsingh/midichlorian/legacy/Frontend-Java/Starhopper/starhopper-main/src/test/java/co/ritual/starhopper/handler/order/dropzone/OrderProgressDropzoneUtilsTest.java
/Users/sarabjeetsingh/midichlorian/legacy/Frontend-Java/Starhopper/starhopper-main/src/test/java/co/ritual/starhopper/handler/order/orderprogress/ui/donation/OrderProgressDonationHeaderBinderTest.java
/Users/sarabjeetsingh/midichlorian/legacy/Frontend-Java/Starhopper/starhopper-main/src/test/java/co/ritual/starhopper/order/queue/delay/GroupQueuedOrderDelayTest.java
/Users/sarabjeetsingh/midichlorian/legacy/Frontend-Java/Starhopper/starhopper-main/src/test/java/co/ritual/starhopper/cardv2/rewardheadercard/RewardPointsHeaderCardTest.java
/Users/sarabjeetsingh/midichlorian/legacy/Frontend-Java/Starhopper/starhopper-main/src/test/java/co/ritual/starhopper/task/SetProfileAttributesTaskTest.java
/Users/sarabjeetsingh/midichlorian/legacy/Frontend-Java/Starhopper/starhopper-main/src/test/java/co/ritual/starhopper/handler/order/status/PrePlacingStatusBinderTest.java
/Users/sarabjeetsingh/midichlorian/legacy/Frontend-Java/Starhopper/starhopper-main/src/test/java/co/ritual/starhopper/prompt/postorder/latestage/milestones/MilestoneBuilder.java
/Users/sarabjeetsingh/midichlorian/legacy/Frontend-Java/Starhopper/starhopper-main/src/test/java/co/ritual/starhopper/handler/user/SignupUtilsTest.java
/Users/sarabjeetsingh/midichlorian/legacy/Frontend-Java/Starhopper/starhopper-main/src/test/java/co/ritual/starhopper/handler/order/orderprogress/ui/social/HostRewardsCalculatorTest.java
/Users/sarabjeetsingh/midichlorian/legacy/Frontend-Java/Starhopper/starhopper-main/src/test/java/co/ritual/starhopper/handler/order/dropzone/ConfirmDropzonePayloadBinderTest.java
/Users/sarabjeetsingh/midichlorian/legacy/Frontend-Java/Starhopper/starhopper-main/src/test/java/co/ritual/starhopper/handler/order/orderprogress/ui/OrderProgressSoloTrackerBinderTest.java
/Users/sarabjeetsingh/midichlorian/legacy/Frontend-Java/Starhopper/starhopper-main/src/test/java/co/ritual/starhopper/prompt/postorder/PostOrderPromptManagerTest.java
/Users/sarabjeetsingh/midichlorian/legacy/Frontend-Java/Starhopper/starhopper-main/src/test/java/co/ritual/starhopper/popup/tutorial/BaseImpressionEvaluatorTest.java
/Users/sarabjeetsingh/midichlorian/legacy/Frontend-Java/Starhopper/starhopper-main/src/test/java/co/ritual/starhopper/handler/order/orderprogress/data/geoqueue/OrderProgressGeoqueueSoloStrategyTest.java
/Users/sarabjeetsingh/midichlorian/legacy/Frontend-Java/Starhopper/starhopper-main/src/test/java/co/ritual/starhopper/assertions/FancyTextAssert.java
/Users/sarabjeetsingh/midichlorian/legacy/Frontend-Java/Starhopper/starhopper-main/src/test/java/co/ritual/starhopper/handler/locale/FetchSupportedLocalesHandlerTest.java
/Users/sarabjeetsingh/midichlorian/legacy/Frontend-Java/Starhopper/starhopper-main/src/test/java/co/ritual/starhopper/prompt/postorder/latestage/milestones/MoneySavedMilestoneTest.java
/Users/sarabjeetsingh/midichlorian/legacy/Frontend-Java/Starhopper/starhopper-main/src/test/java/co/ritual/starhopper/popup/question/MerchantChannelLockExistsQuestionPopupBuilderTest.java
/Users/sarabjeetsingh/midichlorian/legacy/Frontend-Java/Starhopper/starhopper-main/src/test/java/co/ritual/starhopper/handler/homev2/section/QuickAccessSectionBuilderTest.java
/Users/sarabjeetsingh/midichlorian/legacy/Frontend-Java/Starhopper/starhopper-main/src/test/java/co/ritual/starhopper/handler/receiptsv2/data/PastOrdersDataProviderTest.java
/Users/sarabjeetsingh/midichlorian/legacy/Frontend-Java/Starhopper/starhopper-main/src/test/java/co/ritual/starhopper/handler/order/orderprogress/data/OrderProgressParkedStrategyTest.java
/Users/sarabjeetsingh/midichlorian/legacy/Frontend-Java/Starhopper/starhopper-main/src/test/java/co/ritual/starhopper/handler/search/suggestion/client/elasticsearch/CategoryResultAdapterTest.java
/Users/sarabjeetsingh/midichlorian/legacy/Frontend-Java/Starhopper/starhopper-main/src/test/java/co/ritual/starhopper/order/queue/delay/PiggybackQueuedOrderDelayTest.java
/Users/sarabjeetsingh/midichlorian/legacy/Frontend-Java/Starhopper/starhopper-main/src/test/java/co/ritual/starhopper/handler/home/tabs/HomeTabsHandlerTest.java
/Users/sarabjeetsingh/midichlorian/legacy/Frontend-Java/Starhopper/starhopper-main/src/test/java/co/ritual/starhopper/handler/homev3/card/topcard/MarketingExperiencesV2CardBinderTest.java
/Users/sarabjeetsingh/midichlorian/legacy/Frontend-Java/Starhopper/starhopper-main/src/test/java/co/ritual/starhopper/handler/order/orderprogress/ui/geoqueue/OrderProgressGeoqueueSoloBodyUiBinderTest.java
/Users/sarabjeetsingh/midichlorian/legacy/Frontend-Java/Starhopper/starhopper-main/src/test/java/co/ritual/starhopper/handler/menu/MenuItemInfoHelperTest.java
/Users/sarabjeetsingh/midichlorian/legacy/Frontend-Java/Starhopper/starhopper-main/src/test/java/co/ritual/starhopper/order/queue/delay/GeoQueuedOrderDelayTest.java
/Users/sarabjeetsingh/midichlorian/legacy/Frontend-Java/Starhopper/starhopper-main/src/test/java/co/ritual/starhopper/handler/search/suggestion/client/elasticsearch/DealResultAdapterTest.java
/Users/sarabjeetsingh/midichlorian/legacy/Frontend-Java/Starhopper/starhopper-main/src/test/java/co/ritual/starhopper/handler/homev3/card/topcard/NearbyEarnPlusAbstractCardBinderTest.java
/Users/sarabjeetsingh/midichlorian/legacy/Frontend-Java/Starhopper/starhopper-main/src/test/java/co/ritual/starhopper/handler/search/suggestion/data/SearchResultPayloadMarketingDecoratorTest.java
/Users/sarabjeetsingh/midichlorian/legacy/Frontend-Java/Starhopper/starhopper-main/src/test/java/co/ritual/starhopper/handler/list/piggyback/section/MemberCountChallengeCardUiTest.java
/Users/sarabjeetsingh/midichlorian/legacy/Frontend-Java/Starhopper/starhopper-main/src/test/java/co/ritual/starhopper/handler/order/orderprogress/ui/parked/OrderProgressParkedBodyBinderTest.java
/Users/sarabjeetsingh/midichlorian/legacy/Frontend-Java/Starhopper/starhopper-main/src/test/java/co/ritual/starhopper/handler/order/orderprogress/ui/OrderProgressSoloHeaderBinderTest.java
/Users/sarabjeetsingh/midichlorian/legacy/Frontend-Java/Starhopper/starhopper-main/src/test/java/co/ritual/starhopper/handler/search/SearchResultsFilterParamsAdapterTest.java
/Users/sarabjeetsingh/midichlorian/legacy/Frontend-Java/Starhopper/starhopper-main/src/test/java/co/ritual/starhopper/handler/tutorial/PiggybackOnboardingTutorialHandlerTest.java
/Users/sarabjeetsingh/midichlorian/legacy/Frontend-Java/Starhopper/starhopper-main/src/test/java/co/ritual/starhopper/handler/search/landing/data/SearchLandingSequentialDataProviderTest.java
/Users/sarabjeetsingh/midichlorian/legacy/Frontend-Java/Starhopper/starhopper-main/src/test/java/co/ritual/starhopper/handler/search/suggestion/ui/SearchItemListUiBinderTest.java
/Users/sarabjeetsingh/midichlorian/legacy/Frontend-Java/Starhopper/starhopper-main/src/test/java/co/ritual/starhopper/handler/order/ClientHeroStatusHandlerTest.java
/Users/sarabjeetsingh/midichlorian/legacy/Frontend-Java/Starhopper/starhopper-main/src/test/java/co/ritual/starhopper/order/create/listener/RitualOfferCreateOrderListenerTest.java
/Users/sarabjeetsingh/midichlorian/legacy/Frontend-Java/Starhopper/starhopper-main/src/test/java/co/ritual/starhopper/nudge/AddCompanyNudgeTest.java
/Users/sarabjeetsingh/midichlorian/legacy/Frontend-Java/Starhopper/starhopper-main/src/test/java/co/ritual/starhopper/handler/homev3/card/quickaccess/QuickAccessCardPresenterTest.java
/Users/sarabjeetsingh/midichlorian/legacy/Frontend-Java/Starhopper/starhopper-main/src/test/java/co/ritual/starhopper/handler/homev3/card/topcard/ReOrderCardContentBuilderTest.java
/Users/sarabjeetsingh/midichlorian/legacy/Frontend-Java/Starhopper/starhopper-main/src/test/java/co/ritual/starhopper/handler/search/FetchSearchAutoSuggestionV2HandlerTest.java
/Users/sarabjeetsingh/midichlorian/legacy/Frontend-Java/Starhopper/starhopper-main/src/test/java/co/ritual/starhopper/assertions/FancyTextAssertTest.java
/Users/sarabjeetsingh/midichlorian/legacy/Frontend-Java/Starhopper/starhopper-main/src/test/java/co/ritual/starhopper/analytics/IndexCounterTest.java
/Users/sarabjeetsingh/midichlorian/legacy/Frontend-Java/Starhopper/starhopper-main/src/test/java/co/ritual/starhopper/handler/homev3/card/featuredPerks/FeaturedPerksCardGroupTest.java
/Users/sarabjeetsingh/midichlorian/legacy/Frontend-Java/Starhopper/starhopper-main/src/test/java/co/ritual/starhopper/handler/receiptsv2/ui/ReceiptUiBinderTest.java
/Users/sarabjeetsingh/midichlorian/legacy/Frontend-Java/Starhopper/starhopper-main/src/test/java/co/ritual/starhopper/handler/receiptsv2/ui/PastOrderListUiBinderTest.java
/Users/sarabjeetsingh/midichlorian/legacy/Frontend-Java/Starhopper/starhopper-main/src/test/java/co/ritual/starhopper/handler/order/orderprogress/ui/geoqueue/OrderProgressGeoqueueHostHeaderBinderTest.java
/Users/sarabjeetsingh/midichlorian/legacy/Frontend-Java/Starhopper/starhopper-main/src/test/java/co/ritual/starhopper/handler/homev3/card/quickaccess/QuickAccessCardGroupTest.java
/Users/sarabjeetsingh/midichlorian/legacy/Frontend-Java/Starhopper/starhopper-main/src/test/java/co/ritual/starhopper/popup/marketing/FreeCoffeeMonthPopupBuilderTest.java
/Users/sarabjeetsingh/midichlorian/legacy/Frontend-Java/Starhopper/starhopper-main/src/test/java/co/ritual/starhopper/risk/sift/SiftOrderRiskResponseCalculatorTest.java
/Users/sarabjeetsingh/midichlorian/legacy/Frontend-Java/Starhopper/starhopper-main/src/test/java/co/ritual/starhopper/handler/homev3/card/lunchclub/ui/LargeImageHeaderCardPresenterTest.java
/Users/sarabjeetsingh/midichlorian/legacy/Frontend-Java/Starhopper/starhopper-main/src/test/java/co/ritual/starhopper/handler/order/orderprogress/ui/OrderProgressMainUiBinderTest.java
/Users/sarabjeetsingh/midichlorian/legacy/Frontend-Java/Starhopper/starhopper-main/src/test/java/co/ritual/starhopper/popup/tutorial/marketing/UnlockFreeCoffeeTutorialBuilderTest.java
/Users/sarabjeetsingh/midichlorian/legacy/Frontend-Java/Starhopper/starhopper-main/src/test/java/co/ritual/starhopper/handler/menu/MerchantChannelSessionUiUtilsTest.java
/Users/sarabjeetsingh/midichlorian/legacy/Frontend-Java/Starhopper/starhopper-main/src/test/java/co/ritual/starhopper/handler/homev3/card/topcard/TopCardOrderModels/ThirdOrderPolyOrderModelTest.java
/Users/sarabjeetsingh/midichlorian/legacy/Frontend-Java/Starhopper/starhopper-main/src/test/java/co/ritual/starhopper/partner/OnboardingConfirmationTest.java
/Users/sarabjeetsingh/midichlorian/legacy/Frontend-Java/Starhopper/starhopper-main/src/test/java/co/ritual/starhopper/handler/order/orderprogress/data/geoqueue/OrderProgressGeoqueueHostStrategyTest.java
/Users/sarabjeetsingh/midichlorian/legacy/Frontend-Java/Starhopper/starhopper-main/src/test/java/co/ritual/starhopper/handler/search/suggestion/client/SearchItemResultClientTest.java
/Users/sarabjeetsingh/midichlorian/legacy/Frontend-Java/Starhopper/starhopper-main/src/test/java/co/ritual/starhopper/prompt/postorder/latestage/SubjectValueResult.java
/Users/sarabjeetsingh/midichlorian/legacy/Frontend-Java/Starhopper/starhopper-main/src/test/java/co/ritual/starhopper/handler/search/suggestion/client/MarketingCampaignAdapterTest.java
/Users/sarabjeetsingh/midichlorian/legacy/Frontend-Java/Starhopper/starhopper-main/src/test/java/co/ritual/starhopper/handler/homev3/card/farfrommetro/HomescreenFarFromMetroCardGroupTest.java
/Users/sarabjeetsingh/midichlorian/legacy/Frontend-Java/Starhopper/starhopper-main/src/test/java/co/ritual/starhopper/handler/homev3/card/topcard/TopCardOrderModels/TopCardPolynomialFunctionOrderingModelFactoryTest.java
/Users/sarabjeetsingh/midichlorian/legacy/Frontend-Java/Starhopper/starhopper-main/src/test/java/co/ritual/starhopper/analytics/AnalyticLabelAppenderTest.java
/Users/sarabjeetsingh/midichlorian/legacy/Frontend-Java/Starhopper/starhopper-main/src/test/java/co/ritual/starhopper/assertions/ColoredBackgroundTextAssertTest.java
/Users/sarabjeetsingh/midichlorian/legacy/Frontend-Java/Starhopper/starhopper-main/src/test/java/co/ritual/starhopper/partner/ExistingUserOnboardingEmailTest.java
/Users/sarabjeetsingh/midichlorian/legacy/Frontend-Java/Starhopper/starhopper-main/src/test/java/co/ritual/starhopper/assertions/ColoredBackgroundTextAssert.java
/Users/sarabjeetsingh/midichlorian/legacy/Frontend-Java/Starhopper/starhopper-main/src/test/java/co/ritual/starhopper/handler/search/suggestion/ui/MerchantSuggestionUiBinderTest.java
/Users/sarabjeetsingh/midichlorian/legacy/Frontend-Java/Starhopper/starhopper-main/src/test/java/co/ritual/starhopper/handler/homev3/card/topcard/TopCardOrderModels/SecondOrderPolyOrderModelTest.java
/Users/sarabjeetsingh/midichlorian/legacy/Frontend-Java/Starhopper/starhopper-main/src/test/java/co/ritual/starhopper/handler/search/suggestion/ui/CategorySuggestionUiBinderTest.java
/Users/sarabjeetsingh/midichlorian/legacy/Frontend-Java/Starhopper/starhopper-main/src/test/java/co/ritual/starhopper/handler/order/orderprogress/ui/OrderProgressSoloPiggybackBodyBinderTest.java
/Users/sarabjeetsingh/midichlorian/legacy/Frontend-Java/Starhopper/starhopper-main/src/test/java/co/ritual/starhopper/handler/init/InitialHandlerTest.java
/Users/sarabjeetsingh/midichlorian/legacy/Frontend-Java/Starhopper/starhopper-main/src/test/java/co/ritual/starhopper/handler/order/orderprogress/ui/parked/OrderProgressParkedHeaderBinderTest.java
/Users/sarabjeetsingh/midichlorian/legacy/Frontend-Java/Starhopper/starhopper-main/src/test/java/co/ritual/starhopper/handler/prospectivemerchant/DesiredMerchantScreenHandlerTest.java
/Users/sarabjeetsingh/midichlorian/legacy/Frontend-Java/Starhopper/starhopper-main/src/test/java/co/ritual/starhopper/handler/list/menu/ui/MenuUiBuilderV2Test.java
/Users/sarabjeetsingh/midichlorian/legacy/Frontend-Java/Starhopper/starhopper-main/src/test/java/co/ritual/starhopper/popup/marketing/MarketingPopupImpressionEvaluatorTest.java
/Users/sarabjeetsingh/midichlorian/legacy/Frontend-Java/Starhopper/starhopper-main/src/test/java/co/ritual/starhopper/handler/piggyback/DeferPiggybackTutorialHandlerTest.java
/Users/sarabjeetsingh/midichlorian/legacy/Frontend-Java/Starhopper/starhopper-main/src/test/java/co/ritual/starhopper/handler/list/menu/ui/MenuUIBuilderFactoryTest.java
/Users/sarabjeetsingh/midichlorian/legacy/Frontend-Java/Starhopper/starhopper-main/src/test/java/co/ritual/starhopper/handler/homev3/card/topcard/TopCardUtilsTest.java
/Users/sarabjeetsingh/midichlorian/legacy/Frontend-Java/Starhopper/starhopper-main/src/test/java/co/ritual/starhopper/handler/list/piggyback/section/InviteCtaCardUiTest.java
/Users/sarabjeetsingh/midichlorian/legacy/Frontend-Java/Starhopper/starhopper-main/src/test/java/co/ritual/starhopper/nudge/NudgeManagerTest.java
/Users/sarabjeetsingh/midichlorian/legacy/Frontend-Java/Starhopper/starhopper-main/src/test/java/co/ritual/starhopper/handler/order/orderprogress/ui/host/OrderProgressHostBodyBottomBinderTest.java
/Users/sarabjeetsingh/midichlorian/legacy/Frontend-Java/Starhopper/starhopper-main/src/test/java/co/ritual/starhopper/StarhopperMarketingCampaignContextTest.java
/Users/sarabjeetsingh/midichlorian/legacy/Frontend-Java/Starhopper/starhopper-main/src/test/java/co/ritual/starhopper/confirmation/GroupOrderTimingMismatchTest.java
/Users/sarabjeetsingh/midichlorian/legacy/Frontend-Java/Starhopper/starhopper-main/src/test/java/co/ritual/starhopper/handler/cart/ui/cartoption/PiggybackNoTutorialCartOptionBinderTest.java
/Users/sarabjeetsingh/midichlorian/legacy/Frontend-Java/Starhopper/starhopper-main/src/test/java/co/ritual/starhopper/handler/order/orderprogress/ui/host/OrderProgressHostHeaderBinderTest.java
/Users/sarabjeetsingh/midichlorian/legacy/Frontend-Java/Starhopper/starhopper-main/src/test/java/co/ritual/starhopper/handler/order/orderprogress/ui/DefaultProgressBarCalculatorTest.java
/Users/sarabjeetsingh/midichlorian/legacy/Frontend-Java/Starhopper/starhopper-main/src/test/java/co/ritual/starhopper/handler/order/orderprogress/data/OrderProgressSoloPiggybackStrategyTest.java
/Users/sarabjeetsingh/midichlorian/legacy/Frontend-Java/Starhopper/starhopper-main/src/test/java/co/ritual/starhopper/handler/receiptsv2/data/ReceiptPayloadDataProviderTest.java
/Users/sarabjeetsingh/midichlorian/legacy/Frontend-Java/Starhopper/starhopper-main/src/test/java/co/ritual/starhopper/handler/list/menu/ui/MenuItemGroupListBuilderTest.java
/Users/sarabjeetsingh/midichlorian/legacy/Frontend-Java/Starhopper/starhopper-main/src/test/java/co/ritual/starhopper/handler/list/FetchBrowseListHandlerTest.java
/Users/sarabjeetsingh/midichlorian/legacy/Frontend-Java/Starhopper/starhopper-main/src/test/java/co/ritual/starhopper/handler/search/landing/data/SearchLandingConcurrentDataProviderTest.java
/Users/sarabjeetsingh/midichlorian/legacy/Frontend-Java/Starhopper/starhopper-main/src/test/java/co/ritual/starhopper/util/ConcurrentFutureExecutorTest.java
/Users/sarabjeetsingh/midichlorian/legacy/Frontend-Java/Starhopper/starhopper-main/src/test/java/co/ritual/starhopper/handler/cart/ui/cartoption/PiggybackNoTutorialWithDescriptionCartOptionBinderTest.java
/Users/sarabjeetsingh/midichlorian/legacy/Frontend-Java/Starhopper/starhopper-main/src/test/java/co/ritual/starhopper/popup/question/ParkMismatchQuestionPopupBuilderTest.java
/Users/sarabjeetsingh/midichlorian/legacy/Frontend-Java/Starhopper/starhopper-main/src/test/java/co/ritual/starhopper/cardv2/rewardheadercard/rewardprogresscard/RewardPointsProgressCardTest.java
/Users/sarabjeetsingh/midichlorian/legacy/Frontend-Java/Starhopper/starhopper-main/src/test/java/co/ritual/storm/search/index/TestIndexEntry.java
/Users/sarabjeetsingh/midichlorian/legacy/Frontend-Java/Starhopper/starhopper-main/src/test/java/co/ritual/starhopper/handler/search/landing/ui/TwoColumnCategoryCardBinderTest.java
/Users/sarabjeetsingh/midichlorian/legacy/Frontend-Java/Starhopper/starhopper-main/src/test/java/co/ritual/starhopper/popup/question/PromoCreditsRestrictedPopupBuilderTest.java
/Users/sarabjeetsingh/midichlorian/legacy/Frontend-Java/Starhopper/starhopper-main/src/test/java/co/ritual/starhopper/handler/settings/entry/SettingsLandingEntriesTest.java
/Users/sarabjeetsingh/midichlorian/legacy/Frontend-Java/Starhopper/starhopper-main/src/test/java/co/ritual/starhopper/analytics/CardWrapperAnalyticLabelModifierTest.java
/Users/sarabjeetsingh/midichlorian/legacy/Frontend-Java/Starhopper/starhopper-main/src/test/java/co/ritual/starhopper/handler/cart/UpdateOfferNoteHandlerTest.java
/Users/sarabjeetsingh/midichlorian/legacy/Frontend-Java/Starhopper/starhopper-main/src/test/java/co/ritual/starhopper/handler/receiptsv2/data/OrderReceiptAdapterTest.java
/Users/sarabjeetsingh/midichlorian/legacy/Frontend-Java/Starhopper/starhopper-main/src/test/java/co/ritual/starhopper/handler/list/home/ReferralContentBuilderTest.java
/Users/sarabjeetsingh/midichlorian/legacy/Frontend-Java/Starhopper/starhopper-main/src/test/java/co/ritual/starhopper/handler/list/menu/MenuHandlerTest.java
/Users/sarabjeetsingh/midichlorian/legacy/Frontend-Java/Starhopper/starhopper-main/src/test/java/co/ritual/starhopper/handler/homev3/card/topcard/HomescreenTopCardGroupTest.java
/Users/sarabjeetsingh/midichlorian/legacy/Frontend-Java/Starhopper/starhopper-main/src/test/java/co/ritual/starhopper/handler/search/suggestion/client/elasticsearch/MerchantResultAdapterTest.java
/Users/sarabjeetsingh/midichlorian/legacy/Frontend-Java/Starhopper/starhopper-main/src/test/java/co/ritual/starhopper/util/StoreHoursTest.java
/Users/sarabjeetsingh/midichlorian/legacy/Frontend-Java/Starhopper/starhopper-main/src/test/java/co/ritual/starhopper/assertions/ClientImageAssertTest.java
/Users/sarabjeetsingh/midichlorian/legacy/Frontend-Java/Starhopper/starhopper-main/src/test/java/co/ritual/starhopper/prompt/postorder/latestage/milestones/HostOrdersMilestoneTest.java
/Users/sarabjeetsingh/midichlorian/legacy/Frontend-Java/Starhopper/starhopper-main/src/test/java/co/ritual/starhopper/handler/receiptsv2/ui/PastOrderEmptyListUiBinderTest.java
/Users/sarabjeetsingh/midichlorian/legacy/Frontend-Java/Starhopper/starhopper-main/src/test/java/co/ritual/starhopper/order/queue/delay/OrderAheadQueuedOrderDelayTest.java
/Users/sarabjeetsingh/midichlorian/legacy/Frontend-Java/Starhopper/starhopper-main/src/test/java/co/ritual/starhopper/assertions/FancySentenceAssert.java
/Users/sarabjeetsingh/midichlorian/legacy/Frontend-Java/Starhopper/starhopper-main/src/test/java/co/ritual/starhopper/assertions/LeftRightTextAssert.java
/Users/sarabjeetsingh/midichlorian/legacy/Frontend-Java/Starhopper/starhopper-main/src/test/java/co/ritual/starhopper/handler/tutorial/ui/cards/piggyback/PiggybackEarnPointsCardTest.java
/Users/sarabjeetsingh/midichlorian/legacy/Frontend-Java/Starhopper/starhopper-main/src/test/java/co/ritual/starhopper/task/SendOfferNotificationsTaskTest.java
/Users/sarabjeetsingh/midichlorian/legacy/Frontend-Java/Starhopper/starhopper-main/src/test/java/co/ritual/starhopper/handler/homev3/card/topcard/HomeTopCardContentSorterTest.java
/Users/sarabjeetsingh/midichlorian/legacy/Frontend-Java/Starhopper/starhopper-main/src/test/java/co/ritual/starhopper/nudge/InviteToOrderNudgeTest.java
/Users/sarabjeetsingh/midichlorian/legacy/Frontend-Java/Starhopper/starhopper-main/src/test/java/co/ritual/starhopper/handler/order/feedback/ExtendedFeedbackScreenHandlerTest.java
/Users/sarabjeetsingh/midichlorian/legacy/Frontend-Java/Starhopper/starhopper-main/src/test/java/co/ritual/starhopper/handler/order/orderprogress/ui/guest/OrderProgressGuestHeaderBinderTest.java
/Users/sarabjeetsingh/midichlorian/legacy/Frontend-Java/Starhopper/starhopper-main/src/test/java/co/ritual/starhopper/record/CartOrderLineItemBuilderTest.java
/Users/sarabjeetsingh/midichlorian/legacy/Frontend-Java/Starhopper/starhopper-main/src/test/java/co/ritual/starhopper/handler/order/orderprogress/ui/ReadyTimePiggybackStringResolverTest.java
/Users/sarabjeetsingh/midichlorian/legacy/Frontend-Java/Starhopper/starhopper-main/src/test/java/co/ritual/starhopper/handler/search/landing/ui/SearchLandingRewardsCardBinderTest.java
/Users/sarabjeetsingh/midichlorian/legacy/Frontend-Java/Starhopper/starhopper-main/src/test/java/co/ritual/starhopper/handler/search/suggestion/ui/SearchSuggestionCardBinderTest.java
/Users/sarabjeetsingh/midichlorian/legacy/Frontend-Java/Starhopper/starhopper-main/src/test/java/co/ritual/starhopper/StarhopperResponseTest.java
/Users/sarabjeetsingh/midichlorian/legacy/Frontend-Java/Starhopper/starhopper-main/src/test/java/co/ritual/starhopper/handler/search/landing/ui/analytics/TwoColumnCategoryCardAnalyticProcessorTest.java
/Users/sarabjeetsingh/midichlorian/legacy/Frontend-Java/Starhopper/starhopper-main/src/test/java/co/ritual/starhopper/handler/search/suggestion/analytics/LeftImageInfoCardAnalyticProcessorTest.java
/Users/sarabjeetsingh/midichlorian/legacy/Frontend-Java/Starhopper/starhopper-main/src/test/java/co/ritual/starhopper/handler/homev3/card/quickaccess/QuickAccessMerchantContentPresenterTest.java
/Users/sarabjeetsingh/midichlorian/legacy/Frontend-Java/Starhopper/starhopper-main/src/test/java/co/ritual/starhopper/handler/order/OrderProgressHelperTest.java
/Users/sarabjeetsingh/midichlorian/legacy/Frontend-Java/Starhopper/starhopper-main/src/test/java/co/ritual/starhopper/handler/search/landing/data/SearchLandingSequentialAggregateClientTest.java
/Users/sarabjeetsingh/midichlorian/legacy/Frontend-Java/Starhopper/starhopper-main/src/test/java/co/ritual/starhopper/handler/list/menu/ui/MenuUiBuilderTest.java
/Users/sarabjeetsingh/midichlorian/legacy/Frontend-Java/Starhopper/starhopper-main/src/test/java/co/ritual/starhopper/handler/search/landing/ui/SearchLandingListUiBinderTest.java
/Users/sarabjeetsingh/midichlorian/legacy/Frontend-Java/Starhopper/starhopper-main/src/test/java/co/ritual/starhopper/prompt/postorder/latestage/LateStageReferralMilestoneManagerTest.java
/Users/sarabjeetsingh/midichlorian/legacy/Frontend-Java/Starhopper/starhopper-main/src/test/java/co/ritual/starhopper/prompt/postorder/latestage/milestones/TotalOrdersMilestoneTest.java
/Users/sarabjeetsingh/midichlorian/legacy/Frontend-Java/Starhopper/starhopper-main/src/test/java/co/ritual/starhopper/handler/search/suggestion/ui/SearchResultsCardBinderTest.java
/Users/sarabjeetsingh/midichlorian/legacy/Frontend-Java/Starhopper/starhopper-main/src/test/java/co/ritual/starhopper/handler/user/PromoCodeHandlerTest.java
/Users/sarabjeetsingh/midichlorian/legacy/Frontend-Java/Starhopper/starhopper-main/src/test/java/co/ritual/starhopper/handler/order/orderprogress/data/OrderProgressHostStrategyTest.java
/Users/sarabjeetsingh/midichlorian/legacy/Frontend-Java/Starhopper/starhopper-main/src/test/java/co/ritual/starhopper/handler/homev3/card/topcard/NearbyTopMerchantCardBinderTest.java
/Users/sarabjeetsingh/midichlorian/legacy/Frontend-Java/Starhopper/starhopper-main/src/test/java/co/ritual/starhopper/handler/search/ui/SearchAutoSuggestionUiBuilderV2Test.java
/Users/sarabjeetsingh/midichlorian/legacy/Frontend-Java/Starhopper/starhopper-main/src/test/java/co/ritual/internal/SendCommunicationServletTest.java
/Users/sarabjeetsingh/midichlorian/legacy/Frontend-Java/Starhopper/starhopper-main/src/test/java/co/ritual/starhopper/handler/list/piggyback/section/ActivityFeedSectionGroupBuilderTest.java
/Users/sarabjeetsingh/midichlorian/legacy/Frontend-Java/Starhopper/starhopper-main/src/test/java/co/ritual/starhopper/handler/list/menu/PiggybackGrowthInviteWidgetTest.java
/Users/sarabjeetsingh/midichlorian/legacy/Frontend-Java/Starhopper/starhopper-main/src/test/java/co/ritual/starhopper/handler/search/landing/data/category/SearchLandingCategoryClientTest.java
/Users/sarabjeetsingh/midichlorian/legacy/Frontend-Java/Starhopper/starhopper-main/src/test/java/co/ritual/starhopper/handler/order/orderprogress/ui/OrderProgressSoloBodyBinderTest.java
/Users/sarabjeetsingh/midichlorian/legacy/Frontend-Java/Starhopper/starhopper-main/src/test/java/co/ritual/starhopper/handler/search/suggestion/analytics/MerchantSearchResultCardAnalyticProcessorTest.java
/Users/sarabjeetsingh/midichlorian/legacy/Frontend-Java/Starhopper/starhopper-main/src/test/java/co/ritual/starhopper/handler/search/suggestion/client/elasticsearch/ElasticsearchMerchantSearchRequestAdapterTest.java
/Users/sarabjeetsingh/midichlorian/legacy/Frontend-Java/Starhopper/starhopper-main/src/test/java/co/ritual/starhopper/prompt/postorder/latestage/milestones/TimeSavedMilestoneTest.java
/Users/sarabjeetsingh/midichlorian/legacy/Frontend-Java/Starhopper/starhopper-main/src/test/java/co/ritual/starhopper/handler/order/orderprogress/ui/OrderProgressSoloPiggybackHeaderBinderTest.java
/Users/sarabjeetsingh/midichlorian/legacy/Frontend-Java/Starhopper/starhopper-main/src/test/java/co/ritual/starhopper/assertions/StarhopperAssertions.java
/Users/sarabjeetsingh/midichlorian/legacy/Frontend-Java/Starhopper/starhopper-main/src/test/java/co/ritual/starhopper/handler/homev2/data/LandmarkDataViewTest.java
/Users/sarabjeetsingh/midichlorian/legacy/Frontend-Java/Starhopper/starhopper-main/src/test/java/co/ritual/starhopper/handler/order/orderprogress/ui/geoqueue/OrderProgressGeoqueueSoloHeaderBinderTest.java
/Users/sarabjeetsingh/midichlorian/legacy/Frontend-Java/Starhopper/starhopper-main/src/test/java/co/ritual/storm/search/index/TestIndexQueryResults.java
/Users/sarabjeetsingh/midichlorian/legacy/Frontend-Java/Starhopper/starhopper-main/src/test/java/co/ritual/starhopper/handler/search/suggestion/data/SearchFilterReportChoicesAdapterTest.java
/Users/sarabjeetsingh/midichlorian/legacy/Frontend-Java/Starhopper/starhopper-main/src/test/java/co/ritual/starhopper/handler/order/orderprogress/ui/donation/OrderProgressDonationBodyBinderTest.java
/Users/sarabjeetsingh/midichlorian/legacy/Frontend-Java/Starhopper/starhopper-main/src/test/java/co/ritual/starhopper/assertions/LeftRightSentenceAssertTest.java
/Users/sarabjeetsingh/midichlorian/legacy/Frontend-Java/Starhopper/starhopper-main/src/test/java/co/ritual/starhopper/handler/order/orderprogress/ui/growth/OrderProgressNoHostHeaderBinderTest.java
/Users/sarabjeetsingh/midichlorian/legacy/Frontend-Java/Starhopper/starhopper-main/src/test/java/co/ritual/starhopper/assertions/LeftRightTextAssertTest.java
/Users/sarabjeetsingh/midichlorian/legacy/Frontend-Java/Starhopper/starhopper-main/src/test/java/co/ritual/starhopper/handler/search/landing/ui/SearchLandingCategoryCardBinderTest.java
/Users/sarabjeetsingh/midichlorian/legacy/Frontend-Java/Starhopper/starhopper-main/src/test/java/co/ritual/starhopper/handler/list/home/FetchHomeHeaderMessageTest.java
/Users/sarabjeetsingh/midichlorian/legacy/Frontend-Java/Starhopper/starhopper-main/src/test/java/co/ritual/starhopper/handler/order/orderprogress/ui/growth/OrderProgressNoHostTrackerBinderTest.java
/Users/sarabjeetsingh/midichlorian/legacy/Frontend-Java/Starhopper/starhopper-main/src/test/java/co/ritual/starhopper/order/queue/QueuedOrderCalculatorTest.java
/Users/sarabjeetsingh/midichlorian/legacy/Frontend-Java/Starhopper/starhopper-main/src/test/java/co/ritual/starhopper/handler/web/GetWebviewAuthTokenHandlerTest.java
/Users/sarabjeetsingh/midichlorian/legacy/Frontend-Java/Starhopper/starhopper-main/src/test/java/co/ritual/starhopper/handler/order/dropzone/SelectDropzonePayloadBinderTest.java
/Users/sarabjeetsingh/midichlorian/legacy/Frontend-Java/Starhopper/starhopper-main/src/test/java/co/ritual/starhopper/handler/order/orderprogress/ui/snoozed/OrderProgressSnoozedBodyBinderTest.java
/Users/sarabjeetsingh/midichlorian/legacy/Frontend-Java/Starhopper/starhopper-main/src/test/java/co/ritual/starhopper/handler/order/orderprogress/ui/OrderProgressHeaderUiBinderTest.java
/Users/sarabjeetsingh/midichlorian/legacy/Frontend-Java/Starhopper/starhopper-main/src/test/java/co/ritual/starhopper/handler/order/orderprogress/ui/OrderProgressBodyUiBinderTest.java
/Users/sarabjeetsingh/midichlorian/legacy/Frontend-Java/Starhopper/starhopper-main/src/test/java/co/ritual/starhopper/handler/order/status/ReadyStatusBinderTest.java
/Users/sarabjeetsingh/midichlorian/legacy/Frontend-Java/Starhopper/starhopper-main/src/test/java/co/ritual/starhopper/handler/locale/SupportedLocaleBuilderTest.java
/Users/sarabjeetsingh/midichlorian/legacy/Frontend-Java/Starhopper/starhopper-main/src/test/java/co/ritual/starhopper/handler/order/orderprogress/ui/HostProgressBarCalculatorTest.java
/Users/sarabjeetsingh/midichlorian/legacy/Frontend-Java/Starhopper/starhopper-main/src/test/java/co/ritual/starhopper/handler/tutorial/ui/cards/piggyback/PiggybackOfferCardTest.java
/Users/sarabjeetsingh/midichlorian/legacy/Frontend-Java/Starhopper/starhopper-main/src/test/java/co/ritual/starhopper/handler/tutorial/ui/cards/piggyback/PiggybackTitleCardTest.java
/Users/sarabjeetsingh/midichlorian/legacy/Frontend-Java/Starhopper/starhopper-main/src/test/java/co/ritual/starhopper/handler/search/suggestion/ui/LandmarkSuggestionUiBinderTest.java
/Users/sarabjeetsingh/midichlorian/legacy/Frontend-Java/Starhopper/starhopper-main/src/test/java/co/ritual/starhopper/handler/receiptsv2/ui/PastOrderCardBinderTest.java
/Users/sarabjeetsingh/midichlorian/legacy/Frontend-Java/Starhopper/starhopper-main/src/test/java/co/ritual/starhopper/handler/search/landing/ui/FullRowRewardsCardBinderTest.java
/Users/sarabjeetsingh/midichlorian/legacy/Frontend-Java/Starhopper/starhopper-main/src/test/java/co/ritual/starhopper/handler/search/FetchSearchAutoSuggestionHandlerTest.java
/Users/sarabjeetsingh/midichlorian/legacy/Frontend-Java/Starhopper/starhopper-main/src/test/java/co/ritual/starhopper/handler/order/orderprogress/ui/growth/OrderProgressNoHostOrderBottomBinderTest.java
/Users/sarabjeetsingh/midichlorian/legacy/Frontend-Java/Starhopper/starhopper-main/src/test/java/co/ritual/starhopper/handler/cart/ui/cartoption/OfferNotePayloadBinderTest.java
/Users/sarabjeetsingh/midichlorian/legacy/Frontend-Java/Starhopper/starhopper-main/src/test/java/co/ritual/starhopper/quickaccess/QuickAccessManagerTest.java
/Users/sarabjeetsingh/midichlorian/legacy/Frontend-Java/Starhopper/starhopper-main/src/test/java/co/ritual/starhopper/handler/homev3/card/analytics/HomescreenAnalyticsUtilTest.java
/Users/sarabjeetsingh/midichlorian/legacy/Frontend-Java/Starhopper/starhopper-main/src/test/java/co/ritual/starhopper/handler/homev3/card/marketingV2/MarketingCardV2GroupTest.java
/Users/sarabjeetsingh/midichlorian/legacy/Frontend-Java/Starhopper/starhopper-main/src/test/java/co/ritual/starhopper/handler/search/suggestion/analytics/MultiLineLeftRightCardAnalyticProcessorTest.java
/Users/sarabjeetsingh/midichlorian/legacy/Frontend-Java/Starhopper/starhopper-main/src/test/java/co/ritual/starhopper/popup/marketing/PromoReferralConstantsTest.java
/Users/sarabjeetsingh/midichlorian/legacy/Frontend-Java/Starhopper/starhopper-main/src/test/java/co/ritual/starhopper/record/ClientOrderDetailBuilderTest.java
/Users/sarabjeetsingh/midichlorian/legacy/Frontend-Java/Starhopper/starhopper-main/src/test/java/co/ritual/starhopper/handler/order/orderprogress/data/OrderProgressSoloStrategyTest.java
/Users/sarabjeetsingh/midichlorian/legacy/Frontend-Java/Starhopper/starhopper-main/src/test/java/co/ritual/starhopper/handler/search/suggestion/client/elasticsearch/ElasticsearchAutoSuggestionClientTest.java
/Users/sarabjeetsingh/midichlorian/legacy/Frontend-Java/Starhopper/starhopper-main/src/test/java/co/ritual/starhopper/handler/search/FetchSearchV2HandlerTest.java
/Users/sarabjeetsingh/midichlorian/legacy/Frontend-Java/Starhopper/starhopper-main/src/test/java/co/ritual/starhopper/handler/order/orderprogress/ui/host/OrderProgressHostBodyBinderTest.java
/Users/sarabjeetsingh/midichlorian/legacy/Frontend-Java/Starhopper/starhopper-main/src/test/java/co/ritual/starhopper/handler/homev3/card/lunchclub/ui/FourLineCardPresenterTest.java
/Users/sarabjeetsingh/midichlorian/legacy/Frontend-Java/Starhopper/starhopper-main/src/test/java/co/ritual/starhopper/handler/order/orderprogress/ui/social/OrderProgressSocialGridBinderTest.java
/Users/sarabjeetsingh/midichlorian/legacy/Frontend-Java/Starhopper/starhopper-main/src/test/java/co/ritual/starhopper/handler/order/orderprogress/data/OrderProgressGuestStrategyTest.java
/Users/sarabjeetsingh/midichlorian/legacy/Frontend-Java/Starhopper/starhopper-main/src/test/java/co/ritual/starhopper/handler/search/suggestion/client/elasticsearch/ElasticsearchSearchResultsClientTest.java
/Users/sarabjeetsingh/midichlorian/legacy/Frontend-Java/Starhopper/starhopper-main/src/test/java/co/ritual/starhopper/popup/question/PaymentCardExpiringExpiredPopupBuilderTest.java
/Users/sarabjeetsingh/midichlorian/legacy/Frontend-Java/Starhopper/starhopper-main/src/test/java/co/ritual/starhopper/prompt/postorder/latestage/milestones/LateStageReferralMilestoneTest.java
/Users/sarabjeetsingh/midichlorian/legacy/Frontend-Java/Starhopper/starhopper-main/src/test/java/co/ritual/starhopper/handler/homev3/card/topcard/NearbyNewMerchantCardBinderTest.java
/Users/sarabjeetsingh/midichlorian/legacy/Frontend-Java/Starhopper/starhopper-main/src/test/java/co/ritual/starhopper/handler/homev3/card/HomescreenCardGroupCreatorTest.java
/Users/sarabjeetsingh/midichlorian/legacy/Frontend-Java/Starhopper/starhopper-main/src/test/java/co/ritual/starhopper/handler/order/orderprogress/ui/geoqueue/OrderProgressGeoqueueSoloPiggybackBodyBinderTest.java
/Users/sarabjeetsingh/midichlorian/legacy/Frontend-Java/Starhopper/starhopper-main/src/test/java/co/ritual/starhopper/handler/homev3/card/lunchclub/ui/MultiLineLeftRightCardPresenterTest.java
/Users/sarabjeetsingh/midichlorian/legacy/Frontend-Java/Starhopper/starhopper-main/src/test/java/co/ritual/starhopper/handler/order/orderprogress/ui/ReadyTimeSoloStringResolverTest.java
/Users/sarabjeetsingh/midichlorian/legacy/Frontend-Java/Starhopper/starhopper-main/src/test/java/co/ritual/starhopper/handler/search/landing/data/SearchLandingTestHelper.java
/Users/sarabjeetsingh/midichlorian/legacy/Frontend-Java/Starhopper/starhopper-main/src/test/java/co/ritual/starhopper/handler/search/suggestion/client/elasticsearch/ElasticsearchMultiSearchRequestAdapterTest.java
/Users/sarabjeetsingh/midichlorian/legacy/Frontend-Java/Starhopper/starhopper-main/src/test/java/co/ritual/starhopper/handler/search/landing/data/SearchLandingPerksClientTest.java
/Users/sarabjeetsingh/midichlorian/legacy/Frontend-Java/Starhopper/starhopper-main/src/test/java/co/ritual/starhopper/partner/AddUserToStoreInviteEmailTest.java
/Users/sarabjeetsingh/midichlorian/legacy/Frontend-Java/Starhopper/starhopper-main/src/test/java/co/ritual/starhopper/handler/order/orderprogress/data/OrderProgressDonationStrategyTest.java
/Users/sarabjeetsingh/midichlorian/legacy/Frontend-Java/Starhopper/starhopper-main/src/test/java/co/ritual/starhopper/handler/search/ui/SearchUiBuilderTest.java
/Users/sarabjeetsingh/midichlorian/legacy/Frontend-Java/Starhopper/starhopper-main/src/test/java/co/ritual/starhopper/handler/order/status/ReadyStatusFeedbackBinderTest.java
/Users/sarabjeetsingh/midichlorian/legacy/Frontend-Java/Starhopper/starhopper-main/src/test/java/co/ritual/starhopper/handler/homev3/card/topcard/FeaturedMerchantCardBinderTest.java
/Users/sarabjeetsingh/midichlorian/legacy/Frontend-Java/Starhopper/starhopper-main/src/test/java/co/ritual/starhopper/handler/list/piggyback/section/PiggybackScreenOrderManagerTest.java
/Users/sarabjeetsingh/midichlorian/legacy/Frontend-Java/Starhopper/starhopper-main/src/test/java/co/ritual/starhopper/handler/homev3/card/lunchclub/ui/FourLineHorizontalCardBinderTest.java
/Users/sarabjeetsingh/midichlorian/legacy/Frontend-Java/Starhopper/starhopper-main/src/test/java/co/ritual/starhopper/popup/tutorial/marketing/DollarCoffeePromoTutorialBuilderTest.java
/Users/sarabjeetsingh/midichlorian/legacy/Frontend-Java/Starhopper/starhopper-main/src/test/java/co/ritual/starhopper/handler/order/orderprogress/utils/OrderReadyTimeHostCalculatorTest.java
/Users/sarabjeetsingh/midichlorian/legacy/Frontend-Java/Starhopper/starhopper-main/src/test/java/co/ritual/starhopper/handler/order/orderprogress/ui/guest/OrderProgressHostCancelledBodyBinderTest.java
/Users/sarabjeetsingh/midichlorian/legacy/Frontend-Java/Starhopper/starhopper-main/src/test/java/co/ritual/starhopper/risk/RiskEvaluatorTest.java
/Users/sarabjeetsingh/midichlorian/legacy/Frontend-Java/Starhopper/starhopper-main/src/test/java/co/ritual/starhopper/partner/ResetPasswordEmailTest.java
/Users/sarabjeetsingh/midichlorian/legacy/Frontend-Java/Starhopper/starhopper-main/src/test/java/co/ritual/starhopper/handler/search/landing/data/SearchLandingWellnessClientTest.java
