<?xml version="1.0" encoding="utf-8"?>
<!-- Generator: Adobe Illustrator 16.0.0, SVG Export Plug-In . SVG Version: 6.00 Build 0)  -->
<!DOCTYPE svg PUBLIC "-//W3C//DTD SVG 1.1//EN" "http://www.w3.org/Graphics/SVG/1.1/DTD/svg11.dtd">
<svg version="1.1" id="Layer_1" xmlns="http://www.w3.org/2000/svg" xmlns:xlink="http://www.w3.org/1999/xlink" x="0px" y="0px"
	 width="100px" height="100px" viewBox="0 0 100 100" enable-background="new 0 0 100 100" xml:space="preserve">
<path fill-rule="evenodd" clip-rule="evenodd" fill="#FFFFFF" d="M248.001,92.378c-10.09-0.073-19.846-1.787-29.057-6.056
	c-6.041-2.801-11.417-6.512-15.514-11.857c-3.503-4.569-5.435-9.7-5.153-15.523c0.271-5.594,2.626-10.317,6.283-14.446
	c4.32-4.881,9.714-8.225,15.655-10.739c6.453-2.731,13.203-4.27,20.173-4.908c9.167-0.84,18.219-0.218,27.118,2.184
	c7.155,1.931,13.808,4.916,19.537,9.712c4.442,3.716,7.854,8.173,9.407,13.845c1.959,7.158,0.446,13.673-3.902,19.577
	c-3.667,4.979-8.52,8.536-13.97,11.329c-6.334,3.244-13.068,5.235-20.109,6.132c-3.467,0.439-6.966,0.627-10.449,0.928
	C248.013,92.495,248.008,92.437,248.001,92.378z M210.91,44.364c-0.038,0.087-0.057,0.19-0.114,0.261
	c-6.188,7.615-6.985,16.902-2.513,25.089c2.75,5.034,6.865,8.728,11.726,11.638c6.648,3.983,13.928,6.048,21.562,7.012
	c0.731,0.093,1.468,0.15,2.387,0.243c-0.491-0.53-0.84-0.886-1.163-1.261c-0.324-0.379-0.64-0.771-0.936-1.173
	c-2.921-3.974-4.314-8.545-5.15-13.323c-0.713-4.071-0.93-8.181-0.903-12.306c0.003-0.534-0.144-0.729-0.7-0.804
	c-1.908-0.25-3.826-0.486-5.709-0.883c-4.552-0.959-8.894-2.49-12.699-5.252C213.591,51.35,211.167,48.627,210.91,44.364z
	 M252.005,88.465c0.109,0.051,0.15,0.088,0.188,0.086c0.166-0.006,0.334-0.018,0.499-0.036c6.161-0.71,12.123-2.183,17.799-4.718
	c5.526-2.466,10.481-5.735,14.348-10.478c3.202-3.931,5.132-8.385,5.336-13.503c0.228-5.711-1.901-10.596-5.339-15.007
	c-0.047-0.059-0.133-0.083-0.254-0.155c0.106,2.354-0.77,4.295-2.305,5.88c-1.183,1.223-2.479,2.394-3.897,3.321
	c-5.334,3.486-11.345,5.047-17.581,5.871c-0.576,0.076-0.818,0.208-0.807,0.851c0.068,3.89-0.207,7.76-0.861,11.596
	C258.108,78.169,256.302,83.831,252.005,88.465z M236.389,52.221c0.085-0.441,0.131-0.648,0.162-0.858
	c0.437-2.927,1.106-5.794,2.155-8.566c1.059-2.805,2.4-5.44,4.58-7.574c3.021-2.959,6.464-2.925,9.415,0.106
	c1.362,1.398,2.37,3.036,3.217,4.778c1.742,3.584,2.752,7.391,3.358,11.313c0.059,0.38,0.076,0.703,0.619,0.608
	c3.666-0.63,7.287-1.431,10.686-3.003c1.826-0.846,3.552-1.859,4.794-3.507c1.543-2.047,1.39-4.16-0.402-5.984
	c-1.836-1.869-4.145-2.938-6.55-3.811c-6.41-2.326-13.088-3.088-19.852-3.232c-4.627-0.098-9.234,0.228-13.792,1.079
	c-3.78,0.707-7.474,1.695-10.87,3.567c-1.428,0.787-2.744,1.727-3.708,3.077c-1.337,1.872-1.235,3.855,0.349,5.52
	c0.618,0.649,1.33,1.233,2.074,1.735c1.869,1.262,3.945,2.113,6.1,2.734C231.229,50.926,233.769,51.536,236.389,52.221z
	 M240.206,60.313c0.066,1.426,0.092,2.777,0.2,4.121c0.258,3.19,0.836,6.313,2.144,9.263c0.692,1.558,1.555,3.006,2.935,4.066
	c1.64,1.26,3.46,1.274,4.905-0.187c0.92-0.927,1.714-2.054,2.296-3.224c1.624-3.256,2.246-6.797,2.606-10.385
	c0.118-1.194,0.156-2.395,0.231-3.605C250.395,60.749,245.383,60.678,240.206,60.313z M240.721,52.592
	c4.813,0.469,9.474,0.398,14.241,0.121c-0.245-1.244-0.419-2.346-0.682-3.428c-0.615-2.533-1.409-5.007-3.137-7.038
	c-2.044-2.404-4.634-2.39-6.598,0.071C242.175,45.285,241.427,48.873,240.721,52.592z"/>
<g>
	<path fill-rule="evenodd" clip-rule="evenodd" fill="#FFFFFF" d="M51.885,11.446c0.395,0.042,0.789,0.092,1.186,0.125
		c4.928,0.402,9.603,1.724,14.032,3.91c5.597,2.763,10.273,6.638,13.949,11.69c3.354,4.61,5.592,9.719,6.734,15.308
		c0.607,2.965,0.856,5.961,0.732,8.983c-0.181,4.453-1.12,8.749-2.785,12.885c-1.768,4.39-4.219,8.358-7.444,11.822
		c-5.448,5.849-12.114,9.605-19.889,11.412c-3.892,0.904-7.834,1.199-11.806,0.796c-9.403-0.951-17.5-4.721-24.162-11.445
		c-4.069-4.106-6.968-8.962-8.86-14.422c-1.169-3.372-1.869-6.837-2.067-10.401c-0.003-0.076-0.036-0.151-0.056-0.228
		c0-1.26,0-2.521,0-3.782c0.021-0.099,0.049-0.197,0.059-0.296c0.101-1.025,0.16-2.056,0.305-3.075
		c0.624-4.363,1.944-8.506,3.962-12.426c2.042-3.967,4.675-7.489,7.947-10.528c2.899-2.693,6.147-4.873,9.725-6.564
		c4.262-2.015,8.734-3.248,13.436-3.636c0.408-0.034,0.813-0.085,1.22-0.127C49.363,11.446,50.625,11.446,51.885,11.446z
		 M13.101,49.97c0.172,20.405,16.174,36.737,36.646,36.87c20.551,0.134,36.898-16.064,37.098-36.475
		c0.204-20.599-16.021-37.03-36.482-37.228C29.667,12.937,13.287,29.348,13.101,49.97z"/>
	<path fill-rule="evenodd" clip-rule="evenodd" fill="#FFFFFF" d="M17.238,49.947c0.205-18.277,14.62-32.777,32.95-32.672
		c18.216,0.104,32.634,14.633,32.521,32.924c-0.111,18.086-14.441,32.46-32.634,32.502C31.705,82.744,17.397,68.174,17.238,49.947z
		 M27.608,39.204c-0.564,0.979-1.116,1.933-1.676,2.904c4.558,2.632,9.08,5.243,13.646,7.88c-0.841,0.488-1.626,0.936-2.405,1.394
		c-1.892,1.117-3.051,2.763-3.501,4.905c-0.393,1.869-2.191,2.838-3.971,2.126c-0.557-0.222-0.854-0.162-1.248,0.296
		c-1.74,2.024-3.473,4.054-5.211,6.079c-0.19,0.222-0.271,0.452-0.116,0.719c0.156,0.269,0.407,0.308,0.688,0.254
		c2.641-0.497,5.283-0.992,7.924-1.492c0.486-0.092,0.771-0.371,0.809-0.85c0.144-1.85,2.032-3.094,3.934-2.421
		c1.756,0.62,3.527,0.517,5.221-0.265c0.818-0.377,1.583-0.872,2.372-1.313c0.224-0.125,0.448-0.253,0.73-0.414
		c0,5.296,0,10.515,0,15.745c1.12,0,2.203,0,3.332,0c0-0.165,0-0.311,0-0.455c0-2.842,0-5.685,0-8.526
		c0-2.785,0.003-5.571-0.005-8.355c-0.001-0.248,0.066-0.396,0.292-0.514c0.466-0.244,0.911-0.53,1.377-0.774
		c0.104-0.054,0.284-0.055,0.389-0.002c0.446,0.234,0.867,0.515,1.316,0.74c0.278,0.14,0.353,0.319,0.353,0.619
		c-0.011,5.604-0.007,11.208-0.007,16.813c0,0.145,0,0.291,0,0.448c1.138,0,2.229,0,3.359,0c0-5.241,0-10.459,0-15.718
		c0.146,0.078,0.246,0.127,0.344,0.184c0.715,0.411,1.423,0.835,2.145,1.232c1.863,1.025,3.826,1.239,5.836,0.546
		c1.896-0.653,3.757,0.586,3.909,2.422c0.039,0.483,0.323,0.765,0.8,0.854c1.687,0.321,3.372,0.639,5.059,0.956
		c0.956,0.18,1.911,0.359,2.867,0.539c0.279,0.053,0.532,0.018,0.691-0.25c0.156-0.265,0.083-0.504-0.111-0.72
		c-0.03-0.034-0.059-0.071-0.089-0.105c-1.677-1.957-3.353-3.915-5.032-5.872c-0.501-0.583-0.728-0.638-1.432-0.358
		c-1.678,0.663-3.496-0.367-3.89-2.128c-0.171-0.771-0.462-1.536-0.82-2.239c-0.708-1.381-1.874-2.315-3.228-3.038
		c-0.612-0.326-1.203-0.69-1.848-1.062c4.574-2.641,9.103-5.255,13.648-7.881c-0.572-0.986-1.124-1.94-1.68-2.899
		c-2.674,1.542-5.301,3.056-7.929,4.572c-2.39,1.379-4.78,2.758-7.163,4.144c-0.174,0.1-0.296,0.105-0.466,0
		c-0.469-0.288-0.955-0.545-1.419-0.838c-0.101-0.063-0.191-0.223-0.196-0.342c-0.021-0.503,0.011-1.009-0.016-1.512
		c-0.017-0.292,0.088-0.445,0.339-0.589c4.318-2.481,8.631-4.973,12.942-7.462c0.682-0.394,1.363-0.789,2.053-1.189
		c-0.566-0.979-1.112-1.929-1.674-2.899c-4.548,2.625-9.072,5.235-13.653,7.88c0-0.904-0.009-1.736,0.002-2.568
		c0.029-2.304-0.832-4.206-2.545-5.739c-1.377-1.233-1.295-3.298,0.159-4.435c0.506-0.397,0.6-0.679,0.39-1.278
		c-0.874-2.492-1.752-4.984-2.626-7.476c-0.1-0.279-0.243-0.508-0.566-0.517c-0.343-0.01-0.497,0.225-0.6,0.516
		c-0.868,2.47-1.741,4.939-2.607,7.41c-0.238,0.677-0.159,0.915,0.401,1.364c0.713,0.573,1.086,1.318,1.103,2.231
		c0.019,1.02-0.493,1.759-1.22,2.428c-1.41,1.296-2.175,2.931-2.278,4.844c-0.052,0.96-0.015,1.924-0.02,2.887
		c-0.001,0.094-0.013,0.188-0.023,0.32c-4.563-2.635-9.083-5.243-13.628-7.868c-0.562,0.974-1.114,1.928-1.676,2.902
		c1.118,0.646,2.206,1.278,3.295,1.907c3.917,2.259,7.833,4.52,11.752,6.775c0.198,0.114,0.297,0.236,0.287,0.482
		c-0.021,0.515-0.012,1.031-0.001,1.547c0.003,0.191-0.047,0.311-0.228,0.408c-0.464,0.249-0.921,0.513-1.367,0.792
		c-0.189,0.119-0.327,0.123-0.525,0.006c-1.482-0.868-2.973-1.721-4.46-2.58C34.697,43.297,31.179,41.265,27.608,39.204z"/>
	<path fill-rule="evenodd" clip-rule="evenodd" fill="#FFFFFF" d="M55.197,53.899c-0.253-0.698,0.24-1.044,0.881-1.447
		c0.71-0.446,1.235-0.471,1.946,0.006c1.131,0.755,2.351,1.374,3.523,2.062c0.724,0.424,1.07,1.215,0.9,1.988
		c-0.175,0.801-0.785,1.392-1.619,1.45c-0.355,0.025-0.771-0.049-1.083-0.22c-1.463-0.804-2.903-1.652-4.344-2.498
		c-0.101-0.059-0.184-0.222-0.196-0.345C55.178,54.612,55.197,54.324,55.197,53.899z"/>
	<path fill-rule="evenodd" clip-rule="evenodd" fill="#FFFFFF" d="M44.79,54.052c0.273,0.891-0.246,1.276-0.948,1.646
		c-1.185,0.622-2.322,1.333-3.486,1.993c-0.976,0.554-2.084,0.281-2.602-0.621c-0.541-0.942-0.209-2.038,0.786-2.611
		c1.378-0.792,2.758-1.584,4.13-2.387c0.192-0.111,0.332-0.124,0.526-0.001c0.435,0.274,0.883,0.529,1.337,0.771
		c0.197,0.105,0.285,0.225,0.263,0.455C44.771,53.546,44.79,53.8,44.79,54.052z"/>
	<path fill-rule="evenodd" clip-rule="evenodd" fill="#FFFFFF" d="M51.85,40.176c0,0.813-0.008,1.625,0.005,2.438
		c0.002,0.209-0.061,0.334-0.246,0.436c-0.481,0.263-0.948,0.553-1.432,0.812c-0.096,0.051-0.267,0.053-0.361,0.003
		c-0.503-0.271-0.999-0.557-1.484-0.858c-0.094-0.058-0.186-0.208-0.187-0.316c-0.011-1.648-0.024-3.296,0-4.945
		c0.015-1.023,0.692-1.785,1.606-1.883c0.956-0.104,1.786,0.449,2.03,1.367c0.055,0.207,0.063,0.43,0.067,0.646
		C51.854,38.642,51.85,39.409,51.85,40.176z"/>
	<path fill-rule="evenodd" clip-rule="evenodd" fill="#FFFFFF" d="M47.86,49.803c-0.28-0.807,0.21-1.318,1.05-1.658
		c0.387-0.157,0.743-0.544,1.113-0.546c0.357-0.001,0.716,0.359,1.072,0.566c0.334,0.195,0.798,0.323,0.962,0.616
		c0.174,0.308,0.067,0.777,0.065,1.176c0,0.421,0.112,0.917-0.072,1.241c-0.175,0.312-0.665,0.445-1.02,0.654
		c-0.177,0.105-0.378,0.181-0.532,0.312c-0.357,0.305-0.669,0.239-1.033-0.008c-0.443-0.302-0.932-0.534-1.384-0.824
		c-0.108-0.068-0.199-0.238-0.211-0.369C47.841,50.634,47.86,50.299,47.86,49.803z"/>
</g>
</svg>
