certifi==2022.12.7
charset-normalizer==3.0.1
click==8.1.3
contourpy==1.0.7
cycler==0.11.0
docopt==0.6.2
Flask==2.2.3
fonttools==4.38.0
idna==3.4
itsdangerous==2.1.2
Jinja2==3.1.2
kiwisolver==1.4.4
Markdown==3.4.1
MarkupSafe==2.1.2
matplotlib==3.7.0
numpy==1.24.2
packaging==23.0
path-and-address==2.0.1
Pillow==9.4.0
Pygments==2.14.0
pyparsing==3.0.9
python-dateutil==2.8.2
requests==2.28.2
six==1.16.0
urllib3==1.26.14
Werkzeug==2.2.3
