Started at Wed Apr 06 15:27:21 UTC 2022
Processing test
Offering test to Project Build Discarder
Processing test-parametros
Offering test-parametros to Project Build Discarder
Processing test-script-propio
Offering test-script-propio to Project Build Discarder
Finished at Wed Apr 06 15:27:21 UTC 2022. 66ms
Started at Wed Apr 06 16:27:21 UTC 2022
Processing test
Offering test to Project Build Discarder
Processing test-parametros
Offering test-parametros to Project Build Discarder
Processing test-script-propio
Offering test-script-propio to Project Build Discarder
Finished at Wed Apr 06 16:27:21 UTC 2022. 21ms
