Started at Wed Apr 06 12:12:00 UTC 2022
Processing test
Offering test to Project Build Discarder
Processing test-parametros
Offering test-parametros to Project Build Discarder
Processing test-script-propio
Offering test-script-propio to Project Build Discarder
Finished at Wed Apr 06 12:12:00 UTC 2022. 59ms
Started at Wed Apr 06 13:12:00 UTC 2022
Processing test
Offering test to Project Build Discarder
Processing test-parametros
Offering test-parametros to Project Build Discarder
Processing test-script-propio
Offering test-script-propio to Project Build Discarder
Finished at Wed Apr 06 13:12:00 UTC 2022. 21ms
Started at Wed Apr 06 14:12:00 UTC 2022
Processing test
Offering test to Project Build Discarder
Processing test-parametros
Offering test-parametros to Project Build Discarder
Processing test-script-propio
Offering test-script-propio to Project Build Discarder
Finished at Wed Apr 06 14:12:00 UTC 2022. 44ms
