Started at Tue Apr 05 12:03:51 UTC 2022
Processing test
Offering test to Project Build Discarder
Finished at Tue Apr 05 12:03:51 UTC 2022. 24ms
Started at Tue Apr 05 13:03:51 UTC 2022
Processing test
Offering test to Project Build Discarder
Finished at Tue Apr 05 13:03:51 UTC 2022. 15ms
Started at Tue Apr 05 14:03:51 UTC 2022
Processing test
Offering test to Project Build Discarder
Finished at Tue Apr 05 14:03:51 UTC 2022. 25ms
Started at Tue Apr 05 15:03:51 UTC 2022
Processing test
Offering test to Project Build Discarder
Finished at Tue Apr 05 15:03:51 UTC 2022. 23ms
Started at Tue Apr 05 16:03:51 UTC 2022
Processing test
Offering test to Project Build Discarder
Finished at Tue Apr 05 16:03:51 UTC 2022. 18ms
Started at Tue Apr 05 17:03:51 UTC 2022
Processing test
Offering test to Project Build Discarder
Finished at Tue Apr 05 17:03:51 UTC 2022. 23ms
Started at Tue Apr 05 18:03:51 UTC 2022
Processing test
Offering test to Project Build Discarder
Finished at Tue Apr 05 18:03:51 UTC 2022. 19ms
Started at Tue Apr 05 19:03:51 UTC 2022
Processing test
Offering test to Project Build Discarder
Finished at Tue Apr 05 19:03:51 UTC 2022. 22ms
Started at Tue Apr 05 20:03:51 UTC 2022
Processing test
Offering test to Project Build Discarder
Finished at Tue Apr 05 20:03:51 UTC 2022. 14ms
Started at Tue Apr 05 21:03:51 UTC 2022
Processing test
Offering test to Project Build Discarder
Processing test-parametros
Offering test-parametros to Project Build Discarder
Processing test-script-propio
Offering test-script-propio to Project Build Discarder
Finished at Tue Apr 05 21:03:51 UTC 2022. 17ms
