0
0
-1
-2
0
0
-3
-4
0
0
-5
99
99
0
-6
99
99
0
0
-7
99
99
0
-8
99
99
-9
-10
99
99
0
-11
99
99
99
99
-12
99
99
-13
99
99
99
99
99
-14
99
99
99
99
99
-15
99
99
-16
99
99
99
99
0
-17
99
99
0
-18
99
99
0
-19
99
99
0
0
-20
99
99
0
-21
99
99
0