<?xml version="1.0" encoding="UTF-8"?>
<testsuite xmlns:xsi="http://www.w3.org/2001/XMLSchema-instance" xsi:noNamespaceSchemaLocation="https://maven.apache.org/surefire/maven-surefire-plugin/xsd/surefire-test-report.xsd" name="TestRunner" time="261.146" tests="207" errors="2" skipped="0" failures="0">
  <properties>
    <property name="java.specification.version" value="14"/>
    <property name="sun.jnu.encoding" value="UTF-8"/>
    <property name="java.class.path" value="/Users/santhoshtangudige/work/demo-qa-fe-tests/target/test-classes:/Users/santhoshtangudige/work/demo-qa-fe-tests/target/classes:/Users/santhoshtangudige/.m2/repository/info/cukes/cucumber-java/1.2.5/cucumber-java-1.2.5.jar:/Users/santhoshtangudige/.m2/repository/info/cukes/cucumber-core/1.2.5/cucumber-core-1.2.5.jar:/Users/santhoshtangudige/.m2/repository/info/cukes/cucumber-html/0.2.3/cucumber-html-0.2.3.jar:/Users/santhoshtangudige/.m2/repository/info/cukes/cucumber-jvm-deps/1.0.5/cucumber-jvm-deps-1.0.5.jar:/Users/santhoshtangudige/.m2/repository/info/cukes/gherkin/2.12.2/gherkin-2.12.2.jar:/Users/santhoshtangudige/.m2/repository/info/cukes/cucumber-junit/1.2.5/cucumber-junit-1.2.5.jar:/Users/santhoshtangudige/.m2/repository/junit/junit/4.13.1/junit-4.13.1.jar:/Users/santhoshtangudige/.m2/repository/org/hamcrest/hamcrest-core/1.3/hamcrest-core-1.3.jar:/Users/santhoshtangudige/.m2/repository/org/seleniumhq/selenium/selenium-java/3.141.59/selenium-java-3.141.59.jar:/Users/santhoshtangudige/.m2/repository/org/seleniumhq/selenium/selenium-api/3.141.59/selenium-api-3.141.59.jar:/Users/santhoshtangudige/.m2/repository/org/seleniumhq/selenium/selenium-chrome-driver/3.141.59/selenium-chrome-driver-3.141.59.jar:/Users/santhoshtangudige/.m2/repository/org/seleniumhq/selenium/selenium-edge-driver/3.141.59/selenium-edge-driver-3.141.59.jar:/Users/santhoshtangudige/.m2/repository/org/seleniumhq/selenium/selenium-firefox-driver/3.141.59/selenium-firefox-driver-3.141.59.jar:/Users/santhoshtangudige/.m2/repository/org/seleniumhq/selenium/selenium-ie-driver/3.141.59/selenium-ie-driver-3.141.59.jar:/Users/santhoshtangudige/.m2/repository/org/seleniumhq/selenium/selenium-opera-driver/3.141.59/selenium-opera-driver-3.141.59.jar:/Users/santhoshtangudige/.m2/repository/org/seleniumhq/selenium/selenium-remote-driver/3.141.59/selenium-remote-driver-3.141.59.jar:/Users/santhoshtangudige/.m2/repository/org/seleniumhq/selenium/selenium-safari-driver/3.141.59/selenium-safari-driver-3.141.59.jar:/Users/santhoshtangudige/.m2/repository/org/seleniumhq/selenium/selenium-support/3.141.59/selenium-support-3.141.59.jar:/Users/santhoshtangudige/.m2/repository/net/bytebuddy/byte-buddy/1.8.15/byte-buddy-1.8.15.jar:/Users/santhoshtangudige/.m2/repository/org/apache/commons/commons-exec/1.3/commons-exec-1.3.jar:/Users/santhoshtangudige/.m2/repository/com/google/guava/guava/25.0-jre/guava-25.0-jre.jar:/Users/santhoshtangudige/.m2/repository/com/google/code/findbugs/jsr305/1.3.9/jsr305-1.3.9.jar:/Users/santhoshtangudige/.m2/repository/org/checkerframework/checker-compat-qual/2.0.0/checker-compat-qual-2.0.0.jar:/Users/santhoshtangudige/.m2/repository/com/google/errorprone/error_prone_annotations/2.1.3/error_prone_annotations-2.1.3.jar:/Users/santhoshtangudige/.m2/repository/com/google/j2objc/j2objc-annotations/1.1/j2objc-annotations-1.1.jar:/Users/santhoshtangudige/.m2/repository/org/codehaus/mojo/animal-sniffer-annotations/1.14/animal-sniffer-annotations-1.14.jar:/Users/santhoshtangudige/.m2/repository/com/squareup/okhttp3/okhttp/3.11.0/okhttp-3.11.0.jar:/Users/santhoshtangudige/.m2/repository/com/squareup/okio/okio/1.14.0/okio-1.14.0.jar:/Users/santhoshtangudige/.m2/repository/io/github/bonigarcia/webdrivermanager/3.6.0/webdrivermanager-3.6.0.jar:/Users/santhoshtangudige/.m2/repository/org/slf4j/slf4j-api/1.7.25/slf4j-api-1.7.25.jar:/Users/santhoshtangudige/.m2/repository/commons-io/commons-io/2.6/commons-io-2.6.jar:/Users/santhoshtangudige/.m2/repository/com/google/code/gson/gson/2.8.5/gson-2.8.5.jar:/Users/santhoshtangudige/.m2/repository/org/apache/commons/commons-lang3/3.8.1/commons-lang3-3.8.1.jar:/Users/santhoshtangudige/.m2/repository/org/apache/httpcomponents/httpclient/4.5.6/httpclient-4.5.6.jar:/Users/santhoshtangudige/.m2/repository/org/apache/httpcomponents/httpcore/4.4.10/httpcore-4.4.10.jar:/Users/santhoshtangudige/.m2/repository/commons-logging/commons-logging/1.2/commons-logging-1.2.jar:/Users/santhoshtangudige/.m2/repository/commons-codec/commons-codec/1.10/commons-codec-1.10.jar:/Users/santhoshtangudige/.m2/repository/org/rauschig/jarchivelib/1.0.0/jarchivelib-1.0.0.jar:/Users/santhoshtangudige/.m2/repository/org/apache/commons/commons-compress/1.18/commons-compress-1.18.jar:/Users/santhoshtangudige/.m2/repository/org/jsoup/jsoup/1.11.3/jsoup-1.11.3.jar:"/>
    <property name="java.vm.vendor" value="Oracle Corporation"/>
    <property name="sun.arch.data.model" value="64"/>
    <property name="java.vendor.url" value="https://openjdk.java.net/"/>
    <property name="os.name" value="Mac OS X"/>
    <property name="java.vm.specification.version" value="14"/>
    <property name="sun.java.launcher" value="SUN_STANDARD"/>
    <property name="user.country" value="IN"/>
    <property name="sun.boot.library.path" value="/usr/local/Cellar/openjdk/14.0.1/libexec/openjdk.jdk/Contents/Home/lib"/>
    <property name="sun.java.command" value="/Users/santhoshtangudige/work/demo-qa-fe-tests/target/surefire/surefirebooter17297908823547245428.jar /Users/santhoshtangudige/work/demo-qa-fe-tests/target/surefire 2021-09-21T23-51-26_043-jvmRun1 surefire6996910999311580764tmp surefire_04719053487967531410tmp"/>
    <property name="http.nonProxyHosts" value="local|*.local|169.254/16|*.169.254/16|https://approxy.rockwellcollins.com|*.https://approxy.rockwellcollins.com"/>
    <property name="jdk.debug" value="release"/>
    <property name="surefire.test.class.path" value="/Users/santhoshtangudige/work/demo-qa-fe-tests/target/test-classes:/Users/santhoshtangudige/work/demo-qa-fe-tests/target/classes:/Users/santhoshtangudige/.m2/repository/info/cukes/cucumber-java/1.2.5/cucumber-java-1.2.5.jar:/Users/santhoshtangudige/.m2/repository/info/cukes/cucumber-core/1.2.5/cucumber-core-1.2.5.jar:/Users/santhoshtangudige/.m2/repository/info/cukes/cucumber-html/0.2.3/cucumber-html-0.2.3.jar:/Users/santhoshtangudige/.m2/repository/info/cukes/cucumber-jvm-deps/1.0.5/cucumber-jvm-deps-1.0.5.jar:/Users/santhoshtangudige/.m2/repository/info/cukes/gherkin/2.12.2/gherkin-2.12.2.jar:/Users/santhoshtangudige/.m2/repository/info/cukes/cucumber-junit/1.2.5/cucumber-junit-1.2.5.jar:/Users/santhoshtangudige/.m2/repository/junit/junit/4.13.1/junit-4.13.1.jar:/Users/santhoshtangudige/.m2/repository/org/hamcrest/hamcrest-core/1.3/hamcrest-core-1.3.jar:/Users/santhoshtangudige/.m2/repository/org/seleniumhq/selenium/selenium-java/3.141.59/selenium-java-3.141.59.jar:/Users/santhoshtangudige/.m2/repository/org/seleniumhq/selenium/selenium-api/3.141.59/selenium-api-3.141.59.jar:/Users/santhoshtangudige/.m2/repository/org/seleniumhq/selenium/selenium-chrome-driver/3.141.59/selenium-chrome-driver-3.141.59.jar:/Users/santhoshtangudige/.m2/repository/org/seleniumhq/selenium/selenium-edge-driver/3.141.59/selenium-edge-driver-3.141.59.jar:/Users/santhoshtangudige/.m2/repository/org/seleniumhq/selenium/selenium-firefox-driver/3.141.59/selenium-firefox-driver-3.141.59.jar:/Users/santhoshtangudige/.m2/repository/org/seleniumhq/selenium/selenium-ie-driver/3.141.59/selenium-ie-driver-3.141.59.jar:/Users/santhoshtangudige/.m2/repository/org/seleniumhq/selenium/selenium-opera-driver/3.141.59/selenium-opera-driver-3.141.59.jar:/Users/santhoshtangudige/.m2/repository/org/seleniumhq/selenium/selenium-remote-driver/3.141.59/selenium-remote-driver-3.141.59.jar:/Users/santhoshtangudige/.m2/repository/org/seleniumhq/selenium/selenium-safari-driver/3.141.59/selenium-safari-driver-3.141.59.jar:/Users/santhoshtangudige/.m2/repository/org/seleniumhq/selenium/selenium-support/3.141.59/selenium-support-3.141.59.jar:/Users/santhoshtangudige/.m2/repository/net/bytebuddy/byte-buddy/1.8.15/byte-buddy-1.8.15.jar:/Users/santhoshtangudige/.m2/repository/org/apache/commons/commons-exec/1.3/commons-exec-1.3.jar:/Users/santhoshtangudige/.m2/repository/com/google/guava/guava/25.0-jre/guava-25.0-jre.jar:/Users/santhoshtangudige/.m2/repository/com/google/code/findbugs/jsr305/1.3.9/jsr305-1.3.9.jar:/Users/santhoshtangudige/.m2/repository/org/checkerframework/checker-compat-qual/2.0.0/checker-compat-qual-2.0.0.jar:/Users/santhoshtangudige/.m2/repository/com/google/errorprone/error_prone_annotations/2.1.3/error_prone_annotations-2.1.3.jar:/Users/santhoshtangudige/.m2/repository/com/google/j2objc/j2objc-annotations/1.1/j2objc-annotations-1.1.jar:/Users/santhoshtangudige/.m2/repository/org/codehaus/mojo/animal-sniffer-annotations/1.14/animal-sniffer-annotations-1.14.jar:/Users/santhoshtangudige/.m2/repository/com/squareup/okhttp3/okhttp/3.11.0/okhttp-3.11.0.jar:/Users/santhoshtangudige/.m2/repository/com/squareup/okio/okio/1.14.0/okio-1.14.0.jar:/Users/santhoshtangudige/.m2/repository/io/github/bonigarcia/webdrivermanager/3.6.0/webdrivermanager-3.6.0.jar:/Users/santhoshtangudige/.m2/repository/org/slf4j/slf4j-api/1.7.25/slf4j-api-1.7.25.jar:/Users/santhoshtangudige/.m2/repository/commons-io/commons-io/2.6/commons-io-2.6.jar:/Users/santhoshtangudige/.m2/repository/com/google/code/gson/gson/2.8.5/gson-2.8.5.jar:/Users/santhoshtangudige/.m2/repository/org/apache/commons/commons-lang3/3.8.1/commons-lang3-3.8.1.jar:/Users/santhoshtangudige/.m2/repository/org/apache/httpcomponents/httpclient/4.5.6/httpclient-4.5.6.jar:/Users/santhoshtangudige/.m2/repository/org/apache/httpcomponents/httpcore/4.4.10/httpcore-4.4.10.jar:/Users/santhoshtangudige/.m2/repository/commons-logging/commons-logging/1.2/commons-logging-1.2.jar:/Users/santhoshtangudige/.m2/repository/commons-codec/commons-codec/1.10/commons-codec-1.10.jar:/Users/santhoshtangudige/.m2/repository/org/rauschig/jarchivelib/1.0.0/jarchivelib-1.0.0.jar:/Users/santhoshtangudige/.m2/repository/org/apache/commons/commons-compress/1.18/commons-compress-1.18.jar:/Users/santhoshtangudige/.m2/repository/org/jsoup/jsoup/1.11.3/jsoup-1.11.3.jar:"/>
    <property name="sun.cpu.endian" value="little"/>
    <property name="user.home" value="/Users/santhoshtangudige"/>
    <property name="user.language" value="en"/>
    <property name="java.specification.vendor" value="Oracle Corporation"/>
    <property name="java.version.date" value="2020-04-14"/>
    <property name="java.home" value="/usr/local/Cellar/openjdk/14.0.1/libexec/openjdk.jdk/Contents/Home"/>
    <property name="file.separator" value="/"/>
    <property name="basedir" value="/Users/santhoshtangudige/work/demo-qa-fe-tests"/>
    <property name="java.vm.compressedOopsMode" value="Zero based"/>
    <property name="line.separator" value="&#10;"/>
    <property name="java.specification.name" value="Java Platform API Specification"/>
    <property name="java.vm.specification.vendor" value="Oracle Corporation"/>
    <property name="surefire.real.class.path" value="/Users/santhoshtangudige/work/demo-qa-fe-tests/target/surefire/surefirebooter17297908823547245428.jar"/>
    <property name="sun.management.compiler" value="HotSpot 64-Bit Tiered Compilers"/>
    <property name="ftp.nonProxyHosts" value="local|*.local|169.254/16|*.169.254/16|https://approxy.rockwellcollins.com|*.https://approxy.rockwellcollins.com"/>
    <property name="java.runtime.version" value="14.0.1+14"/>
    <property name="user.name" value="santhoshtangudige"/>
    <property name="path.separator" value=":"/>
    <property name="os.version" value="10.16"/>
    <property name="java.runtime.name" value="OpenJDK Runtime Environment"/>
    <property name="file.encoding" value="US-ASCII"/>
    <property name="java.vm.name" value="OpenJDK 64-Bit Server VM"/>
    <property name="localRepository" value="/Users/santhoshtangudige/.m2/repository"/>
    <property name="java.vendor.url.bug" value="https://bugreport.java.com/bugreport/"/>
    <property name="java.io.tmpdir" value="/var/folders/d7/clj20lrn35z0k_hpy8nc75400000gn/T/"/>
    <property name="java.version" value="14.0.1"/>
    <property name="user.dir" value="/Users/santhoshtangudige/work/demo-qa-fe-tests"/>
    <property name="os.arch" value="x86_64"/>
    <property name="java.vm.specification.name" value="Java Virtual Machine Specification"/>
    <property name="java.library.path" value="/Users/santhoshtangudige/Library/Java/Extensions:/Library/Java/Extensions:/Network/Library/Java/Extensions:/System/Library/Java/Extensions:/usr/lib/java:."/>
    <property name="java.vm.info" value="mixed mode, sharing"/>
    <property name="java.vendor" value="N/A"/>
    <property name="java.vm.version" value="14.0.1+14"/>
    <property name="sun.io.unicode.encoding" value="UnicodeBig"/>
    <property name="socksNonProxyHosts" value="local|*.local|169.254/16|*.169.254/16|https://approxy.rockwellcollins.com|*.https://approxy.rockwellcollins.com"/>
    <property name="java.class.version" value="58.0"/>
  </properties>
  <testcase name="Given I am on Tools QA Home Page" classname="Scenario: Verification of Text Box" time="0.001"/>
  <testcase name="Then I see following tiles on the home page" classname="Scenario: Verification of Text Box" time="0"/>
  <testcase name="When I click &quot;Elements&quot; Tile" classname="Scenario: Verification of Text Box" time="0.001"/>
  <testcase name="Then I am on Elements page" classname="Scenario: Verification of Text Box" time="0"/>
  <testcase name="When I click &quot;Text Box&quot; Element" classname="Scenario: Verification of Text Box" time="0"/>
  <testcase name="Then I see &quot;Text Box&quot; is displayed" classname="Scenario: Verification of Text Box" time="0"/>
  <testcase name="Scenario: Verification of Text Box" classname="Scenario: Verification of Text Box" time="0.134"/>
  <testcase name="Given I am on Tools QA Home Page" classname="Scenario: Verification of Elements Tile" time="0"/>
  <testcase name="Then I see following tiles on the home page" classname="Scenario: Verification of Elements Tile" time="0"/>
  <testcase name="When I click &quot;Elements&quot; Tile" classname="Scenario: Verification of Elements Tile" time="0"/>
  <testcase name="Then I am on Elements page" classname="Scenario: Verification of Elements Tile" time="0"/>
  <testcase name="When I click &quot;Check Box&quot; Element" classname="Scenario: Verification of Elements Tile" time="0"/>
  <testcase name="Then I see &quot;Check Box&quot; is displayed" classname="Scenario: Verification of Elements Tile" time="0"/>
  <testcase name="Scenario: Verification of Elements Tile" classname="Scenario: Verification of Elements Tile" time="0.084"/>
  <testcase name="Given I am on Tools QA Home Page" classname="Scenario: Verification of Radio Button" time="0"/>
  <testcase name="Then I see following tiles on the home page" classname="Scenario: Verification of Radio Button" time="0"/>
  <testcase name="When I click &quot;Elements&quot; Tile" classname="Scenario: Verification of Radio Button" time="0"/>
  <testcase name="Then I am on Elements page" classname="Scenario: Verification of Radio Button" time="0"/>
  <testcase name="And I click &quot;Radio Button&quot; Element" classname="Scenario: Verification of Radio Button" time="0"/>
  <testcase name="Then I see &quot;Radio Button&quot; is displayed" classname="Scenario: Verification of Radio Button" time="0"/>
  <testcase name="Scenario: Verification of Radio Button" classname="Scenario: Verification of Radio Button" time="0.091"/>
  <testcase name="Given I am on Tools QA Home Page" classname="Scenario: Verification of Web Tables" time="0"/>
  <testcase name="Then I see following tiles on the home page" classname="Scenario: Verification of Web Tables" time="0"/>
  <testcase name="When I click &quot;Elements&quot; Tile" classname="Scenario: Verification of Web Tables" time="0"/>
  <testcase name="Then I am on Elements page" classname="Scenario: Verification of Web Tables" time="0"/>
  <testcase name="And I click &quot;Web Tables&quot; Element" classname="Scenario: Verification of Web Tables" time="0.001"/>
  <testcase name="Then I see &quot;Web Tables&quot; is displayed" classname="Scenario: Verification of Web Tables" time="0"/>
  <testcase name="Scenario: Verification of Web Tables" classname="Scenario: Verification of Web Tables" time="0.084"/>
  <testcase name="Given I am on Tools QA Home Page" classname="Scenario: Verification of Buttons" time="0"/>
  <testcase name="Then I see following tiles on the home page" classname="Scenario: Verification of Buttons" time="0"/>
  <testcase name="When I click &quot;Elements&quot; Tile" classname="Scenario: Verification of Buttons" time="0"/>
  <testcase name="Then I am on Elements page" classname="Scenario: Verification of Buttons" time="0"/>
  <testcase name="And I click &quot;Buttons&quot; Element" classname="Scenario: Verification of Buttons" time="0"/>
  <testcase name="Then I see &quot;Buttons&quot; is displayed" classname="Scenario: Verification of Buttons" time="0"/>
  <testcase name="Scenario: Verification of Buttons" classname="Scenario: Verification of Buttons" time="0.084"/>
  <testcase name="Given I am on Tools QA Home Page" classname="Scenario: Verification of Links" time="0"/>
  <testcase name="Then I see following tiles on the home page" classname="Scenario: Verification of Links" time="0"/>
  <testcase name="When I click &quot;Elements&quot; Tile" classname="Scenario: Verification of Links" time="0"/>
  <testcase name="Then I am on Elements page" classname="Scenario: Verification of Links" time="0"/>
  <testcase name="And I click &quot;Links&quot; Element" classname="Scenario: Verification of Links" time="0"/>
  <testcase name="Then I see &quot;Links&quot; is displayed" classname="Scenario: Verification of Links" time="0"/>
  <testcase name="Scenario: Verification of Links" classname="Scenario: Verification of Links" time="0.133"/>
  <testcase name="Given I am on Tools QA Home Page" classname="Scenario: Verification of BrokenLinks" time="0"/>
  <testcase name="Then I see following tiles on the home page" classname="Scenario: Verification of BrokenLinks" time="0"/>
  <testcase name="When I click &quot;Elements&quot; Tile" classname="Scenario: Verification of BrokenLinks" time="0"/>
  <testcase name="Then I am on Elements page" classname="Scenario: Verification of BrokenLinks" time="0"/>
  <testcase name="And I click &quot;BrokenLinks&quot; Element" classname="Scenario: Verification of BrokenLinks" time="0"/>
  <testcase name="Then I see &quot;BrokenLinks&quot; is displayed" classname="Scenario: Verification of BrokenLinks" time="0.001"/>
  <testcase name="Scenario: Verification of BrokenLinks" classname="Scenario: Verification of BrokenLinks" time="0.087"/>
  <testcase name="Given I am on Tools QA Home Page" classname="Scenario: Verification of UploadDownload" time="0"/>
  <testcase name="Then I see following tiles on the home page" classname="Scenario: Verification of UploadDownload" time="0"/>
  <testcase name="When I click &quot;Elements&quot; Tile" classname="Scenario: Verification of UploadDownload" time="0"/>
  <testcase name="Then I am on Elements page" classname="Scenario: Verification of UploadDownload" time="0"/>
  <testcase name="And I click &quot;UploadDownload&quot; Element" classname="Scenario: Verification of UploadDownload" time="0"/>
  <testcase name="Then I see &quot;UploadDownload&quot; is displayed" classname="Scenario: Verification of UploadDownload" time="0"/>
  <testcase name="Scenario: Verification of UploadDownload" classname="Scenario: Verification of UploadDownload" time="0.081"/>
  <testcase name="Given I am on Tools QA Home Page" classname="Scenario: Verification of DynamicProperties" time="0"/>
  <testcase name="Then I see following tiles on the home page" classname="Scenario: Verification of DynamicProperties" time="0"/>
  <testcase name="When I click &quot;Elements&quot; Tile" classname="Scenario: Verification of DynamicProperties" time="0"/>
  <testcase name="Then I am on Elements page" classname="Scenario: Verification of DynamicProperties" time="0"/>
  <testcase name="And I click &quot;DynamicProperties&quot; Element" classname="Scenario: Verification of DynamicProperties" time="0"/>
  <testcase name="Then I see &quot;DynamicProperties&quot; is displayed" classname="Scenario: Verification of DynamicProperties" time="0"/>
  <testcase name="Scenario: Verification of DynamicProperties" classname="Scenario: Verification of DynamicProperties" time="0.077"/>
  <testcase name="Given I am on Tools QA Home Page" classname="Scenario: Verification of Practice Form" time="0.001"/>
  <testcase name="Then I see following tiles on the home page" classname="Scenario: Verification of Practice Form" time="0"/>
  <testcase name="When I click &quot;Forms&quot; Tile" classname="Scenario: Verification of Practice Form" time="0"/>
  <testcase name="Then I am on Forms page" classname="Scenario: Verification of Practice Form" time="0"/>
  <testcase name="And I click &quot;Practice Form&quot;" classname="Scenario: Verification of Practice Form" time="0"/>
  <testcase name="Then I see &quot;Practice Form&quot; appears" classname="Scenario: Verification of Practice Form" time="0"/>
  <testcase name="Scenario: Verification of Practice Form" classname="Scenario: Verification of Practice Form" time="0.085"/>
  <testcase name="Given I am on Tools QA Home Page" classname="Scenario: Verification of Tiles" time="0"/>
  <testcase name="Then I see following tiles on the home page" classname="Scenario: Verification of Tiles" time="0"/>
  <testcase name="Scenario: Verification of Tiles" classname="Scenario: Verification of Tiles" time="0.082"/>
  <testcase name="Given I am on Tools QA Home Page" classname="Scenario: Verification of Selenium Certification Training Banner Image" time="0"/>
  <testcase name="Then I see Selenium Certification Banner Image" classname="Scenario: Verification of Selenium Certification Training Banner Image" time="0"/>
  <testcase name="Scenario: Verification of Selenium Certification Training Banner Image" classname="Scenario: Verification of Selenium Certification Training Banner Image" time="0.089"/>
  <testcase name="Given I am on Tools QA Home Page" classname="Scenario: Verification of footer" time="0"/>
  <testcase name="Then I see footer information as follows" classname="Scenario: Verification of footer" time="0"/>
  <testcase name="Scenario: Verification of footer" classname="Scenario: Verification of footer" time="0.08"/>
  <testcase name="Given I am on Tools QA Home Page" classname="Scenario: Verification of Sortable Interactions" time="0"/>
  <testcase name="Then I see following tiles on the home page" classname="Scenario: Verification of Sortable Interactions" time="0"/>
  <testcase name="When I click &quot;Interactions&quot; Tile" classname="Scenario: Verification of Sortable Interactions" time="0"/>
  <testcase name="Then I am on Interactions page" classname="Scenario: Verification of Sortable Interactions" time="0"/>
  <testcase name="And I click the &quot;Sortable&quot; Interaction" classname="Scenario: Verification of Sortable Interactions" time="0"/>
  <testcase name="Scenario: Verification of Sortable Interactions" classname="Scenario: Verification of Sortable Interactions" time="0.093"/>
  <testcase name="Given I am on Tools QA Home Page" classname="Scenario: Verification of Selectable Interactions" time="0"/>
  <testcase name="Then I see following tiles on the home page" classname="Scenario: Verification of Selectable Interactions" time="0"/>
  <testcase name="When I click &quot;Interactions&quot; Tile" classname="Scenario: Verification of Selectable Interactions" time="0"/>
  <testcase name="Then I am on Interactions page" classname="Scenario: Verification of Selectable Interactions" time="0"/>
  <testcase name="And I click the &quot;Selectable&quot; Interaction" classname="Scenario: Verification of Selectable Interactions" time="0"/>
  <testcase name="Scenario: Verification of Selectable Interactions" classname="Scenario: Verification of Selectable Interactions" time="0.08"/>
  <testcase name="Given I am on Tools QA Home Page" classname="Scenario: Verification of Resizable Interactions" time="0"/>
  <testcase name="Then I see following tiles on the home page" classname="Scenario: Verification of Resizable Interactions" time="0"/>
  <testcase name="When I click &quot;Interactions&quot; Tile" classname="Scenario: Verification of Resizable Interactions" time="0"/>
  <testcase name="Then I am on Interactions page" classname="Scenario: Verification of Resizable Interactions" time="0"/>
  <testcase name="And I click the &quot;Resizable&quot; Interaction" classname="Scenario: Verification of Resizable Interactions" time="0"/>
  <testcase name="Scenario: Verification of Resizable Interactions" classname="Scenario: Verification of Resizable Interactions" time="0.08"/>
  <testcase name="Given I am on Tools QA Home Page" classname="Scenario: Verification of Draggable Interactions" time="0"/>
  <testcase name="Then I see following tiles on the home page" classname="Scenario: Verification of Draggable Interactions" time="0"/>
  <testcase name="When I click &quot;Interactions&quot; Tile" classname="Scenario: Verification of Draggable Interactions" time="0"/>
  <testcase name="Then I am on Interactions page" classname="Scenario: Verification of Draggable Interactions" time="0"/>
  <testcase name="And I click the &quot;Draggable&quot; Interaction" classname="Scenario: Verification of Draggable Interactions" time="0.01">
    <error message="element click intercepted: Element &lt;li class=&quot;btn btn-light &quot; id=&quot;item-4&quot;&gt;...&lt;/li&gt; is not clickable at point (133, 661). Other element would receive the click: &lt;div&gt;...&lt;/div&gt;&#10;  (Session info: headless chrome=93.0.4577.82)&#10;Build info: version: &apos;3.141.59&apos;, revision: &apos;e82be7d358&apos;, time: &apos;2018-11-14T08:17:03&apos;&#10;System info: host: &apos;Santhosh-MacBook-Pro.local&apos;, ip: &apos;fe80:0:0:0:1c0d:e564:e23:745%en0&apos;, os.name: &apos;Mac OS X&apos;, os.arch: &apos;x86_64&apos;, os.version: &apos;10.16&apos;, java.version: &apos;14.0.1&apos;&#10;Driver info: org.openqa.selenium.chrome.ChromeDriver&#10;Capabilities {acceptInsecureCerts: false, browserName: chrome, browserVersion: 93.0.4577.82, chrome: {chromedriverVersion: 93.0.4577.63 (ff5c0da2ec0ad..., userDataDir: /var/folders/d7/clj20lrn35z...}, goog:chromeOptions: {debuggerAddress: localhost:52747}, javascriptEnabled: true, networkConnectionEnabled: false, pageLoadStrategy: normal, platform: MAC, platformName: MAC, proxy: Proxy(), setWindowRect: true, strictFileInteractability: false, timeouts: {implicit: 0, pageLoad: 300000, script: 30000}, unhandledPromptBehavior: dismiss and notify, webauthn:extension:credBlob: true, webauthn:extension:largeBlob: true, webauthn:virtualAuthenticators: true}&#10;Session ID: 9edc69dd8eeb64df22d6e66c85c478c3" type="org.openqa.selenium.ElementClickInterceptedException"><![CDATA[org.openqa.selenium.ElementClickInterceptedException: 
element click intercepted: Element <li class="btn btn-light " id="item-4">...</li> is not clickable at point (133, 661). Other element would receive the click: <div>...</div>
  (Session info: headless chrome=93.0.4577.82)
Build info: version: '3.141.59', revision: 'e82be7d358', time: '2018-11-14T08:17:03'
System info: host: 'Santhosh-MacBook-Pro.local', ip: 'fe80:0:0:0:1c0d:e564:e23:745%en0', os.name: 'Mac OS X', os.arch: 'x86_64', os.version: '10.16', java.version: '14.0.1'
Driver info: org.openqa.selenium.chrome.ChromeDriver
Capabilities {acceptInsecureCerts: false, browserName: chrome, browserVersion: 93.0.4577.82, chrome: {chromedriverVersion: 93.0.4577.63 (ff5c0da2ec0ad..., userDataDir: /var/folders/d7/clj20lrn35z...}, goog:chromeOptions: {debuggerAddress: localhost:52747}, javascriptEnabled: true, networkConnectionEnabled: false, pageLoadStrategy: normal, platform: MAC, platformName: MAC, proxy: Proxy(), setWindowRect: true, strictFileInteractability: false, timeouts: {implicit: 0, pageLoad: 300000, script: 30000}, unhandledPromptBehavior: dismiss and notify, webauthn:extension:credBlob: true, webauthn:extension:largeBlob: true, webauthn:virtualAuthenticators: true}
Session ID: 9edc69dd8eeb64df22d6e66c85c478c3
]]></error>
    <system-out><![CDATA[
  Background:                                   &amp#27;[90m# InteractionsPage.feature:9&amp#27;[0m
    &amp#27;[32mGiven &amp#27;[0m&amp#27;[32mI am on Tools QA Home Page&amp#27;[0m            &amp#27;[90m# HomeSteps.HomePage()&amp#27;[0m
    &amp#27;[32mThen &amp#27;[0m&amp#27;[32mI see following tiles on the home page&amp#27;[0m &amp#27;[90m# HomeSteps.iSeeFollowingTilesOnTheHomePage(DataTable)&amp#27;[0m
    &amp#27;[32mWhen &amp#27;[0m&amp#27;[32mI click "&amp#27;[0m&amp#27;[32m&amp#27;[1mInteractions&amp#27;[0m&amp#27;[32m" Tile&amp#27;[0m            &amp#27;[90m# HomeSteps.iClickTile(String)&amp#27;[0m
    &amp#27;[32mThen &amp#27;[0m&amp#27;[32mI am on Interactions page&amp#27;[0m              &amp#27;[90m# InteractionsSteps.iAmOnInteractionsPage()&amp#27;[0m
]]></system-out>
  </testcase>
  <testcase name="Scenario: Verification of Draggable Interactions" classname="Scenario: Verification of Draggable Interactions" time="0.01">
    <error message="element click intercepted: Element &lt;li class=&quot;btn btn-light &quot; id=&quot;item-4&quot;&gt;...&lt;/li&gt; is not clickable at point (133, 661). Other element would receive the click: &lt;div&gt;...&lt;/div&gt;&#10;  (Session info: headless chrome=93.0.4577.82)&#10;Build info: version: &apos;3.141.59&apos;, revision: &apos;e82be7d358&apos;, time: &apos;2018-11-14T08:17:03&apos;&#10;System info: host: &apos;Santhosh-MacBook-Pro.local&apos;, ip: &apos;fe80:0:0:0:1c0d:e564:e23:745%en0&apos;, os.name: &apos;Mac OS X&apos;, os.arch: &apos;x86_64&apos;, os.version: &apos;10.16&apos;, java.version: &apos;14.0.1&apos;&#10;Driver info: org.openqa.selenium.chrome.ChromeDriver&#10;Capabilities {acceptInsecureCerts: false, browserName: chrome, browserVersion: 93.0.4577.82, chrome: {chromedriverVersion: 93.0.4577.63 (ff5c0da2ec0ad..., userDataDir: /var/folders/d7/clj20lrn35z...}, goog:chromeOptions: {debuggerAddress: localhost:52747}, javascriptEnabled: true, networkConnectionEnabled: false, pageLoadStrategy: normal, platform: MAC, platformName: MAC, proxy: Proxy(), setWindowRect: true, strictFileInteractability: false, timeouts: {implicit: 0, pageLoad: 300000, script: 30000}, unhandledPromptBehavior: dismiss and notify, webauthn:extension:credBlob: true, webauthn:extension:largeBlob: true, webauthn:virtualAuthenticators: true}&#10;Session ID: 9edc69dd8eeb64df22d6e66c85c478c3" type="org.openqa.selenium.ElementClickInterceptedException"><![CDATA[org.openqa.selenium.ElementClickInterceptedException: 
element click intercepted: Element <li class="btn btn-light " id="item-4">...</li> is not clickable at point (133, 661). Other element would receive the click: <div>...</div>
  (Session info: headless chrome=93.0.4577.82)
Build info: version: '3.141.59', revision: 'e82be7d358', time: '2018-11-14T08:17:03'
System info: host: 'Santhosh-MacBook-Pro.local', ip: 'fe80:0:0:0:1c0d:e564:e23:745%en0', os.name: 'Mac OS X', os.arch: 'x86_64', os.version: '10.16', java.version: '14.0.1'
Driver info: org.openqa.selenium.chrome.ChromeDriver
Capabilities {acceptInsecureCerts: false, browserName: chrome, browserVersion: 93.0.4577.82, chrome: {chromedriverVersion: 93.0.4577.63 (ff5c0da2ec0ad..., userDataDir: /var/folders/d7/clj20lrn35z...}, goog:chromeOptions: {debuggerAddress: localhost:52747}, javascriptEnabled: true, networkConnectionEnabled: false, pageLoadStrategy: normal, platform: MAC, platformName: MAC, proxy: Proxy(), setWindowRect: true, strictFileInteractability: false, timeouts: {implicit: 0, pageLoad: 300000, script: 30000}, unhandledPromptBehavior: dismiss and notify, webauthn:extension:credBlob: true, webauthn:extension:largeBlob: true, webauthn:virtualAuthenticators: true}
Session ID: 9edc69dd8eeb64df22d6e66c85c478c3
]]></error>
  </testcase>
  <testcase name="Given I am on Tools QA Home Page" classname="Scenario: Verification of Droppable Interactions" time="0"/>
  <testcase name="Then I see following tiles on the home page" classname="Scenario: Verification of Droppable Interactions" time="0"/>
  <testcase name="When I click &quot;Interactions&quot; Tile" classname="Scenario: Verification of Droppable Interactions" time="0"/>
  <testcase name="Then I am on Interactions page" classname="Scenario: Verification of Droppable Interactions" time="0"/>
  <testcase name="And I click the &quot;Droppable&quot; Interaction" classname="Scenario: Verification of Droppable Interactions" time="0"/>
  <testcase name="Scenario: Verification of Droppable Interactions" classname="Scenario: Verification of Droppable Interactions" time="0.084"/>
  <testcase name="Given I am on Tools QA Home Page" classname="Scenario: Verification of Accordian" time="0"/>
  <testcase name="Then I see following tiles on the home page" classname="Scenario: Verification of Accordian" time="0"/>
  <testcase name="When I click &quot;Widgets&quot; Tile" classname="Scenario: Verification of Accordian" time="0"/>
  <testcase name="Then I am on Widgets page" classname="Scenario: Verification of Accordian" time="0"/>
  <testcase name="And I click &quot;Accordian&quot; Widgets" classname="Scenario: Verification of Accordian" time="0"/>
  <testcase name="And I see &quot;Accordian&quot; widget" classname="Scenario: Verification of Accordian" time="0"/>
  <testcase name="Scenario: Verification of Accordian" classname="Scenario: Verification of Accordian" time="0.083"/>
  <testcase name="Given I am on Tools QA Home Page" classname="Scenario: Verification of Auto Complete" time="0"/>
  <testcase name="Then I see following tiles on the home page" classname="Scenario: Verification of Auto Complete" time="0"/>
  <testcase name="When I click &quot;Widgets&quot; Tile" classname="Scenario: Verification of Auto Complete" time="0"/>
  <testcase name="Then I am on Widgets page" classname="Scenario: Verification of Auto Complete" time="0"/>
  <testcase name="And I click &quot;Auto Complete&quot; Widgets" classname="Scenario: Verification of Auto Complete" time="0"/>
  <testcase name="And I see &quot;Auto Complete&quot; widget" classname="Scenario: Verification of Auto Complete" time="0"/>
  <testcase name="Scenario: Verification of Auto Complete" classname="Scenario: Verification of Auto Complete" time="0.083"/>
  <testcase name="Given I am on Tools QA Home Page" classname="Scenario: Verification of Date Picker" time="0"/>
  <testcase name="Then I see following tiles on the home page" classname="Scenario: Verification of Date Picker" time="0"/>
  <testcase name="When I click &quot;Widgets&quot; Tile" classname="Scenario: Verification of Date Picker" time="0"/>
  <testcase name="Then I am on Widgets page" classname="Scenario: Verification of Date Picker" time="0"/>
  <testcase name="And I click &quot;Date Picker&quot; Widgets" classname="Scenario: Verification of Date Picker" time="0"/>
  <testcase name="And I see &quot;Date Picker&quot; widget" classname="Scenario: Verification of Date Picker" time="0"/>
  <testcase name="Scenario: Verification of Date Picker" classname="Scenario: Verification of Date Picker" time="0.079"/>
  <testcase name="Given I am on Tools QA Home Page" classname="Scenario: Verification of Slider" time="0"/>
  <testcase name="Then I see following tiles on the home page" classname="Scenario: Verification of Slider" time="0"/>
  <testcase name="When I click &quot;Widgets&quot; Tile" classname="Scenario: Verification of Slider" time="0"/>
  <testcase name="Then I am on Widgets page" classname="Scenario: Verification of Slider" time="0"/>
  <testcase name="And I click &quot;Slider&quot; Widgets" classname="Scenario: Verification of Slider" time="0"/>
  <testcase name="And I see &quot;Slider&quot; widget" classname="Scenario: Verification of Slider" time="0"/>
  <testcase name="Scenario: Verification of Slider" classname="Scenario: Verification of Slider" time="0.092"/>
  <testcase name="Given I am on Tools QA Home Page" classname="Scenario: Verification of Progress Bar" time="0"/>
  <testcase name="Then I see following tiles on the home page" classname="Scenario: Verification of Progress Bar" time="0"/>
  <testcase name="When I click &quot;Widgets&quot; Tile" classname="Scenario: Verification of Progress Bar" time="0"/>
  <testcase name="Then I am on Widgets page" classname="Scenario: Verification of Progress Bar" time="0"/>
  <testcase name="And I click &quot;Progress Bar&quot; Widgets" classname="Scenario: Verification of Progress Bar" time="0"/>
  <testcase name="And I see &quot;Progress Bar&quot; widget" classname="Scenario: Verification of Progress Bar" time="0"/>
  <testcase name="Scenario: Verification of Progress Bar" classname="Scenario: Verification of Progress Bar" time="0.08"/>
  <testcase name="Given I am on Tools QA Home Page" classname="Scenario: Verification of Tabs" time="0"/>
  <testcase name="Then I see following tiles on the home page" classname="Scenario: Verification of Tabs" time="0.001"/>
  <testcase name="When I click &quot;Widgets&quot; Tile" classname="Scenario: Verification of Tabs" time="0"/>
  <testcase name="Then I am on Widgets page" classname="Scenario: Verification of Tabs" time="0"/>
  <testcase name="And I click &quot;Tabs&quot; Widgets" classname="Scenario: Verification of Tabs" time="0"/>
  <testcase name="And I see &quot;Tabs&quot; widget" classname="Scenario: Verification of Tabs" time="0"/>
  <testcase name="Scenario: Verification of Tabs" classname="Scenario: Verification of Tabs" time="0.079"/>
  <testcase name="Given I am on Tools QA Home Page" classname="Scenario: Verification of Tool Tips" time="0"/>
  <testcase name="Then I see following tiles on the home page" classname="Scenario: Verification of Tool Tips" time="0"/>
  <testcase name="When I click &quot;Widgets&quot; Tile" classname="Scenario: Verification of Tool Tips" time="0"/>
  <testcase name="Then I am on Widgets page" classname="Scenario: Verification of Tool Tips" time="0"/>
  <testcase name="And I click &quot;Tool Tips&quot; Widgets" classname="Scenario: Verification of Tool Tips" time="0"/>
  <testcase name="And I see &quot;Tool Tips&quot; widget" classname="Scenario: Verification of Tool Tips" time="0"/>
  <testcase name="Scenario: Verification of Tool Tips" classname="Scenario: Verification of Tool Tips" time="0.088"/>
  <testcase name="Given I am on Tools QA Home Page" classname="Scenario: Verification of Menu" time="0"/>
  <testcase name="Then I see following tiles on the home page" classname="Scenario: Verification of Menu" time="0"/>
  <testcase name="When I click &quot;Widgets&quot; Tile" classname="Scenario: Verification of Menu" time="0"/>
  <testcase name="Then I am on Widgets page" classname="Scenario: Verification of Menu" time="0"/>
  <testcase name="And I click &quot;Menu&quot; Widgets" classname="Scenario: Verification of Menu" time="0"/>
  <testcase name="And I see &quot;Menu&quot; widget" classname="Scenario: Verification of Menu" time="0"/>
  <testcase name="Scenario: Verification of Menu" classname="Scenario: Verification of Menu" time="0.08"/>
  <testcase name="Given I am on Tools QA Home Page" classname="Scenario: Verification of Select Menu" time="0"/>
  <testcase name="Then I see following tiles on the home page" classname="Scenario: Verification of Select Menu" time="0"/>
  <testcase name="When I click &quot;Widgets&quot; Tile" classname="Scenario: Verification of Select Menu" time="0"/>
  <testcase name="Then I am on Widgets page" classname="Scenario: Verification of Select Menu" time="0"/>
  <testcase name="And I click &quot;Select Menu&quot; Widgets" classname="Scenario: Verification of Select Menu" time="0"/>
  <testcase name="And I see &quot;Select Menu&quot; widget" classname="Scenario: Verification of Select Menu" time="0"/>
  <testcase name="Scenario: Verification of Select Menu" classname="Scenario: Verification of Select Menu" time="0.088"/>
  <testcase name="Given I am on Tools QA Home Page" classname="Scenario: Verification of Browser Window" time="0"/>
  <testcase name="Then I see following tiles on the home page" classname="Scenario: Verification of Browser Window" time="0"/>
  <testcase name="When I click &quot;Alerts, Frame &amp; Windows&quot; Tile" classname="Scenario: Verification of Browser Window" time="0"/>
  <testcase name="Then I am on Alerts, Frame &amp; Windows page" classname="Scenario: Verification of Browser Window" time="0"/>
  <testcase name="And I click the &quot;Browser Windows&quot;" classname="Scenario: Verification of Browser Window" time="0.001"/>
  <testcase name="And I see &quot;Browser Windows&quot; opens" classname="Scenario: Verification of Browser Window" time="0"/>
  <testcase name="Scenario: Verification of Browser Window" classname="Scenario: Verification of Browser Window" time="0.082"/>
  <testcase name="Given I am on Tools QA Home Page" classname="Scenario: Verification of Alerts" time="0"/>
  <testcase name="Then I see following tiles on the home page" classname="Scenario: Verification of Alerts" time="0"/>
  <testcase name="When I click &quot;Alerts, Frame &amp; Windows&quot; Tile" classname="Scenario: Verification of Alerts" time="0"/>
  <testcase name="Then I am on Alerts, Frame &amp; Windows page" classname="Scenario: Verification of Alerts" time="0"/>
  <testcase name="And I click the &quot;Alerts&quot;" classname="Scenario: Verification of Alerts" time="0"/>
  <testcase name="And I see &quot;Alerts&quot; opens" classname="Scenario: Verification of Alerts" time="0"/>
  <testcase name="Scenario: Verification of Alerts" classname="Scenario: Verification of Alerts" time="0.078"/>
  <testcase name="Given I am on Tools QA Home Page" classname="Scenario: Verification of Frames" time="0"/>
  <testcase name="Then I see following tiles on the home page" classname="Scenario: Verification of Frames" time="0"/>
  <testcase name="When I click &quot;Alerts, Frame &amp; Windows&quot; Tile" classname="Scenario: Verification of Frames" time="0"/>
  <testcase name="Then I am on Alerts, Frame &amp; Windows page" classname="Scenario: Verification of Frames" time="0"/>
  <testcase name="And I click the &quot;Frames&quot;" classname="Scenario: Verification of Frames" time="0"/>
  <testcase name="And I see &quot;Frames&quot; opens" classname="Scenario: Verification of Frames" time="0"/>
  <testcase name="Scenario: Verification of Frames" classname="Scenario: Verification of Frames" time="0.079"/>
  <testcase name="Given I am on Tools QA Home Page" classname="Scenario: Verification of Nested Frames" time="0"/>
  <testcase name="Then I see following tiles on the home page" classname="Scenario: Verification of Nested Frames" time="0"/>
  <testcase name="When I click &quot;Alerts, Frame &amp; Windows&quot; Tile" classname="Scenario: Verification of Nested Frames" time="0"/>
  <testcase name="Then I am on Alerts, Frame &amp; Windows page" classname="Scenario: Verification of Nested Frames" time="0"/>
  <testcase name="And I click the &quot;Nested Frames&quot;" classname="Scenario: Verification of Nested Frames" time="0"/>
  <testcase name="And I see &quot;Nested Frames&quot; opens" classname="Scenario: Verification of Nested Frames" time="0"/>
  <testcase name="Scenario: Verification of Nested Frames" classname="Scenario: Verification of Nested Frames" time="0.085"/>
  <testcase name="Given I am on Tools QA Home Page" classname="Scenario: Verification of Modal Dialogs" time="0"/>
  <testcase name="Then I see following tiles on the home page" classname="Scenario: Verification of Modal Dialogs" time="0"/>
  <testcase name="When I click &quot;Alerts, Frame &amp; Windows&quot; Tile" classname="Scenario: Verification of Modal Dialogs" time="0"/>
  <testcase name="Then I am on Alerts, Frame &amp; Windows page" classname="Scenario: Verification of Modal Dialogs" time="0"/>
  <testcase name="And I click the &quot;Modal Dialogs&quot;" classname="Scenario: Verification of Modal Dialogs" time="0"/>
  <testcase name="And I see &quot;Modal Dialogs&quot; opens" classname="Scenario: Verification of Modal Dialogs" time="0"/>
  <testcase name="Scenario: Verification of Modal Dialogs" classname="Scenario: Verification of Modal Dialogs" time="0.08"/>
</testsuite>