{
    "data": {
      "attributes": {
        "terraform_version": "1.1.0",
        "working-directory": "",
        "execution-mode": "local",
        "auto-apply": false,
        "auto-apply-run-trigger": true,
        "name": "tfm_azure"
        
      },
      "type": "workspaces",
      "id": "ws-kbCBsGQRqLUhFWkQ"
      
    }
  }
  