<?xml version="1.0" encoding="UTF-8"?>
<svg width="194px" height="194px" viewBox="0 0 194 194" version="1.1" xmlns="http://www.w3.org/2000/svg" xmlns:xlink="http://www.w3.org/1999/xlink">
    <!-- Generator: Sketch 50.2 (55047) - http://www.bohemiancoding.com/sketch -->
    <title>ico-solution-route</title>
    <desc>Created with Sketch.</desc>
    <defs></defs>
    <g id="ico-solution-route" stroke="none" stroke-width="1" fill="none" fill-rule="evenodd">
        <polygon id="Path-2" fill="#00A690" fill-rule="nonzero" points="57.2207031 98.9101562 57.2207031 122.050781 51.2207031 122.050781 51.2207031 92.9101562 136.556641 92.9101562 136.556641 34.1308594 142.556641 34.1308594 142.556641 98.9101562"></polygon>
        <g id="cross" transform="translate(29.000000, 29.000000)" fill="#00A690" fill-rule="nonzero">
            <polygon id="Path-2" points="-1.36700659 3.10214328 2.85431128 -1.16171359 46.5598777 42.1078177 42.3385598 46.3716745"></polygon>
            <polygon id="Path-2" transform="translate(22.596436, 22.604980) scale(-1, 1) translate(-22.596436, -22.604980) " points="-1.36700659 3.10214328 2.85431128 -1.16171359 46.5598777 42.1078177 42.3385598 46.3716745"></polygon>
        </g>
        <g id="cross-copy" transform="translate(120.000000, 120.000000)" fill="#00A690" fill-rule="nonzero">
            <polygon id="Path-2" points="-1.36700659 3.10214328 2.85431128 -1.16171359 46.5598777 42.1078177 42.3385598 46.3716745"></polygon>
            <polygon id="Path-2" transform="translate(22.596436, 22.604980) scale(-1, 1) translate(-22.596436, -22.604980) " points="-1.36700659 3.10214328 2.85431128 -1.16171359 46.5598777 42.1078177 42.3385598 46.3716745"></polygon>
        </g>
        <path d="M54,153 C61.1797017,153 67,147.179702 67,140 C67,132.820298 61.1797017,127 54,127 C46.8202983,127 41,132.820298 41,140 C41,147.179702 46.8202983,153 54,153 Z M54,159 C43.5065898,159 35,150.49341 35,140 C35,129.50659 43.5065898,121 54,121 C64.4934102,121 73,129.50659 73,140 C73,150.49341 64.4934102,159 54,159 Z" id="Oval" fill="#00A690" fill-rule="nonzero"></path>
        <path d="M141.52094,35.9986252 L137.151608,35.9966602 L139.335053,38.8351391 L127.443045,54.266797 L120,54.0957031 L135.551034,33.9159134 L135.604244,33.9850866 L139.340731,29 L143.071526,33.9865076 L143.123375,33.9192257 L159.339355,55 L151.633301,54.8228603 L139.335053,38.8351391 L141.52094,35.9986252 Z" id="Combined-Shape" fill="#00A690"></path>
    </g>
</svg>