<?xml version="1.0" encoding="UTF-8"?>
<svg width="340px" height="60px" viewBox="0 0 340 60" version="1.1" xmlns="http://www.w3.org/2000/svg" xmlns:xlink="http://www.w3.org/1999/xlink">
    <!-- Generator: Sketch 50.2 (55047) - http://www.bohemiancoding.com/sketch -->
    <title>preloader.full</title>
    <desc>Created with Sketch.</desc>
    <defs></defs>
    <g id="preloader.full" stroke="none" stroke-width="1" fill="none" fill-rule="evenodd">
        <path d="M93.28,17.216 C96.6400168,17.216 99.2439908,18.0746581 101.092,19.792 C102.940009,21.5093419 103.864,23.7866525 103.864,26.624 L103.864,45.272 C103.864,45.7573358 103.621336,46 103.136,46 L100.616,46 C100.130664,46 99.888,45.7573358 99.888,45.272 L99.888,43.256 C99.888,43.1439994 99.850667,43.0693335 99.776,43.032 C99.701333,42.9946665 99.626667,43.0319994 99.552,43.144 C98.543995,44.2266721 97.2840076,45.0479972 95.772,45.608 C94.2599924,46.1680028 92.608009,46.448 90.816,46.448 C88.2026536,46.448 86.0093422,45.7760067 84.236,44.432 C82.4626578,43.0879933 81.576,41.0346805 81.576,38.272 C81.576,35.471986 82.5933232,33.2600081 84.628,31.636 C86.6626768,30.0119919 89.4906486,29.2 93.112,29.2 L99.608,29.2 C99.7946676,29.2 99.888,29.1066676 99.888,28.92 L99.888,26.848 C99.888,24.9439905 99.3560053,23.4413388 98.292,22.34 C97.2279947,21.2386612 95.5760112,20.688 93.336,20.688 C91.5813246,20.688 90.1440056,21.0239966 89.024,21.696 C87.9039944,22.3680034 87.1946682,23.3013274 86.896,24.496 C86.7839994,24.9440022 86.5040022,25.130667 86.056,25.056 L83.312,24.72 C82.8266642,24.645333 82.6026665,24.4400017 82.64,24.104 C83.0133352,22.0506564 84.1613237,20.3893397 86.084,19.12 C88.0066763,17.8506603 90.405319,17.216 93.28,17.216 Z M91.712,43.032 C93.9146777,43.032 95.8279919,42.4813388 97.452,41.38 C99.0760081,40.2786612 99.888,38.794676 99.888,36.928 L99.888,32.616 C99.888,32.4293324 99.7946676,32.336 99.608,32.336 L93.728,32.336 C91.2639877,32.336 89.2853408,32.839995 87.792,33.848 C86.2986592,34.856005 85.552,36.255991 85.552,38.048 C85.552,39.6906749 86.1306609,40.9319958 87.288,41.772 C88.4453391,42.6120042 89.919991,43.032 91.712,43.032 Z M123.52,17.384 C124.752006,17.384 125.778663,17.6079978 126.6,18.056 C126.973335,18.2053341 127.104001,18.5039978 126.992,18.952 L126.432,21.416 C126.319999,21.8640022 126.021336,22.0133341 125.536,21.864 C124.826663,21.6399989 123.912006,21.5466665 122.792,21.584 C120.850657,21.658667 119.24534,22.3773265 117.976,23.74 C116.70666,25.1026735 116.072,26.8293229 116.072,28.92 L116.072,45.272 C116.072,45.7573358 115.829336,46 115.344,46 L112.824,46 C112.338664,46 112.096,45.7573358 112.096,45.272 L112.096,18.392 C112.096,17.9066642 112.338664,17.664 112.824,17.664 L115.344,17.664 C115.829336,17.664 116.072,17.9066642 116.072,18.392 L116.072,21.528 C116.072,21.6773341 116.1,21.7613332 116.156,21.78 C116.212,21.7986668 116.277333,21.7520006 116.352,21.64 C117.136004,20.2959933 118.134661,19.2506704 119.348,18.504 C120.561339,17.7573296 121.951992,17.384 123.52,17.384 Z M133.208,46 C132.722664,46 132.48,45.7573358 132.48,45.272 L132.48,7.528 C132.48,7.04266424 132.722664,6.8 133.208,6.8 L135.728,6.8 C136.213336,6.8 136.456,7.04266424 136.456,7.528 L136.456,30.152 C136.456,30.2640006 136.493333,30.3479997 136.568,30.404 C136.642667,30.4600003 136.717333,30.4320006 136.792,30.32 L148.496,18.056 C148.720001,17.7946654 149.018665,17.664 149.392,17.664 L152.36,17.664 C152.770669,17.664 152.976,17.8133318 152.976,18.112 C152.976,18.2240006 152.920001,18.3733324 152.808,18.56 L145.864,26.232 C145.751999,26.3440006 145.733333,26.4746659 145.808,26.624 L154.208,45.16 C154.282667,45.3093341 154.32,45.421333 154.32,45.496 C154.32,45.8320017 154.096002,46 153.648,46 L151.016,46 C150.642665,46 150.362668,45.8133352 150.176,45.44 L143.064,29.256 C143.026666,29.181333 142.970667,29.1346668 142.896,29.116 C142.821333,29.0973332 142.746667,29.125333 142.672,29.2 L136.568,35.584 C136.493333,35.7333341 136.456,35.8639994 136.456,35.976 L136.456,45.272 C136.456,45.7573358 136.213336,46 135.728,46 L133.208,46 Z M170.504,43.032 C172.184008,42.9946665 173.630661,42.6120036 174.844,41.884 C176.057339,41.1559964 176.999997,40.1386732 177.672,38.832 C177.746667,38.6453324 177.877332,38.514667 178.064,38.44 C178.250668,38.365333 178.437332,38.3839994 178.624,38.496 L180.248,39.392 C180.696002,39.6533346 180.808001,39.9706648 180.584,40.344 C179.687996,42.210676 178.344009,43.6946612 176.552,44.796 C174.759991,45.8973388 172.632012,46.448 170.168,46.448 C167.554654,46.448 165.352009,45.8320062 163.56,44.6 C161.767991,43.3679938 160.480004,41.6506777 159.696,39.448 C158.986663,37.581324 158.632,35.0053498 158.632,31.72 C158.632,30.1146586 158.66,28.8360048 158.716,27.884 C158.772,26.9319952 158.911999,26.0453374 159.136,25.224 C159.77067,22.7973212 161.049324,20.8560073 162.972,19.4 C164.894676,17.9439927 167.218653,17.216 169.944,17.216 C173.192016,17.216 175.739991,18.0559916 177.588,19.736 C179.436009,21.4160084 180.621331,23.7866514 181.144,26.848 C181.368001,28.0426726 181.48,29.9093206 181.48,32.448 C181.48,32.9333358 181.237336,33.176 180.752,33.176 L162.832,33.176 C162.645332,33.176 162.552,33.2693324 162.552,33.456 C162.552,35.322676 162.663999,36.685329 162.888,37.544 C163.298669,39.2240084 164.16666,40.5586617 165.492,41.548 C166.81734,42.5373383 168.48799,43.032 170.504,43.032 Z M169.944,20.688 C168.077324,20.688 166.546673,21.1639952 165.352,22.116 C164.157327,23.0680048 163.373335,24.3466586 163,25.952 C162.775999,26.6986704 162.626667,27.967991 162.552,29.76 C162.552,29.9466676 162.645332,30.04 162.832,30.04 L177.224,30.04 C177.410668,30.04 177.504,29.9466676 177.504,29.76 C177.429333,28.1173251 177.317334,26.9226704 177.168,26.176 C176.757331,24.4959916 175.926673,23.1613383 174.676,22.172 C173.425327,21.1826617 171.84801,20.688 169.944,20.688 Z M201.696,20.24 C201.696,20.7253358 201.453336,20.968 200.968,20.968 L194.864,20.968 C194.677332,20.968 194.584,21.0613324 194.584,21.248 L194.584,37.6 C194.584,39.392009 194.985329,40.6519964 195.788,41.38 C196.590671,42.1080036 197.850658,42.472 199.568,42.472 L200.8,42.472 C201.285336,42.472 201.528,42.7146642 201.528,43.2 L201.528,45.16 C201.528,45.6453358 201.285336,45.9066665 200.8,45.944 L198.896,45.944 C196.207987,45.944 194.17334,45.440005 192.792,44.432 C191.41066,43.423995 190.72,41.557347 190.72,38.832 L190.72,21.248 C190.72,21.0613324 190.626668,20.968 190.44,20.968 L187.248,20.968 C186.762664,20.968 186.52,20.7253358 186.52,20.24 L186.52,18.392 C186.52,17.9066642 186.762664,17.664 187.248,17.664 L190.44,17.664 C190.626668,17.664 190.72,17.5706676 190.72,17.384 L190.72,11.112 C190.72,10.6266642 190.962664,10.384 191.448,10.384 L193.856,10.384 C194.341336,10.384 194.584,10.6266642 194.584,11.112 L194.584,17.384 C194.584,17.5706676 194.677332,17.664 194.864,17.664 L200.968,17.664 C201.453336,17.664 201.696,17.9066642 201.696,18.392 L201.696,20.24 Z M231.376,24.72 C231.898669,26.4000084 232.16,28.7706514 232.16,31.832 C232.16,34.9306822 231.936002,37.2453257 231.488,38.776 C230.815997,41.1653453 229.584009,43.0413265 227.792,44.404 C225.999991,45.7666735 223.77868,46.448 221.128,46.448 C219.671993,46.448 218.328006,46.1586696 217.096,45.58 C215.863994,45.0013304 214.837337,44.1706721 214.016,43.088 C213.941333,42.9759994 213.866667,42.9386665 213.792,42.976 C213.717333,43.0133335 213.68,43.0879994 213.68,43.2 L213.68,56.136 C213.68,56.6213358 213.437336,56.864 212.952,56.864 L210.432,56.864 C209.946664,56.864 209.704,56.6213358 209.704,56.136 L209.704,18.392 C209.704,17.9066642 209.946664,17.664 210.432,17.664 L212.952,17.664 C213.437336,17.664 213.68,17.9066642 213.68,18.392 L213.68,20.52 C213.68,20.6320006 213.717333,20.6973332 213.792,20.716 C213.866667,20.7346668 213.941333,20.706667 214.016,20.632 C214.837337,19.5493279 215.854661,18.7093363 217.068,18.112 C218.281339,17.5146637 219.634659,17.216 221.128,17.216 C223.741346,17.216 225.934658,17.8879933 227.708,19.232 C229.481342,20.5760067 230.703997,22.4053218 231.376,24.72 Z M226.896,38.888 C227.344002,38.0666626 227.670666,37.1426718 227.876,36.116 C228.081334,35.0893282 228.184,33.6613425 228.184,31.832 C228.184,30.0773246 228.109334,28.7053383 227.96,27.716 C227.810666,26.7266617 227.549335,25.8400039 227.176,25.056 C226.727998,23.7119933 225.934672,22.6480039 224.796,21.864 C223.657328,21.0799961 222.304008,20.688 220.736,20.688 C219.242659,20.688 217.992005,21.0799961 216.984,21.864 C215.975995,22.6480039 215.229336,23.6933268 214.744,25 C214.407998,25.7466704 214.165334,26.623995 214.016,27.632 C213.866666,28.640005 213.792,30.039991 213.792,31.832 C213.792,33.624009 213.866666,35.0333282 214.016,36.06 C214.165334,37.0866718 214.426665,37.9919961 214.8,38.776 C215.248002,40.0453397 215.985328,41.0626628 217.012,41.828 C218.038672,42.5933372 219.261326,42.976 220.68,42.976 C222.173341,42.976 223.461328,42.6026704 224.544,41.856 C225.626672,41.1093296 226.410664,40.1200062 226.896,38.888 Z M240.784,46 C240.298664,46 240.056,45.7573358 240.056,45.272 L240.056,7.528 C240.056,7.04266424 240.298664,6.8 240.784,6.8 L243.304,6.8 C243.789336,6.8 244.032,7.04266424 244.032,7.528 L244.032,45.272 C244.032,45.7573358 243.789336,46 243.304,46 L240.784,46 Z M262.848,17.216 C266.208017,17.216 268.811991,18.0746581 270.66,19.792 C272.508009,21.5093419 273.432,23.7866525 273.432,26.624 L273.432,45.272 C273.432,45.7573358 273.189336,46 272.704,46 L270.184,46 C269.698664,46 269.456,45.7573358 269.456,45.272 L269.456,43.256 C269.456,43.1439994 269.418667,43.0693335 269.344,43.032 C269.269333,42.9946665 269.194667,43.0319994 269.12,43.144 C268.111995,44.2266721 266.852008,45.0479972 265.34,45.608 C263.827992,46.1680028 262.176009,46.448 260.384,46.448 C257.770654,46.448 255.577342,45.7760067 253.804,44.432 C252.030658,43.0879933 251.144,41.0346805 251.144,38.272 C251.144,35.471986 252.161323,33.2600081 254.196,31.636 C256.230677,30.0119919 259.058649,29.2 262.68,29.2 L269.176,29.2 C269.362668,29.2 269.456,29.1066676 269.456,28.92 L269.456,26.848 C269.456,24.9439905 268.924005,23.4413388 267.86,22.34 C266.795995,21.2386612 265.144011,20.688 262.904,20.688 C261.149325,20.688 259.712006,21.0239966 258.592,21.696 C257.471994,22.3680034 256.762668,23.3013274 256.464,24.496 C256.351999,24.9440022 256.072002,25.130667 255.624,25.056 L252.88,24.72 C252.394664,24.645333 252.170666,24.4400017 252.208,24.104 C252.581335,22.0506564 253.729324,20.3893397 255.652,19.12 C257.574676,17.8506603 259.973319,17.216 262.848,17.216 Z M261.28,43.032 C263.482678,43.032 265.395992,42.4813388 267.02,41.38 C268.644008,40.2786612 269.456,38.794676 269.456,36.928 L269.456,32.616 C269.456,32.4293324 269.362668,32.336 269.176,32.336 L263.296,32.336 C260.831988,32.336 258.853341,32.839995 257.36,33.848 C255.866659,34.856005 255.12,36.255991 255.12,38.048 C255.12,39.6906749 255.698661,40.9319958 256.856,41.772 C258.013339,42.6120042 259.487991,43.032 261.28,43.032 Z M292.36,46.448 C289.671987,46.448 287.366676,45.748007 285.444,44.348 C283.521324,42.947993 282.205337,41.0533453 281.496,38.664 C281.010664,37.0213251 280.768,34.7066816 280.768,31.72 C280.768,29.0319866 281.010664,26.754676 281.496,24.888 C282.168003,22.5733218 283.474657,20.716007 285.416,19.316 C287.357343,17.915993 289.671987,17.216 292.36,17.216 C295.085347,17.216 297.446657,17.9066598 299.444,19.288 C301.441343,20.6693402 302.738664,22.3866564 303.336,24.44 C303.485334,24.9626693 303.597333,25.4666642 303.672,25.952 L303.672,26.064 C303.672,26.4746687 303.448002,26.717333 303,26.792 L300.536,27.072 L300.368,27.072 C300.031998,27.072 299.808001,26.8666687 299.696,26.456 C299.696,26.3066659 299.658667,26.0826682 299.584,25.784 C299.247998,24.3653262 298.426673,23.1613383 297.12,22.172 C295.813327,21.1826617 294.226676,20.688 292.36,20.688 C290.493324,20.688 288.934673,21.1826617 287.684,22.172 C286.433327,23.1613383 285.621335,24.4773251 285.248,26.12 C284.911998,27.5386738 284.744,29.4239882 284.744,31.776 C284.744,34.2400123 284.911998,36.1439933 285.248,37.488 C285.621335,39.1680084 286.433327,40.5026617 287.684,41.492 C288.934673,42.4813383 290.493324,42.976 292.36,42.976 C294.189342,42.976 295.76666,42.5000048 297.092,41.548 C298.41734,40.5959952 299.229332,39.3920073 299.528,37.936 C299.565334,37.861333 299.584,37.7680006 299.584,37.656 L299.64,37.6 C299.677334,37.1146642 299.957331,36.909333 300.48,36.984 L302.888,37.376 C303.373336,37.450667 303.597334,37.7306642 303.56,38.216 L303.336,39.168 C302.775997,41.3333442 301.48801,43.0879933 299.472,44.432 C297.45599,45.7760067 295.085347,46.448 292.36,46.448 Z M321.648,43.032 C323.328008,42.9946665 324.774661,42.6120036 325.988,41.884 C327.201339,41.1559964 328.143997,40.1386732 328.816,38.832 C328.890667,38.6453324 329.021332,38.514667 329.208,38.44 C329.394668,38.365333 329.581332,38.3839994 329.768,38.496 L331.392,39.392 C331.840002,39.6533346 331.952001,39.9706648 331.728,40.344 C330.831996,42.210676 329.488009,43.6946612 327.696,44.796 C325.903991,45.8973388 323.776012,46.448 321.312,46.448 C318.698654,46.448 316.496009,45.8320062 314.704,44.6 C312.911991,43.3679938 311.624004,41.6506777 310.84,39.448 C310.130663,37.581324 309.776,35.0053498 309.776,31.72 C309.776,30.1146586 309.804,28.8360048 309.86,27.884 C309.916,26.9319952 310.055999,26.0453374 310.28,25.224 C310.91467,22.7973212 312.193324,20.8560073 314.116,19.4 C316.038676,17.9439927 318.362653,17.216 321.088,17.216 C324.336016,17.216 326.883991,18.0559916 328.732,19.736 C330.580009,21.4160084 331.765331,23.7866514 332.288,26.848 C332.512001,28.0426726 332.624,29.9093206 332.624,32.448 C332.624,32.9333358 332.381336,33.176 331.896,33.176 L313.976,33.176 C313.789332,33.176 313.696,33.2693324 313.696,33.456 C313.696,35.322676 313.807999,36.685329 314.032,37.544 C314.442669,39.2240084 315.31066,40.5586617 316.636,41.548 C317.96134,42.5373383 319.63199,43.032 321.648,43.032 Z M321.088,20.688 C319.221324,20.688 317.690673,21.1639952 316.496,22.116 C315.301327,23.0680048 314.517335,24.3466586 314.144,25.952 C313.919999,26.6986704 313.770667,27.967991 313.696,29.76 C313.696,29.9466676 313.789332,30.04 313.976,30.04 L328.368,30.04 C328.554668,30.04 328.648,29.9466676 328.648,29.76 C328.573333,28.1173251 328.461334,26.9226704 328.312,26.176 C327.901331,24.4959916 327.070673,23.1613383 325.82,22.172 C324.569327,21.1826617 322.99201,20.688 321.088,20.688 Z" id="arketplace" fill="#FFFFFF"></path>
        <g id="SophiaTX-Marketplace-logo" transform="translate(6.000000, 15.000000)" fill="#00A690" fill-rule="nonzero">
            <path d="M22.4804387,33 L18,30.6072245 C18.1165628,30.3641597 18.3338106,29.9215405 18.6430194,29.3076675 C19.1547233,28.2917806 19.7407816,27.1616187 20.3925601,25.9453821 C22.2557119,22.4686897 24.2762635,18.990811 26.3882817,15.7344602 C29.4134664,11.0701717 32.3753147,7.24843086 35.2273005,4.53852873 C38.9894235,0.963831782 42.5670871,-0.699818303 46,0.274794017 L44.6954597,5.39198729 C43.3215127,5.0019204 41.21157,5.98306533 38.5873288,8.47656883 C36.0822855,10.8568129 33.3519007,14.379891 30.5321121,18.7274959 C28.5090628,21.8466725 26.561037,25.1997161 24.7635126,28.553946 C24.1340544,29.7285323 23.5688807,30.8184201 23.0770335,31.7948855 C22.7841116,32.3764239 22.5822625,32.78767 22.4804387,33 Z" id="Stroke-1"></path>
            <path d="M40.5887829,32.3044666 L36,29.9431114 C36.1116772,29.7062718 36.3197326,29.2747798 36.6156171,28.6762392 C37.1053376,27.6855904 37.6656365,26.5834676 38.2880504,25.3973743 C40.0673863,22.0066103 41.9918099,18.6146139 43.9966664,15.4384365 C46.6769933,11.1921506 49.29768,7.65607015 51.8188775,5.04717631 C55.8698079,0.855340162 59.6999636,-1.01252328 63.339313,0.544694124 C68.4885339,2.74796052 69.7308367,8.9564141 68.6306573,17.6556833 C68.28691,20.3737401 67.7155445,23.2469203 66.9802559,26.1766782 C66.5470475,27.9027975 66.0832609,29.5436542 65.6188867,31.0483477 C65.3382989,31.9575252 65.1177212,32.6253508 64.9870968,33 L60.1806871,31.1711674 C60.2903541,30.8566271 60.4902864,30.251308 60.7503543,29.4086201 C61.1870729,27.993538 61.6243792,26.4463673 62.0321908,24.8214418 C62.7171223,22.0923317 63.2464269,19.4306601 63.5594221,16.9557639 C64.378168,10.4818278 63.5645446,6.41571535 61.4004703,5.48974374 C60.242336,4.99419723 58.1552004,6.01203687 55.4187149,8.84370707 C53.1896191,11.1503388 50.7694332,14.4158846 48.2671045,18.3801782 C46.3465276,21.4228365 44.4907266,24.6938784 42.7735693,27.9661527 C42.1722105,29.1121227 41.6316155,30.1754874 41.1606362,31.1282247 C40.8801008,31.6957159 40.686561,32.0971037 40.5887829,32.3044666 Z" id="Stroke-5"></path>
            <path d="M4.54945113,33 L0,30.6480001 C0.11587668,30.4032821 0.331798293,29.9588139 0.639651735,29.342909 C1.14877225,28.3243405 1.73343065,27.1913718 2.38561194,25.9722122 C4.24984962,22.4872866 6.28605812,19.0011597 8.43352555,15.7365769 C12.1249243,10.1249077 15.7566816,5.7501473 19.2865576,3.04581458 C22.2554137,0.771294244 25.1617835,-0.324244661 28,0.0839265581 L27.3079198,5.33813898 C25.9881681,5.14834209 24.2918326,5.78776573 22.2878929,7.32303768 C19.3135718,9.60174485 16.0129104,13.577672 12.6165446,18.7408319 C10.5664977,21.8573159 8.60937277,25.2080463 6.81627927,28.5599781 C6.18839465,29.7337185 5.6264207,30.8227285 5.13882008,31.7982434 C4.84864085,32.3787885 4.64939634,32.7889274 4.54945113,33 Z" id="Stroke-3"></path>
        </g>
    </g>
</svg>