timestamp: 2017-01-16T13:27:42.506000
CREATE TABLE auth_user(
    id INTEGER PRIMARY KEY AUTOINCREMENT,
    first_name CHAR(128),
    last_name CHAR(128),
    email CHAR(512),
    password CHAR(512),
    registration_key CHAR(512),
    reset_password_key CHAR(512),
    registration_id CHAR(512)
);
success!
timestamp: 2017-01-16T13:27:42.618000
CREATE TABLE auth_group(
    id INTEGER PRIMARY KEY AUTOINCREMENT,
    role CHAR(512),
    description TEXT
);
success!
timestamp: 2017-01-16T13:27:42.736000
CREATE TABLE auth_membership(
    id INTEGER PRIMARY KEY AUTOINCREMENT,
    user_id INTEGER REFERENCES auth_user (id) ON DELETE CASCADE  ,
    group_id INTEGER REFERENCES auth_group (id) ON DELETE CASCADE
);
success!
timestamp: 2017-01-16T13:27:42.837000
CREATE TABLE auth_permission(
    id INTEGER PRIMARY KEY AUTOINCREMENT,
    group_id INTEGER REFERENCES auth_group (id) ON DELETE CASCADE  ,
    name CHAR(512),
    table_name CHAR(512),
    record_id INTEGER
);
success!
timestamp: 2017-01-16T13:27:42.965000
CREATE TABLE auth_event(
    id INTEGER PRIMARY KEY AUTOINCREMENT,
    time_stamp TIMESTAMP,
    client_ip CHAR(512),
    user_id INTEGER REFERENCES auth_user (id) ON DELETE CASCADE  ,
    origin CHAR(512),
    description TEXT
);
success!
timestamp: 2017-01-16T13:27:43.084000
CREATE TABLE auth_cas(
    id INTEGER PRIMARY KEY AUTOINCREMENT,
    user_id INTEGER REFERENCES auth_user (id) ON DELETE CASCADE  ,
    created_on TIMESTAMP,
    service CHAR(512),
    ticket CHAR(512),
    renew CHAR(1)
);
success!
timestamp: 2017-01-16T15:04:18.855000
CREATE TABLE test_table(
    id INTEGER PRIMARY KEY AUTOINCREMENT,
    title CHAR(512),
    body TEXT
);
success!
timestamp: 2017-01-16T15:17:29.763000
CREATE TABLE device_user_info(
    id INTEGER PRIMARY KEY AUTOINCREMENT,
    user_name CHAR(512),
    device_id CHAR(512),
    location_places CHAR(512),
    is_active CHAR(1),
    created_on TIMESTAMP,
    created_by INTEGER REFERENCES auth_user (id) ON DELETE CASCADE  ,
    modified_on TIMESTAMP,
    modified_by INTEGER REFERENCES auth_user (id) ON DELETE CASCADE
);
success!
timestamp: 2017-01-16T15:26:19.265000
ALTER TABLE device_user_info ADD device_name CHAR(512);
success!
success!
success!
success!
success!
success!
success!
success!
success!
timestamp: 2017-01-16T15:29:22.825000
ALTER TABLE device_user_info ADD device_model CHAR(512);
success!
success!
success!
timestamp: 2017-01-16T15:31:52.064000
ALTER TABLE device_user_info ADD status CHAR(512);
success!
success!
success!
success!
success!
success!
success!
success!
success!
success!
success!
success!
success!
success!
success!
success!
success!
success!
success!
success!
success!
timestamp: 2017-01-16T15:48:17.946000
ALTER TABLE device_user_info ADD device_type CHAR(512);
success!
success!
success!
success!
success!
success!
success!
success!
success!
success!
success!
success!
success!
success!
success!
success!
success!
success!
success!
success!
success!
success!
success!
success!
success!
success!
success!
success!
success!
success!
success!
success!
success!
success!
success!
success!
success!
success!
success!
success!
success!
success!
success!
success!
success!
success!
success!
success!
success!
success!
success!
success!
success!
success!
success!
success!
success!
success!
success!
success!
success!
success!
success!
success!
success!
success!
success!
success!
success!
insert into device_user_info ('device_id','device_name','location_places','device_model','device_type','status') values ('test1','devName','locPlace','locModel','devType','devStatus')
success!
success!
success!
success!
success!
success!
success!
success!
success!
success!
success!
success!
success!
insert into device_user_info (device_id,device_name,location_places,device_model,device_type,status) values ('test1','devName','locPlace','locModel','devType','devStatus')
