module sticker-app

go 1.12

require (
	github.com/BurntSushi/toml v0.3.1 // indirect
	github.com/dgrijalva/jwt-go v3.2.0+incompatible // indirect
	github.com/fsnotify/fsnotify v1.4.7 // indirect
	github.com/hashicorp/hcl v0.0.0-20180404174102-ef8a98b0bbce // indirect
	github.com/labstack/echo v3.3.5+incompatible
	github.com/labstack/echo/v4 v4.7.2
	github.com/labstack/gommon v0.3.1
	github.com/magiconair/properties v1.7.6 // indirect
	github.com/mitchellh/mapstructure v0.0.0-20180220230111-00c29f56e238 // indirect
	github.com/pelletier/go-toml v1.1.0 // indirect
	github.com/pmezard/go-difflib v1.0.0 // indirect
	github.com/spf13/afero v1.1.0 // indirect
	github.com/spf13/cast v1.2.0 // indirect
	github.com/spf13/jwalterweatherman v0.0.0-20180109140146-7c0cea34c8ec // indirect
	github.com/spf13/pflag v1.0.1 // indirect
	github.com/spf13/viper v1.0.2
	github.com/stretchr/objx v0.1.0 // indirect
	github.com/stretchr/testify v1.7.0
	github.com/valyala/bytebufferpool v1.0.0 // indirect
	gopkg.in/DATA-DOG/go-sqlmock.v1 v1.3.0
	gopkg.in/yaml.v2 v2.2.1 // indirect
	gorm.io/driver/mysql v1.3.2
	gorm.io/gorm v1.23.2
)
