{
   "geocoded_waypoints" : [
      {
         "geocoder_status" : "OK",
         "place_id" : "ChIJ_QdVqvb0rjgR7Q7Y0L76qpg",
         "types" : [ "establishment", "point_of_interest", "store" ]
      },
      {
         "geocoder_status" : "OK",
         "place_id" : "ChIJKwyxiYr0rjgROlaUC6ISemU",
         "types" : [ "establishment", "point_of_interest", "school" ]
      }
   ],
   "routes" : [
      {
         "bounds" : {
            "northeast" : {
               "lat" : 41.3387545,
               "lng" : 69.3341787
            },
            "southwest" : {
               "lat" : 41.3297748,
               "lng" : 69.3266782
            }
         },
         "copyrights" : "Картографические данные © 2018 Google",
         "legs" : [
            {
               "distance" : {
                  "text" : "1,6 км",
                  "value" : 1580
               },
               "duration" : {
                  "text" : "4 мин.",
                  "value" : 232
               },
               "end_address" : "9, Ziyolilar St, Tashkent, Узбекистан",
               "end_location" : {
                  "lat" : 41.3387545,
                  "lng" : 69.3341787
               },
               "start_address" : "71 Mirzo Ulug'bek shoh ko'chasi, Тошкент, Узбекистан",
               "start_location" : {
                  "lat" : 41.33077369999999,
                  "lng" : 69.3291966
               },
               "steps" : [
                  {
                     "distance" : {
                        "text" : "49 м",
                        "value" : 49
                     },
                     "duration" : {
                        "text" : "1 мин.",
                        "value" : 12
                     },
                     "end_location" : {
                        "lat" : 41.330447,
                        "lng" : 69.32948139999999
                     },
                     "html_instructions" : "Направляйтесь на \u003cb\u003eюг\u003c/b\u003e",
                     "polyline" : {
                        "points" : "ilg{FozcfLJDH?DCLQTg@"
                     },
                     "start_location" : {
                        "lat" : 41.33077369999999,
                        "lng" : 69.3291966
                     },
                     "travel_mode" : "DRIVING"
                  },
                  {
                     "distance" : {
                        "text" : "0,1 км",
                        "value" : 99
                     },
                     "duration" : {
                        "text" : "1 мин.",
                        "value" : 24
                     },
                     "end_location" : {
                        "lat" : 41.3297748,
                        "lng" : 69.32871279999999
                     },
                     "html_instructions" : "Поверните \u003cb\u003eнаправо\u003c/b\u003e в сторону \u003cb\u003eMusavvirlar Ko'chasi\u003c/b\u003e",
                     "maneuver" : "turn-right",
                     "polyline" : {
                        "points" : "ijg{Fg|cfLfCxC"
                     },
                     "start_location" : {
                        "lat" : 41.330447,
                        "lng" : 69.32948139999999
                     },
                     "travel_mode" : "DRIVING"
                  },
                  {
                     "distance" : {
                        "text" : "0,3 км",
                        "value" : 259
                     },
                     "duration" : {
                        "text" : "1 мин.",
                        "value" : 36
                     },
                     "end_location" : {
                        "lat" : 41.33140900000001,
                        "lng" : 69.3266782
                     },
                     "html_instructions" : "Поверните \u003cb\u003eнаправо\u003c/b\u003e на \u003cb\u003eMusavvirlar Ko'chasi\u003c/b\u003e",
                     "maneuver" : "turn-right",
                     "polyline" : {
                        "points" : "afg{FmwcfLu@vAaAlBi@dAq@rAQVMJsAP"
                     },
                     "start_location" : {
                        "lat" : 41.3297748,
                        "lng" : 69.32871279999999
                     },
                     "travel_mode" : "DRIVING"
                  },
                  {
                     "distance" : {
                        "text" : "0,8 км",
                        "value" : 789
                     },
                     "duration" : {
                        "text" : "2 мин.",
                        "value" : 117
                     },
                     "end_location" : {
                        "lat" : 41.3375199,
                        "lng" : 69.3301074
                     },
                     "html_instructions" : "Поверните \u003cb\u003eнаправо\u003c/b\u003e",
                     "maneuver" : "turn-right",
                     "polyline" : {
                        "points" : "ipg{FwjcfL_DiDyDaEY[gDuDKMmCwCQAQC_@HW@eAHuCPwER"
                     },
                     "start_location" : {
                        "lat" : 41.33140900000001,
                        "lng" : 69.3266782
                     },
                     "travel_mode" : "DRIVING"
                  },
                  {
                     "distance" : {
                        "text" : "0,4 км",
                        "value" : 384
                     },
                     "duration" : {
                        "text" : "1 мин.",
                        "value" : 43
                     },
                     "end_location" : {
                        "lat" : 41.3387545,
                        "lng" : 69.3341787
                     },
                     "html_instructions" : "Поверните \u003cb\u003eнаправо\u003c/b\u003e на \u003cb\u003eZiyolilar ko'chasi\u003c/b\u003e\u003cdiv style=\"font-size:0.9em\"\u003eПункт назначения будет справа\u003c/div\u003e",
                     "maneuver" : "turn-right",
                     "polyline" : {
                        "points" : "ovh{Fe`dfLe@qHYkEK}@Ia@I[MYSUaBoBQS"
                     },
                     "start_location" : {
                        "lat" : 41.3375199,
                        "lng" : 69.3301074
                     },
                     "travel_mode" : "DRIVING"
                  }
               ],
               "traffic_speed_entry" : [],
               "via_waypoint" : []
            }
         ],
         "overview_polyline" : {
            "points" : "ilg{FozcfLTDRUTg@fCxCwBdE{AxCQVMJsAP_DiDsE}EsDcEmCwCQAQC_@H}AJmJd@_A}NU_BWu@gCyC"
         },
         "summary" : "Ziyolilar ko'chasi",
         "warnings" : [],
         "waypoint_order" : []
      }
   ],
   "status" : "OK"
}
