{
    "prepare_queue": {
        "installed": [],
        "uninstalled": []
    },
    "config_munge": {
        "files": {}
    },
    "installed_plugins": {
        "call-number": {
            "PACKAGE_NAME": "io.cordova.refq"
        },
        "com.phonegap.plugins.facebookconnect": {
            "APP_ID": "615624041961288",
            "APP_NAME": "shelter",
            "PACKAGE_NAME": "io.cordova.refq"
        },
        "cordova-plugin-camera": {
            "PACKAGE_NAME": "io.cordova.refq"
        },
        "cordova-plugin-datepicker": {
            "PACKAGE_NAME": "io.cordova.refq"
        },
        "cordova-plugin-device": {
            "PACKAGE_NAME": "io.cordova.refq"
        },
        "cordova-plugin-dialogs": {
            "PACKAGE_NAME": "io.cordova.refq"
        },
        "cordova-plugin-file": {
            "PACKAGE_NAME": "io.cordova.refq"
        },
        "cordova-plugin-file-transfer": {
            "PACKAGE_NAME": "io.cordova.refq"
        },
        "cordova-plugin-filepath": {
            "PACKAGE_NAME": "io.cordova.refq"
        },
        "cordova-plugin-googleplus": {
            "PACKAGE_NAME": "io.cordova.refq"
        },
        "cordova-plugin-inappbrowser": {
            "PACKAGE_NAME": "io.cordova.refq"
        },
        "cordova-plugin-media-capture": {
            "PACKAGE_NAME": "io.cordova.refq"
        },
        "cordova-plugin-network-information": {
            "PACKAGE_NAME": "io.cordova.refq"
        },
        "cordova-plugin-video-editor": {
            "PACKAGE_NAME": "io.cordova.refq"
        },
        "cordova-plugin-whitelist": {
            "PACKAGE_NAME": "io.cordova.refq"
        },
        "cordova-plugin-x-socialsharing": {
            "PACKAGE_NAME": "io.cordova.refq"
        },
        "ionic-plugin-keyboard": {
            "PACKAGE_NAME": "io.cordova.refq"
        },
        "twitter-connect-plugin": {
            "FABRIC_KEY": "d5b3c3fd2951ef243fbd1107e4ec3bb15a219236",
            "PACKAGE_NAME": "io.cordova.refq"
        }
    },
    "dependent_plugins": {
        "cordova-plugin-autostart": {
            "PACKAGE_NAME": "io.cordova.refq"
        },
        "cordova-plugin-compat": {
            "PACKAGE_NAME": "io.cordova.refq"
        },
        "onesignal-cordova-plugin": {
            "PACKAGE_NAME": "io.cordova.refq"
        }
    }
}