{
    "prepare_queue": {
        "installed": [],
        "uninstalled": []
    },
    "config_munge": {
        "files": {}
    },
    "installed_plugins": {
        "call-number": {
            "PACKAGE_NAME": "io.cordova.jawla"
        },
        "com.phonegap.plugins.facebookconnect": {
            "APP_ID": "1332619583496119",
            "APP_NAME": "Jawla",
            "PACKAGE_NAME": "io.cordova.jawla"
        },
        "cordova-plugin-camera": {
            "PACKAGE_NAME": "io.cordova.jawla"
        },
        "cordova-plugin-device": {
            "PACKAGE_NAME": "io.cordova.jawla"
        },
        "cordova-plugin-dialogs": {
            "PACKAGE_NAME": "io.cordova.jawla"
        },
        "cordova-plugin-file": {
            "PACKAGE_NAME": "io.cordova.jawla"
        },
        "cordova-plugin-file-transfer": {
            "PACKAGE_NAME": "io.cordova.jawla"
        },
        "cordova-plugin-geolocation": {
            "PACKAGE_NAME": "io.cordova.jawla"
        },
        "cordova-plugin-googleplus": {
            "PACKAGE_NAME": "io.cordova.jawla"
        },
        "cordova-plugin-inappbrowser": {
            "PACKAGE_NAME": "io.cordova.jawla"
        },
        "cordova-plugin-media-capture": {
            "PACKAGE_NAME": "io.cordova.jawla"
        },
        "cordova-plugin-network-information": {
            "PACKAGE_NAME": "io.cordova.jawla"
        }
    },
    "dependent_plugins": {
        "cordova-plugin-compat": {
            "PACKAGE_NAME": "io.cordova.jawla"
        }
    }
}