{
     "android": {
         "release": {
             "keystore": "E:\\ReleaseKeys\\Jawla\\debug.keystore",
             "storePassword": "android",
             "alias": "hellboyJawla",
             "password" : "android",
             "keystoreType": ""
         }
     }
 }
